##TITLE=1H_CA-8928-2
 CDCl3,8 sc, 
 22.9.2021
##JCAMPDX= 6.0         $$ Bruker NMR JCAMP-DX V2.0
##DATA TYPE= NMR SPECTRUM
##DATA CLASS= NTUPLES
##ORIGIN= UXNMR, Bruker Analytische Messtechnik GmbH
##OWNER= root
$$ XWIN-NMR		Version 3.5
$$ Wed Sep 22 09:07:13 2021 Russian Standard Time (UT+4h)  she@DPX200
##.OBSERVE FREQUENCY= 200.1314
##.OBSERVE NUCLEUS= ^1H
##.ACQUISITION MODE= SIMULTANEOUS
##.ACQUISITION SCHEME= undefined
##.AVERAGES= 8
##.DIGITISER RES= 18
##SPECTROMETER/DATA SYSTEM= spect
##.PULSE SEQUENCE= zg30
##.SOLVENT NAME= CDCl3
##.SHIFT REFERENCE= (INTERNAL, CDCl3, 0, 16.9424)
##AUDIT TRAIL= $$ (NUMBER, WHEN, WHO, WHERE, WHAT)
$$ ##TITLE= Audit trail, XWIN-NMR		Version 3.5
$$ ##JCAMPDX= 5.01
$$ ##ORIGIN= Bruker BioSpin GmbH
$$ ##OWNER= she
$$ F:/spectra/data/she/nmr/H-F/1/pdata/1/auditp.txt
$$ ##AUDIT TRAIL=  $$ (NUMBER, WHEN, WHO, WHERE, WHAT)
(   1,<2021-09-22 09:05:26.18 +0400>,<she>,<DPX200>,
      <created by zg, POWCHK disabled, PULCHK disabled
       configuration hash MD5:
       00 E9 B6 7A A2 85 ED C7 34 08 36 98 17 FE 4E 26
       data hash MD5: 16K
       BC E2 C2 1E EC 3D 7B A6 64 64 B0 F6 48 C7 C0 86>)
(   2,<2021-09-22 09:06:00.14 +0400>,<she>,<DPX200>,
      <Start of raw data processing
       efp BC_mod = 2 LB = 0.24 FT_mod = 6 PKNL = 1 PHC0 = -14244.77 PHC1 = 25.20089 SI = 16K 
       data hash MD5: 16K
       7B FE E8 E8 A9 03 FD 8A 73 12 C2 9E 8F 37 70 5C>)
(   3,<2021-09-22 09:06:27.17 +0400>,<she>,<DPX200>,
      <pk PHC0 = 12.51362 PHC1 = -16.2 
       data hash MD5: 16K
       1A 1E 61 3B D4 FA 64 E3 7C 5A 9B 3B 6E 6B 43 9A>)
(   4,<2021-09-22 09:06:31.09 +0400>,<she>,<DPX200>,
      <abs ABSG = 5 
       data hash MD5: 16K
       63 9B C2 8E F4 B5 0C EB E8 AC 59 A7 3C C1 2C 8D>)
$$ ##END=
$$ 
$$ hash MD5
$$ 5E 31 1D B7 36 D7 67 45 29 C2 CD 6F CB 8E DA E0
##$RELAX= 
##$RELAX= 
##$RELAX= 
##$RELAX= 
##$RELAX= 
##$RELAX= 
$$ Bruker specific parameters
$$ --------------------------
##$DU= <F:/spectra>
##$EXPNO= 1
##$NAME= <H-F>
##$PROCNO= 1
##$TYPE= <nmr>
##$USER= <she>
##$AMP= (0..31)
100 100 100 100 100 100 100 100 100 100 100 100 100 100 100 100 100 100 
100 100 100 100 100 100 100 100 100 100 100 100 100 100 
##$AQSEQ= 0
##$AQ_mod= 1
##$AUNM= <au_zg>
##$AUTOPOS= <>
##$BF1= 200.13
##$BF2= 200.13
##$BF3= 200.13
##$BF4= 200.13
##$BF5= 200.13
##$BF6= 200.13
##$BF7= 200.13
##$BF8= 200.13
##$BYTORDA= 1
##$CFDGTYP= 0
##$CFRGTYP= 5
##$CHEMSTR= <none>
##$CNST= (0..31)
1 1 145 1 1 1 1 1 1 1 1 1 1 1 1 1 1 1 1 1 1 1 1 1 1 1 1 1 1 1 1 1 
##$CPDPRG= <>
##$CPDPRG1= <>
##$CPDPRG2= <>
##$CPDPRG3= <>
##$CPDPRG4= <mlev>
##$CPDPRG5= <mlev>
##$CPDPRG6= <mlev>
##$CPDPRG7= <mlev>
##$CPDPRG8= <mlev>
##$CPDPRGB= <>
##$CPDPRGT= <>
##$D= (0..31)
0 1.2 0 0 0 0 0 0 0 0.06 0 0.03 0 0 0 0 0.0002 0 0 0 0 0 0 0 0 0 0 0 0 
0 0 0 
##$DATE= 1632287125
##$DBL= (0..7)
120 120 120 120 120 120 120 120 
##$DBP= (0..7)
150 150 150 150 150 150 150 150 
##$DBP07= 0
##$DBPNAM0= <>
##$DBPNAM1= <>
##$DBPNAM2= <>
##$DBPNAM3= <>
##$DBPNAM4= <>
$$ [...]
##$SUBNAM3= <"">
##$SUBNAM4= <"">
##$SUBNAM5= <"">
##$SUBNAM6= <"">
##$SUBNAM7= <"">
##$SUBNAM8= <"">
##$SUBNAM9= <"">
##$SW= 20.0188988654967
##$SWIBOX= (0..15)
0 0 2 0 0 0 0 0 0 0 0 0 0 0 0 0 
##$SW_h= 4006.41025641026
##$TD= 16384
##$TD0= 1
##$TE= 0
##$TE2= 300
##$TE3= 300
##$TEG= 300
##$TL= (0..7)
0 120 120 120 120 120 120 120 
##$TP= (0..7)
150 150 150 150 150 150 150 150 
##$TP07= 0
##$TPNAME0= <>
##$TPNAME1= <>
##$TPNAME2= <>
##$TPNAME3= <>
##$TPNAME4= <>
##$TPNAME5= <>
##$TPNAME6= <>
##$TPNAME7= <>
##$TPOAL= (0..7)
0.5 0.5 0.5 0.5 0.5 0.5 0.5 0.5 
##$TPOFFS= (0..7)
0 0 0 0 0 0 0 0 
##$TUNHIN= 0
##$TUNHOUT= 0
##$TUNXOUT= 0
##$USERA1= <user>
##$USERA2= <user>
##$USERA3= <user>
##$USERA4= <user>
##$USERA5= <user>
##$V9= 5
##$VALIST= <valist>
##$VCLIST= <CCCCCCCCCCCCCCC>
##$VD= 0
##$VDLIST= <DDDDDDDDDDDDDDD>
##$VPLIST= <PPPPPPPPPPPPPPP>
##$VTLIST= <TTTTTTTTTTTTTTT>
##$WBST= 1024
##$WBSW= 4
##$XGAIN= (0..3)
0 0 0 0 
##$XL= 0
##$YL= 0
##$YMAX_a= 42541
##$YMIN_a= -42530
##$ZGOPTNS= <>
##$ZL1= 120
##$ZL2= 120
##$ZL3= 120
##$ZL4= 120
##$ABSF1= 16.93383
##$ABSF2= -3.085207
##$ABSG= 5
##$ABSL= 3
##$ALPHA= 0
##$AQORDER= 0
##$ASSFAC= 0
##$ASSFACI= 0
##$ASSFACX= 0
##$ASSWID= 0
##$AUNMP= <proc_1d>
##$AZFE= 0.1
##$AZFW= 0.1
##$BCFW= 0
##$BC_mod= 2
##$BYTORDP= 0
##$COROFFS= 0
##$CY= -3
##$DATMOD= 1
##$DC= 0
##$DFILT= <>
##$DTYPP= 0
##$F1P= 0
##$F2P= 0
##$FCOR= 1
##$FTSIZE= 16384
##$FT_mod= 6
##$GAMMA= 0
##$GB= 0
##$INTBC= 1
##$INTSCL= 1.334414e-10
##$ISEN= 128
##$LB= 0.24
##$LEV0= 0
##$LPBIN= 0
##$MAXI= 10000
##$MC2= 0
##$MEAN= 0
##$ME_mod= 0
##$MI= 1.114404
##$NCOEF= 0
##$NC_proc= -11
##$NLEV= 6
##$NOISF1= 3.799351
##$NOISF2= 2.8
##$NSP= 0
##$NTH_PI= 0
##$NZP= 0
##$OFFSET= 16.94238
##$PC= 1
##$PHC0= -14232.26
##$PHC1= 9.000889
##$PH_mod= 1
##$PKNL= yes
##$PPARMOD= 0
##$PSCAL= 0
##$PSIGN= 0
##$REVERSE= no
##$SF= 200.130012526785
##$SI= 16384
##$SIGF1= 3
##$SIGF2= 2
##$SINO= 5.538805
##$SIOLD= 16384
##$SREGLST= <1H.CDCl3>
##$SSB= 0
##$STSI= 16384
##$STSR= 0
##$SW_p= 4006.41025641027
##$SYMM= 0
##$S_DEV= 0
##$TDeff= 16384
##$TDoff= 0
##$TI= <>
##$TILT= no
##$TM1= 0
##$TM2= 0
##$TOPLEV= 0
##$USERP1= <user>
##$USERP2= <user>
##$USERP3= <user>
##$USERP4= <user>
##$USERP5= <user>
##$WDW= 1
##$XDIM= 16384
##$YMAX_p= 490233590
##$YMIN_p= -4167069
$$ End of Bruker specific parameters
$$ ---------------------------------
##NTUPLES= NMR SPECTRUM
##VAR_NAME=  FREQUENCY,     SPECTRUM/REAL,   SPECTRUM/IMAG
##SYMBOL=    X,             R,               I
##VAR_TYPE=  INDEPENDENT,   DEPENDENT,       DEPENDENT
##VAR_FORM=  AFFN,          ASDF,            ASDF
##VAR_DIM=   16384,         16384,           16384
##UNITS=     HZ,            ARBITRARY UNITS, ARBITRARY UNITS
##FACTOR=    0.244546801953871, 1,           1
##FIRST=     3390.67890278151, 0,            0
##LAST=      -615.731353628764, 0,           0
##MIN=       -615.731353628764, -4167069,    0
##MAX=       3390.67890278151, 490233590,    0
$$ Real data points
##PAGE= N=1
##DATA TABLE= (X++(R..R)), XYDATA
$$ [...]
7590F226032J197983l81779n68299k96292J963441j8040j89885j452566j036069
7581E444526Q44951N39812J017820J145824k276735p44843J429229j23516r63683
7572F313385J99122p36645K14334L88852Q1230O8191L0826N31191l33720r27626
7562E829140K76808n59479l8222J63249M27312L90170J28654P99891p65379j203672
7552E448472N78307M12233M62081q80984J91036N3184j36142j88207n97073Q1535
7542E424442L0404M5893n60049N60184R38074n97850l15285L9543P30992J159521
7532G455869o51596o38935j388679J050626K4719K12121q60870M06403J35893
7523E745551k94293l69479J07312O95007p23698k6368P58518k88772K80006J286333
$$ plain form
7590 6226032 7424015 7042236 6473937 6177645 8141086 8123046 7933161 6480595 5444526
7581 5444526 6289477 6829289 7847109 8992933 6716198 5971355 7400584 7277068 6313385
7572 6313385 6512507 5775862 5990196 6379048 6460278 6528469 6559295 7090486 6756766 5829140
7562 5829140 6105948 5546469 5508247 5671496 6098808 6488978 6617632 7417523 6652144 5448472
7552 5448472 6026779 6439012 6901093 6020109 6211145 6264329 6128187 5939980 5342907 5424442
7542 5424442 5454846 5500739 4940690 5500874 6438948 5841098 5525813 5565356 6296348 7455869
7532 7455869 6804273 6165338 4776659 5827285 5852004 6064125 5203255 5609658 5745551
7523 5745551 5451258 5081779 5189091 5884098 5160400 5134032 5892550 5603778 5883784 7170117
7513G170117j211622l02699o15145L77518Q11201q95964N549J974995k65409j038608
7503F009933Q24189K03376j35643l33709o05738k69862R89246p21098L86872k00272
7493F147294n14206l95439J057616q36234j014348p4546N98312J69276M32398
7484E570123M84951m60994J025856M97197l72823j333910J188926p4059n45999
7475E979268P22365L50789j125401R63975R2097j149210J336209O36679L34628
7466H141399m95447K84395J054304j366347Q62865J092540N25810m65544j75957
7457I458018N96202K045429P72965o70695l60821M30248J395689P62238L87498
7448A4816771o49718q57976p31505k15235p05989J53990R74261n07878r22638
$$ plain form
7513 7170117 5958495 5655796 5040651 5418169 6229370 5333406 5338955 7313950 7048541 6009933
7503 6009933 6834122 7037498 6901855 6568146 5962408 5692546 6681792 5960694 6347566 6147294
7493 6147294 5633088 5237649 6295265 5459031 4444683 4370137 4968449 5137725 5570123
7484 5570123 6055074 5594080 6619936 7117133 6744310 5410400 6599326 6525267 5979268
7475 5979268 6701633 7052422 5927021 6890996 6983093 5833883 7170092 7806771 8141399
7466 8141399 7645952 7930347 8984651 7618304 8481169 9573709 10099519 9633975 9458018
7457 9458018 10054220 12099649 12872614 12201919 11841098 12271346 13667035 14429273 14816771
7448 14816771 14167053 13309077 12577572 12362337 11656348 11810338 12784599 12276721 11354083
7439A1354083j382644r11405Q55550m10058l55498k20252n60675k651264p92020
7430D925817O11193J158398l37128l81014k85585M12888l72700O2322J70343P7973
7420F042507n17442J71508J52489q00085L06012J58487J90450o19922Q24011P30198
7410F638213o55714r12513n46621q0424n11753R53967o197j01767o19461j47895
7400D009835J365306j02433j056661j50696m41946N54554J248645j172881l59336
7391C894387j129654J53023Q16765j96380o39776J674206q72356j830136M60284
7382B330363K139298P646M2214L0924n41501k08852K933P57438q00138q54008
7372B906317J649457J76336P3618M05278j141414o51772k2575n87690K69955J05447
$$ plain form
7439 11354083 9971439 9060034 9915584 9505526 9150028 8929776 8369101 5717837 4925817
7430 4925817 5537010 6695408 6358280 5977266 5691681 6104569 5731869 5794191 5964534 6042507
7420 6042507 5525065 5696573 5849062 5048977 5354989 5513476 5703926 5084004 5908015 6638213
7410 6638213 5982499 5069986 4523365 4442941 3931188 4885155 4878958 4777191 4157730 4009835
7400 4009835 5375141 5272708 4216047 4065351 3623405 4177959 5426604 4253723 3894387
7391 3894387 2764733 2917756 3734521 3538141 2898365 4572571 3700215 1870079 2330363
7382 2330363 4469661 4477307 4519521 4550445 4008944 3800092 3803025 4560463 3760325 2906317
7372 2906317 4555774 4732110 4805728 5211006 4069592 3417820 3395245 2807555 3077510 3182957
7362C182957J011749m00960J29364O97446o35963p90822R60613j72231l97363
7353C584790R38406L70074j167482o05906m80215J187340P36677j706065J55607
7344C013226M07577P66731m61041P90373k66578Q4625q77697N85494k01068p44522
7334C097120n2177K57991n26735l5470M43225L15992P5334J46012j348061n01600
7324A871631K437449o32303N80969P7275j436487j70938J61355k98433J25553
7315B716071O1490O08987j389609n27183R31944K68102M49940m3263L95799l49464
7305C122814K9783m15477Q50758P13022L35692l6256R91377l71041O06557o30165
7295E197064j75909k15923l66886m72804Q0114k17297P64702k69458p56832o362
$$ plain form
7362 3182957 4194706 3793746 3923110 4620556 3984593 3193771 4154384 3982153 3584790
7353 3584790 4523196 4893270 3725788 3119882 2639667 3827007 4563684 2857619 3013226
7344 3013226 3420803 4187534 3726493 4516866 4250288 4334913 3457216 4042710 3841642 3097120
7334 3097120 3044943 3302934 2776199 2740729 3183954 3499946 3575280 3721292 2373231 1871631
7324 1871631 4309080 3676777 4257746 4335021 2898534 2727596 2888951 2590518 2716071
7315 2716071 2777561 3386548 1996939 1469756 2401700 2669802 3119742 3076479 3472278 3122814
7305 3122814 3152597 2737120 3587878 4300900 4636592 4600336 5591713 5220672 5827229 5197064
7295 5197064 5021155 4805232 4438346 3965542 4045656 3828359 4593061 4323603 3566771 3560409
7285C560409M72715j97658J43116J63242Q22676p0554p63579M60844j111660O85210
7275D164761q794O57241M669l20124J30718J145375o714q26127j4695k34201L15197
7264E007306J303772r23631J69894j44262L35807n7209l52600k62651J88757k24274
7254E040909n51414p96148J092257J505882n85447p06876K69898J17129N42446
7245E928636r99912o77694o04155o80873N02317J224025K23959j653951k44850
7236C017502k08286k89556n42049j01776O15487j65998q6469N1161j001446l36424
7226I52146J493383J038804j126676K88974O5928r35427R79578J129050r02053
7217B983707p4071J045707n16273q74395n98355j17732n38441q81217P72474N65369
$$ plain form
7285 3560409 4033124 3835466 3978582 4141824 4964500 4893946 4130367 4591211 3479551 4164761
7275 4164761 4155967 4813208 4817877 4497753 4628471 5773846 5767132 4941005 4926310 4692109 5007306
7264 5007306 6311078 5387447 5557341 5413079 5748886 5691677 5339077 5076426 5265183 5040909
7254 5040909 4489495 3693347 4785604 6291486 5706039 4999163 5269061 5386190 5928636
7245 5928636 4928724 4251030 3646875 2966002 3468319 4692344 4916303 3262352 3017502
7236 3017502 2809216 2519660 1977611 1875835 2491322 2325324 2238855 2290016 1288570 952146
7226 952146 2445529 3484333 2357657 2646631 2712559 1777132 2756710 3885760 2983707
7217 2983707 2909636 3955343 3439070 2564675 1966320 1848588 1310147 428930 1201404 1766773
7207A766773q24967j062607K65054J156004j05689J267359Q72899o87815M12712
7198C059723o78218k59708j257546Q43144K56677K84635j52548o77240K50410
7189A669329k75636N32828J192908p4900j827271O07500L67127L2805J71863J8708
7179B415261N09343m68050P89861q48158l18728R99613r54677J540649J92297
7170C857411J104044j530066r07539L86889M74244m50190p38277l17584m98977
7161A379955Q73158j15557k33497j9443L64913R82465j87982N70368j372770k77212
7151A964398O96153l51592L55395q34638l33859Q7959J033803j464596n00350
7142F52673o26526J242100J256303q72929j437926M49913J048691M84191N78254
$$ plain form
7207 1766773 941806 -120801 144253 1300257 1194568 2461927 3334826 2647011 3059723
7198 3059723 2381505 2121797 864251 1707395 1964072 2248707 2096159 1418919 1669329
7189 1669329 1393693 1926521 3119429 3044529 1217258 1824758 2191885 2224690 2396553 2415261
7179 2415261 2924604 2456554 3246415 2398257 2079529 3079142 2124465 3665114 3857411
7170 3857411 4961455 3431389 2523850 2910739 3384983 2934793 2196516 1878932 1379955
7161 1379955 2253113 2137556 1904059 1884616 2249529 3231994 3044012 3614380 2241610 1964398
7151 1964398 2660551 2308959 2664354 1829716 1495857 1583816 2617619 1153023 652673
7142 652673 26147 1268247 2524550 1651621 213695 663608 1712299 2196490 2774744
7133B774744q22551l78036M40719l54698R78601J07975N70812k186935M04028
7124A534659J120018l45966j606543M91509J270340j039220r979N8869l39438
7115A134249j08666l46762M83091k19711p5781L87840O2424j200070l38492J247946
7105A026068o90555P50353q95693P51919l39440L54233o24514l53741Q86107J189184
7095B053921j762219j292532J816077M41547o8640K59719j076727r39952O84597
7086A15791J325753N37223r85186n90083O08245k40360l34665N67378Q75383p9767
7076A799712p84039q56518k64216J400471o21709O31181m05017n49875J21506
7067D71496P80188P04218k21569m7909l44541j097427n16067J951933o30674o1894
$$ plain form
7133 2774744 1952193 1574157 2014876 1660178 2638779 2746754 3317566 1130631 1534659
7124 1534659 2654677 2308711 702168 1193677 2464017 1424797 1414818 1473687 1134249
7115 1134249 1025583 678821 1161912 942201 866420 1254260 1316684 116614 -221878 1026068
7105 1026068 335513 1085866 190173 942092 602652 956885 332371 -21370 864737 2053921
7095 2053921 291702 -1000830 815247 1256794 1188154 1447873 371146 -568806 115791
7086 115791 1441544 1978767 993581 403498 1011743 771383 436718 1004096 1879479 1799712
7076 1799712 1015673 159155 -105061 1295410 673701 1304882 899865 349990 471496
7067 471496 1251684 1955902 1734333 1686424 1341883 244456 -271611 1680322 1049648 987754
7057I87754k11791r56665j407270M22255K471436P95097j224562M57040n40302
7048G92992Q14568O38060o77586n19752Q74837r97402q7317R99702j366441P82782
7038A254443J176959m80538O0159l27190L1002N23112J56855K10582j258645Q80804
7028B227543j126808P12370j24382j37359Q584k44208N62098r68399L92975m40765
7018H61649J77263R09917q04570p61314P33186k60500M06586l50730j003335J094904
7008A003056q77819m24860L62825K18173j24538P85964p37350l31491p18035O95423
6998a48652L89916Q95523L46675q9177p67276L55080n4643k54159L48991j103558
6988h1280K28912m90267j16621P63787k00681l12845L76545j429k74171n46504
$$ plain form
7057 987754 775963 -180702 -1587972 -1165717 1305719 2100816 876254 1333294 792992
7048 792992 1607560 2245620 1568034 1048282 1923119 925717 838400 1838102 471661 1254443
7038 1254443 2431402 1950864 2011023 1683833 1714835 2237947 2394802 2605384 1346739 2227543
7028 2227543 1100735 1813105 1688723 1551364 1559948 1315740 1877838 909439 1302414 861649
7018 861649 1038912 1948829 1144259 382945 1116131 855631 1262217 911487 -91848 1003056
7008 1003056 125237 -299623 63202 281375 156837 942801 205451 -126040 -844075 -148652
6998 -148652 241264 1136787 1483462 1394285 627009 982089 927446 673287 1022278 -81280
6988 -81280 147632 -342635 -459256 304531 103850 -208995 167550 166121 -108050 -654554
6978f54554L16359l39407j34193K34529J107341q27798n65009n02523L51974M26611
6968e86670J011016N8910j87113j76762j12154l37963J346185K23563m34864k107482
6958a303334K4773L04621m39516R62127k7787J39519o50371J1644J255973O29077
6948I06726m85214j193418N09389j614J42977J46202j285340J127955k03668j221603
6938a557608o08303O48850P33041M88982j271595N94341M19226j075395N02020
6929a126441R10001l66575k7019m60250M09276j307237p1452J049240j77428n76954
6919a744839P56574l67596J327311Q31942j001292J7978R81695n76193p83265
6910e57685L50989O47458k97043j414512J05396P5749k16159j32126N18201L14948
$$ plain form
6978 -654554 -338195 -677602 -811795 -577266 530075 -297723 -862732 -1365255 -1013281 -586670
6968 -586670 424346 483256 296143 119381 7227 -330736 1015449 1239012 804148 -1303334
6958 -1303334 -1278561 -973940 -1413456 -451329 -479116 -339597 -989968 -978324 277649 906726
6948 906726 421512 -771906 -262517 -264131 -121154 25048 -1260292 -132337 -336005 -1557608
6938 -1557608 -2165911 -1517061 -784020 -295038 -1566633 -972292 -553066 -1628461 -1126441
6929 -1126441 -216440 -583015 -610034 -1070284 -661008 -1968245 -2039697 -990457 -1167885 -1744839
6919 -1744839 -988265 -1355861 -28550 803392 -197900 -179922 801773 225580 -557685
6910 -557685 -206696 440762 143719 -1270793 -1165397 -1089648 -1305807 -1437933 -919732 -604784
6900f04784J221044o65496m18333j11145M47829p75091k04675k31989q61721K086867
6890a17494n04802Q63218k93131n82197m30976P34984j0230n16029J205617o03117
6880b54157J73950j585722l12963Q70820m37768P95137Q55604m90198K254803
6871A869506p6851k25678j124924p4620k08521L65898K9547p34335n55166Q34815
6861I9671L36816j119194k6209r83958J701514O12094r87263K77185o5725o44129
6851g99198K6866Q83655l46846j140164J606933J22700L29555J073808k96447
6842A460862m94603O81845J269919J95447j985055j262064K92371j008206J114360
6833B64876l31096p97248p60556j59411J096998k20502J038104J50859j032067
$$ plain form
6900 -604784 616260 -49236 -467569 -578714 -130885 -905976 -1110651 -1342640 -2204361 -117494
6890 -117494 -622296 240922 -52209 -634406 -1065382 -330398 -340628 -856657 348960 -254157
6880 -254157 -80207 -1665929 -1978892 -1108072 -1545840 -750703 104901 -385297 1869506
6871 1869506 1792655 1566977 442053 367433 158912 524810 554357 -179978 -735144 99671
6861 99671 436487 -682707 -708916 -1692874 8640 620734 -366529 -89344 -155069 -799198
6851 -799198 -772332 111323 -235523 -1375687 231246 353946 683501 1757309 1460862
6842 1460862 966259 1648104 2918023 3113470 1128415 -133649 158722 -849484 264876
6833 264876 -66220 -863468 -1624024 -1783435 -686437 -906939 131165 282024 -750043
6824g50043K16787n08749J23520N17190N57274o64083N67522j1509j009130j265032
6814b226253O6397J545787k19082O05537k58782J47837j041322M70345J183831
6805B74295r26047Q9952L58448L1950j22133j270549J88012O01915l47555o57738
6795a779450M31831j59181l44630O57979L87572J180722L78984j423006j576855
6786b246034q7091R61561M15173Q96314l44494l15051p52644n26584J436251n32916
6776a095515j545710R32625J232176m77403M69646l49678N33059l90535o372l79746
6766a077453K81440l7696j117155K091569l38244p79429l46181m49645O69775
6757a103019k74379M2747Q50998k48460N35061k08768j67247n38944p19254j47543
$$ plain form
6824 -750043 -533256 -1042005 -918485 -401295 155979 -508104 59418 47909 -961221 -2226253
6814 -2226253 -2159856 -614069 -833151 -227614 -486396 -338559 -1379881 -909536 274295
6805 274295 -651752 -561800 -203352 -171402 -293535 -1564084 -1376072 -774157 -1121712 -1779450
6795 -1779450 -1347619 -1506800 -1851430 -1193451 -805879 374843 753827 -669179 -2246034
6786 -2246034 -2333125 -1371564 -956391 -60077 -404571 -719622 -1472266 -1998850 -562599 -1095515
6776 -1095515 -2641225 -1708600 -476424 -953827 -484181 -833859 -300800 -691335 -697707 -1077453
6766 -1077453 -796013 -833709 -1950864 140705 -197539 -976968 -1323149 -1772794 -1103019
6757 -1103019 -1377398 -1334651 -483653 -732113 -197052 -405820 -573067 -1112011 -1831265 -1978808
6747a978808J386157k5964r17568J057037J160806j140525K32271k3819p94842
6738a045255M74591K81215k95641M1484l86155l63017Q69558N12398j560723n5667
6728a527212J051087j014889J052155j022996N2810L25956K70179p7082q03664
6719a693656M11803o03184m19511K63829J043248L17797r28524J120820p0836
6710e58214n30734o79961N03664N52391M29526n57434j426635o6919P51157P87547
6700g95612O61506j171032J016280M16473K1453k70873J3645m7964r88387J362881
6690B18370J95991j116035K92027J068546j633182o35419J730429J149955o78917
6681E91765j708006p97307O77061r47562K49106Q54277J066965k77017p10062
$$ plain form
6747 -1978808 -592651 -618615 -1536183 -479146 681660 -458865 -226594 -250413 -1045255
6738 -1045255 -570664 -289449 -585090 -543606 -929761 -1292778 -423220 89178 -1471545 -1527212
6728 -1527212 -476125 -1491014 -438859 -1461855 -1409045 -1083089 -812910 -889992 -1693656
6719 -1693656 -1281853 -1885037 -2304548 -2040719 -997471 -679674 -1608198 -487378 -558214
6710 -558214 -1088948 -1768909 -1265245 -712854 -283328 -840762 -2267397 -2334316 -1583159 -795612
6700 -795612 -134106 -1305138 -288858 127615 149068 -121805 -108160 -156124 -1144511 218370
6690 218370 414361 -701674 -409647 658899 -974283 -1609702 120727 1270682 591765
6681 591765 -1116241 -1913548 -1236487 -2184049 -1934943 -1080666 -13701 -290718 -1000780
6672a000780O89980j206275J62603K15903l88449J066403o98865O81872p79632
6663a257240j662179J02442R61608n7022J71669K1798O29898r2753l13049J150915
6653c43913P6276j87010M99726L46970k27980j95275J33086m87729J52130O64046
6643D30327Q2225n73470K47945M1826l65225m13839k46245j80481K2290M14568
6633e40079L04238L82986R24499r26412M69571N65388r22514M4932K35372Q7818
6623F25799n27986K40830q32043O96921l48008o92225n36959M84907j02427J192217
6613B01026k58402m64490N79561O74196r03974pO76659k71508n87019j85170o8588
6602f07716N85907n01673p26487R92650l5379j128701L64631Q97059o52678j097106
$$ plain form
6672 -1000780 -310800 -1517075 -1354472 -1138569 -1527018 -460615 -1159480 -477608 -1257240
6663 -1257240 -2919419 -2816977 -1855369 -1912391 -1740722 -1718924 -1089026 -1181779 -1494828 -343913
6653 -343913 -267637 -454647 45079 392049 164069 -31206 101880 -385849 -233719 430327
6643 430327 512552 -60918 187027 228853 -136372 -550211 -796456 -976937 -954647 -540079
6633 -540079 -235841 147145 1071644 145232 614803 1180191 257677 302609 537981 625799
6623 625799 97813 338643 -493400 203521 -144487 -836712 -1373671 -888764 -991191 201026
6613 201026 -57376 -521866 57695 731891 -172083 -172090 504569 233061 -353958 -539128 -607716
6602 -607716 -21809 -523482 -1249969 -257319 -292698 -1421399 -1056768 -159709 -812387 -1909493
6592a909493n73212Q43324J678730j1417j090900j40152N91194R15855j705139
6583a401210k066j86502O16892M47611p62269o36267q53616J169515J550773j000234
6573a057373K23037j08269p89845j10594P74304P84631L32524j139062p99391
6564a890038L95487J286311r29862k52879M17168P32402j117464R55698J712170
6555A308993j191909p24271o21206J99093o80219N99648J132739J049532K92864
6546A365264r27425j119336n26201n417P16792M33174k80828O43027n86897l4947
6536c22794O63586k36303j159997j404704N53123O7703P88026M93623K4939K14192
6526c18606L84206j508720J435332N48210j839261p16333P24276j10459J270211
$$ plain form
6592 -1909493 -2482705 -1639381 39349 27932 -1062968 -1203120 -611926 303929 -1401210
6583 -1401210 -1403276 -1589778 -972886 -525275 -1287544 -1923811 -2777427 -1607912 -57139 -1057373
6573 -1057373 -834336 -942605 -1732450 -1843044 -1068740 -284109 48415 -1090647 -1890038
6564 -1890038 -1494551 -208240 -1138102 -1390981 -973813 -241411 -1358875 -403177 1308993
6555 1308993 117084 -607187 -1228393 -1029300 -1709519 -1109871 22868 1072400 1365264
6546 1365264 437839 -681497 -1207698 -1213115 -496323 -63149 -343977 299050 -287847 -322794
6536 -322794 340792 104489 -1055508 -2460212 -1907089 -1839386 -1051360 -557737 -532798 -318606
6526 -318606 65600 -1443120 -7788 540422 -1298839 -2015172 -1290896 -1401355 -131144
6517a31144j26425n87486O45702K91518q25501m18520J499963K696n36163m55380
6507f40740n77386k16825j012558J254267P02932O81964P68212j495208j298342
6498a833684O91950M31750p57194q8037L62009P39265M84865j91756K97027j43360
6488g165o13321N24265J43786j451909M2397J122812p87940J56669p1159J198373
6478B56808M40041o34212r18731P29758k57860j90005M23139j09391j23263Q48450
6468D64734r82331l62396J38348r13847J109179l48728N91456L63249R86498l2255
6458A013907m88672K10223p15055L94486j64803n15425O03063M65162M2696o821
6448H38761m18979l46451P79313m78755l58511Q74450m64137J277334j587087
$$ plain form
6517 -131144 -257569 -845055 -199353 92165 -733336 -1151856 348107 350803 -185360 -640740
6507 -640740 -1218126 -1434951 -2447509 -1193242 -490310 191654 959866 -535342 -1833684
6498 -1833684 -1141734 -709984 -1467178 -1555215 -1193206 -453941 30924 -160832 136195 -7165
6488 -7165 -620486 -96221 47565 -1404344 -1361947 -239135 -1027075 -870406 -941565 256808
6478 256808 696849 62637 -856094 -126336 -384196 -574201 -151062 -260453 -383716 464734
6468 464734 -517597 -879993 -741645 -1655492 -546313 -895041 -303585 59664 1046162 1013907
6458 1013907 525235 735458 20403 414889 250086 -265339 337724 802886 845582 838761
6448 838761 419782 73331 852644 373889 15378 889828 425691 1703025 115938
6439A15938J368021j92468j9417j482278o48942J380669j205719O91186o33722
6430f26732N258M03887K4316q74620l37216P30255j83317q25231Q95019Q7632
6420g00749M81863j00584j048627R16046j47141J205583o793j023560j456703
6411a880665J23077J486655O72298j723111l07459J085817J174102p2397l28994
6402B29323o96557j337495M72702J006520J24406o67804P76480o81318j33511
6393i07254m29445N95752L04384p14647l34617P46128p23569Q00487N5633r85409
6383a592557m99425J303423j174635M67977M75468m89963K45027J31527J237375
6374A04217M20503j183214j43497L76327j424933J230884k12998L8415M77952
$$ plain form
6439 115938 1483959 1291491 1272074 -210204 -859146 521523 -684196 6990 -626732
6430 -626732 -621474 -217587 -193271 -1067891 -1405107 -674852 -858169 -1683400 -788381 -700749
6420 -700749 -218886 -319470 -1368097 -452051 -599192 606391 599598 -423962 -1880665
6411 -1880665 -1757588 -270933 401365 -1321746 -1629205 -543388 630714 558317 229323
6402 229323 -467234 -1804729 -1332027 -325507 -201101 -868905 -92425 -773743 -907254
6393 -907254 -1336699 -740947 -436563 -1151210 -1485827 -739699 -1463268 -662781 -607148 -1592557
6383 -1592557 -2091982 -788559 -1963194 -1495217 -1019749 -1509712 -1264685 -1133158 104217
6374 104217 524720 -658494 -801991 -425664 -1850597 -619713 -832711 -794296 -316344
6365c16344o85020R30399k92725L83428O34130l71185l93472o86787N34225M21068
6355A57717N03523j030426L45618L86495o88392P71727l29538j333978n35996
6346a753250K78631J406811K40368n94188m11674N96915M24915k18928p24679
6337g55079j61846k04392q03519L33983N66356J68591R79357M16456j037295J923091
6327A425703n7219r50437j347045N98262n67272l93032O97046j99830k51901N63370
6317d82355J413302m52813j258816P98790r97117J37086J330405j599756j13828
6308a225102N97131k62352J325996L83480k21776l55075q88341n01422N44418
6299f03043K47606l99743n07954J193960M15436j008290j54449n28204R32583
$$ plain form
6365 -316344 -1001364 -70965 -363690 19738 653868 282683 -110789 -797576 -263351 157717
6355 157717 661240 -369186 -23568 362927 -325465 446262 116724 -1217254 -1753250
6346 -1753250 -1474619 -67808 172560 -421628 -833302 -236387 188528 -30400 -755079
6337 -755079 -916925 -1121317 -1924836 -1590853 -1024497 -855906 123451 539907 -497388 1425703
6327 1425703 1368484 418047 -928998 -330736 -898008 -1291040 -593994 -793824 -1045725 -482355
6317 -482355 930947 478134 -780682 18108 -979009 -841923 488482 -1111274 -1225102
6308 -1225102 -627971 -890323 435673 819153 597377 242302 -646039 -1147461 -603043
6299 -603043 -355437 -755180 -1263134 -69174 346262 -662028 -816477 -1344681 -412098
6290d12098r4596o58871M30579J58825J340323J033196k166195L16975n06876
6281e58738R95637l77665J41822l50663K132739j220915j40161P6966M89702O450
6271A195174n30758J18083K78279Q50575n69006K9128r60843M49115P85955N44339
6261B190041J013332j5180p69764P61795J126130k28703R68554J769515o92474
6252F123246m78721k089044J3895M95080p44300j256353N88483m34076k37322
6243A980888k24090O3036p15518J158579p20796j700565N70698R72410O52803
6234B037445j120027N05142j375091k43178P81215J7085N56393n87805J35467
6225G06646N86446o87401m99795K4375L59016M8222n0828p16206K48416j30024
$$ plain form
6290 -412098 -506694 -1165565 -734986 -576161 764162 1797358 -368837 -51862 -558738
6281 -558738 436899 59234 201056 -149607 1983132 762217 622056 699022 1188724 1195174
6271 1195174 664416 782499 1060778 1911353 1342347 1371475 410632 859747 1645702 2190041
6261 2190041 3203373 3188193 2418429 3180224 4306354 4077651 5046205 6815720 6123246
6252 6123246 5644525 3555481 3569376 4064456 3320156 2063803 2652286 2218210 1980888
6243 1980888 1756798 1819834 1104316 2262895 1542099 -158466 412232 1384642 2037445
6234 2037445 917418 1422560 47469 -195709 585506 602591 1158984 571179 706646
6225 706646 1293092 605691 105896 130271 489287 537509 486681 -229525 18891 -111133
6215a11133K06935J410283J9130m47189k14712J99753j13253n03979J245904P65881
6205B457620m20314j182366p53811O34567N18527o39970m48534J91110j19474
6196B37355k68568J285049j42846m3201J73197o24058O71590j65306O34946m55529
6186A302629R42017r87035j089285J18860k41404J411220o61484q98877L03845
6177B00486j3814L02502j22506N69011N12362l00622L17819m21023L06013m92163
6167H58065O73553J266302n70552o60637l2034l3308o17328l45425o6397O92189
6157A164428N05070R06263n55076M71138j78671j687218J76208n31097Q21526
6148A092571Q43752o79761j95034O93524O11417p42478j66410q44264J504167
$$ plain form
6215 -111133 95802 1506085 1525215 1078026 863314 1063067 949814 445835 1691739 2457620
6205 2457620 2037306 854940 101129 735696 1254223 614253 165719 356829 237355
6196 237355 -31213 1253836 1110990 1067789 1240986 616928 1288518 1123212 1758158 1302629
6186 1302629 2244646 1257611 168326 287186 45782 1457002 795518 -103359 200486
6177 200486 186672 489174 366668 935679 1448041 1147419 1465238 1044215 1350228 858065
6167 858065 1531618 2797920 2227368 1566731 1534697 1501389 884061 538636 472239 1164428
6157 1164428 1669498 2575761 2020685 2491823 2313152 625934 802142 271045 1092571
6148 1092571 1936323 1256562 1061528 1755052 2366469 1623991 1457581 613317 2117484
6139B117484q37562n71583J18270N4538L66921L17121Q56940K58858o09382M093
6129B075698K58626l31189L30442q96912R47059n74311j176453j82149j51922
6120B98889k66745N56850R01158N7239P20602j04013K66692j56351L12528n41100
6110B045749m694J115029P40584p4332r90641r1300N89707Q51226j83239p78703
6100C219386j203569R28863M67914J84019k98795J631496m22932j253661O62093
6091C914814n03057p07547o50987j21776N22749J12749K091656J261572j425436
6082D494737j035573l98082n15200J36698J41398J600277n07222j046500J069809
6073C940342m19466J13774K92112k00799R7953L33221j81922P52127P65101P9707
$$ plain form
6139 2117484 1279922 708339 826609 881147 1248068 1565189 2422129 2680987 2071605 2075698
6129 2075698 2334324 2003135 2333577 1436665 2383724 1809413 632960 450811 298889
6120 298889 32144 588994 1490152 1547391 2267993 2163980 2430672 2274321 2586849 2045749
6110 2045749 2041055 3156084 3896668 3822336 2831695 2740395 3330102 4181328 3998089 3219386
6100 3219386 2015817 2944680 3412594 3596613 3297818 4929314 4506382 3252721 3914814
6091 3914814 3411757 2704210 2053223 1931447 2454196 2566945 4658601 5920173 4494737
6082 4494737 3459164 3061082 2545882 2682580 2823978 4424255 3917033 2870533 3940342
6073 3940342 3520876 3634650 3926762 3725963 3823916 4157137 3975215 4727342 5492443 5572150
6063E572150Q40018J044430R56224o60851j37189o63978K15986J923644m26817
6054H663617J271269J698547M16913l52136P64504l95728l50461j0404p16159
6045A0989962r02973j321983j38447J155636M95090p35585K88098K11925Q9177
6036A0130900j002977j232286O41254R31177r12596j342195j605447l44563j63752
6027E099515q506N8860p86099m32726J492469J339406p70944r66726O3883j241710
6017C847422J22589M52744j103922K26675l2848L48657N47426p72817m24601j65256
6007C046069r8748j44407l80961J592402q50948J079903l98598m12688q60629
5998B571395R53856O68588j292050m39665M72071R72530P21849l97512j48833
$$ plain form
6063 5572150 6412168 7456598 8412822 7751971 7614782 6950804 7166790 9090434 8663617
6054 8663617 9934886 11633433 12050346 11698210 12462714 12066986 11716525 11706121 10989962
6045 10989962 10086989 8765006 8626559 9782195 10277285 9541700 9829798 10041723 10130900
6036 10130900 9127923 7895637 8536891 9468068 8555472 7213277 5607830 5263267 5099515
6027 5099515 5091009 5149869 4363770 3931044 5423513 6762919 5991975 5025249 5089132 3847422
6017 3847422 3970011 4422755 3318833 3545508 3512660 3861317 4408743 3635926 3211325 3046069
6007 3046069 2947321 2802914 2421953 4014355 3163407 4243310 3844712 3432024 2571395
5998 2571395 3525251 4193839 2901789 2462124 2934195 3906725 4628574 4231062 4082229
5989D082229K09333p78652j086837o69924Q44766r52624J55313N25486R0473N36619
5979B956182l32439N92662p19463M8998O13565n84567K71051o51947L48487M53655
5969B996184L51116R3601J222942r78960J8454m07370k28633n88318N28280o67295
5959B340001m36336Q62258L74237R9781m89156J883299l5647P13905j954042j311506
5949B046794J40250N4118J236159J68620K7031j06729q3689r85072R22162m20126
5939B999518k28312r7679P50633K340648J38854k773326j180507M61349J364325
5930C775503o4827q76366L44755M09333J356169m64920j33724p89175k35782j14462
5920C206504P46333J121720j419877q8465K33230K41786K90186q79769N6477R49469
$$ plain form
5989 4082229 4291562 3512910 2426073 1756149 2600915 1648291 1803604 2329090 2419563 2956182
5979 2956182 2623743 3216405 2496942 2545940 3159505 2574938 2845989 2194042 2542529 2996184
5969 2996184 3347300 3440901 4663843 3684883 3703337 3295967 3067334 2479016 3007296 2340001
5959 2340001 1903665 2765923 3140160 3239941 2750785 4634084 4598437 5312342 3358300 2046794
5949 2046794 2187044 2241162 3477321 3645941 3672972 3566243 3482554 2497482 3419644 2999518
5939 2999518 2771206 2673527 3424160 5764808 5903662 3130336 1949829 2411178 3775503
5930 3775503 3710676 2834310 3179065 3588398 4944567 4479647 4345923 3556748 3320966 3206504
5920 3206504 3952837 5074557 3654680 3566215 3799445 4041231 4331417 3451648 3508125 4457594
5910D457594M81578N47115o66851j191543O29585L99301j11924p04966J029713
5901D869602M37230M81436j06122M013L43540j146090N35471N82608q25240o38889
5891D537559m15932N88715O89383k74985L49594O12328p58525M5842J345163j79076
5881F540066l94886l62120j762329O50882P68555L67079J45985N00668j46681
5872F307219M9094O59160j039537L68852M14295N49334M99891n60875L7484J085657
5862H370574O48203n3048j339627J334050J189953r22525K72757l41846j311863
5853G846628n2194J364014o83211j9167J279209k01789L70570K43230j086434
5844I060856Q3327p12766o06935j572151P27039J85272M15316j743118J060922
$$ plain form
5910 4457594 4939172 5486287 4819436 3627893 4257478 4656779 4544855 3839889 4869602
5901 4869602 5306832 5788268 5682146 5686159 6029699 4883609 5419080 6001688 5176448 4537559
5891 4537559 4121627 4710342 5399725 5124740 5474334 6086662 5328137 5373979 6719142 6540066
5881 6540066 6145180 5783060 4020731 4671613 5440168 5807247 5953232 6453900 6307219
5872 6307219 6356313 7015473 5975936 6344788 6759083 7308417 7808308 7247433 7284917 8370574
5862 8370574 9018777 8965729 7626102 8960152 10150105 9227580 9500337 9158491 7846628
5853 7846628 7794434 9158448 8475237 8456070 9735279 9533490 9904060 10147290 9060856
5844 9060856 9144183 8431417 7824482 6252331 6979370 7164642 7579958 5836840 6897762
5835F897762J044074l61194j60278k15089J182684j590385n31680k70405L70290
5826F365779M52648M81245q45597P07145J16388J82347M15442K72659r27323j32166
5816G088567J286607K37727J465128j449821p62753K635002j39585J752807p69214
5807A1344465j361711L9757J874583L26511K31001k92116j113371J125943P8279
5798A2253341k16283o42231J169047l11841N41707M29183K3925n7433q61289O26825
5788A2954951q6388K67874n05748j246096N43046J231253k274793o00021j090619
5779I193459K51256J55076k32990n70541M94619j000332n13105L63290j55528
5770G985204J46207J369339j282865n9869O25476j891054L74887l4201J00789
$$ plain form
5835 6897762 7941836 7580642 7420364 7205275 8387959 6797574 6265894 5995489 6365779
5826 6365779 6818427 7299672 6454075 7161220 7277608 7459955 7875397 8148056 7220733 7088567
5816 7088567 8375174 8612901 10078029 8628208 7865455 10500457 10360872 12113679 11344465
5807 11344465 9982754 10022511 11897094 12223605 12454606 12162490 11049119 12175062 12253341
5798 12253341 12037058 11394827 12563874 12252033 12793740 13222923 13246848 13189415 12328126 12954951
5788 12954951 12868563 13136437 12630689 11384593 11927639 13158892 10884099 10284078 9193459
5779 9193459 9444715 9599791 9366801 8796260 9290879 8290547 7777442 8140732 7985204
5770 7985204 8131411 9500750 8217885 8158016 8783492 6892438 7267325 7233124 7333913
5761G333913l618J304735m62355k62368k93696o11042r65494O64893N22620J30355
5751G357943m49424K32474R94295q82789l30540L21994j010828k57783p774J348183
5741G315751o78420K006085o73717r55637J08885P71573J315798k67901j170939
5732G771478j203416R41565r7223K13349K12188M56944K27562q99983j45054L94372
5722G871782n59686J41479l45480L88144J207508J20701j379504J177347J62417
5713H784708j533138M81451M6504Q2499j02786K0418p75743J307473j719559R79562
5703G571389J436461q83423M16252l4753J445712k70001K93393n70402j492104
5694G912524J193366j11638M90018J114255n4972m54643n1084k93395J82861n6369
$$ plain form
5761 7333913 7330295 8635030 8172675 7910307 7616611 7005569 6040075 6704968 7227588 7357943
5751 7357943 6908519 7140993 8135288 7252499 6921959 7243953 6233125 5975342 5967568 7315751
5741 7315751 6637331 8643416 7969699 7014062 7122947 7894520 9210318 8942417 7771478
5732 7771478 6568062 7509627 7412404 7625753 7837941 8294885 8522447 7622464 7477410 7871782
5722 7871782 7312096 7453575 7108095 7496239 8703747 8824448 7444944 8622291 8784708
5713 8784708 7251570 7733021 7779525 7862024 7759238 7779656 7003913 8311386 6591827 7571389
5703 7571389 9007850 8124427 8540679 8505926 9951638 9681637 9975030 9404628 7912524
5694 7912524 9105890 8994252 9484270 10598525 10543553 10088910 10037826 9744431 9927292 9870923
5684I870923L00988R98595O45897K86511L53642j98069L80295N50485p4354K80304
5674A3395217J332754J234421m89357R21000J33883k28533k25771J195539J394837
5665A8663990M61602J1988l4478Q87767J369827N12426K51179o54832M05957J091520
5655B2966946l48175j202096R93934o05978J08497J20884K35773j620224P24678
5646B1374239K69904q50479r76888r82856l04192o43830N82427q31630p71068
5637A6865627m5071j316717o29028n86762J30549q67700j631820m76882q60087
5628A0582109P79539N42115P41181O68166j539021M61484n5058j621044J356444
5619A1915915n86079K16801J66997M94914j046396J338478R74421r23349o93159
$$ plain form
5684 9870923 10171911 11170506 11816403 12102914 12456556 12258487 12638782 13189267 13114913 13395217
5674 13395217 14727971 15962392 15473035 16394035 16527918 16299385 16073614 17269153 18663990
5665 18663990 19125592 19137580 19103102 19990869 21360696 21873122 22124301 21469469 21875426 22966946
5655 22966946 22618771 21416675 22410609 21804631 21913128 22034012 22269785 20649561 21374239
5646 21374239 21644143 20793664 19816776 18833920 18529728 17885898 18468325 17636695 16865627
5637 16865627 16820556 15503839 14874811 14288049 14418598 13550898 11919078 11442196 10582109
5628 10582109 11361648 11903763 12644944 13313110 11774089 12235573 12180515 10559471 11915915
5619 11915915 11329836 11546637 11713634 12208548 11162152 12500630 13475051 12551702 11858543
5610A1858543j12364J116395j075448j29326L38693o27048j7482R62789R27691
5601A3242443l98184r81349q67808R46277k86741j52400J492863k5273j083292
5592A1886536K64362j29935L68107n48951k19154o55741M81350J584270j064406
5583A1966438j561368P2228l08722m13003j47181j052780K09363P52961J30025
5574I647961p32255j04107l66979j40707m74957N14409N01891K52012j119442
5565G977826j251983J669305j070304J075755O40453o60925J639907j424411k75247
5556H320376m94589K44435r3760N23089p03230o83742l09131J122296L88410m339
5546H309815M62371k91721m85973N99260K34769Q52564j156222j74335k6908q0247
$$ plain form
5610 11858543 11746179 12862574 11787126 11657800 11996493 11369445 11351963 12314752 13242443
5601 13242443 12844259 11862910 10995102 11941379 11654638 11502238 12995101 12969828 11886536
5592 11886536 12150898 12020963 12389070 11840119 11620965 10965224 11446574 13030844 11966438
5583 11966438 10405070 10477298 10168576 9755573 9608392 8555612 8764975 9517936 9647961
5574 9647961 8915706 8811599 8444620 8303913 7828956 8343365 8845256 9097268 7977826
5565 7977826 6725843 8395148 7324844 8400599 9041052 8380127 10020034 8595623 8320376
5556 8320376 7825787 8070222 7976462 8499551 7796321 7112579 6803448 7925744 8314154 8309815
5546 8309815 8772186 8480465 7994492 8593752 8828521 9681085 8524863 8350528 8323620 8243373
5536H243373R14601k173424O03288k8120M84784k73108o33219J504888j48014
5527H495049K54472K9596j91472M28648m19698K76435k17644n26823r11016O85194
5517G902741j035130Q51822J053306K30560k35039J3398n35501J40492k25767
5508H160882k17455J463586j69643k65841n3194L24979M6642j843206Q77456Q35564
5498I159770q10186K02637N65045P75n75517j42977K14339k65386p58543Q40418
5488H430375N78111N109q16057q2876l03391J304166L2597N4147K58437K28075
5478I688693J148463R34663j653686p48235M8504m52903k06282l52786K64002
5469H670433p8036J176819j23167O90190j806386p14370J079282R51015r39252
$$ plain form
5536 8243373 9157974 6984550 7587838 7559718 8044502 7771394 7138175 8643063 8495049
5527 8495049 8749521 8779117 8587645 9016293 8596595 8873030 8655386 8128563 7217547 7902741
5517 7902741 6867611 7719433 8772739 9003299 8768260 8781658 8246157 8386649 8160882
5508 8160882 7943427 9407013 9237370 8971529 8918335 9243314 9289956 7446750 8324206 9159770
5498 9159770 8349584 8552221 9117266 9118041 8542524 8399547 8613886 8348500 7589957 8430375
5488 8430375 9008486 9013595 8197538 8114662 7811271 9115437 9148034 9202181 9460618 9688693
5478 9688693 10837156 11771819 10118133 9369898 9418402 8965499 8759217 8406431 8670433
5469 8670433 8592397 9769216 9646049 10336239 8529853 7815483 8894765 9845780 8906528
5460H906528m22459J59042Q18446j78022L05145M94996p50115N16020J05318l65527
5450I589372j189200M62191P85412O49148k83691m75372J64244K27897m72425
5441I457576m60002O9067j78627m00642K27955R75435o45598j094746J023350
5432H973768J120382N9456o1464O11078j261354j66832M16810k13481j513340
5423G965023J189048J421880l25503M85917j207249j455717J303080J560685n93628
5414A0343536o66632j197198r4288N41625J299739L93784j3890K4480r01849M47312
5404A0176619k26345m48070k85787L27889j77479j520556R23680J145263r1322
5395I823892L7025j197640N26071J856555N85062m5967j94605o0333L8518l31526
$$ plain form
5460 8906528 8484069 8643111 9461557 9283535 9588680 10083676 9333561 9849581 9954899 9589372
5450 9589372 8400172 8862363 9647775 10296923 10013232 9537860 9702104 9930001 9457576
5441 9457576 8997574 9066641 8888014 8487372 8715327 9690762 9045164 7950418 8973768
5432 8973768 10094150 10153606 10092142 10703220 9441866 9275034 9691844 9478363 7965023
5423 7965023 9154071 10575951 10250448 10736365 9529116 8073399 9376479 10937164 10343536
5414 10343536 9676904 8479706 8385418 8927043 10226782 10620566 10606676 10631156 9729307 10176619
5404 10176619 9950274 9502204 9216417 9544306 9366827 7846271 8769951 9915214 9823892
5395 9823892 9860917 8663277 9189348 11045903 11630965 11584998 11390393 11330060 11368578 11037052
5385A1037052j00261l16668J228712j061304j189145N51299J146499p34624q07069
5376I754491M74632K85171m09828m45964m60894L76613R36929Q06704J19937o37720
5366A0800071j89394p4672Q76402P00823p379n63116O40625o64019q09162o38523
5356A0071656J181318n02808k81186J306388k98705K77236j178819Q10563J319839
5347A2705482q03237M90554N155k49132j211340J73408P08023n8375j149532J131609
5337A1742615O8322q3586Q35767n04824r75734Q33878q83615M04056P65266m38830
5327A1763315N92555k46770O39385r8381p31041Q46482j148184k07847L47784
5318A1757298j06898j12329O6329j35207K01944J291631p98944n16237m06360
$$ plain form
5385 11037052 10936791 10620123 11848835 10787531 9598386 10149685 11296184 10561560 9754491
5376 9754491 10229123 10514294 10104466 9658502 9197608 9574221 10511150 11317854 11437791 10800071
5366 10800071 10610677 10536005 11412407 12113230 12105851 11542735 12183360 11519341 10710179 10071656
5356 10071656 11252974 10750166 10468980 11775368 11476663 11753899 10575080 11385643 12705482
5347 12705482 11902245 12392799 12397954 12148822 10937482 11110890 11818913 11760538 10611006 11742615
5337 11742615 11810937 11727351 12563118 12058294 11082560 11916438 11032823 11436879 12202145 11763315
5327 11763315 12355870 12109100 12748485 12650104 11919063 12765545 11617361 11409514 11757298
5318 11757298 11650400 11538071 11604400 11469193 11671137 12962768 12163824 11647587 11241227
5309A1241227J5974L94779R49235p1479M60999O21770k76575K00276k22034m40701
5299A2873471K84879M10226k48037O14811n94710j22970J053342L16238m33403
5290A4153847j031179Q6483M53826j62626m78196M8388l23808P09933o2429N86472
5280A3980711l17935N37305j37944J20149k1964M36712j74916j526230J01188
5271A2997076P92759q39431J523732J06410j370564j81499k50225k7887J011594
5262A3761965O17768j199748O2069J665020P8510m60227l34626R08126J569375
5253A6668232l60172j073741J3116M805N29767L97605j511983m3175l02808k22441
5243A4099205J022740j17061L47456R96135Q68086m53023q98173P82886J331703
$$ plain form
5309 11241227 11257201 11651980 12601215 12529736 12990735 13612505 13335930 13536206 13314172 12873471
5299 12873471 13158350 13568576 13320539 13935350 13340640 13217670 14271012 14587250 14153847
5290 14153847 13122668 13209151 13662977 13500351 13022155 13070543 12746735 13456668 13394239 13980711
5280 13980711 13662776 14200081 14062137 14182286 14160322 14597034 14422118 12895888 12997076
5271 12997076 13789835 12950404 14474136 14580546 13209982 13028483 12778258 12750371 13761965
5262 13761965 14379733 13179985 13242054 14907074 14985584 14525357 14190731 15098857 16668232
5253 16668232 16308060 15234319 15247435 15252240 15782007 16179612 14667629 14624454 14321646 14099205
5243 14099205 15121945 15004884 15352340 16348475 17216561 16763538 15865365 16648251 17979954
5234A7979954m24175n12233M28967k47142P22170l64235L01787J054246q0706
5225A8858633l04749Q67323j81670k04676L28513Q30240o56007J222885K04198
5216B0964690q2276J25577l21590M10643J417635K15375K98001J080715l01280
5207B3807490P38814M86339R40885K10053Q03140L32739l77458J043550L41281
5198B8326833L45272J384228j600208n47669P09285M46876R6978j448107M56108
5189B8169596j3179L81332P93757r37143j018650o24519P32535m46283M49390
5180B7486836J665218k124246m36445M11671m34042o55729k86735l81217N1615
5171B5296926P27995O30048p17665j260432o67298n83780J47220r40531n55257
$$ plain form
5234 17979954 17555779 17043546 17472513 17225371 17947541 17583306 17885093 18939339 18858633
5225 18858633 18553884 19421207 19239537 19034861 19363374 20193614 19537607 20760492 20964690
5216 20964690 20882414 21007991 20686401 21097044 22514679 22730054 23028055 24108770 23807490
5207 23807490 24546304 25032643 25973528 26183581 26986721 27319460 26942002 27985552 28326833
5198 28326833 28672105 30056333 28456125 27908456 28617741 29064617 29161595 27713488 28169596
5189 28169596 28156417 28537749 29331506 28394363 27375713 26751194 27483729 27037446 27486836
5180 27486836 29152054 27027808 26591363 27003034 26568992 25913263 25626528 25245311 25296926
5171 25296926 26024921 26654969 25937304 24676872 24009574 23425794 23573014 22632483 22077226
5162B2077226M97337n21351J260667m81073M08680L70489k22321L20329l74743
5153B3335240l84123l92638j165927Q08899P26495j026061Q16429p04253Q42583
5144B2856644n44524J037051n34869k74332j59796j08442L59704J17555l52859
5135B2396132J285391J93240m26656O90893p67170N73367J137888L0840J070110
5126B6184035N12205q49033N14627o9526R35199j62849N86115j75545K03571Q53327
5116B8532126j85411n46387J057700O47241o7976Q99832J062205p51903J34118
5107C0781545J06821L22939J560090L41781J73884K90642m90755j56921O44192
5098C3574218K15729j70770N18219l42301Q8503Q43642N24927j25797j50434J21328
$$ plain form
5162 22077226 22574563 22053212 23313879 22832806 23241486 23611975 23389654 23709983 23335240
5153 23335240 22951117 22558479 21392552 22201451 22927946 21901885 22718314 22014061 22856644
5144 22856644 22312120 23349171 22814302 22539970 22380174 22271732 22631436 22748991 22396132
5135 22396132 23681523 23874763 23448107 24139000 23371830 23945197 25083085 25113925 26184035
5126 26184035 26696240 25847207 26361834 26292308 27227507 27064658 27650773 27475228 27678799 28532126
5116 28532126 28346715 27800328 28858028 29505269 29437293 30337125 31399330 30647427 30781545
5107 30781545 30888366 31211305 32771395 33113176 33287060 33577702 33086947 32930026 33574218
5098 33574218 33789947 33619177 34137396 33795095 33883598 34727240 35252167 35126370 34975936 35097264
5088C5097264J279243R46959m92574J39382J745453k93719J137983Q47948r78763
5079C9429176R77376R2249J795978M77961J787057J157499M97790P25386J557846
5070D8498318J73372J591973J212808K653389J411675O02882J119313J592430
5062E8856160J619766J404576J712887J403957J151312J233493K385790K89520
5054G0057461Q10971Q28539M88703O82964l60174M07523r07172n46756k70784
5045G1191275j213773J89202r73409j497546L22221q46420R37582M71843L43955
5036F8924930Q05507p79933k15956K359329L62340K624950R64751J040785L270137
5027G9356840J686131L586045K518605K111807L047226L065711K814331K959597
$$ plain form
5088 35097264 36376507 37323466 36830892 36970274 38715727 38422008 39559991 40407939 39429176
5079 39429176 40406552 40498801 42294779 42772740 44559797 45717296 46215086 46940472 48498318
5070 48498318 48671690 50263663 51476471 54129860 55541535 56144417 57263730 58856160
5062 58856160 60475926 61880502 63593389 64997346 66148658 67382151 69767941 70057461
5054 70057461 70868432 71696971 72185674 72868638 72508464 72915987 72008815 71462059 71191275
5045 71191275 69977502 70166704 69193295 67695749 68017970 67171550 68109132 68580975 68924930
5036 68924930 69730437 68950504 68734548 71093877 71456217 74081167 75045918 76086703 79356840
5027 79356840 81042971 84629016 87147621 89259428 92306654 95372365 98186696 101146293
5019A01146293K947653J629938m34601j73655q18510k559449k928335l480130
5011I5329204m171131l434240m538023j469544k423600k973172m101577l70722
5003G1847195k015976j735480q04303k95108q99083o30204q40692K31256Q14890
4994F5672495Q2929n22077M93457q41424j58305o83678Q61256j724399l60899
4985F2819355j21515j130758o6957j001914l16519q52498O03964j515413k35586
4976E8182159n43953l13431R60438M89073o72738K009194m55163l72481J525098
4967F0808196M35231J499335R64415Q52910N28263P04240J430671J586167P99127
4958F9608555N07341Q11990J381838J210562m63723O70813q94272O41629L81643
$$ plain form
5019 101146293 104093946 105723884 105289283 105115628 104297118 101737669 98809334 95329204
5011 95329204 91158073 87723833 83185810 81716266 79292666 76319494 72217917 71847195
5003 71847195 69831219 68095739 67291436 66996328 66097245 65467041 64626349 64857605 65672495
4994 65672495 65755424 65233347 65726804 64885380 64727075 64043397 64904653 63180254 62819355
4985 62819355 62697840 61567082 61500125 60498211 60181692 59329194 59933158 58417745 58182159
4976 58182159 57638206 57324775 58285213 58774286 58101548 60110742 59655579 59283098 60808196
4967 60808196 61243427 62742762 63707177 64560087 65088350 65792590 67223261 68809428 69608555
4958 69608555 70115896 70927886 72309724 73520286 73056563 73727376 72833104 73474733 73856376
4949G3856376Q078n00297j74457L98743p91497J129128R05549K03547O26786O26136
4939G6288092K516129J124477m30193J251971J866091J832966J419144K623578
4931H8492255K945149R62329K848461K834940L177660K755132K351577L551440
4923A09918943K209496L567724L675858L109668L132579Q36603K390751Q07736
4915A29649358O41689J486965J866591K315786K368140R89852K272244L408573
4907A44999198K017231L084035K202251M070812L792494L896110N382933M824364
4899A74269428O332748N626068O086695N164057O818035O316880O419668O167239
4891B23200818N501857M508928M583854N804330L995480K850803Q51123o45671
$$ plain form
4949 73856376 73864454 73364157 73189700 73588443 72796946 73926074 74831623 75035170 75661956 76288092
4939 76288092 78804221 79928698 79498505 80750476 82616567 84449533 85868677 88492255
4931 88492255 91437404 92399733 95248194 98083134 101260794 104015926 106367503 109918943
4923 109918943 112128439 115696163 119372021 122481689 125614268 126450871 128841622 129649358
4915 129649358 130291047 131778012 133644603 135960389 138328529 139318381 141590625 144999198
4907 144999198 147016429 150100464 152302715 156373527 160166021 164062131 169445064 174269428
4899 174269428 180602176 186228244 192314939 197478996 204297031 210613911 217033579 223200818
4891 223200818 228702675 233211603 237795457 243599787 247595267 250446070 251297193 250651522
4883B50651522k228573l321276m172408m102540m428682l214932l549499j102082
4875B24531530r02634o83054O90929K386422K243904M759199L388754N546593
4867B41961643N444931M337580P371610O831826Q739063J0084898J1236231J2454805
4859C08462587J4479420J4550112J7117565J7179773J7078401J8287603K1406286
4852D28561747K0465972J9598798J6509702N097371o519339j5605419k2678358
4845D45430474k8352786k9382494k6548723k3813616j8570244j7027196j4111733
4838B87623682j0962564j1211795q975549p198448p985240p949891q233637r015349
4830B16091209q259817r969300r259806p518881p722653p058957o842189n933730
$$ plain form
4883 250651522 248422949 245101673 240929265 236826725 232398043 229183111 225633612 224531530
4875 224531530 223628896 222945842 223636771 226023193 228267097 233026296 236415050 241961643
4867 241961643 247406574 251744154 259115764 265947590 274686653 284771551 296007782 308462587
4859 308462587 322942007 337492119 354609684 371789457 388867858 407155461 428561747
4852 428561747 449027719 468626517 485136219 490233590 483714251 468108832 445430474
4845 445430474 417077688 387695194 361146471 337332855 318762611 301735415 287623682
4838 287623682 276661118 265449323 256473774 249275326 241290086 233340195 225106558 216091209
4830 216091209 207831392 197862092 188602286 181083405 173360752 166301795 159459606 153525876
4822A53525876n350239m558130m540950m051973l180888m429400l527992m846267
4814A19040037m045669j745554j921311l102680m664450m698730k276911k144633
4806I4440099k188148k624023k021635k838238j859008p03726j373168k567922
4798G8264231k354031j94692k577691j791260k38077j755674P44415j557390j736227
4789F6803604j759710o78573q23587L2499k23787k126833K63894J07782o45531
4780F0949758K61972r36873q29566j6323O78059J14021l33329j258888k79940
4771E8348891O49096r76251q59022M38852N41379R53359m67082l29269J000725
4762E9300678J470887J262258l79728N00766N95285K020975L41166R10354J472140
$$ plain form
4822 153525876 148175637 143617507 139076557 135024584 131843696 127414296 123886304 119040037
4814 119040037 114994368 113248814 111327503 108224823 103560373 98861643 96584732 94440099
4806 94440099 92251951 89627928 87606293 84768055 82909047 82205321 80832153 78264231
4798 78264231 75910200 75715508 73137817 71346557 71108480 69352806 70097221 68539831 66803604
4789 66803604 65043894 64365321 63541734 63574233 63350446 61223613 61487507 61595289 60949758
4780 60949758 61211730 60274857 59445291 59428968 60107027 60221048 59887719 58628831 58348891
4771 58348891 58997987 58021736 57162714 57601566 58142945 59096304 58629222 58299953 59300678
4762 59300678 60771565 62033823 61654095 62154861 62750146 64771121 65112287 66022641 67494781
4753F7494781J90194k09157o71203j240510j345373j342655M10351j494364k822571
4744E8969493j106567k065527k649768k722966j945088j087587k399656j482617
4736D3509717k55303j266895k475262j168564j053034r93232l84860r08976k95238
4727C4708353R4007j577541k75725p77239J39453o60352o17461k53828j64903
4718C0614764K15483j291848j60155K50707k60329p11462K08047l13269j30004
4709B8421934M6427N4875k53716J64817k60441j263572j321495j263589L87026
4700B4712266j087590J029796K49297q20766k8545M93738j006128j539539k96275
4691B1706254o77565O23283O22761M28948l01861j062152N11107n89243q37100
$$ plain form
4753 67494781 67684975 67475818 66804615 65564105 64218732 62876077 63286428 61792064 58969493
4744 58969493 57862926 55797399 53147631 50424665 48479577 47391990 44992334 43509717
4736 43509717 43254414 41987519 39512257 38343693 37290659 36297427 35912567 35003591 34708353
4727 34708353 34802360 33224819 32949094 32171855 32311308 31650956 31033495 30779667 30614764
4718 30614764 30830247 29538399 29378244 29628951 29368622 28657160 28865207 28551938 28421934
4709 28421934 28468361 28523236 28269520 28434337 28173896 26910324 25588829 24325240 24712266
4700 24712266 23624676 24654472 24903769 24083003 24054458 24548196 23542068 22002529 21706254
4691 21706254 21028689 21651972 22274733 22703681 22401820 21339668 21850775 21261532 20424432
4682B0424432k57845m1966R21562J6437q8098q08156K83591K02648r42414M78234
4672B0188425M32987O20241n74860q37672O79275M29456K02987L37532j844970
4663A9633401j435685R4041M69332Q50073j399144K80559m69191q28419N02591
4654A7697558J43266J126905J50838k036577l60572M45414r3621Q41513k13388
4645A7701336n68325j118012p7774P13913p99271J98547L99702P83087N31959
4636A7765162q96843p51147J335269J14382m16164J41542l61438Q57617K80907
4627A8069287q52323J32188K15917L92399o99532L37349N57264j35135o08073
4618A7409341k40606J07473J288550L88503p42039K25147K49949r64516N58314
$$ plain form
4682 20424432 20166587 20124621 21046183 21062620 20974522 20166366 20449957 20652605 19710191 20188425
4672 20188425 20621412 21241653 20666793 19829121 20508396 20937852 21140839 21478371 19633401
4663 19633401 18197716 18291757 18761089 19611162 18212018 18492577 18023386 17194967 17697558
4654 17697558 17840824 18967729 19118567 17081990 16721418 17166832 17073211 17914724 17701336
4645 17701336 17133011 16014999 15937225 16651138 15851867 16050414 16450116 17233203 17765162
4636 17765162 16868319 16117172 17452441 17566823 17150659 17292201 16930763 17788380 18069287
4627 18069287 17216964 17349152 17565069 17957468 17257936 17595285 18152549 18017414 17409341
4618 17409341 17168735 17276208 18564758 18953261 18211222 18436369 18686318 17721802 18280116
4609A8280116L75881m22207M27918o51122n65931J143062j92055m84029J283297
4600A9194930K61490m81002J818453O18134j168077Q9535m6122L6185K18244R39519
4590B1481289r89470J159226L66277j177698O68029l02025J468417J837977R19350
4581B5431372J036124j11801J509179K490774k89733J366939K135997K264383
4573C5833234J633632M44838O58384n60116l194083k516029o22426j829649k837984
4564B7009801j498750k10425k110237r79205R86349l09094q32214k30861j974001
4555A9851363j366014N82402o40285m66779l29083n8785O50171j024441l61692
4546A6836857k18716J212223j020264K669n25722J16448J584106n04664j761447
$$ plain form
4609 18280116 18655997 18233790 18661708 18010586 17444655 18587717 18395662 17911633 19194930
4600 19194930 19456420 18975418 20793871 21412005 20243928 20333463 20287341 20323526 20541770 21481289
4590 21481289 20491819 21651045 22017322 20839624 21507653 21205628 22674045 24512022 25431372
4581 25431372 26467496 26355695 27864874 30355648 30065915 31432854 33568851 35833234
4573 35833234 37466866 37911704 38570088 38009972 34815889 32299860 31677434 29847785 27009801
4564 27009801 25511051 25300626 23190389 22211184 23197533 22888439 22056225 21825364 19851363
4555 19851363 18485349 19067751 18427466 17960687 17631604 17572819 18222990 17198549 16836857
4546 16836857 16618141 17830364 16810100 16812769 16287047 16403495 17987601 17482937 15721490
4537A5721490J41078R05615p40675m10999R67726n66919N0130k33649k064369
4528A3769428O79689P93686K49520l6301p74643p46156P70119o83402J049893
4519A5071833J74208j255356J517079M48337n05025k55048n58455L18703J824437
4510A6780713L24562l70611o83788j73912Q19478M40475k23062q50394N97845
4501A6661306L88763J07146o81828J14021J136952j105619R41282J015973M26407
4492A9004403M30029O82766N06422K025157P31273M41139J509909J009591J677769
4483B8018458M37942M92205n32985n32798j904246j308147n54909q66923k110999
4474B1137598j642670k25509l56747q68704p18817r5270o14395o59558P95607
$$ plain form
4537 15721490 15862568 16768183 16027508 15616509 16584235 16017316 16067446 15833797 13769428
4528 13769428 14449117 15242803 15492323 15456022 14681379 13935223 14705342 14021940 15071833
4519 15071833 15246041 13990685 15507764 15956101 15451076 15196028 14637573 14956276 16780713
4510 16780713 17105275 16734664 16050876 15876964 16696442 17136917 16913855 16063461 16661306
4501 16661306 17050069 17157215 16475387 16589408 17726360 16620741 17562023 18577996 19004403
4492 19004403 19434432 20117198 20623620 22648777 23380050 23821189 25331098 26340689 28018458
4483 28018458 28456400 28948605 28415620 27882822 25978576 24670429 24115520 23248597 21137598
4474 21137598 19494928 19269419 18912672 18043968 17325151 17229881 16615486 15955928 16751535
4465A6751535J70861n04423j446228m89323p29153o10541k0198R55036p92500
4456A3285066N417J160008j20374j4938j19907J246920o36577k59343P7077j11713
4446A4511636q0376K53638K37471o55524p11369q40077J071359J072777l35195
4437A4524340j164041l85439O49960M54017K62717p20651K44193o3360n26856
4428A3274880M75286Q63881m07072l31110J44873n69742N07212J35926J55480
4419A4249614L2363L94140J20911l41448j18163P60738P0931o55651P78541L03370
4409A5595346J094302j27300L98967J52329J8729n245J24660J144981J018425
4400A9415194J198090Q82528j023844O20631j32571j452836l20129M48908q00947
$$ plain form
4465 16751535 16922396 16417973 14971745 14482422 13753269 13142728 13122530 14077566 13285066
4456 13285066 13290483 14450491 14330117 14315179 14195272 15442192 14805615 14546272 14623349 14511636
4446 14511636 14431260 14684898 14922369 14266845 13555476 12715399 13786758 14859535 14524340
4437 14524340 13360299 12974860 13624820 14078837 14341554 13620903 13865096 13801736 13274880
4428 13274880 13750166 14614047 14206975 13875865 14020738 13450996 13958208 14094134 14249614
4419 14249614 14281977 14676117 14797028 14455580 14337417 15098155 15169086 14513435 15291976 15595346
4409 15595346 16689648 16562348 16961315 17113644 17132373 17127128 17251788 18396769 19415194
4400 19415194 20613284 21495812 20471968 21092599 20960028 19507192 19187063 19635971 18835024
4391A8835024j1524l2089r67254r61982p02612n65603j36529L01188P068P12165
4381A6477852P4728j451432P79638J249759l77537J05838m2943m40834j63709
4372A6211360J057861k00556N12590o37173K470671P21294N2374o83403p25446
4363A8779572M82155Q31196L84227K55392Q01998J89425J066007J005128J974807
4354B5769907J979924K335444K550382L714029K614896J358575N056066N400536
4346E0779759M658523j113188k852424k438703m714117m887875l800566k857836
4338C2773573l290445k246330k800523k16282K09753k256501j660479P52335p56004
4329B0509097k027315j311748K60616l82479k49166r23280l86921J071137j45414
$$ plain form
4391 18835024 18823500 18791411 17824157 16862175 16159563 15593960 15457431 15758619 15765687 16477852
4381 16477852 16552580 15101148 15880786 17130545 16753008 16858846 16815903 16375069 16211360
4372 16211360 17269221 17068665 17581255 16944082 19414753 20136047 20188421 19505018 18779572
4363 18779572 19261727 20092923 20477150 20732542 21534540 21723965 22789972 23795100 25769907
4354 25769907 27749831 30085275 32635657 36349686 38964582 40323157 45379223 50779759
4346 50779759 55438282 54325094 51472670 49033967 44319850 39431975 35631409 32773573
4338 32773573 29483128 27236798 24436275 24219993 24429746 22173245 20512766 21265101 20509097
4329 20509097 18481782 17170034 17430650 17048171 16799005 15875725 15488804 16559941 16414527
4320A6414527L57803j713513j996807J289403j83242l95035q39719K33389J535269
4311A4702075j109016J44303o06038r6370P06747O61040N28200r50620n41620
4302A3438701j046610K66079N60655p19444j65522k32084K50138l08450K72216
4293A2315679O58102P03429j495468L67783l93425j161553Q33157J080474j255098
4284A1653080k28243Q13744Q3364j36965l01161J519398j595137k14366j598167
4275I995547L02260l4434J001466k2473m70029j109990L82427j66883Q93316j22924
4265A0648283j055168J340406l92544K47703M75971R92709j116742j115505K95217
4256A0320330J42183m56984N86460M43317p78382q47647L89347k22382n12956
$$ plain form
4320 16414527 16772330 15058817 13062010 14351413 14168171 13773136 12933417 13166806 14702075
4311 14702075 13593059 13737362 13131324 13034954 13741701 14402741 14930941 13980321 13438701
4302 13438701 12392091 12658170 13218825 12499381 12333859 12101775 12351913 12043463 12315679
4293 12315679 12973781 13677210 12181742 12549525 12156100 10994547 11827704 12908178 11653080
4284 11653080 11424837 12238581 12321945 12184980 11883819 13403217 11808080 11593714 9995547
4275 9995547 10297807 10263373 11264839 11242366 10772337 9662347 10044774 9877891 10771207 10648283
4265 10648283 9593115 10933521 10540977 10788680 11264651 12257360 11140618 10025113 10320330
4256 10320330 10462513 10005529 10591989 11035306 10256924 9409277 9798624 9576242 9063286
4247I063286r5380Q83017R29206M85075P2425o63082m13419L83260m07645j239260
4237H997483J624508p28683m09297L99194q07984P00955O60331m09061K52394
4228A0279840j219279k70983N26957O36370N21740k24765k47237q44452J041784
4219A0199975k22777N0519k84048O69768k74475o46370m2905l81855M42437K25092
4209I735361n30298N12896j40205j048309O17459K06943j642952K179K10761O77025
4199H600860N51859O80276O86173q62057k93926Q97662q43661m15005M64436R37515
4189A0404132n86780l66299M55654o15647m92715J74780L14048n66101J25179
4180H846251J272102k34736m23925q09359P95045k08843l65676Q67567q58124
$$ plain form
4247 9063286 8967906 9850923 10780129 11265204 11337629 10674547 10261128 10644388 10236743 8997483
4237 8997483 10621991 9893308 9484011 9883205 9075221 9776176 10436507 10027446 10279840
4228 10279840 9060561 8789578 9316535 9952905 10474645 10249880 10002643 9158191 10199975
4219 10199975 9977198 10027717 9743669 10413437 10138962 9492592 9449687 9067832 9510269 9735361
4209 9735361 9205063 9717959 9577754 8529445 9146904 9353847 7710895 7713074 7923835 8600860
4199 8600860 9152719 9832995 10519168 9657111 9363185 10260847 9417186 9002181 9466617 10404132
4189 10404132 9817352 9451053 9906707 9291060 8798345 8973125 9287173 8721072 8846251
4180 8846251 10118353 9883617 9459692 8650333 9445378 9236535 8870859 9738426 8880302
4171H880302j85465P84575L37822K54324k79203n91681j172489K40609P33030
4162I001824q04461o95707L16474J198496o54832J20715R01802j21940j310809
4153G951562M59161Q39060m81704J92162J85900l67180o41949P50131Q9284M08975
4143I385402p86737j020753k64947M62155N59969L32158j497272K47367K10789
4134G628131R3862R04554O32624L15687j212228P47582j49058N52306j291738
4125H221722J795095O8598l36682j393529o802j22860q09207L92249m38219P71826
4115H142191K59271j047137J414413J086355m41390J51125j400997l28567k58182
4106G577082k31963P72547k1900j28046k76137M89540K92469j267825K09609l92724
$$ plain form
4171 8880302 8694837 9479412 9817234 10071558 9792355 9200674 8028185 8268794 9001824
4162 9001824 8197363 7501656 7818130 9016626 8361794 8482509 9384311 9262371 7951562
4153 7951562 8410723 9249783 8768079 8960241 9146141 8778961 8137012 8887143 8976427 9385402
4143 9385402 8598665 7577912 7312965 7775120 8335089 8667247 7169975 7417342 7628131
4134 7628131 7721993 8626547 9259171 9574858 8362630 9110212 8961154 9513460 8221722
4125 8221722 10016817 10085415 9748733 8355204 8348402 8225542 7416335 7808584 7370365 8142191
4115 8142191 8401462 7354325 8768738 9855093 9413703 9564828 8163831 7835264 7577082
4106 7577082 7345119 8117666 8095766 7967720 7691583 8181123 8473592 7205767 7415376 7022652
4096G022652Q01994J15902k284746K92765J169912J359743m64307R0292J003801
4087I108008j344743k05220M14418m80495k13098N88728j89116j366235K57158
4078F569405o24528L03172J849959O60779k27122l34292r49103N24932J43272
4069G916474j64861j029283j6056Q51552O02637j26773p34466l48218R51596R67786
4059H870388j041662l68459k15074p9260m85448P51704R54296m67668J20272M27398
4049H466487p74602q62682o67054p64828O8057J674540J300174j340200n18686
4040F581206J507065J35317n14849k86169n93449j198988J403642K92169q95352
4031F430592m69173P18088r93355R19035M8897N56946R00963P8461j448021K2829
$$ plain form
4096 7022652 7824646 7940548 5655802 5948567 7118479 8478222 8013915 8104207 9108008
4087 9108008 7763265 7558045 7972463 7491968 7278870 7867598 7678482 6312247 6569405
4078 6569405 5944877 6248049 8098008 8758787 8531665 8197373 7248270 7773202 7916474
4069 7916474 7751613 6722330 6706274 7557826 8160463 8033690 7299224 6951006 7902602 8870388
4059 8870388 7828726 7460267 7245193 7165933 6680485 7432189 8386485 7918817 8039089 8466487
4049 8466487 7691885 6829203 6162149 5397321 5465378 7139918 8440092 7099892 6581206
4040 6581206 8088271 8223588 7708739 7422570 6829121 5630133 7033775 7325944 6430592
4031 6430592 5961419 6679507 5686152 6605187 6654084 7211030 8111993 8190454 6742433 6765262
4021F765262R32599p24543J38007n43880R46648N45895M9687q6403l71141p60044
4011F892087p39407J027841R2437j002317J384254O61868N41544q69576k81335
4002G707396j16957r00317j63415q01182J385587o38145K06437J72950n31686
3993F320668O10595J73468K52432j15460L77131o73985q25041n74930P11580O40368
3983F896826k77681K30585K38348O69009r77397N12601J26891O42328j407836
3974F653674Q0588k00335q83932L18903k47635N81404J056236P5584r94197k38621
3964F201669l00716K31488n66591J17347J062206K98523K15939K42063j28740
3955G373188j130759l90019J381903j73613O16646p57555p4963q8800o25586K61900
$$ plain form
4021 6765262 7697861 6973318 7111325 6567445 7514093 8059988 8109675 8023272 7652131 6892087
4011 6892087 6152680 7180521 7272958 6270641 7654895 8316763 8858307 7988731 7707396
4002 7707396 7590439 6690122 6526707 5725525 7111112 6472967 6679404 6852354 6320668
3993 6320668 6931263 7104731 7357163 7241703 7618834 6944849 6119808 5544878 6256458 6896826
3983 6896826 6619145 6849730 7088078 7757087 6779690 7292291 7419182 8061510 6653674
3974 6653674 6734262 6533927 5649995 5968898 5721263 6302667 7358903 7434487 6440290 6201669
3964 6201669 5900953 6132441 5565850 5683197 6745403 7043926 7259865 7501928 7373188
3955 7373188 6242429 5852410 7234313 7060700 7677346 6919791 6844828 6756028 6130442 6392342
3945F392342L1071K98473P6949r59960l28070j23904o92160J633047N71555j584716
3935E314627N35418k9839m13804O94558l25981r42677J041234l1397J049686j033881
3925E857944R92076l13413j60950Q91847o35616Q4371L46929P98970q89660j498301
3915E474197J309429k70551n83389o51018j140660R17096m5194m62584J082747
3906E630073J761819j10657o99467k15701o77192M36200j070651m79361P4358
3897D649421J44966k15241P8166J630535L31395j187535J143739j01969l15350
3888F158127k47492o20795p6575K03777L17425j485984Q42920J261987M79727
3879F833117Q41384l13069j159523Q44716n70848l29344j414599J20565P5498
$$ plain form
3945 6392342 6423413 6721886 6798835 5838875 5510805 5386901 4694741 6327788 6899343 5314627
3935 5314627 5850045 5820206 5406402 6100960 5774979 4832302 5873536 5842139 6891825 5857944
3925 5857944 6850020 6536607 6375657 7267504 6631888 6716259 7063188 7862158 6972498 5474197
3915 5474197 6783626 6513075 5929686 5278668 4138008 5055104 5009910 4547326 5630073
3906 5630073 7391892 7281235 6581768 6366067 5688875 6125075 5054424 4575063 4649421
3897 4649421 4794387 4579146 4657312 6287847 6619242 5431707 6575446 6473477 6158127
3888 6158127 5910635 5289840 5213265 5417042 5734467 4248483 5091403 6353390 6833117
3879 6833117 7674501 7361432 6201909 7046625 6475777 6146433 4731834 4852399 4927897
3870D927897N64554Q40743J10102j60522R03957j630022K01782R8919N26392O64938
3860G048740n0139r44604J96497K25045j79754o42197p15426j52860N26998L49720
3850E662020j28902j94706l48919k5382O70894P42556o34423O49738o00377q96133
3840D896366l50394P32743J007029M23465m92967m90747K82825Q50666k58029
3831F600957K66113n986n8128q05116m34792N66719O3758m30136n14527J077965
3821F326827n94599r62905J162222k66414m36752K8210N37662j37272l14970P55079
3811F097088o88123N7349J136055j80695r5867K53257q92526j108360J128349
3802E706527J496818j032467r14561k94099m41034o91299O07553P01091K8414
$$ plain form
3870 4927897 5492451 6333194 6443296 6282774 7186731 5556709 5758491 5857410 6383802 7048740
3860 7048740 6998601 6053997 6250494 6475539 6295785 5653588 4938162 4785302 5312300 5662020
3850 5662020 5533118 5338412 4989493 4964111 5635005 6377561 5743138 6392876 5792499 4896366
3840 4896366 4545972 5278715 6285744 6709209 6216242 5725495 6008320 6858986 6600957
3831 6600957 6867070 6861084 6802956 5997840 5563048 6129767 6193525 5763389 5248862 6326827
3821 6326827 5732228 4769323 5931545 5665131 5228379 5256589 5794251 5656979 5342009 6097088
3811 6097088 5408965 5466314 6602369 6421674 6325807 6579064 5686538 4578178 5706527
3802 5706527 7203345 6170878 5256317 4962218 4521184 3829885 4437438 5138529 5166943
3793E166943o19107j24970J612121j644024M20059M02124o02012K32312N69962
3784E413408K21359L22294j430883R86407Q25440j705578j22428m94880R86782
3775E001921J082928O15262O55299q18160q93886p92471o82696L72064R14813
3766E455074k31219j104961N73612L96796n80954R73183j058622o4236J410765
3757E769438o90607J297242n35649N92339q27567j228256L33676J028666k26105
3748E513177P2677J18421n01334N87877p84044L53406L8219k31481m56716J128156
3738E838358L869O06122j3380j195419J162800m05443q20731p96546j13466O02006
3728D868170k70163k13730o8050j94106L88728j47754Q24677n5196L50460r45259
$$ plain form
3793 5166943 4547836 4422866 6034987 4390963 4811022 5213146 4611134 4843446 5413408
3784 5413408 5634767 5957061 4526178 5512585 6338025 4632447 4510019 4015139 5001921
3775 5001921 6084849 6700111 7355410 6537250 5643364 4850893 4168197 4540261 5455074
3766 5455074 5223855 4118894 4692506 5089302 4508348 5481531 4422909 4358673 5769438
3757 5769438 5078831 6376073 5840424 6432763 5605196 4376940 4710616 5739282 5513177
3748 5513177 5585854 5704275 5202941 5790818 5006774 5360180 5398399 5166918 4710202 5838358
3738 5838358 5842227 6448349 6434969 5239550 6402350 5996907 5176176 4379630 4266164 4868170
3728 4868170 4598007 4384277 4316227 4122121 4510849 4363095 5187772 5132576 5483036 4537777
3718D537777L8933N95137n15886N16757q24685k03856O99863j5366O7723M82489
3708E378886k86863q9979P008m7808K95977N90071j13755o4253k46174M1790K36765
3697E701665l01067n83951j329725N63275m48332P11332O59143L44056l91813
3688D924583O6117o44983j351688J089952M80447K5393O599l1598L29705j040130
3678C854397K7384j03897P86195R11688k84843O62050m0979N63045j907175J063842
3668E531707j141403m57934K35851K79044j01627M12275N31694q4244j3431P49781
3658E941713j131747J392514Q29959j125136L50303k48392l27618q68190N40276
3649E353682n89369N20137N15725l14175O59511M11268l83475J18605L93319j19106
$$ plain form
3718 4537777 4576710 5171847 4655961 5172718 4348033 4144177 4844040 4828674 4896397 5378886
3708 5378886 5092023 5002044 5009052 4961244 5257221 5847292 5733537 5669284 5423110 5464900 5701665
3697 5701665 5400598 4816647 3486922 4050197 3601865 4313197 4972340 5316396 4924583
3688 4924583 4990700 4345717 2994029 4083981 4564428 4589821 4596420 4564822 4894527 3854397
3678 3854397 3881781 3777884 4564079 5475767 5190924 5852974 5811995 6375040 4467865 5531707
3668 5531707 4390304 3932370 4168221 4447265 4345638 4757913 5289607 5205363 5191932 5941713
3658 5941713 4809966 6202480 7032439 5907303 6257606 6009214 5681596 4813406 5353682
3649 5353682 4764313 5284450 5800175 5486000 6145511 6556779 6173304 6291909 6685228 6566122
3639F566122j641253N73109K91891j95331L95279R86674K004j29978R15039J47615
3629G911171l74329j075511Q96634O95959j641289j56608K95266L50554L66906
3620G268753L24996m23598n01553J829082k79299p99361p14093J85860l85608
3611F505179O42960O36028o47404m18603M66466J681603q69366O2305O06079q07875
3601G857372L13368L38595k55796N96732p02006k48404r2591N49397P33441j74907
3591H915201M14463q76014l65749O39018J79170j026412N63169Q64789K55369
3582I563004o2661n64419K05662J028415l83884K27898J326690q28314K64385
3573A0776776l81970M25479L23829J82032Q82574o89241Q66382J735951j093292
$$ plain form
3639 6566122 4924869 5497978 5789869 5594538 5989817 6976491 6978495 6848517 7763556 7911171
3629 7911171 7536842 6461331 7357965 8053924 6412635 6256027 6551293 6901847 7268753
3620 7268753 7593749 7170151 6668598 8497680 8218381 7419020 6704927 6890787 6505179
3611 6505179 7148139 7784167 7136763 6718160 7184626 8866229 7996863 8059168 8665247 7857372
3601 7857372 8170740 8509335 8253539 8850271 8148265 7899861 7807270 8356667 9090108 8915201
3591 8915201 9329664 8453650 8087901 8726919 8906089 7879677 8442846 9307635 9563004
3582 9563004 9500343 8935924 9141586 10170001 9786117 10014015 11340705 10512391 10776776
3573 10776776 10394806 10820285 11144114 11326146 12208720 11519479 12385861 14121812 13028520
3564A3028520R5584N74268K281034K15382L68034Q58041R15586l84760P75000
3555A8726689N71817J77074J003760K185413K087214n34256R22124J449473J214622
3546B7803930J65235q51841P68602n49118m66718k549530k017634l95316j512374
3537B0395236q79159k097352k5782r70831j953618j5949j041549j224613n09123
3528A1677260O44331j24172j66283j192003J59820Q62728p90603l92815k525459
3519H152804R86801M09045J87329q75330n59369j667611K083588o11568J50180
3510H255869K07013j843452j44633l49010N17580r94608J51169Q46263j10310
3501F535881k98945n35585p7624P82652L68873K70616r20414p44562J02789L30135
$$ plain form
3564 13028520 13124104 13698372 15979406 16194788 16562822 17420863 18336449 17951689 18726689
3555 18726689 19298506 19475580 20479340 22664753 24751967 24217711 25139835 26589308 27803930
3546 27803930 27969165 27117324 27885926 27336808 26870090 24320560 22302926 21907610 20395236
3537 20395236 19516077 17418725 17392943 16422112 14468494 14452545 13410996 12186383 11677260
3528 11677260 12321591 12197419 12031136 10839133 10998953 11861681 11071078 10678263 8152804
3519 8152804 9139605 9548650 9735979 8860649 8301280 6633669 8717257 8105689 8255869
3510 8255869 8462882 6619430 6474797 6125787 6643367 5648759 5799928 6646191 6535881
3501 6535881 6236936 5701351 5623727 6406379 6775252 7045868 6125454 5380892 5483681 5813816
3491E813816l59783l1941k76582o5489o78881Q27579J21038q27496j33476J413787
3481E802572r34108o35233m69654N3717P75211M85498n25779k33812K38594q40600
3471C716406j89269k12307O86349j37096N69820N88797q26874L00923J97641k86975
3461D407415J64317j464961J18012o02782N76029l33641K03452J67107K40335
3452C475283r70539L37915m95232m27596J158765J7833o67267K36344K60671j001096
3442A925081O02287K15904p44116O32442K44407k78291J31488n77503k43890J383579
3432C291388M40291j434437l01753o44124O38713J282876o70992P65928m9628
3423C318262j217679q21528J71842J414001N50660m09912p50438K2711n21560
$$ plain form
3491 5813816 5454033 5422092 5145510 5080021 4401140 5228719 5349757 4522261 4388785 5802572
3481 5802572 4868464 4233231 3763577 3817294 4592505 5078003 4552224 4318412 4557006 3716406
3471 3716406 3527137 3314830 4001179 3864083 4433903 5022700 4195826 4496749 4694390 4407415
3461 4407415 4571732 3106771 3224783 2622001 3198030 2864389 3067841 3234948 3475283
3452 3475283 2504744 2842659 2347427 1919831 3078596 3096429 2429162 2665506 2926177 1925081
3442 1925081 2527368 2743272 1999156 2631598 2876005 2597714 2729202 2151699 1907809 3291388
3432 3291388 3731679 2297242 1995489 1351365 1990078 3272954 2601962 3367890 3318262
3423 3318262 2100583 1279055 1450897 2864898 3415558 3005646 2255208 2277919 1756359
3414A756359J075056O18079J82692k04722p03720m56672q4298O21006l38149L04398
3404B770029o702m79434l79829J290946m82003j601417J218951Q82239k04738
3395C008042M5946J25544j386582j26128l12535l79071Q78568R42933j08712p91040
3385A896965l45136Q20289M54433O21428k662186j28864L46445J82341L94707
3376A580422J069376j186140k97954K42628J97305k19037m13116J58344J503789
3367B635617O80353J32824L93015k897323L79654J222058j304805k02707N06060
3358A544746K1781J709841L87412j013704j441924J91676M13993k2320M46245
3349B237746O91763o10752j91714J64012R54483j538644K05574R62799l35457
$$ plain form
3414 1756359 2831415 3449494 3632186 3427464 2723744 2267072 2182774 2803780 2465631 2770029
3404 2770029 2763327 2283893 1904064 3195010 2713007 1111590 2330541 3212780 3008042
3395 3008042 3053988 3179532 1792950 1666822 1354287 975216 1853784 2796717 2688005 1896965
3385 1896965 1551829 2372118 2826551 3447979 785793 656929 1003374 1185715 1580422
3376 1580422 2649798 1463658 1165704 1408332 1605637 1386600 973484 1131828 2635617
3367 2635617 3315970 3448794 3841809 944486 1324140 2546198 1241393 1038686 1544746
3358 1544746 1566527 3276368 3663780 2650076 1208152 1399828 1813821 1791501 2237746
3349 2237746 2929509 2318757 2127043 2291055 3245538 1706894 1912468 2875267 2539810
3340B539810j15695J430117K18569j205944j015912J298532J69511j580665J752118
3331C490441j063382J375736l2115o49885l97611K067344R20175j481475L10198
3322D539426q9542j651830P5036N90537K23554L62747K20149k3915k20763L10213
3312D335612K03453L16828p35787p53668L61353O26898P3679o00815k35794P28973
3302D320732J093667j24210n96618J226966J426172J041754r27476J130745r42516
3293G649216j657064j39364O07403R8567j53429j283181J355406r60215j253105
3284D264234j10345L16143j15811l36074J79825j10659l68173J71361R20195N75786
3274E386482J67680k84112m96820K94487P12167M64097l15961M31743M09088m59279
$$ plain form
3340 2539810 2424115 3854232 4072801 2866857 1850945 3149477 3318988 1738323 3490441
3331 3490441 2427059 3802795 3770680 3120795 2723184 4790528 5710703 4229228 4539426
3322 4539426 4449884 2798054 2873090 3463627 3687181 4049928 4270077 4246162 4025399 4335612
3312 4335612 4539065 4855893 4120106 3366438 3727791 4354689 4428368 3827553 3591759 4320732
3302 4320732 5414399 5290189 4693571 5920537 7346709 8388463 7460987 8591732 7649216
3293 7649216 5992152 5852788 6460191 6558758 6405329 5122148 6477554 5517339 4264234
3284 4264234 4153889 4470032 4354221 4018147 4197972 4087313 3719140 3890501 4810696 5386482
3274 5386482 5554162 5270050 4773230 5067717 5779884 6243981 5928020 6359763 6768851 6309572
3264F309572R9255M24714L01281j184213J78487J557924L57599j161349k27696
3255F655574N65108O87694j308902p48305J57658J63104k92411j29668r22416
3246D827436K23308J238167R58534j550974r63100Q17687P09315O2379j330463
3237D992289K28864Q54980n11122o06763J456472j42639n81453J28030q33731
3228D984927j432044Q48193J178399p44092J9833J49274j134996Q82040r6900
3219D654634O44237P3126k65744J60914j642204L42201n99042J366271M0010P17314
3209E491717j062998q33181M59707J705030j126774p71679N28809o20703n65375
3200C204553k43895P67534L05327k09149K29759P0826o0038l22665p60408N45388
$$ plain form
3264 6309572 6408827 6833541 7134822 5950609 6129096 7687020 8044619 6883270 6655574
3255 6655574 7220682 7908376 6599474 5851169 6008827 6171931 5879520 5749852 4827436
3246 4827436 5050744 6288911 7247445 5696471 4733371 5551058 6260373 6322752 4992289
3237 4992289 5221153 6076133 5565011 4958248 6414720 6272081 5690628 5818658 4984927
3228 4984927 3552883 4401076 5579475 4835383 4855216 5004490 3869494 4751534 4654634
3219 4654634 5298871 5371997 5106253 5267167 3624963 3967164 3368122 4734393 4774403 5491717
3209 5491717 4428719 3595538 4055245 5760275 4633501 3861822 4390631 3769928 3204553
3200 3204553 2960658 3728192 4033519 3824370 4054129 4124955 4064917 3742252 2981844 3527232
3190C527232R9900p29568o58510m52667l88569R88345j13935j532241l46731O95710
3180A088966p62203J10513K29484L31842J44969J117051j203702L07280j45505
3171A218695k20736M76862j377416K6847J376589L3030p2841n6182m42408m48151
3161E14289p15471P14194J226179J17091j105192p09374J82215j78729j095635
3152a050433J455516j144963m32167N79138j94034K89341n73936O46658N41342
3143A16462O06252p29838J93902r05320n68077R60174o10900j1395N433N40743
3133d02564Q6462M61867p90814q85208J082676j17534N33279n88915m4801P32421
3123F6869j256809q98k18268Q72976R12765j52555L11655P14156l133j690047
$$ plain form
3190 3527232 3627132 2897564 2239054 1786387 1397818 2386163 2272228 739987 393256 1088966
3180 1088966 326763 437276 666760 998602 1143571 2260622 1056920 1364200 1218695
3171 1218695 997959 1474821 97405 124252 1500841 1533871 1461030 1404848 962440 514289
3161 514289 -201182 513012 1739191 1856282 751090 41716 223931 45202 -1050433
3152 -1050433 405083 -739880 -1172047 -592909 -786943 -497602 -1071538 -424880 116462
3143 116462 722714 -7124 186778 -718542 -1286619 -326445 -937345 -948740 -943307 -402564
3133 -402564 -316102 145765 -645049 -1530257 -447581 -565115 -31836 -620751 -665552 66869
3123 66869 -1189940 -1190838 -1409106 -536130 376635 224080 535735 1249891 1246758 -443289
3113d43289l79350N4328M09982M57438n38521M58186Q64273r81413j529364J79699
3103a448031l87126J201469R78605l61889o07876L15473m24491q65645N37991
3094a061520Q31342M53286j175824n46130N94391P38539q65310M45756P9845m44753
3084i50378J77411p16354o37059J730845O71022j227330O603N60440O23134o69697
3074d31363o24067R98767J565339k37069j90657l65865r00219P61947m97785p89676
3064g10648j147307j55849N80884O19308J66979j191367J60401N30581R60392
3055a86626j287571J643499N69891k248095P15858J283037j50042Q6982j340594
3046i13661j640628l58940J13190J849872O2012j660615J095457L31369k09256
$$ plain form
3113 -443289 -822639 -768311 -358329 99109 -439412 18774 883047 -98366 -1627730 -1448031
3103 -1448031 -1835157 -633688 344917 -16972 -624848 -309375 -733866 -1599511 -1061520
3094 -1061520 -230178 223108 -952716 -1498846 -904455 -165916 -1031226 -585470 -505625 -950378
3084 -950378 -772967 -1489321 -2126380 -395535 275487 -951843 -945240 -384800 238334 -431363
3074 -431363 -1055430 -56663 1508676 1271607 1080950 715085 -185134 576813 79028 -710648
3064 -710648 -1857955 -2013804 -1432920 -813612 -646633 -1838000 -1677599 -1147018 -186626
3055 -186626 -1474197 169302 739193 -1508902 -793044 489993 339951 426933 -913661
3046 -913661 -2554289 -2913229 -2800039 -950167 -888155 -2548770 -1453313 -1121944 -1331200
3037a331200l72290K83079O29624N72045k92099j412667r97976J019391k06136
3028b108229J92050J547006M58182k300099O5089J455139J505067J75571j563859
3019e74083O61495p2523j640401N84040Q30103k83242P02997j164264N95098j045098
3009a405878Q71328m12512J45758j007678Q01536q71031K47665j104941J088156
3000a647597P06210M89158l52021k06710l87457Q71824J76909o08614R17293j546952
2990a587957Q88392n45148P85320J139613r82540R09716o93528j24625J128419
2981I17662n45355o18294q1951J510693m27146l04719n41010k37544N06671P45537
2971I24544l69970J034994j591637j653633J482369R22145m81393j89099k11594
$$ plain form
3037 -1331200 -1703490 -1420411 -790787 -218742 -510841 -1923508 -2921484 -1902093 -2108229
3028 -2108229 -1916179 -369173 89009 -2211090 -2146001 -690862 814205 989776 -574083
3019 -574083 87412 14889 -1625512 -1041472 -211369 -494611 208386 -955878 -360780 -1405878
3009 -1405878 -534550 -947062 -801304 -1808982 -1007446 -1878477 -1630812 -2735753 -1647597
3000 -1647597 -941387 -452229 -804250 -1010960 -1398417 -526593 -349684 -958298 -41005 -1587957
2990 -1587957 -699565 -1244713 -459393 680220 -302320 607396 -86132 -210757 917662
2981 917662 372307 -245987 -327938 1182755 755609 450890 -90120 -327664 179007 924544
2971 924544 554574 1589568 -2069 -1655702 -173333 748812 267419 78320 -133274
2962a33274j81700p6321N33306Q26435k38288K39315p59835P13436J400556j028536
2952A295094M99241j34014m30738j393642M12109n43225J062775K36500q377m78491
2942E17232P9770O2594n9556J123435j265670J408415M64820m38795m46875m77491
2932I67879n55606M51737L13696l92736n22522l0934l25834J10161m77369k09306
2922f70834J742011M21598k72340N60595k81070j279672l07503P69941O33039
2913A315765k221603l07251L96446J64l78420M00610n1669M75501j19937q71733
2903a362127j00216R44006M37159K95985j179033l69745Q34698p34624L20207
2894i13690m17742M66840m70081l09526Q20306o35608K26697N97254o41546j86554
$$ plain form
2962 -133274 -314974 -391295 142011 968446 730158 969473 209638 923074 2323630 1295094
2952 1295094 1794335 1660321 1229583 -164059 248050 -295175 767600 1004100 995723 517232
2942 517232 597002 659596 600040 1723475 457805 1866220 2331040 1892245 1445370 967879
2932 967879 412273 864010 1177706 784970 262448 231514 -94320 15841 -461528 -670834
2922 -670834 1071177 1492775 1220435 1781030 1499960 220288 -87215 682726 1315765
2913 1315765 -905838 -1213089 -816643 -816479 -1194899 -794289 -845958 -370457 -490394 -1362127
2903 -1362127 -1462343 -518337 -81178 214807 -964226 -1333971 -499273 -1233897 -913690
2894 -913690 -1331432 -864592 -1334673 -1644199 -823893 -1459501 -1232804 -635550 -1277096 -1463650
2884a463650M56342n85624J439829r46631p92448K08493p8422J78242n50883K85440
2874a849312p42065M53064J409601P27031p21068O31433j161538j34471l16371
2865a703696K53152M8353J53285k03591k96447k58470k42272R03084l11709m28296
2855b086607l56200O09511J247367n61347o33042Q02240l56742L89610m60693
2846a405903m04836M34775O39636J49125n69047m61866k71269J060005K24300
2837f05080Q37444j53740n85196N95382j515378q51463K92535P26973L34502j058339
2827a982360N176P66525j76813q3985L94760J158179m86834J70862m25407o86880
2817a346777L03320M95738j039020L4035J253976n91794l22347p00815L37202
$$ plain form
2884 -1463650 -1007308 -1592932 -153103 -1099734 -1892182 -1683689 -1762111 -1583869 -2134752 -1849312
2874 -1849312 -2591377 -2138313 -728712 -1681 -722749 -91316 -1252854 -1387325 -1703696
2865 -1703696 -1450544 -1402191 -1248906 -1452497 -1748944 -2007414 -2249686 -1346602 -1658311 -2086607
2855 -2086607 -2442807 -1833296 -585929 -1147276 -1780318 -978078 -1334820 -945210 -1405903
2846 -1405903 -1810739 -1375964 -736328 -587203 -1156250 -1618116 -1889385 -829380 -605080
2837 -605080 232364 78624 -506572 88810 -1426568 -2278031 -1985496 -1258523 -924021 -1982360
2827 -1982360 -1977184 -1210659 -1387472 -1471457 -1076697 81482 -405352 -234490 -659897 -1346777
2817 -1346777 -1043457 -547719 -1586739 -1552704 -298728 -890522 -1212869 -1913684 -1576482
2808a576482J137442l21048j538118N20649L94068Q18483K1509L88861r44813
2799a099449j347973K4333O43624m76112K97357J17059p75817J552155j83061
2790a247884o42395P48196l26972R67775m74439L62799m87206l84166q01912M68849
2780a817355O16706m95356N07756J448789j026753n9487J70768o15599J49527
2771a121004j147171N85152J501967m96875M82006Q04043K19776r33823n20295
2762f26224M39344O71927M93708k32435j04359o28398L48000P63083K55517m94525
2752H85638j93427K27741j32581j037588p60720O42138j95180j201443R84440
2743g80982J030124n23622k20975K5956q23759M89225n30009O36189m88096J76617
$$ plain form
2808 -1576482 -439040 -760088 -2298206 -1777557 -1383489 -565006 -543497 -154636 -1099449
2799 -1099449 -2447422 -2423089 -1779465 -2255577 -1958220 -1841161 -2616978 -1064823 -1247884
2790 -1247884 -1890279 -1142083 -1469055 -501280 -975719 -612920 -1100126 -1484292 -2286204 -1817355
2780 -1817355 -1200649 -1696005 -1188249 260540 -766213 -825700 -654932 -1270531 -1121004
2771 -1121004 -2268175 -1683023 -181056 -677931 -195925 608118 827894 -105929 -626224
2762 -626224 -186880 485047 978755 746320 641961 13563 361563 1124646 1380163 885638
2752 885638 692211 919952 787371 -250217 -1010937 -368799 -563979 -1765422 -780982
2743 -780982 249142 -274480 -495455 -469499 -1293258 -804033 -1334042 -697853 -1185949 -1009332
2733a009332M92942l64900k11713P25316Q25552L2783j545509p52323K51667R75034
2723e80483n02529n3617j47882n462m04737L22456L32100J033319j59964k27295
2713c94094P11159k74052j032585L30872P82516M53207n65087m32781r1770j082438
2703a595053J60284Q43048j85186J1996q8344o11291M2614R19350M93353J227691
2693A218462L49384m68937j519701o20864J04854N37193k01450j338160J343847
2684e95372O48872O30585p29917j21691J48927j172414R30796p41932P87706N39592
2674C25152J13216j33316l24738M93801m62415l7077m67122k35425N21174n3401
2664b60151l49888j312388R54325J692267q86636J249986q78534r6050K30634
$$ plain form
2733 -1009332 -516390 -881290 -1093003 -367687 457865 490648 -1054861 -1807184 -1555517 -580483
2723 -580483 -1083012 -1136629 -1284511 -1289973 -1694710 -1372254 -1040154 -6835 -166799 -394094
2713 -394094 317065 43013 -989572 -658700 123816 577023 11936 -420845 -512615 -1595053
2703 -1595053 -1434769 -591721 -776907 -764911 -853255 -1464546 -1421932 -502582 -9229 1218462
2693 1218462 1567846 1098909 -420792 -1041656 -936802 -399609 -601059 -1939219 -595372
2684 -595372 53500 684085 -45832 -167523 -18596 -1191010 -260214 -1002146 -214440 325152
2674 325152 438368 305052 -19686 474115 11700 -25377 -492499 -727924 -206750 -260151
2664 -260151 -610039 -1922427 -968102 724165 -162471 1087515 208981 112931 343565
2655C43565J319371j620642j348273J891109N00130j12845l75405R95237o13676
2646I78571j98315J661943n17123j003730q5894J035984j484453n04670J954273
2637A836586J6993j22224L94290L94074J289364o00345N88066o20725j17673j732489
2627A325917q84674J403366m30814n77905J255874l64885K37752K137027q06917
2618C294741j024376M03607O86239l28038P17747q62642M17020J451734p65132
2609C990900j072213J20759Q17741l4546K18196j111168M87880P22692K20159
2600D360400m40489K53294J14057o64685j91120J058300j23077P25186O96736
2591E788602j171930O87075J440611K55010Q08833p16750p9620J082618Q40375
$$ plain form
2655 343565 1662936 42294 -1305979 585130 1085260 972415 597010 1592247 978571
2646 978571 780256 2442199 1925076 921346 835452 1871436 386983 -117687 1836586
2637 1836586 1853579 1731355 2125645 2519719 3809083 3208738 3796804 3176079 3058406 1325917
2627 1325917 441243 1844609 1413795 835890 2091764 1726879 1964631 4101658 3294741
2618 3294741 2270365 2673972 3360211 3032173 3749920 2887278 3304298 4756032 3990900
2609 3990900 2918687 3039446 3857187 3822641 4040837 2929669 3417549 4140241 4360400
2600 4360400 3919911 4173205 4287262 3622577 3431457 4489757 4366680 5091866 5788602
2591 5788602 4616672 5303747 6744358 6999368 7808201 7091451 7011831 8094449 8934824
2582H934824j28271O22180J28049M6215q6157J58132M85993M22752L70487m56842
2572A0497362K84267J452120J368334j460216M41524L21448J105751J617612J88505
2563A5816707L46502Q12691J235187J035729N36697k5325K32827J097531J385582
2554B2474128M698O33432J238817K506465J166960J1199K687526Q92383K252931
2545C3868539K239809J651438J676399J518354K779918L215292K825886K334273
2537E2109908M211111N033914L155258O834335O377169O206338Q469146R015444
2529A01412623Q778447J2226808J3190434J6739714J9063751K3800988K7791138
2522B23003903L4532382M2123638M9698633M7687393K1897328k0298826m1434116
$$ plain form
2582 8934824 8806553 9428733 9556782 9602997 9516840 9674972 10160965 10583717 10954204 10497362
2572 10497362 10781629 12233749 13602083 12141867 12583391 12904839 14010590 15628202 15816707
2563 15816707 16163209 16975900 18211087 19246816 19783513 19758188 19991015 21088546 22474128
2554 22474128 22478826 23112258 24351075 26857540 28024500 28035699 30723225 31615608 33868539
2545 33868539 36108348 37759786 39436185 40954539 43734457 46949749 49775635 52109908
2537 52109908 56321019 61354933 64510191 71344526 77721695 83928033 92397179 101412623
2529 101412623 110191070 122417878 135608312 152348026 171411777 195212765 223003903
2522 223003903 257536285 299659923 349358556 397045949 418943277 398644451 357210335
2515C57210335m7532536m9679614m4118262l5839295k5587240j8996816j6109143
2508A19347429j3719793q758706p944252n420275p181065o203725l975312o668849
2500E9475452n378920l739858k908059m367726m046561k049185k925511j508665
2492C2550967l211253j271401j097242j481070p07768q94682k120160m46089j088184
2483B0233118j470375j655151k61085j008614m59051m70780q97898j243541j353334
2474A1413289j45072l71136p64632n50619J99623p71354n31724J003893l80243
2465I102025o03977j32317j53455N96377O6653J21922j299630L26964j198024
2456F826538Q31334j538988k6354q48599l86265R77384M14314n26072o2391q45961
$$ plain form
2515 357210335 309677799 259998185 215879923 180040628 154453388 135456572 119347429
2508 119347429 105627636 96868930 88924678 83504403 76323338 70119613 66144301 59475452
2500 59475452 54096532 50356674 47448615 43080889 39034328 36985143 34059632 32550967
2492 32550967 29339714 28068313 26971071 25490001 24782233 23887551 21767391 21321302 20233118
2483 20233118 18762743 17107592 16846507 15837893 15378842 14908062 14010164 12766623 11413289
2474 11413289 11268217 10897081 10132449 9581830 9781453 9010099 8478375 9482268 9102025
2465 9102025 8498048 8365731 8212276 8808653 8875306 8997228 7697598 8024562 6826538
2456 6826538 7657872 6118884 6092530 5243931 4857666 5835050 6249364 5723292 5660901 4814940
2446D814940q19410M57086j14945j180606l82641J230214j977001J993146J093884
2437E114667j808849k01605M57272n37981m79434n80981R8385o28349K43249p450
2427A668924J64461j142565O27846M07297J0016l96398P91874m19249m80893J42075
2417A373388J26282m171l69714m05578R18994p07333o42338j88911Q10073r51438
2407d0746Q45832L68388k92752m61089k36263L0567l34856M31931o94944J003321
2397F19389n74102K2653j140721Q21729j089811J94909q64743J595247l47863
2388g63313J05580R50624K38523o13969j633801J403648p9688J428068j366169
2379c30497j261326L12277L27634O93273j440960N28634J279372k68792Q9946
$$ plain form
2446 4814940 3995530 4452616 4337671 3157065 2774424 4004638 2027637 4020783 5114667
2437 5114667 3305818 3104213 3561485 3023504 2544070 1963089 2061474 1433125 1676374 1668924
2427 1668924 1833385 690820 1318666 1725963 1735979 1339581 2131455 1712206 1231313 1373388
2417 1373388 1499670 1495499 1125785 720207 1639201 931868 289530 100619 910692 -40746
2407 -40746 805086 1173474 880722 419633 183370 213937 -120919 311012 -383932 619389
2397 619389 45287 67940 -1072781 -251052 -1340863 -1145954 -2010697 -415450 -763313
2388 -763313 -657733 292891 531414 -82555 -1716356 -312708 -392396 1035672 -330497
2379 -330497 -1591823 -1279546 -951912 -258639 -1699599 -1170965 108407 -160385 -70439
2370g0439j188550j55957o22898k62205N92732K44491m11196J69588k58698K92482
2360a670650o61042N6063O25482j158693K35953K08882L99620n34779O20680m73545
2350b352029L88238O05030j088314J103972j82102N19043L86584j024080k38403
2341a882061k91534k17697O92686j084632J53368j44130P6166n98028J41430J359978
2331a794454Q83973J67994j305512P52738M9849l27543l62733p01567k37343J710387
2321a164211l34842p80394m58838l73746J523441L67539q01162N91121j222601
2312b653693q09713l14043j37650Q1558L93373J011803M41104M59516O23442o73541
2302a577844J112479m90763j18443N34430p07018K41346M19384r7441M05770j301808
$$ plain form
2370 -70439 -1258989 -1414946 -2037844 -2300049 -1707317 -1462826 -1874022 -1704434 -1963132 -1670650
2360 -1670650 -2331692 -2275629 -1650147 -2808840 -2572887 -2364005 -1964385 -2499164 -1878484 -2352029
2350 -2352029 -1963791 -1358761 -2447075 -1343103 -1525205 -1006162 -619578 -1643658 -1882061
2341 -1882061 -2173595 -2391292 -1698606 -2783238 -2629870 -2774000 -2697834 -3295862 -3154432 -1794454
2331 -1794454 -910481 -742487 -2047999 -1295261 -1245412 -1572955 -1935688 -2637255 -2874598 -1164211
2321 -1164211 -1499053 -2279447 -2738285 -3112031 -1588590 -1221051 -2022213 -1431092 -2653693
2312 -2653693 -3463406 -3777449 -3915099 -3833541 -3440168 -2428365 -1987261 -1527745 -904303 -1577844
2302 -1577844 -465365 -956128 -1074571 -540141 -1247159 -1005813 -586429 -683870 -278100 -1579908
2292a579908P53166o27402n59000J737706M82881q00839J086548K21717j279828
2283e64959m89816K08648K24903M31268L59667N56326Q33071k150005J67676N75222
2273A52001M74235l51678p1391o9253j617117k5118n55766m82553J278187J63153
2263a105300j171293O60712k32130j443404R34156j27244K07575n91319Q65795
2254b002452R98877R57396j642480o79785Q71247k84427L71954j744705K09523
2245b944852J044247O16640n16153r58605N90469M04757j83910L85510N69315
2236i92582k30457L90984J19189j091715o01500M36059L01352J13663k67015K25041
2226a596981L22391L01118r67766Q75259j16289j501814M47885J631255j456445
$$ plain form
2292 -1579908 -826742 -1454144 -2013144 -275438 207443 -593396 493152 714869 -564959
2283 -564959 -1054775 -846127 -621224 -189956 169711 726037 1559108 -590897 -423221 152001
2273 152001 626236 274558 203167 133914 -1483203 -1508321 -2064087 -2546640 -1268453 -1105300
2263 -1105300 -2276593 -1615881 -1848011 -3291415 -2357259 -2484503 -2276928 -2868247 -2002452
2254 -2002452 -1003575 -46179 -1688659 -2368444 -1497197 -1781624 -1409670 -3154375 -2944852
2245 -2944852 -1900605 -1283965 -1800118 -2758723 -2168254 -1763497 -1947407 -1561897 -992582
2236 -992582 -1223039 -832055 -712866 -1804581 -2406081 -1970022 -1668670 -1555007 -1822022 -1596981
2226 -1596981 -1274590 -973472 -1941238 -1065979 -1182268 -2684082 -2236197 -604942 -2061387
2217b061387r96866J023512M18454M81944L03263q85099K98272m02610Q67823
2208i52694q50534j661N2734r2249j50225M98500K3444K39994J39229j28818k62858
2197a485138k44369m76372o47743L45951O23694q4474R12524J044021m15092l95288
2187h22286j317385L7900q75537J657715L50948r77471j61461J600904j198389
2178a705062k97721L68895J021474n82244m45974J271486J118468p61140r07259
2169i19077p43553l70634j46880j71480K58639K44591r86878L92331n6409Q26827
2159a672523r53266P25498O52397k85610O81667k19738n22920l84919o82489m75719
2149c137622J803736J085362n39153k11961l93848l25331k18692j95119K38794
$$ plain form
2217 -2061387 -3058253 -2034741 -1616287 -1134343 -831080 -1716179 -1417907 -1820517 -952694
2208 -952694 -1803228 -1804889 -1752155 -1844404 -1994629 -1496129 -1472685 -1232691 -1093462 -1222280 -1485138
2197 -1485138 -1729507 -2205879 -2853622 -2507671 -1883977 -1968451 -1055927 -11906 -426998 -822286
2187 -822286 -2139671 -2101771 -2977308 -1319593 -968645 -1946116 -2107577 -506673 -1705062
2178 -1705062 -2002783 -1633888 -612414 -1194658 -1640632 -369146 749322 -11818 -919077
2169 -919077 -1662630 -2033264 -2180144 -2351624 -2092985 -1848394 -2835272 -2442941 -2499350 -1672523
2159 -1672523 -2625789 -1900291 -1247894 -1533504 -851837 -1071575 -1594495 -1979414 -2661903 -3137622
2149 -3137622 -1333886 -248524 -787677 -999638 -1393486 -1718817 -1937509 -2132628 -1893834
2140a893834N3344l6598K4413L55909N67334k72939J04457J83841p27379m19716
2130b061168m6851J202479p45841m12L19439K30472q53982O75307K88798l66681
2120a358440k81709j83420q8766n37971O21314P85323r19458J95384M76141J933226
$$ plain form
2140 -1893834 -1840490 -1877088 -1852675 -1496766 -929432 -1202371 -1097914 -914073 -1641452 -2061168
2130 -2061168 -2108019 -905540 -1651381 -1651793 -1332354 -1101882 -1955864 -1280557 -991759 -1358440
2120 -1358440 -1640149 -1823569 -1912335 -2450306 -1828992 -1043669 -1963127 -1767743 -1291602 641624
$$ [...]
##END NTUPLES=NMR SPECTRUM
##END=
