##TITLE=1H_CA-8928-1
 CDCl3,8 sc, 
 21.9.2021
##JCAMPDX= 6.0         $$ Bruker NMR JCAMP-DX V2.0
##DATA TYPE= NMR SPECTRUM
##DATA CLASS= NTUPLES
##ORIGIN= UXNMR, Bruker Analytische Messtechnik GmbH
##OWNER= root
$$ XWIN-NMR		Version 3.5
$$ Tue Sep 21 10:58:30 2021 Russian Standard Time (UT+4h)  she@DPX200
##.OBSERVE FREQUENCY= 200.1314
##.OBSERVE NUCLEUS= ^1H
##.ACQUISITION MODE= SIMULTANEOUS
##.ACQUISITION SCHEME= undefined
##.AVERAGES= 8
##.DIGITISER RES= 18
##SPECTROMETER/DATA SYSTEM= spect
##.PULSE SEQUENCE= zg30
##.SOLVENT NAME= D2O
##.SHIFT REFERENCE= (INTERNAL, D2O, 0, 17.0792)
##AUDIT TRAIL= $$ (NUMBER, WHEN, WHO, WHERE, WHAT)
$$ ##TITLE= Audit trail, XWIN-NMR		Version 3.5
$$ ##JCAMPDX= 5.01
$$ ##ORIGIN= Bruker BioSpin GmbH
$$ ##OWNER= she
$$ F:/spectra/data/she/nmr/H-F/1/pdata/1/auditp.txt
$$ ##AUDIT TRAIL=  $$ (NUMBER, WHEN, WHO, WHERE, WHAT)
(   1,<2021-09-21 10:56:38.70 +0400>,<she>,<DPX200>,
      <created by zg, POWCHK disabled, PULCHK disabled
       configuration hash MD5:
       00 E9 B6 7A A2 85 ED C7 34 08 36 98 17 FE 4E 26
       data hash MD5: 16K
       B1 6F DB 94 43 74 28 F8 67 08 BD 83 C9 AB 78 82>)
(   2,<2021-09-21 10:56:41.75 +0400>,<she>,<DPX200>,
      <Start of raw data processing
       efp BC_mod = 2 LB = 0.24 FT_mod = 6 PKNL = 1 PHC0 = -14073.73 PHC1 = 11.8009 SI = 16K 
       data hash MD5: 16K
       25 AC 12 5E C2 10 53 30 3F 37 E3 58 57 A3 CF 87>)
(   3,<2021-09-21 10:57:05.20 +0400>,<she>,<DPX200>,
      <pk PHC0 = -3.690443 PHC1 = 2.600002 
       data hash MD5: 16K
       9F D4 61 9A 85 BC 13 1B 73 6A 45 09 C4 F3 56 64>)
(   4,<2021-09-21 10:57:08.62 +0400>,<she>,<DPX200>,
      <abs ABSG = 5 
       data hash MD5: 16K
       C9 7B 94 2A 14 D0 B5 B1 45 9D 51 8B 81 A3 24 A0>)
(   5,<2021-09-21 10:57:27.23 +0400>,<she>,<DPX200>,
      <pk PHC0 = -3.329898 PHC1 = 4.999999 
       data hash MD5: 16K
       4B 73 E2 9C ED 59 37 E5 60 0E 9A 52 C4 42 9D F4>)
(   6,<2021-09-21 10:57:30.45 +0400>,<she>,<DPX200>,
      <abs ABSG = 5 
       data hash MD5: 16K
       D2 28 7B 63 BB AC 96 00 45 1D AB AB 6B 4B 05 C1>)
$$ ##END=
$$ 
$$ hash MD5
$$ 22 36 0A 46 B1 DC 5E C4 B7 5C 1A 28 65 B9 47 6A
##$RELAX= 
##$RELAX= 
##$RELAX= 
##$RELAX= 
##$RELAX= 
##$RELAX= 
$$ Bruker specific parameters
$$ --------------------------
##$DU= <F:/spectra>
##$EXPNO= 1
##$NAME= <H-F>
##$PROCNO= 1
##$TYPE= <nmr>
##$USER= <she>
##$AMP= (0..31)
100 100 100 100 100 100 100 100 100 100 100 100 100 100 100 100 100 100 
100 100 100 100 100 100 100 100 100 100 100 100 100 100 
##$AQSEQ= 0
##$AQ_mod= 1
##$AUNM= <au_zg>
##$AUTOPOS= <>
##$BF1= 200.13
##$BF2= 200.13
##$BF3= 200.13
##$BF4= 200.13
##$BF5= 200.13
##$BF6= 200.13
##$BF7= 200.13
##$BF8= 200.13
##$BYTORDA= 1
##$CFDGTYP= 0
##$CFRGTYP= 5
##$CHEMSTR= <none>
##$CNST= (0..31)
1 1 145 1 1 1 1 1 1 1 1 1 1 1 1 1 1 1 1 1 1 1 1 1 1 1 1 1 1 1 1 1 
##$CPDPRG= <>
##$CPDPRG1= <>
##$CPDPRG2= <>
##$CPDPRG3= <>
##$CPDPRG4= <mlev>
##$CPDPRG5= <mlev>
##$CPDPRG6= <mlev>
##$CPDPRG7= <mlev>
##$CPDPRG8= <mlev>
$$ [...]
##$SUBNAM3= <"">
##$SUBNAM4= <"">
##$SUBNAM5= <"">
##$SUBNAM6= <"">
##$SUBNAM7= <"">
##$SUBNAM8= <"">
##$SUBNAM9= <"">
##$SW= 20.0188988654967
##$SWIBOX= (0..15)
0 0 2 0 0 0 0 0 0 0 0 0 0 0 0 0 
##$SW_h= 4006.41025641026
##$TD= 16384
##$TD0= 1
##$TE= 0
##$TE2= 300
##$TE3= 300
##$TEG= 300
##$TL= (0..7)
0 120 120 120 120 120 120 120 
##$TP= (0..7)
150 150 150 150 150 150 150 150 
##$TP07= 0
##$TPNAME0= <>
##$TPNAME1= <>
##$TPNAME2= <>
##$TPNAME3= <>
##$TPNAME4= <>
##$TPNAME5= <>
##$TPNAME6= <>
##$TPNAME7= <>
##$TPOAL= (0..7)
0.5 0.5 0.5 0.5 0.5 0.5 0.5 0.5 
##$TPOFFS= (0..7)
0 0 0 0 0 0 0 0 
##$TUNHIN= 0
##$TUNHOUT= 0
##$TUNXOUT= 0
##$USERA1= <user>
##$USERA2= <user>
##$USERA3= <user>
##$USERA4= <user>
##$USERA5= <user>
##$V9= 5
##$VALIST= <valist>
##$VCLIST= <CCCCCCCCCCCCCCC>
##$VD= 0
##$VDLIST= <DDDDDDDDDDDDDDD>
##$VPLIST= <PPPPPPPPPPPPPPP>
##$VTLIST= <TTTTTTTTTTTTTTT>
##$WBST= 1024
##$WBSW= 4
##$XGAIN= (0..3)
0 0 0 0 
##$XL= 0
##$YL= 0
##$YMAX_a= 656113
##$YMIN_a= -778706
##$ZGOPTNS= <>
##$ZL1= 120
##$ZL2= 120
##$ZL3= 120
##$ZL4= 120
##$ABSF1= 16.97782
##$ABSF2= -3.04122
##$ABSG= 5
##$ABSL= 3
##$ALPHA= 0
##$AQORDER= 0
##$ASSFAC= 0
##$ASSFACI= 0
##$ASSFACX= 0
##$ASSWID= 0
##$AUNMP= <proc_1d>
##$AZFE= 0.1
##$AZFW= 0.1
##$BCFW= 0
##$BC_mod= 2
##$BYTORDP= 0
##$COROFFS= 0
##$CY= -3
##$DATMOD= 1
##$DC= 0
##$DFILT= <>
##$DTYPP= 0
##$F1P= 0
##$F2P= 0
##$FCOR= 1
##$FTSIZE= 16384
##$FT_mod= 6
##$GAMMA= 0
##$GB= 0
##$INTBC= 1
##$INTSCL= 1.334414e-10
##$ISEN= 128
##$LB= 0.24
##$LEV0= 0
##$LPBIN= 0
##$MAXI= 10000
##$MC2= 0
##$MEAN= 0
##$ME_mod= 0
##$MI= 1.114404
##$NCOEF= 0
##$NC_proc= -4
##$NLEV= 6
##$NOISF1= 3.799351
##$NOISF2= 2.8
##$NSP= 0
##$NTH_PI= 0
##$NZP= 0
##$OFFSET= 17.07923
##$PC= 1
##$PHC0= -14080.75
##$PHC1= 19.4009
##$PH_mod= 1
##$PKNL= yes
##$PPARMOD= 0
##$PSCAL= 0
##$PSIGN= 0
##$REVERSE= no
##$SF= 200.129985139109
##$SI= 16384
##$SIGF1= 3
##$SIGF2= 2
##$SINO= 5.538805
##$SIOLD= 16384
##$SREGLST= <1H.CDCl3>
##$SSB= 0
##$STSI= 16384
##$STSR= 0
##$SW_p= 4006.41025641027
##$SYMM= 0
##$S_DEV= 0
##$TDeff= 16384
##$TDoff= 0
##$TI= <>
##$TILT= no
##$TM1= 0
##$TM2= 0
##$TOPLEV= 0
##$USERP1= <user>
##$USERP2= <user>
##$USERP3= <user>
##$USERP4= <user>
##$USERP5= <user>
##$WDW= 1
##$XDIM= 16384
##$YMAX_p= 441804978
##$YMIN_p= -169681
$$ End of Bruker specific parameters
$$ ---------------------------------
##NTUPLES= NMR SPECTRUM
##VAR_NAME=  FREQUENCY,     SPECTRUM/REAL,   SPECTRUM/IMAG
##SYMBOL=    X,             R,               I
##VAR_TYPE=  INDEPENDENT,   DEPENDENT,       DEPENDENT
##VAR_FORM=  AFFN,          ASDF,            ASDF
##VAR_DIM=   16384,         16384,           16384
##UNITS=     HZ,            ARBITRARY UNITS, ARBITRARY UNITS
##FACTOR=    0.244546801953871, 1,           1
##FIRST=     3418.06591697525, 0,            0
##LAST=      -588.344339435024, 0,           0
##MIN=       -588.344339435024, -169681,     0
##MAX=       3418.06591697525, 441804978,    0
$$ Real data points
##PAGE= N=1
##DATA TABLE= (X++(R..R)), XYDATA
$$ [...]
$$ plain form
8285 437692 469525 507559 480085 471799 492530 502240 477619 493316 502830 489333 501668 508334
8273 508334 504362 503349 490742 521793 505959 467865 457254 429543 451904 419040 426139 426925 434948
8260 434948 449764 437103 401405 430138 437514 441889 435121 419907 419248 430489 429924 436208 452035
8247 452035 433712 428737 434488 421335 423698 420277 419785 416992 375413 403033 443752 439851 436601
8234 436601 450224 445550 445485 448714 442827 435738 403209 425411 437645 424490 440159 438573 464982
8221 464982 454658 428927 450441 450777 433163 413532 422372 450343 442654 459953 480212 503721
8209 503721 482269 491297 489964 492128 490471 474016 482996 480895 483648 523863 518990 494781 466787
8196 466787 466361 459425 507795 433898 438495 568899 521670 556195 526339 528579 528976 522491 502578
$$ packed form
8285D37692L1833L8034k7474q286K0731R710k4621J5697R514j3497J2335O666
8273E08334l972j013j2607L1051j5834l8094j0611k7711K2361l2864P099P86Q023
8260D34948J4816j2661l5698K8733P376M375o768j5214o59J1241n65O284J5827
8247D52035j8323m975N751j3153K363l421m92k793m1579K7620M0719l901l250
8234D36601J3623m674o5L229n887p089l2529K2202J2234j3155J5669j586K6409
8221D64982j0324k5731K1514L36j7614j9631Q840K7971p689J7299K0259K3509
8209E03721k1452R028j333K164j657j6455Q980k101K753M0215m873k4209k7994
8196D66787m26o936M8370p3897M597J30404m7229L4525k9856K240L97o485j9913
$$ plain form
8183 502578 491766 513537 525339 529316 538021 547932 540477 538764 562478 521961 524878 546112 538509
8170 538509 568838 548756 552026 548100 559276 541586 532061 543142 566615 593625 581867 606050
8158 606050 594463 574968 594475 571831 591493 578852 546921 543500 561250 544430 562827 591816
8146 591816 596555 625235 613778 619795 597325 597537 623673 610347 582268 600495 588967 609746
8134 609746 622286 637864 636455 639865 633714 617985 626588 647306 635120 626868 645879 649363 654797
8121 654797 671185 669321 692943 693335 670612 655433 673433 712259 687811 692956 698702 686642 695406
8108 695406 684998 674203 683445 720453 725888 768709 775324 748502 742116 749567 726543 722657 765822
8095 765822 749672 751790 745400 755655 767200 786993 788236 796562 759929 784304 800992 781135
$$ packed form
8183E02578j0812K1771J1802L977Q705R911p455j713K3714m0517K917K1234p603
8170E38509L0329k0082L270l926J1176j7690r525J1081K3473K7010j1758K4183
8158F06050j1587j9495J9507k2644J9662j2641l1931l421J7750j6820J8397K8989
8146E91816M739K8680j1457O017k2470K12K6136j3326k8079J8227j1528K0779
8134F09746J2540J5578j409L410o151j5729Q603K0718j2186q252J9011L484N434
8121F54797J6388j864K3622L92k2723j5179J8000L8826k4448N145N746j2060Q764
8108F95406j0408j0795R242L7008N435M2821O615k6822o386P451k3024l886M3165
8095G65822j6150K118o390J0255J1545J9793J243Q326l6633K4375J6688j9857
$$ plain form
8083 781135 800883 817845 810372 813020 809254 820881 820567 830620 848197 850684 878181 864961 872382
8070 872382 861387 870676 903223 894988 876683 866656 873103 865742 886811 883309 876393 899937 896781
8057 896781 925453 937758 933332 949026 942082 923188 955967 1000743 986730 993956 1002731 1036956
8045 1036956 1058452 1091402 1110940 1114855 1130226 1132429 1148436 1150824 1166864 1179364 1167577 1201150
8033 1201150 1226877 1209799 1185437 1167359 1129104 1112198 1106697 1096110 1089887 1086054 1102487 1099354
8021 1099354 1114207 1102161 1119547 1126850 1145481 1179751 1205521 1261184 1304086 1324949 1367198 1423918
8009 1423918 1424867 1436507 1431178 1404975 1397497 1406284 1401617 1395804 1382733 1378996 1394263 1402336 1386990
7996 1386990 1372590 1377941 1327189 1286115 1271352 1225585 1218039 1218098 1218720 1177653 1155393 1148675 1155053
$$ packed form
8083G81135J9748J6962p473K648l766J1627l14J0053J7577K487K7497j3220P421
8070H72382j0995R289L2547q235j8305j0027O447p361K1069l502o916K3544l156
8057H96781K8672J2305m426J5694o944j8894L2779M4776j4013P226Q775L4225
8045A036956K1496L2950J9538L915J5371K203J6007K388J6040J2500j1787L3573
8033A201150K5727j7078k4362j8078l8255j6906n501j0587o223l833J6433l133
8021A099354J4853j2046J7386P303J8631L4270K5770N5663M2902K0863M2249N6720
8009A423918R49J1640n329k6203p478Q787m667n813j3071l737J5267Q073j5346
7996A386990j4400N351n0752m1074j4763m5767p546N9O22m1067k2260o718O378
$$ plain form
7983 1155053 1127372 1121850 1119389 1127258 1121553 1116842 1091653 1113379 1126714 1114469 1110704 1086987 1121808
7970 1121808 1128099 1099626 1137100 1146319 1125495 1151491 1118158 1166013 1184901 1154852 1127037 1128709
7958 1128709 1106927 1122099 1133258 1135061 1138566 1148319 1168393 1192921 1209326 1170619 1187424 1179778
7946 1179778 1177630 1193555 1187592 1181737 1213245 1226422 1189806 1185619 1173589 1185402 1200926 1213127
7934 1213127 1177794 1200979 1209175 1226583 1202735 1223114 1227387 1220616 1215867 1234061 1241007 1229800
7922 1229800 1265256 1272546 1267210 1304567 1300276 1296510 1313141 1311412 1327116 1328407 1298496 1325127 1361766
7909 1361766 1333095 1341570 1323660 1334792 1344663 1326800 1331137 1329906 1333318 1340992 1368190 1384087 1362903
7896 1362903 1370824 1392383 1394064 1401877 1401026 1385511 1400533 1395198 1381248 1396630 1418639 1439150 1427885
$$ packed form
7983A155053k7681n522k461P869n705m711k5189K1726J3335j2245l765k3717L4821
7970A121808O291k8473L7474R219k0824K5996l3333M7855J8888l0049k7815J672
7958A128709k1782J5172J1159J803L505R753K0074K4528J6405l8707J6805p646
7946A179778k148J5925n963n855L1508J3177l6616m187j2030J1813J5524J2201
7934A213127l5333K3185Q196J7408k3848K0379M273o771m749J8194O946j1207
7922A229800L5456P290n336L7357m291l766J6631j729J5704J291k9911K6631L6639
7909A361766k8671Q475j7910J1132R871j7863M337j231L412P674K7198J5897k1184
7896A362903P921K1559J681P813q51j5515J5022n335j3950J5382K2009K0511j1265
$$ plain form
7883 1427885 1444334 1452283 1429725 1424570 1438975 1457026 1474350 1500115 1481063 1475335 1464297 1491014
7871 1491014 1513565 1507886 1520521 1512075 1510092 1562370 1568099 1595975 1595268 1582520 1594169 1630067 1630951
7858 1630951 1657335 1649567 1651577 1650005 1651912 1710666 1721418 1721518 1733709 1750596 1770539 1790312 1796650
7845 1796650 1792655 1797973 1843783 1861150 1886355 1917967 1940556 2000475 2036205 2036268 2069356 2063254 2082095
7832 2082095 2106480 2101275 2178210 2201857 2240268 2274705 2282347 2297192 2309289 2312083 2295183 2268604
7820 2268604 2259453 2240984 2236842 2233410 2238082 2265881 2307482 2350213 2344654 2401278 2421501 2427524 2441679
7807 2441679 2477496 2515795 2543363 2589167 2624998 2685181 2752174 2779901 2725036 2680670 2629150
7796 2629150 2549315 2493815 2414024 2355728 2320084 2264859 2239324 2194469 2185033 2185995 2178248 2180336
$$ packed form
7883A427885J6449P949k2558n155J4405J8051J7324K5765j9052n728j1038K6717
7871A491014K2551n679J2635q446j983N2278N729K7876p07j2748J1649L5898Q84
7858A630951K6384p768K010j572J907N8754J0752J00J2191J6887J9943J9773O338
7845A796650l995N318M5810J7367K5205L1612K2589N9919L5730O3L3088o102J8841
7832B082095K4385n205P6935K3647L8411L4437P642J4845J2097K794j6900k6579
7820B268604r151j8469m142l432M672K7799M1601M2731n559N6624K0223O023J4155
7807B441679L5817L8299K7568M5804L5831O0183O6993K7727n4865m4366n1520
7796B629150p9835n5500p9791n8296l5644n5225k5535m4855r436R62p747K088
$$ plain form
7784 2180336 2172487 2174108 2185672 2205367 2201439 2207797 2200489 2218635 2218372 2213764 2201173 2215974 2192051
7771 2192051 2193780 2218947 2210379 2240545 2266058 2257562 2228825 2215010 2177353 2181115 2156335 2156130 2127359
7758 2127359 2106472 2117738 2096391 2073743 2068983 2037892 2043477 2029238 2043403 2034844 1976562 1965337
7746 1965337 1956974 1980588 1977777 1946877 1963209 1964635 1943093 1949756 1929336 1916581 1932670 1930793
7734 1930793 1943077 1934778 1894361 1890665 1883798 1904051 1929961 1947798 1933250 1929208 1935965 1925337
7722 1925337 1905049 1921270 1928997 1936369 1901015 1927580 1923159 1920638 1921848 1965898 1927989 1897971
7710 1897971 1902917 1924310 1935952 1927226 1938766 1951262 1965230 1946240 1943203 1936675 1950094 1944658
7698 1944658 1931950 1970491 1974619 1967451 1956194 1938793 1987072 1996624 1986064 1999449 1977210 1991179
$$ packed form
7784B180336p849J621J1564J9695l928O358p308J8146k63m608j2591J4801k3923
7771B192051J729K5167q568L0166K5513q496k8737j3815l7657L762k4780k05k8771
7758B127359k0887J1266k1347k2648m760l1091N585j4239J4165q559n8282j1225
7746A965337q363K3614k811l0900J6332J426k1542O663k0420j2755J6089j877
7734A930793J2284q299m0417l696o867K0253K5910J7837j4548m042O757j0628
7722A925337k0288J6221P727P372l5354K6565m421k521J210M4050l7909l0018
7710A897971M946K1393J1642q726J1540J2496J3968j8990l037o528J3419n436
7698A944658j2708L8541M128p168j1257j7401M8279R552j0560J3385k2239J3969
$$ plain form
7686 1991179 2002227 2005301 2011650 1975889 1977052 1980727 1972381 1959576 1951566 1978942 1964926 1980991 1977017
7673 1977017 1980136 1959508 1945099 1956809 1968594 1968737 1948654 1969682 1937065 1951796 1935518 1929003
7661 1929003 1898636 1892004 1906612 1886440 1862956 1848966 1833830 1842954 1839350 1849914 1853712 1845528
7649 1845528 1811772 1803987 1845488 1848972 1794112 1816872 1809043 1766937 1766862 1776323 1781473 1764155 1745956
7636 1745956 1767236 1751808 1749511 1753098 1728228 1725951 1699385 1718691 1720964 1708834 1698316 1674187
7624 1674187 1669899 1694244 1695982 1665036 1675708 1688548 1681682 1656909 1656878 1646994 1623919 1626223 1635174
7611 1635174 1626285 1631345 1622250 1644370 1645517 1604769 1594141 1592937 1594556 1611189 1604392 1585398 1572636
7598 1572636 1553043 1560430 1560953 1575330 1563932 1545911 1536076 1527110 1559399 1543137 1509131 1512531 1531390
$$ packed form
7686A991179J1048L074O349l5761J163L675q346j2805q010K7376j4016J6065l974
7673A977017L119k0628j4409J1710J1785J43k0083K1028l2617J4731j6278o515
7661A929003l0367o632J4608k0172k3484j3990j5136R124l604J0564L798q184
7649A845528l3756p785M1501L484n4860K2760p829m2106p5R461N150j7318j8199
7636A745956K1280j5428k297L587k4870k277k6566J9306K273j2130j0518k4129
7624A674187m288K4345J738l0946J0672J2840o866k4773l1r884k3075K304Q951
7611A635174q889N060r095K2120J147m0748j0628j204J619J6633o797j8994j2762
7598A572636j9593P387N23J4377j1398j8021r835q966L2289j6262l4006L400J8859
$$ plain form
7585 1531390 1510986 1494534 1493814 1521390 1523288 1476943 1480932 1488210 1460048 1451235 1453892 1475242 1457825
7572 1457825 1462241 1456498 1454098 1434249 1450181 1461110 1426021 1421778 1432165 1440674 1423609 1416481 1384332
7559 1384332 1397618 1411352 1410414 1415080 1414684 1384659 1371063 1379714 1365747 1345106 1348977 1346878 1327950
7546 1327950 1339130 1357966 1338302 1331488 1323174 1308798 1274688 1280178 1299547 1291929 1269094 1263396
7534 1263396 1284357 1298946 1286059 1298211 1281000 1261595 1244547 1259975 1261001 1270812 1268886 1241965
7522 1241965 1233915 1221440 1182407 1200312 1189768 1190523 1208588 1233697 1190919 1181278 1180196 1184654 1173446
7509 1173446 1169207 1169991 1182832 1170210 1173802 1183409 1184841 1157744 1140908 1147568 1119759 1127749 1129504
7496 1129504 1134456 1099225 1109754 1092674 1099538 1107142 1120594 1126278 1119731 1106897 1078512 1076188 1082592
$$ packed form
7585A531390k0404j6452p20K7576J898m6345L989P278k8162q813K657K1350j7417
7572A457825M416n743k400j9849J5932J0929l5089m243J0387Q509j7065p128l2149
7559A384332J3286J3734r38M666l96l0025j3596Q651j3967k0641L871k099j8928
7546A327950J1180J8836j9664o814q314j4376l4110N490J9369p618k2835n698
7534A263396K0961J4589j2887J2152j7211j9405j7048J5428J026R811j926k6921
7522A241965q050j2475l9033J7905j0544P55J8065K5109m2778r641j082M458j1208
7509A173446m239P84J2841j2622L592R607J432k7097j6836O660k7809P990J755
7496A129504M952l5231J0529j7080O864P604J3452N684o547j2834k8385k324O404
$$ plain form
7483 1082592 1083631 1046626 1075266 1098711 1075290 1058247 1048445 1054458 1045681 1052806 1036696 1033344 1037191
7470 1037191 1006618 988549 969810 997656 1000395 1010961 1005786 994824 982358 976323 991590 956982
7458 956982 962174 948257 971710 949434 966467 948250 953303 942077 945087 920011 925210 901574
7446 901574 921607 945916 938474 957318 931044 920608 904592 930572 924373 892378 910785 889286
7434 889286 879361 889133 900591 891974 894977 881609 874413 870298 858053 861616 879870 879216 871887 883923
7420 883923 884738 863732 833937 845412 841655 838206 857758 858348 832601 820188 848960 816484 795086
7407 795086 811160 818123 815312 804888 790806 812228 830093 819815 829947 812023 800841 806152
7395 806152 804926 788512 799236 796450 785549 786519 781054 784216 767399 764480 759964 782274 770636
$$ packed form
7483A082592J039l7005K8640K3445k3421j7043r802O013q777P125j6110l352L847
7470A037191l0573j8069j8739K7846K739J0566n175j0962j2466o035J5267l4608
7458I56982N192j3917K3453k2276J7033j8217N053j1226L010k5076N199k3636
7446I01574K0033K4309p442J8844k6274j0436j6016K5980o199l1995J8407k1499
7434H89286r925R772J1458q617L003j3368p196m115j2245L563J8254o54p329J2036
7420H83923Q15k1006k9795J1475l757l449J9552N90k5747j2413K8772l2476k1398
7407G95086J6074O963k811j0424j4082K1422J7865j0278J0132j7924j1182N311
7395H06152j226j6414J0724k786j0901R70n465L162j6817k919m516K2310j1638
$$ plain form
7382 770636 772008 766383 750101 741315 720428 740906 735398 716529 700889 747515 733621 724350 729595
7369 729595 732553 719496 716717 677257 709902 701441 702471 731388 706371 706497 707939 722678 713602
7356 713602 680170 712086 721185 719142 710328 697757 683385 734668 719865 721341 699336 694445 733983
7343 733983 704082 680037 683615 673729 691379 653066 631799 645601 625691 628158 656488 645941
7331 645941 609258 598967 629523 616638 615949 641575 641590 636479 613248 600518 591071 602134 594423
7318 594423 577713 566949 590792 591039 592531 588726 603026 575975 575468 561393 575965 571041 572279
7305 572279 607908 563710 544487 544409 533525 578441 566775 564144 558310 564437 592852 567015 535586
7292 535586 559487 585330 595684 559512 549095 554590 531045 532210 547910 553933 531546 515274
$$ packed form
7382G70636J372n625j6282q786k0887K0478n508j8869j5640M6626j3894r271N245
7369G29595K958j3057k779l9460L2645q461J030K8917k5017J26J442J4739r076
7356G13602l3432L1916R099k043q814j2571j4372N1283j4803J476k2005m891L9538
7343G33983k9901k4045L578r886J7650l8313k1267J3802j9910K467K8330j0547
7331F45941l6683j0291L0556j2885o89K5626J5n111k3231j2730r447J1063p711
7318E94423j6710j0764K3843K47J492l805J4300k7051n07j4075J4572m924J238
7305E72279L5629m4198j9223p8j0884M4916j1666k631n834O127K8415k5837l1429
7292E35586K3901K5843J0354l6172j0417N495k3545J165J5700O023k2387j6272
$$ plain form
7280 515274 526676 528496 515203 532081 532483 527124 515827 499796 513628 485269 495580 503826 519938
7267 519938 517848 504217 518183 499679 498018 493514 487059 487162 475496 495126 474719 435643 434829
7254 434829 478532 488833 510123 491574 491186 490493 475391 453608 472629 462253 451383 465332
7242 465332 467141 452928 449700 464955 468809 459204 430729 453414 454392 438064 446681 437628 403676
7229 403676 428619 435041 444574 410637 428004 438991 417576 429428 413751 408583 413468 418049 428362
7216 428362 436994 427355 392393 390638 408458 410599 422933 408581 396256 393119 390557 411475 395807
7203 395807 408518 395298 405776 403920 392346 402353 395011 411584 433476 422931 426629 385756
7191 385756 364257 423215 431112 432143 422353 383495 389306 370649 376667 385799 376586 371963 352708
$$ packed form
7280E15274J1402J820j3293J6878M02n359j1297j6031J3832k8359J0311Q246J6112
7267E19938k090j3631J3966j8504j661m504o455J03j1666J9630k0407l9076q14
7254D34829M3703J0301K1290j8549l88o93j5102k1783J9021j0376j0870J3949
7242D65332J809j4213l228J5255L854r605k8475K2685R78j6328Q617r053l3952
7229D03676K4943O422R533l3937J7367J0987k1415J1852j5677n168M885M581J0313
7216D28362Q632r639l4962j755J7820K141J2334j4352j2325l137k562K0918j5668
7203C95807J2711j3220J0478j856j1574J0007p342J6573K1892j0545L698m0873
7191C85756k1499N8958P897J031r790l8858N811j8657O018R132r213m623j9255
$$ plain form
7178 352708 347277 378926 378437 363092 366854 368484 339990 338555 334844 324909 327121 354057 346589 363198
7164 363198 377972 393393 379344 371074 378560 383850 371922 348220 364035 365613 355913 369517 363128
7151 363128 349384 344901 344971 354630 361162 369151 342549 345420 342984 339325 354876 353208 334220 319366
7137 319366 316932 310579 306032 295049 319427 332083 350411 341863 329778 358073 333106 305993
7125 305993 285951 290015 303557 313582 288251 308401 328016 320823 351081 343644 311363 294849
7113 294849 282811 307752 305441 312769 294282 320916 326987 304024 280454 283689 279227 320635 331293
7100 331293 305865 300611 311870 299363 298086 274446 266735 288629 282830 268009 277928 302121 316370
7087 316370 298248 267795 283153 297071 274781 290508 276305 297007 271292 284505 281294 266694
$$ packed form
7178C52708n431L1649m89j5345L762J630k8494j435l711r935K212K6936p468J6609
7164C63198J4774J5421j4049q270P486N290j1928k3702J5815J578r700J3604o389
7151C63128j3744m483P0R659O532P989k6602K871k436l659J5551j668j8988j4854
7137C19366k434o353m547j0983K4378J2656J8328q548j2085K8295k4967k7113
7125C05993k0042M064J3542J0025k5331K0150J9615p193L0258p437l2281j6514
7113B94849j2038K4941k311P328j8487K6634O071k2963k3570L235m462M1408J0658
7100C31293k5428n254J1259j2507j277k3640p711K1894n799j4821R919K4193J4249
7087C16370j8122l0453J5358J3918k2290J5727j4203K0702k5715J3213l211j4600
$$ plain form
7075 266694 279701 271783 253828 282370 319887 277631 240237 253124 254307 260064 289038 264605
7063 264605 278796 262908 253385 268393 262951 245465 254094 256195 238008 218490 265193 280151
7051 280151 272461 265668 270373 249045 264626 255350 243849 242145 273172 265333 256588 245183 238992
7038 238992 239005 226428 243177 259204 263786 263700 248561 260880 240789 245638 233376 220436 244809
7025 244809 233538 215100 204308 204599 214515 241749 252349 250524 248055 237381 237447 238174 245873 224119
7011 224119 219673 229373 227506 210216 219097 257059 234851 236113 223584 238497 238598 217049 224039
6998 224039 214250 226344 209580 206518 206766 190678 207259 220878 243775 229424 205776 249525
6986 249525 239693 219403 211296 211396 226629 228427 241739 242444 223935 204184 216769 199799 212101
$$ packed form
7075B66694J3007p918j7955K8542L7517m2256l7394J2887J183N757K8974k4433
7063B64605J4191j5888r523J5008n442j7486Q629K101j8187j9518M6703J4958
7051B80151p690o793M705k1328J5581r276j1501j704L1027p839q745j1405o191
7038B38992J3j2577J6749J6027M582q6j5139J2319k0091M849j2262j2940K4373
7025B44809j1271j8438j0792K91R916K7234J0600j825k469j0674O6P27P699k1754
7011B24119m446R700j867j7290Q881L7962k2208J262j2529J4913J01k1549O990
6998B24039r789J2094j6764l062K48j6088J6581J3619K2897j4351k3648M3749
6986B49525r832k0290q107J00J5233J798J3312P05j8509j9751J2585j6970J2302
$$ plain form
6973 212101 215949 228720 226996 213820 231054 211853 216137 226184 207232 191210 211437 231065
6961 231065 220953 218015 190801 191320 205107 201768 202603 192728 187096 186841 208457 210610 194072 206544
6947 206544 211647 209513 197921 189628 219485 193420 176029 183463 193587 203268 201555 207696 215057
6934 215057 211520 207861 193001 209023 194502 191513 207433 180859 188770 184012 198019 188477 209637
6921 209637 184693 183787 159194 186804 182226 172365 190607 173000 178369 170833 181511 191131 212113
6908 212113 214906 219119 203529 182291 185271 210892 207566 211200 192169 192136 202485 194999 186511 172121
6894 172121 179788 193577 168812 167323 187687 193504 199932 162379 168271 158868 179156 185831 179325
6881 179325 184701 168997 180828 202847 201835 175379 198624 187236 195311 191627 172758 197263
$$ packed form
6973B12101L848J2771j724j3176J7234j9201M284J0047j8952j6022K0227J9628
6961B31065j0112k938k7214N19J3787l339Q35r875n632k55K1616K153j6538J2472
6947B06544N103k134j1592q293K9857k6065j7391P434J0124R681j713O141P361
6934B15057l537l659j4860J6022j4521k989J5920k6574P911m758J4007r542K1160
6921B09637k4944r06k4593K7610m578r861J8242j7607N369p536J0678R620K0982
6908B12113K793M213j5590k1238K980K5621l326L634j9031l3J0349p486q488j4390
6894A72121P667J3789k4765j489K0364N817O428l7553N892r403K0288O675o506
6881A79325N376j5704J1831K2019j012k6456K3245j1388Q075l684j8869K4505
$$ plain form
6869 197263 197935 209981 197565 186112 169520 165537 155896 135423 131806 173371 160758 156097 167653
6856 167653 173755 207084 187476 173390 155330 153693 174520 186372 171456 167678 168251 163307 162708
6843 162708 169703 170007 157285 158479 167502 171471 171067 155975 180209 169904 165529 158020 147189 138457
6829 138457 151034 176000 151011 162995 140552 145819 138003 145063 102916 138826 182718 138316
6817 138316 167250 189208 172610 170378 163408 152791 168119 157652 162798 161231 159708 189438 176623
6804 176623 134920 154534 171050 170419 151813 143565 115667 142661 151056 144582 155738 156211 148890
6791 148890 141197 131759 169738 185729 178593 149225 179930 178421 174328 189911 170674 135164 128762
6778 128762 150875 143635 143072 140852 151760 166661 197394 176373 136560 135769 182767 185075 169995
$$ packed form
6869A97263O72J2046j2416j1453j6592l983r641k0473l617M1565j2613m661J1556
6856A67653O102L3329j9608j4086j8060j637K0827J1852j4916l778N73m944n99
6843A62708O995L04j2722J194R023L969m04j5092K4234j0305m375p509j0831q732
6829A38457J2577K4966k4989J1984k2443N267p816P060m2147L5910M3892m4402
6817A38316K8934K1958j6598k232o970j0617J5328j0467N146j567j523K9730j2815
6804A76623m1703J9614J6516o31j8606q248k7898K6994Q395o474J1156M73p321
6791A48890p693r438L7979J5991p136k9368L0705j509m093J5583j9237l5510o402
6778A28762K2113p240n63k220J0908J4901L0733k1021l9813p91M6998K308j5080
$$ plain form
6765 169995 156205 145168 180171 181400 165394 151438 152660 160172 164251 169694 170666 168196 137125
6752 137125 147839 152365 172483 180047 158179 146647 156306 143099 127220 124685 114097 123933 147036
6739 147036 184024 153895 151855 139034 140858 107453 139752 152666 136515 126782 122336 172193
6727 172193 175068 177362 136505 135368 135107 148330 147827 123151 132151 146077 152142 157942 133488 150286
6713 150286 184207 183310 171450 154979 124797 119418 110106 128597 148945 139097 124534 144736 153266
6700 153266 140380 177348 164398 124797 117762 117467 165130 144514 133279 153546 139251 149396
6688 149396 159660 135684 142481 158753 141747 141354 165997 163515 159053 156147 130915 150753 156093
6675 156093 133903 158376 159695 154301 145943 155249 159140 158514 140943 131889 156439 178123 148672
$$ packed form
6765A69995j3790j1037L5003J229j6006j3956J222P512M079N443R72k470l1071
6752A37125J0714M526K0118P564k1868j1532R659j3207j5879k535j0588R836K3103
6739A47036L6988l0129k040j2821J824l3405L2299J2914j6151r733m446M9857
6727A72193K875K294m0857j137k61J3223n03k4676R000J3926O065N800k4454J6798
6713A50286L3921q97j1860j6471l0182n379r312J8491K0348r848j4563K0202Q530
6700A53266j2886L6968j2950l9601p035k95M7663k0616j1235K0267j4295J0145
6688A49396J0264k3976O797J6272j7006l93K4643k482m462k906k5232J9838N340
6675A56093k2190K4473J319n394q358R306L891o26j7571r054K4550K1684k9451
$$ plain form
6662 148672 176677 143250 134200 176754 169080 153935 157596 131625 127243 157490 144772 144935 169784
6649 169784 150756 116832 93605 133697 140387 144305 160623 138482 170818 163310 132101 118998
6637 118998 134590 124684 154534 143138 135374 142997 161019 158668 178199 144369 149758 154701 157938
6624 157938 135857 120685 118545 148869 172700 140930 138496 145936 145229 143779 149872 140894 132042
6611 132042 118984 128352 137010 121947 132191 164926 151683 140862 147852 137368 135905 144407 154011
6598 154011 155449 173795 146872 123269 116279 134292 141360 126671 135700 157955 143040 168734
6586 168734 148595 147596 139065 161592 172869 159848 176985 173013 151978 133219 145792 154601 149596
6573 149596 128512 139225 128679 145786 159096 158569 184974 155767 152943 171450 151109 159279
$$ packed form
6662A48672K8005l3427r050M2554p674j5145L661k5971m382L0247j2718J63K4849
6649A69784j9028l3924k3227M0092O690L918J6318k2141L2336p508l1209j3103
6637A18998J5592r906K9850j1396p764P623J8022k351J9531l3830N389M943L237
6624A57938k2081j5172k140L0324K3831l1770k434P440p07j450O093q978q852
6611A32042j3058R368Q658j5063J0244L2735j3243j0821O990j0484j463Q502R604
6598A54011J438J8346k6923k3603o990J8013P068j4689R029K2255j4915K5694
6586A68734k0139r99q531K2527J1277j3021J7137l972k1035j8759J2573Q809n005
6573A49596k1084J0713j0546J7107J3310n27K6405k9207k824J8507k0341Q170
$$ plain form
6561 159279 138189 159412 152700 162161 158396 157088 135287 144939 137929 113982 144007 175653 180328
6548 180328 184454 157967 144960 130548 138591 143538 136642 143305 140108 152587 157011 137105 121708
6535 121708 139787 139492 135961 139303 161758 138154 128837 156794 139605 148602 117963 113853 145891
6522 145891 134443 89375 111465 144473 136952 130361 109625 121562 115976 126308 132012 132758 128286
6509 128286 127140 119685 126926 169048 159384 136149 146436 149042 128890 126327 149771 151152 145857
6496 145857 149741 134519 164081 153546 121206 112651 115478 161370 147898 118839 91595 118378
6484 118378 128291 119502 106977 134234 143840 163172 176293 150563 133676 116054 113398 137693
6472 137693 160693 137611 137183 131387 139781 132881 142432 151319 154370 151274 141498 111217 135448 140705
$$ packed form
6561A59279k1090K1223o712R461l765j308k1801R652p010k3947L0025L1646M675
6548A80328M126k6487j3007j4412Q043M947o896O663l197J2479M424j9906j5397
6535A21708J8079k95l531L342K2455k3604r317K7957j7189Q997l0639m110L2038
6522A45891j1448m5068K2090L3008p521o591k0736J1937n586J0332N704P46m472
6509A28286j146p455P241M2122r664k3235J0287K606k0152k563K3444J381n295
6496A45857L884j5222K9562j0535l2340q555K827M5892j3472k9059k7244K6783
6484A18378R913q789j2525K7257R606J9332J3121k5730j6887j7622k656K4295
6472A37693K3000k3082m28n796Q394o900R551Q887L051l096r776l0281K4231N257
$$ plain form
6458 140705 124767 130826 161311 153159 138496 152117 133019 144498 119098 116025 127321 144692
6446 144692 146046 136320 138554 119061 90536 104400 111155 135916 141573 131259 141957 134796 143746
6433 143746 140138 136942 142254 142605 122799 97166 133627 129841 122502 164326 141526 130619 125169
6420 125169 136573 155811 146744 105036 125854 111332 119744 156295 151443 141855 143461 146787 129680
6407 129680 132926 160903 168128 136891 127663 117842 117800 121322 154115 159500 148167 149488 157856 139387
6393 139387 126406 150081 144849 164535 143125 131070 157660 142708 121227 131862 163832 138967
6381 138967 134692 125429 126095 154417 165198 139719 124997 137793 153546 134566 121463 152806
6369 152806 134716 135673 123626 134945 170973 142530 137430 149314 141604 134704 128602 133573 154481
$$ packed form
6458A40705j5938O059L0485q152j4663J3621j9098J1479k5400l073J1296J7371
6446A44692J354r726K234j9493k8525J3864O755K4761N657j0314J0698p161Q950
6433A43746l608l196N312L51j9806k5633L6461l786p339M1824k2800j0907n450
6420A25169J1404J9238r067m1708K0818j4522Q412L6551m852r588J606L326j7107
6407A29680L246K7977P225l1237r228r821m2L522L2793N385j1333J321Q368j8469
6393A39387j2981K3675n232J9686k1410j2055K6590j4952k1481J0635L1970k4865
6381A38967m275r263O66K8322J0781k5479j4722J2796J5753j8980j3103L1343
6369A52806j8090R57j2047J1319L6028k8443n100J1884p710o900o102M971K0908
$$ plain form
6356 154481 163305 172302 177157 179829 176380 159881 148907 149933 143547 151754 147003 159758 156126 127911
6342 127911 149082 176421 162752 157498 129455 134865 143386 174602 159090 130478 136768 147700
6330 147700 154291 158116 150457 177144 168790 165987 184159 182790 148880 128531 149632 149882 152717
6317 152717 171910 149479 134187 173977 143522 149056 159114 131107 103144 121032 129643 136107
6305 136107 117880 105940 108832 127362 140991 154058 159678 157048 145795 151478 142714 171441 179877
6292 179877 179082 181405 164187 170336 205633 188274 188236 167293 167511 176672 156596 143596 146767 156335
6278 156335 147931 140842 122365 176131 178092 188284 169280 155732 158628 138530 163170 160321 169896
6265 169896 171467 159467 163506 162677 163978 154019 142544 155857 162073 181125 193388 155457 157298
$$ packed form
6356A54481Q824Q997M855K672l449j6499j0974J026o386Q207m751J2755l632k8215
6342A27911K1171K7339j3669n254k8043N410Q521L1216j5512k8612O290J0932
6330A47700O591L825p659K6687q354k803J8172j369l3910k0349K1101K50K835
6317A52717J9193k2431j5292L9790l0455N534J0058k8007k7963J7888Q611O464
6305A36107j8227j1940K892J8530J3629J3067N620k630j1253N683q764K8727Q436
6292A79877p95K323j7218O149L5297j7359l8k0943K18R161k0076j3000L171R568
6278A56335q404p089j8477N3766J961J0192j9004j3548K896k0098K4640k849R575
6265A69896J571j2000M039q29J301r959j1475J3313O216J9052J2263l7931J841
$$ plain form
6252 157298 154663 151407 151287 153224 164724 184722 188752 191813 182321 154482 165056 168512 163830 168890
6238 168890 171183 164042 190114 168612 158647 173764 183281 169970 166027 147453 157993 160916 166266
6225 166266 170780 161265 173142 160603 192991 207591 179496 167056 175142 175168 194630 195299 177134
6212 177134 197906 186216 189329 208878 207987 196137 197011 191259 163482 150675 151431 170866 183041
6199 183041 166385 184761 196051 176150 180936 190954 177478 157417 182451 181687 181371 174029 196691
6186 196691 199016 195665 163192 162946 159502 157930 177925 205298 207516 194280 220994 215424 187112
6173 187112 171745 179695 190488 170050 179147 157752 176267 178496 177256 193775 201238 200196 178764
6160 178764 194475 195960 188983 196889 187490 162812 179061 206857 236172 220889 195436 200060 193626
$$ packed form
6252A57298k635l256j20J937J1500J9998M030L061r492k7839J0574L456m682N060
6238A68890K293p141K6072k1502r965J5117R517j3311l943j8574J0540K923N350
6225A66266M514r515J1877j2539L2388J4600k8095j2440Q086K6J9462O69j8165
6212A77134K0772j1690L113J9549q91j1850Q74n752k7777j2807P56J9435J2175
6199A83041j6656J8376J1290j9901M786J0018j3476k0061K5034p64l16p342K2662
6186A96691K325l351l2473k46l444j572J9995K7373K218j3236K6714n570k8312
6173A87112j5367P950J0793k0438R097k1395J8515K229j240J6519P463j042k1432
6160A78764J5711J485o977P906r399k4678J6249K7796K9315j5283k5453M624o434
$$ plain form
6147 193626 179025 178305 183000 210823 217114 191278 213386 201972 210882 197745 189322 172568 164932
6134 164932 201212 181206 173290 192676 233836 210485 235409 230819 212219 218474 195005 211188
6122 211188 191035 223184 208946 194293 230202 247071 219714 224896 236999 213923 216049 208871
6110 208871 200884 184824 193007 183055 215387 178630 185748 211244 220800 220510 204982 187688 195022
6097 195022 214523 213730 210332 209404 203932 217621 229713 213003 200401 205151 232172 235148 213833
6084 213833 201332 218379 233973 226474 230399 223893 245699 218859 221753 204983 200086 210857 197744
6071 197744 222609 256634 224455 229715 240184 233350 243323 229747 247744 238410 230693 224590 229436
6058 229436 235169 227764 212223 184763 193891 251100 217767 213950 223035 239686 253063 261549 259442
$$ packed form
6147A93626j4601p20M695K7823O291k5836K2108j1414Q910j3137q423j6754p636
6134A64932L6280k0006p916J9386M1160k3351K4924m590j8600O255k3469J6183
6122B11188k0153L2149j4238j4653L5909J6869k7357N182J2103k3076K126p178
6110B08871p987j6060Q183r952L2332l6757P118K5496R556k90j5528j7294P334
6097A95022J9501p93l398r28n472J3689J2092j6710j2602M750K7021K976k1315
6084B13833j2501J7047J5594p499L925o506K1806k6840K894j6770m897J0771j3113
6071A97744K4865L4025l2179N260J0469o834R973j3576J7997r334p717o103M846
6058B29436N733p405j5541k7460R128N7209l3333l817R085J6651J3377Q486k107
$$ plain form
6045 259442 230569 230081 236191 230313 236508 217710 217190 191689 215031 226095 222904 227606 207100
6032 207100 208119 234218 239131 224224 240741 217134 224096 222581 216236 249472 256303 250699 242232
6019 242232 222137 236445 240767 240767 245153 234697 234054 246077 277886 273960 259391 241677 257262
6006 257262 282576 265175 264336 272553 271991 263896 260078 292655 274410 254141 277834 261445 236902
5993 236902 254533 264272 238526 248410 237187 259303 264410 255838 240484 254846 262501 247361 249548
5980 249548 286006 287050 230487 201129 211342 231041 235716 253159 268369 272408 262179 275700
5968 275700 250360 246242 255785 290318 283670 258360 250365 247950 272843 244723 236178 292949 266323
5955 266323 272133 287708 246709 226876 239811 256908 263335 272609 268133 272737 253104 276811 296282
$$ packed form
6045B59442k8873m88O110n878O195j8798n20k5501K3342J1064l191M702k0506
6032B07100J019K6099M913j4907J6517k3607O962j515o345L3236O831n604q467
6019B42232k0095J4308M322%M386j0456o43J2023L1809l926j4569j7714J5585
6006B57262K5314j7401q39Q217n62q095l818L2577j8245k0269K3693j6389k4543
5993B36902J7631R739k5746R884j1223K2116N107q572j5354J4362P655j5140K187
5980B49548L6458J044n6563k9358J0213J9699M675J7443J5210M039j0229J3521
5968B75700k5340m118R543L4533o648k5310p995k415K4893k8120q545N6771k6626
5955B66323N810J5575m0999j9833J2935J7097O427R274m476M604j9633K3707J9471
$$ plain form
5942 296282 316923 285053 288978 282033 264360 299134 285602 281591 278784 287800 295407 323918 310180
5929 310180 288946 308223 307859 262408 262017 285051 272245 293693 324759 304468 310802 296731 269553
5916 269553 295286 296510 299073 284254 282279 302871 310488 307056 294554 280119 296396 303610 294731
5903 294731 277103 268456 289200 278301 267913 288295 281582 314573 291668 287482 300567 287126
5891 287126 309652 301439 328493 298020 278398 297756 306298 301245 287855 272751 307956 325814
5879 325814 305381 307187 316644 319889 308979 315654 320664 325112 326886 338253 361560 352707 341909
5866 341909 339392 318528 299912 292508 307616 306203 323180 314241 320308 341842 359877 349458 374506
5853 374506 369680 340702 336312 313745 343719 357187 338415 320001 347318 362956 368556 358831
$$ packed form
5942B96282K0641l1870L925o945j7673L4774j3532m011k807R016P607K8511j3738
5929C10180k1234J9277l64m5451l91K3034j2806K1448L1066k0291O334j4071k7178
5916B69553K5733J224K563j4819j975K0592P617l432j2502j4435J6277P214q879
5903B94731j7628q647K0744j0899j0388K0382o713L2991k2905m186J3085j3441
5891B87126K2526q213K7054l0473j9622J9358Q542n053j3390j5104L5205J7858
5879C25814k0433J806R457L245j0910O675N010M448J774J1367K3307q853j0798
5866C41909k517k0864j8616p404J5108j413J6977q939O067K1534J8035j0419K5048
5853C74506m826k8978m390k2567K9974J3468j8772j8414K7317J5638N600r725
$$ plain form
5841 358831 351480 348984 320350 340164 342159 349064 370993 361275 357096 332701 332605 366662 375775 370397
5827 370397 356881 398319 392512 382439 361320 365668 391168 392525 411294 433402 409009 397417
5815 397417 388878 370274 390906 387714 390552 393943 373955 386929 407419 402691 419458 403291 424864
5802 424864 401717 408475 413418 397108 396004 407062 400425 408710 410511 415837 437241 440767 460311
5789 460311 458871 456378 427513 412122 431232 461748 458436 458731 469753 447234 456099 479751 472309
5776 472309 471964 477853 468344 486905 491347 480380 498461 513566 502532 514352 521961 524038 505354
5763 505354 473583 495881 518330 531213 528125 510813 538366 511709 496937 510532 500212 487595
5751 487595 486281 510067 513976 489477 463671 485515 518753 519033 505849 510496 505602 480362 481586
$$ packed form
5841C58831p351k496k8634J9814J995O905K1929r718m179k4395r6L4057R113n378
5827C70397j3516M1438n807j0073k1119M348K5500J357J8769K2108k4393j1592
5815C97417q539j8604K0632l192K838L391j9988J2974K0490m728J6767j6167K1573
5802D24864k3147O758M943j6310j104J1058o637Q285J801N326K1404L526J9544
5789D60311j440k493k8865j5391J9110L0516l312K95J1022k2519Q865K3652p442
5776D72309l45N889r509J8561M442j0967J8081J5105j1034J1820P609K077j8684
5763E05354l1771K2298K2449J2883l088j7312K7553k6657j4772J3595j0320j2617
5751D87595j314K3786L909k4499k5806K1844L3238K80j3184M647m894k5240J224
$$ plain form
5738 481586 530967 512928 529315 548791 537768 525440 537700 510301 490182 513556 517053 502065
5726 502065 535416 549285 542348 546544 543216 536367 558752 566174 567787 591531 612257 621411 575995
5713 575995 554797 553614 568927 585106 614007 590623 627428 623935 626540 607917 602407 594202 584531
5700 584531 589656 607050 609211 614530 632015 622497 629248 625269 605491 583537 558590 573368 565827
5687 565827 551817 564073 559542 556723 539918 534122 527152 527627 553178 571208 520531 509143 497828
5674 497828 506331 486192 470418 522515 522106 512969 510668 497293 485698 481990 469113 481703 499954
5661 499954 494514 510437 493702 492636 531065 541811 535883 521950 528375 529391 534267 545964 541939
5648 541939 535211 543860 562869 539005 543138 525175 494555 491685 510094 492952 503535 533446
$$ packed form
5738D81586M9381j8039J6387J9476j1023j2328J2260k7399k0119K3374L497j4988
5726E02065L3351J3869o937M196l328o849K2385P422J613K3744K0726R154m5416
5713E75995k1198j183J5313J6179K8901k3384L6805l493K605j8623n510q205r671
5700E84531N125J7394K161N319J7485r518O751l979j9778k1954k4947J4778p541
5687E65827j4010J2256m531k819j6805n796o970M75K5551J8030n0677j1388j1315
5674D97828Q503k0139j5774N2097m09r137k301j3375j1595l708j2877J2590J8251
5661D99954n440J5923j6735j066L8429J0746n928j3933O425J016M876J1697m025
5648E41939o728Q649J9009k3864M133j7963l0620k870J8409j7142J0583K9911
$$ plain form
5636 533446 557725 539867 530586 527697 525147 526493 547305 539552 532572 551143 581040 578294 600241
5623 600241 576771 551920 550861 569234 575454 570884 558700 559210 582305 552674 565966 604464 574889
5610 574889 552697 544495 564354 561922 547272 568735 557825 560317 575320 600386 596012 591930 575818
5597 575818 580919 577839 596531 612893 634427 617078 610539 601498 596977 622338 602677 569426 619322
5584 619322 656181 635020 622381 660438 665672 656623 689693 688041 681805 682095 693190 703626 728200
5571 728200 722094 719697 754582 753989 749199 742249 743197 734963 730072 710601 736380 757390 749635 784373
5557 784373 776291 765553 774742 787574 823763 821008 810492 799639 850079 832215 837044 854607
5545 854607 842970 855558 876725 843158 835375 851679 849110 835430 792431 816297 839690 833700
$$ packed form
5636E33446K4279j7858r281k889k550J346K0812p753o980J8571K9897k746K1947
5623F00241k3470k4851j059J8373O220m570j2184N10K3095k9631J3292L8498k9575
5610E74889k2192q202J9859k432j4650K1463j0910K492J5003K5066m374m082j6112
5597E75818N101l080J8692J6362K1534j7349o539r041m521K5361j9661l3251M9896
5584F19322L6859k1161j2639L8057N234r049L3070j652o236K90J1095J0436K4574
5571G28200o106k397L4885n93m790o950R48q234m891j9471K5779K1010p755L4738
5557G84373q082j0738R189J2832L6189k755j0516j0853N0440j7864M829J7563
5545H54607j1637J2588K1167l3567p783J6304k569j3680m2999K3866K3393n990
$$ plain form
5533 833700 820664 830505 818897 832761 864734 849347 854599 847358 839529 847202 829574 813124 799384
5520 799384 768023 774969 766645 780874 755379 748697 745471 751007 752505 716969 727866 748148 736963
5507 736963 736076 779232 771685 734375 708100 725034 748088 759559 740990 757905 714859 703236
5495 703236 731212 735886 739873 740089 738607 734001 732124 771908 788101 792305 801609 778386 772473 818992
5481 818992 797605 808021 824269 785846 767658 768320 805702 822949 802436 814054 798189 761085
5469 761085 771538 800104 812056 804803 820044 833901 825189 819203 835375 841799 805690 771160
5457 771160 764161 792524 797553 790015 789765 809245 829158 822827 834957 849788 868257 891302 894761
5444 894761 893964 872564 880401 857833 846428 850290 844659 834342 811085 789386 788957 798961 822776
$$ packed form
5533H33700j3036R841j1608J3864L1973j5387N252p241p829P673j7628j6450j3740
5520G99384l1361O946q324J4229k5495o682l226N536J498l5536J0897K0282j1185
5507G36963q87M3156p547l7310k6275J6934K3054J1471j8569J6915m3046j1623
5495G03236K7976M674L987K16j482m606j877L9784J6193M204R304k3223n913M6519
5481H18992k1387J0416J6248l8423j8188O62L7382J7247k0513J1618j5865l7104
5469G61085J0453K8566J1952p253J5241J3857q712n986J6172O424l6109l4530
5457G71160o999K8363N029p538k50J9480J9913o331J2130J4831J8469K3045L459
5444H94761p97k1400P837k2568j1405L862n631j0317k3257k1699m29J0004K3815
$$ plain form
5431 822776 830964 822768 838414 821623 822854 825238 836592 865850 882129 898507 908289 911690 921649
5418 921649 920935 919587 914154 877366 905409 911873 920837 898810 877571 858899 808011 838103 871715
5405 871715 868164 830314 827719 835471 853206 872161 858885 868993 862386 845920 844137 870168 876185
5392 876185 854868 857988 873066 879422 867025 852386 856950 862813 867255 857586 818109 867039 864425
5379 864425 873148 871213 858709 868140 889979 842200 853488 871566 890399 900229 894509 890158 890980
5366 890980 886674 854786 859637 872564 903237 897821 887731 908452 949666 938282 914715 921455
5354 921455 924572 916977 906103 908655 910256 907767 899344 932448 958192 940352 938128 933482 895224
5341 895224 889904 924461 893886 913426 928638 957538 953338 938675 957349 934881 941798 946244
$$ packed form
5431H22776Q188q196J5646j6791J231K384J1354K9258J6279J6378R782L401R959
5418I21649p14j348n433l6788K8043O464Q964k2027k1239j8672n0888L0092L3612
5405H71715l551l7850k595P752J7735J8955j3276J0108o607j6466j783K6031O017
5392H76185k1317L120J5078O356j2397j4639M564N863M442r669l9477M8930k614
5379H64425Q723j935j2504R431K1839m7779J1288J8078J8833R830n720m351Q22
5366H90980m306l1888M851J2927L0673n416j0090K0721M1214j1384k3567O740
5354I21455L117p595j0874K552J601k489q423L3104K5744j7840k224m646l8258
5341H95224n320L4557l0575J9540J5212K8900m200j4663J8674k2468O917M446
$$ plain form
5329 946244 952044 947331 982274 982282 976092 947306 958337 972916 978767 976871 987743 999829 986632
5316 986632 968277 970607 1002675 1004742 969517 995417 986091 972006 967829 963719 963760 955408 987383
5303 987383 1014791 1026644 1023724 1012959 1028419 1056769 1034112 1048725 1053914 1047362 1015196 1014316 1032118
5290 1032118 1027966 1006779 1007572 995062 1031450 1012637 1025105 1034029 996188 1025114 1034365 998999
5278 998999 1004781 1024916 1035883 1056171 1030232 1024466 1055047 1072898 1082215 1061067 1064008 1066319 1059003
5265 1059003 1070121 1110910 1091299 1073555 1065223 1079485 1055666 1059671 1068884 1106647 1104359 1099115
5253 1099115 1114969 1114042 1076146 1102273 1134969 1102283 1094308 1080672 1096236 1081129 1098755 1082500
5241 1082500 1101128 1115890 1094308 1075679 1113837 1122763 1112265 1121453 1111719 1116287 1144488 1141827
$$ packed form
5329I46244N800m713L4943Qo190k8786J1031J4579N851j896J0872J2086j3197
5316I86632j8355K330L2068K067l5225K5900r326j4085m177m110M1q352L1975
5303I87383K7408J1853k920j0765J5460K8350k2657J4613N189o552l2166q80J7802
5290A032118m152k1187P93j2510L6388j8813J2468Q924l7841K8926R251l5366
5278I98999N782K0135J0967K0288k5939n766L0581J7851R317k1148K941K311p316
5265A059003J1118M0789j9611j7744q332J4262k3819M005R213L7763k288n244
5253A099115J5854r27l7896K6127L2696l2686p975j3636J5564j5107J7626j6255
5241A082500J8628J4762k1582j8629L8158Q926j0498R188r734M568K8201k661
$$ plain form
5229 1141827 1152102 1171685 1158072 1142951 1148844 1134473 1126701 1137123 1170768 1153221 1142381 1170517
5217 1170517 1149407 1143519 1173867 1164978 1181308 1185488 1157564 1170099 1176556 1165198 1158193 1147945
5205 1147945 1174902 1195286 1187557 1186873 1198687 1228304 1194463 1137362 1144502 1176316 1168092 1215696
5193 1215696 1227417 1252489 1256318 1264070 1275215 1276397 1292884 1312536 1325073 1319948 1283105 1286873
5181 1286873 1285308 1284682 1280670 1282646 1320803 1302811 1321464 1338180 1377361 1356475 1350538 1359666 1392127
5168 1392127 1385369 1368006 1385388 1398371 1408134 1416385 1401961 1424433 1451465 1428749 1427282 1405983
5156 1405983 1416291 1442486 1464421 1446561 1432745 1436105 1457208 1478537 1451103 1438638 1478061 1472425
5144 1472425 1479113 1504494 1510465 1497316 1486043 1494054 1484014 1523786 1554690 1590841 1564786 1567887
$$ packed form
5229A141827J0275J9583j3613j5121N893j4371p772J0422L3645j7547j0840K8136
5217A170517k1110n888L0348q889J6330M180k7924J2535O457j1358p005j0248
5205A147945K6957K0384p729o84J1814K9617l3841n7101P140L1814q224M7604
5193A215696J1721K5072L829P752J1145J182J6487J9652J2537n125l6843L768
5181A286873j565o26m012J976L8157j7992J8653J6716L9181k0886n937R128L2461
5168A392127o758j7363J7382J2983R763Q251j4424K2472K7032k2716j467k1299
5156A405983J0308K6195K1935j7860j3816L360K1103K1329k7434j2465L9423n636
5144A472425O688K5381N971j3149j1273Q011j0040L9772L0904L6151k6055L101
$$ plain form
5132 1567887 1560577 1585800 1590966 1599667 1616964 1635339 1674621 1705007 1757910 1790593 1818553 1848904
5120 1848904 1906391 1989034 2050616 2103550 2191311 2286855 2388371 2508372 2666484 2819368 2979924
5109 2979924 3207569 3520680 3824555 4030871 4056412 3897554 3613943 3333565 3092924 2869794
5099 2869794 2675225 2547602 2453431 2384747 2344768 2303898 2261647 2202318 2190421 2185497 2190065
5088 2190065 2171120 2166043 2195058 2163782 2110686 2121158 2115176 2105924 2107138 2142162 2149862 2119672
5076 2119672 2110116 2142480 2154798 2152661 2156935 2184734 2200354 2191596 2215087 2218909 2247389 2258166
5064 2258166 2258669 2252450 2282680 2291594 2283801 2275341 2277531 2327726 2385439 2449008 2493162 2545140 2615166
5051 2615166 2701827 2796673 2878910 3007337 3148838 3307292 3429706 3622260 3888333 4165802
$$ packed form
5132A567887p310K5223N166Q701J7297J8375L9282L0386N2903L2683K7960L0351
5120A848904N7487Q2643O1582N2934Q7761R5544J01516J20001J58112J52884J60556
5109B979924K27645L13111L03875K06316K5541j58858k83611k80378k40641k23130
5099B869794j94569j27623r4171o8684l9979m0870m2251n9329j1897m924M568
5088B190065j8945n077K9015l1276n3096J0472n982r252J214L5024P700l0190
5076B119672r556L2364J2318k137M274K7799J5620q758K3491L822K8480J0777
5064B258166N03o219L0230Q914p793q460K190N0195N7713O3569M4154N1978P0026
5051B615166Q6661R4846Q2237J28427J41501J58454J22414J92554K66073K77469
$$ plain form
5041 4165802 4389568 4496485 4509554 4376727 4134361 3849303 3587366 3378651 3191333 3065477
5031 3065477 2968111 2888726 2826922 2784617 2766648 2747102 2707888 2715826 2688442 2650347 2629522 2606644
5019 2606644 2590746 2621256 2638881 2664457 2685167 2679710 2698180 2751583 2724124 2727204 2760605 2782534
5007 2782534 2809631 2809405 2820412 2868456 2895826 2923570 2937954 2944883 2955326 2952846 2942419 2911735
4995 2911735 2915445 2905512 2944036 2963268 2988027 3013279 3042506 3058286 3076195 3101162 3154945 3186971
4983 3186971 3252467 3306548 3327714 3283400 3231869 3255468 3246026 3233767 3216099 3219666 3228803 3251637
4971 3251637 3292525 3304751 3346914 3371336 3382819 3385529 3401881 3439399 3439271 3492858 3557952 3605506
4959 3605506 3617777 3622661 3615672 3619647 3654389 3670506 3713877 3772579 3806151 3862205 3915488 3983841
$$ packed form
5041D165802K23766J06917J3069j32827k42366k85058k61937k08715j87318j25856
5031C065477r7366p9385o1804m2305j7969j9546l9214P938k7384l8095k0825k2878
5019B606644j5898L0510J7625K5576K0710n457J8470N3403k7459L080L3401K1929
5007B782534K7097k26J1007M8044K7370K7744J4384O929J0443k480j0427l0684
4995B911735L710r933L8524J9232K4759K5252K9227J5780J7909K4967N3783L2026
4983C186971O5496N4081K1166m4314n1531K3599r442j2259j7668L567R137K2834
4971C251637M0888J2226M2163K4422J1483K710J6352L7518j28N3587O5094M7554
4959C605506J2271M884o989L975L4742J6117M3371N8702L3572N6054N3283O8353
$$ plain form
4947 3983841 4047761 4117790 4197000 4266390 4307752 4346547 4383217 4465297 4545785 4626662 4722820
4936 4722820 4766943 4788602 4804534 4849049 4894681 4966551 5016644 5115409 5195130 5258814 5369771
4925 5369771 5508621 5613714 5727694 5835036 5953119 6049094 6161012 6287903 6443368 6574644
4915 6574644 6663881 6728540 6761762 6827027 6871264 6896515 7016110 7137139 7294409 7471480 7659078
4904 7659078 7846154 8038638 8229889 8385643 8558647 8768131 9031476 9339067 9648931 9960732
4894 9960732 10283126 10605046 10926391 11253537 11582485 11888726 12195190 12582223 12962736 13297501
4884 13297501 13656281 14005592 14306995 14624660 14933802 15327696 15773583 16293258 16841665
4875 16841665 17433186 18017486 18603916 19228450 19832434 20442653 21059260 21714077 22393423
$$ packed form
4947C983841O3920P0029P9210O9390M1362L8795L6670Q2080Q0488Q0877R6158
4936D722820M4123K1659J5932M4515M5632P1870N0093R8765P9721O3684J10957
4925E369771J38850J05093J13980J07342J18083R5975J11918J26891J55465J31276
4915F574644Q9237O4659L3222O5265M4237K5251J19595J21029J57270J77071J87598
4904G659078J87076J92484J91251J55754J73004K09484K63345L07591L09864L11801
4894I960732L22394L21920L21345L27146L28948L06241L06464L87033L80513L34765
4884A3297501L58780L49311L01403L17665L09142L93894M45887N19675N48407
4875A6841665N91521N84300N86430O24534O03984O10219O16607O54817O79346
$$ plain form
4866 22393423 23052612 23746805 24471471 25172905 25915927 26754733 27707246 28799126 29956887
4857 29956887 31273568 32645166 34073325 35535439 37061231 38672320 40467737 42446671
4849 42446671 44689081 47186397 49925573 53050626 56535152 60467819 64993359 70198487
4841 70198487 76155773 83100385 91460014 101583496 113804526 128333975 145255577 164546943
4833 164546943 186586517 212131555 242569955 279738826 325248072 375986243 420151843
4826 420151843 441804978 432378768 396691546 344713147 291785566 244223651 203713811
4819 203713811 172888918 150070684 132930494 119553981 108787666 99910254 92445189
4812 92445189 86112908 80822880 76322507 72481894 69125891 66228914 63697244 61604211
$$ packed form
4866B2393423O59189O94193P24666P01434P43022Q38806R52513J091880J157761
4857B9956887J316681J371598J428159J462114J525792J611089J795417J978934
4849D2446671K242410K497316K739176L125053L484526L932667M525540N205128
4841G0198487N957286O944612Q359629J0123482J2221030J4529449J6921602J9291366
4833A64546943K2039574K5545038L0438400L7168871M5509246N0738171M4165600
4826D20151843K1653135r426210l5687222n1978399n2927581m7561915m0509840
4819B03713811l0824893k2818234j7140190j3376513j0766315q877412p465065
4812I2445189o332281n290028m500373l840613l356003k896977k531670k093033
$$ plain form
4804 61604211 59857061 58389660 57114796 56037801 55036345 54138811 53298271 52545106 51822602
4795 51822602 51246258 50850770 50689734 50634383 50687512 50762367 50898310 51124088 51438652 51924479
4785 51924479 52639440 53605661 54799687 56272869 57983045 59902858 62161504 64785322
4777 64785322 67851947 71458179 75727715 80694524 86613250 93775762 102564307 113199941
4769 113199941 126159345 141720643 159753130 180626611 205258479 234496168 270028935
4762 270028935 313678032 362442986 404574269 428165405 428915949 409499228 366086567
4755 366086567 311845566 263901999 221005488 185628472 159065807 139198112 123984464
4748 123984464 112064126 102480614 94771649 88372699 83156190 78805963 74921032 71105143
$$ packed form
4804F1604211j747150j467401j274864j076995j001456q97534q40540p53165p22504
4795E1822602n76344l95488j61036n5351N3129P4855J35943K25778L14564M85827
4785E1924479P14961R66221J194026J473182J710176J919813K258646K623818
4777F4785322L066625L606232M269536M966809N918726P162512Q788545J0635634
4769A13199941J2959404J5561298J8032487K0873481K4631868K9237689L5532767
4762B70028935M3649097M8764954M2131283K3591136P50544j9416721m3412661
4755C66086567n4241001m7943567m2896511l5377016k6562665j9867695j5213648
4748A23984464j1920338r583512p708965o398950n216509m350227l884931l815889
$$ plain form
4740 71105143 67178228 63198805 59464153 56062651 53021102 50339814 47982836 45840844
4732 45840844 43925933 42128297 40487096 39027729 37680821 36452694 35336977 34266397
4724 34266397 33227188 32141934 31019849 29919526 28825695 27803169 26915295 26082386
4716 26082386 25361381 24659330 23992373 23362726 22759305 22151066 21563337 21012244 20503600
4707 20503600 19998870 19556046 19107291 18625332 18142202 17694655 17249108 16847373 16484433
4698 16484433 16149677 15846243 15523533 15259080 14986286 14697337 14432790 14181234 13923448
4689 13923448 13725524 13525984 13315575 13143865 12968991 12761950 12482349 12225889 11959541
4680 11959541 11669254 11404609 11225216 11034402 10870082 10653042 10422238 10191877 9922658
$$ packed form
4740G1105143l926915l979423l734652l401502l041549k681288k356978k141992
4732D5840844j914911j797636j641201j459367j346908j228127j115717j070580
4724C4266397j039209j085254j122085j100323j093831j022526q87874q32909
4716B6082386p21005p02051o66957o29647o03421o08239n87729n51093n08644
4707B0503600n04730m42824m48755m81959m83130m47547m45547m01735l62940
4698A6484433l34756l03434l22710k64453k72794k88949k64547k51556k57786
4689A3923448j97924j99540k10409j71710j74874k07041k79601k56460k66348
4680A1959541k90287k64645j79393j90814j64320k17040k30804k30361k69219
$$ plain form
4671 9922658 9710060 9529311 9360823 9201475 9074143 9016246 8907741 8796357 8670693 8531175
4661 8531175 8420550 8342426 8235664 8150576 8063373 7994937 7892866 7819673 7765477 7662621 7559691
4650 7559691 7467793 7375690 7275950 7248181 7196901 7152825 7119625 7095163 7029753 6963891 6878059
4639 6878059 6812911 6738982 6667847 6620456 6606352 6544428 6470273 6415928 6355318 6247802 6158977
4628 6158977 6077184 6042513 5938283 5812861 5731447 5671149 5651771 5622354 5577879 5573080 5499302
4617 5499302 5468819 5414299 5349927 5308375 5256722 5193220 5129064 5084361 5054984 4983382 4919566
4606 4919566 4838431 4782682 4736914 4673661 4634486 4634888 4632254 4639992 4646523 4604346 4566829 4546788
4594 4546788 4514104 4500218 4487322 4447556 4444144 4395253 4374790 4323190 4273766 4238293 4214026 4158018
$$ packed form
4671I922658k12598j80749j68488j59348j27332n7897j08505j11384j25664j39518
4661H531175j10625p8124j06762q5088q7203o8436j02071p3193n4196j02856j02930
4650G559691r1898r2103r9740k7769n1280m4076l3200k4462o5410o5862q5832
4639F878059o5148p3929p1135m7391j4104o1924p4155n4345o0610j07516q8825
4628F158977q1793l4671j04230j25422q1414o0298j9378k9417m4475m799p3778
4617E499302l0483n4520o4372m1552n1653o3502o4156m4703k9377p1602o3816
4606D919566q1135n5749m5768o3253l9175M02k634P738O531m2177l7517k0041
4594D546788l2684j3886j2896l9766l412m8891k0463n1600m9424l5473k4267n6008
$$ plain form
4582 4158018 4145607 4139308 4183286 4174833 4149556 4168863 4195344 4202267 4207469 4200960 4164454 4153056
4570 4153056 4149748 4153211 4190790 4190715 4179962 4195399 4167113 4184050 4188704 4166084 4188617 4192499 4190761
4557 4190761 4198945 4181347 4206534 4237976 4337447 4443661 4484329 4598637 4734739 4871365 5047754
4546 5047754 5317977 5598711 5839930 5959339 5891222 5676620 5353140 5036201 4760816 4450778
4536 4450778 4275691 4147066 4049081 4013240 3960275 3932356 3868410 3818311 3799061 3791525 3748963
4525 3748963 3676206 3645605 3613995 3590792 3566211 3532753 3488711 3466844 3432744 3384175 3353260
4514 3353260 3373230 3358488 3360427 3382835 3338139 3323863 3326074 3323009 3306044 3292150 3270789 3239585
4502 3239585 3225464 3217615 3230133 3219161 3205417 3213920 3193576 3199083 3203602 3201195 3201020 3207278 3188115
$$ packed form
4582D158018j2411o299M3978q453k5277J9307K6481O923N202o509l6506j1398
4570D153056l308L463L7579p5j0753J5437k8286J6937M654k2620K2533L882j738
4557D190761Q184j7598K5187L1442R9471J06214M0668J14308J36102J36626J76389
4546E047754K70223K80734K41219J19409o8117k14602l23480l16939k75385l10038
4536D450778j75087j28625r7985l5841n2965k7919o3946n0099j9250p536m2562
4525C748963p2757l0601l1610k3203k4581l3458m4042k1867l4100m8569l0915
4514C353260J9970j4742J939K2408m4696j4276K211l065j6965j3894k1361l1204
4502C239585j4121p849J2518j0972j3744Q503k0344N507M519k407j75O258j9163
$$ plain form
4489 3188115 3199304 3190106 3243784 3316005 3377286 3450422 3518947 3606044 3741887 3850412 4042495
4478 4042495 4261348 4511045 4764823 5007143 5073974 4990783 4807449 4485335 4164610 3915634
4468 3915634 3702958 3521474 3405151 3321884 3260534 3207424 3149542 3100785 3093549 3053413 3009949
4457 3009949 2948273 2904230 2896963 2862005 2838861 2782274 2770613 2781262 2753275 2761184 2761974 2735602
4445 2735602 2685743 2672351 2678827 2671158 2634654 2617715 2607033 2599596 2573979 2539336 2484352 2449462
4433 2449462 2431130 2424936 2381540 2409876 2403632 2364254 2378803 2367780 2365717 2328683 2315706 2310692
4421 2310692 2300092 2291347 2287612 2322302 2315388 2336389 2315060 2288843 2265179 2270143 2267710 2272502 2282024
4408 2282024 2257754 2269489 2259623 2216359 2247361 2240528 2222157 2205790 2214188 2197862 2191391 2194418
$$ packed form
4489C188115J1189r198N3678P2221O1281P3136O8525Q7097J35843J08525J92083
4478D042495K18853K49697K53778K42320O6831q3191j83334l22114l20725k48976
4468C915634k12676j81484j16323q3267o1350n3110n7882m8757p236m0136m3464
4457C009949o1676m4043p267l4958k3144n6587j1661J0649k7987P909P90k6372
4445B735602m9859j3392O476p669l6504j6939j0682p437k5617l4643n4984l4890
4433B449462j8332o194m3396K8336o244l9378J4549j1023k063l7034j2977n014
4421B310692j0600q745l735L4690o914K1001k1329k6217k3664M964k433M792R522
4408B282024k4270J1735r866m3264L1002o833j8371j6367Q398j6326o471L027
$$ plain form
4396 2194418 2203851 2211369 2194198 2201889 2181796 2217957 2223906 2177917 2164882 2142345 2127288 2119751
4384 2119751 2104753 2101730 2070989 2091863 2069882 2053627 2053580 2021515 2006726 1979388 1961705 1975164
4372 1975164 1951061 1953837 1947808 1919725 1914375 1954632 1966191 1962661 1945142 1949861 1947877 1944659 1922657
4359 1922657 1930293 1926423 1934798 1904210 1891647 1865941 1865583 1832027 1806806 1803935 1822161 1827851 1832492
4346 1832492 1856052 1827722 1844837 1840321 1845122 1822354 1810257 1803362 1809463 1800176 1795414 1765635 1752650
4333 1752650 1768066 1765187 1761036 1754702 1728568 1747353 1729066 1721396 1720443 1721988 1720228 1747543 1741991
4320 1741991 1752389 1743518 1760892 1787633 1787741 1805385 1825273 1835036 1860012 1933046 2006429 2062905
4308 2062905 2141505 2201508 2146772 2108988 2038654 1972696 1920888 1846604 1796979 1776425 1751014
$$ packed form
4396B194418R433P518j7171P691k0093L6161N949m5989j3035k2537j5057p537
4384B119751j4998l023l0741K0874k1981j6255m7l2065j4789k7338j7683J3459
4372A975164k4103K776o029k8083n350M0257J1559l530j7519M719j984l218k2002
4359A922657P636l870Q375l0588j2563k5706l58l3556k5221k871J8226N690M641
4346A832492K3560k8330J7115m516M801k2768j2097o895O101r287m762k9779j2985
4333A752650J5416k879m151o334k6134J8785j8287p670r53J545j760K7315n552
4320A741991J0398q871J7374K6741J08J7644J9888R763K4976P3034P3383N6476
4308B062905P8600O0003n4736l7784p0334o5958n1808p4284m9625k0554k5411
$$ plain form
4297 1751014 1729824 1719871 1712298 1687323 1653812 1668363 1647986 1653470 1671330 1664863 1661055 1646275
4285 1646275 1647590 1643250 1605759 1613260 1636162 1653953 1648085 1669944 1672848 1656418 1659488 1669870 1691539
4272 1691539 1674576 1658998 1678217 1674265 1629219 1646933 1656472 1681283 1716819 1715750 1705415 1695821
4260 1695821 1683542 1690098 1702801 1676620 1682966 1725751 1743024 1751727 1748908 1768024 1799911 1820278
4248 1820278 1853750 1898346 1903498 1920838 1931329 1993699 2072579 2097058 2125324 2176922 2231903 2285248
4236 2285248 2349580 2441572 2532145 2637934 2755778 2882134 3060730 3238077 3402167 3565539
4226 3565539 3664860 3710961 3668466 3533274 3378630 3218832 3097742 3021190 2941034 2888982 2853044
4215 2853044 2849657 2858768 2898050 2934216 2959580 2986664 3025224 3053539 3122712 3194783 3267142 3373872
$$ packed form
4297A751014k1190r953p573k4975l3511J4551k0377N484J7860o467l808j4780
4285A646275J315m340l7491P501K2902J7791n868K1859K904j6430L070J0382K1669
4272A691539j6963j5578J9219l952m5046J7714R539K4811L5536j069j0335r594
4260A695821j2279O556J2703k6181O346M2785J7273Q703k819J9116L1887K0367
4248A820278L3472M4596N152J7340J0491O2370P8880K4479K8266N1598N4981N3345
4236B285248O4332R1992R0573J05789J17844J26356J78596J77347J64090J63372
4226C565539R9321M6101m2495j35192j54644j59798j21090p6552q0156n2052l5938
4215B853044l387R111L9282L6166K5364K7084L8560K8315O9173P2071P2359J06730
$$ plain form
4203 3373872 3492195 3583363 3760340 3972995 4105537 4307047 4589124 4881987 5208854 5631785
4193 5631785 6184743 6798881 7567006 8440252 9526266 10692482 12093673 13815610 15994968
4184 15994968 18766321 22475452 26271967 28139118 26266987 22353353 19158776 15722878
4176 15722878 12708196 10581214 9076485 7976706 7146052 6540686 6046097 5629741 5239957
4167 5239957 4912408 4637824 4363652 4126147 3912007 3729826 3576624 3435249 3300204 3201308
4157 3201308 3114655 3016279 2916991 2844053 2731381 2671896 2624073 2549560 2491613 2442384 2395164
4146 2395164 2339605 2299547 2225044 2155136 2089226 2009082 2015387 2003153 1945565 1915402 1885516 1825015
4134 1825015 1776795 1737092 1718462 1700200 1665812 1676295 1643488 1645934 1624441 1577663 1540984 1547993
$$ packed form
4203C373872J18323R1168J76977K12655J32542K01510K82077K92863L26867M22931
4193E631785N52958O14138P68125Q73246J086014J166216J401191J721937K179358
4184A5994968K771353L709131L796515J867151j872131l913634l194577l435898
4176A5722878l014682k126982j504729j099779q30654o05366m94589m16356l89784
4167E239957l27549k74584k74172k37505k14140j82181j53202j41375j35045r8896
4157C201308q6653r8376r9288p2938j12672n9485m7823p4513n7947m9229m7220
4146B395164n5559m0058p4503o9908o5910q0144O305j2234n7588l0163k9886o0501
4134A825015m8220l9703j8630j8262l4388J0483l2807K446k1493m6778l6679P009
$$ plain form
4122 1547993 1486361 1499617 1477399 1468533 1485909 1458608 1465958 1458634 1444603 1446044 1426764 1412236
4110 1412236 1409289 1400082 1399018 1397703 1411437 1391360 1348417 1313279 1310328 1317100 1277202 1263495 1268017
4097 1268017 1223086 1231212 1189447 1176582 1143469 1127020 1137487 1151758 1179429 1167469 1138997 1119002
4085 1119002 1107462 1092592 1091101 1058777 1097552 1088919 1058580 1045545 1065867 1056983 1044281 1042902
4073 1042902 1069225 1057163 1019124 1014263 992410 1000768 1020632 1031548 990855 973309 982442 983134
4061 983134 999168 989651 959358 950468 942342 940845 951813 937667 932180 942901 928840 918370 917253
4048 917253 898523 943762 947400 898274 898272 934993 919685 896858 905100 914054 902439 883769 880266
4035 880266 873315 878985 899311 876466 878967 876952 887514 867931 856508 859758 850525 872442 851566
$$ packed form
4122A547993o1632J3256k2218q866J7376k7301P350p324j4031J441j9280j4528
4110A412236k947r207j064j315J3734k0077m2943l5138k951O772l9898j3707M522
4097A268017m4931Q126m1765j2865l3113j6449J0467J4271K7671j1960k8472j9995
4085A119002j1540j4870j491l2324L8775q633l0339j3035K0322q884j2702j379
4073A042902K6323j2062l8039m861k1853Q358J9864J0916m0693j7546R133O92
4061I83134J6034r517l0293q890q126j497J0968j4146n487J0721j4061j0470j117
4048I17253j8730M5239L638m9126kL6721j5308k2827Q242Q954j1615j8670l503
4035H80266o951N670K0326k2845K501k015J0562j9583j1423L250r233K1917k0876
$$ plain form
4022 851566 835384 831682 836227 826746 816670 815606 804661 812694 803757 787708 782026 798910 803100
4009 803100 781796 747255 752175 744771 773957 783995 782846 770777 740440 759836 768287 782003
3997 782003 771671 773311 740407 745496 744386 741265 755991 744089 715787 707600 700013 704284 721585
3984 721585 733491 753046 733602 716605 719871 716501 726728 691652 715428 699327 712368 702092
3972 702092 735731 709820 686234 683203 674343 676824 676955 678169 678581 675350 641349 642824 658615 660636
3958 660636 648978 654224 688448 680466 682341 670821 677452 685268 682600 701375 665209 663310 650392
3945 650392 673024 672475 647693 663195 643219 650309 643394 607697 652350 619449 641611 679364
3933 679364 679894 652709 657548 660911 674997 685649 671434 684687 701850 703658 716698 730925 739985
$$ packed form
4022H51566j6182l702M545r481j0076j064j0945Q033q937j6049n682J6884M190
4009H03100k1304l4541M920p404K9186J0038j149j2069l0337J9396Q451J3716
3997G82003j0332J640l2904N089j110l121J4726j1902k8302q187p587M271J7301
3984G21585J1906J9555j9444j6997L266l370J0227l5076K3776j6101J3041j0276
3972G02092L3639k5911k3586l031q860K481J31J214M12l231l4001J475J5791K021
3958F60636j1658N246L4224p982J875j1520O631P816k668J8775l6166j899j2918
3945F50392K2632n49k4782J5502j9976P090o915l5697M4653l2901K2162L7753
3933F79364N30k7185M839L363J4086J0652j4215J3253J7163J808J3040J4227R060
$$ plain form
3920 739985 732268 708372 689918 699515 709064 688296 672628 666887 625957 608914 620864 626209 644069
3907 644069 623356 630220 625997 595363 605685 586982 603832 587739 562633 583284 592390 588481
3895 588481 579491 595375 574058 547416 544079 566694 572692 588258 579427 575061 567578 565769 554520
3882 554520 557838 558095 532747 544564 552171 534686 512787 521132 533500 531649 541185 534987 538545
3869 538545 546756 542607 524196 511090 502092 527154 506515 514063 525379 519146 547860 534087 539827
3856 539827 520484 512336 518733 519281 506071 504206 495689 487268 505350 520666 511350 508738 503173 503793
3842 503793 504006 514168 491103 482348 499091 505098 485788 489309 499612 506703 506664 494619 520535
3829 520535 501832 498097 469338 451722 486906 491021 490328 477509 471199 475485 499401 487522 449512
$$ packed form
3920G39985p717k3896j8454R597R549k0768j5668n741m0930j7043J1950N345J7860
3907F44069k0713O864m223l0634J0322j8703J6850j6093k5106K0651R106l909
3895E88481q990J5884k1317k6642l337K2615N998J5566q831m366p483j809j1249
3882E54520L318K57k5348J1817P607j7485k1899Q345J2368j851R536o198L558
3869E38545Q211m149j8411j3106q998K5062k0639P548J1316o233K8714j3773N740
3856E39827j9343q148O397N48j3210j865q517q421J8082J5316r316k612n565O20
3842E03793K13J0162k3065q755J6743O007j9310L521J0303P091l9j2045K5916
3829E20535j8703l735k8759j7616L5184M115o93j2819o310M286K3916j1879l8010
$$ plain form
3816 449512 480714 474017 471395 478108 473902 431715 420490 472159 464715 447213 450067 433706 473939
3803 473939 478256 465534 475723 484427 491649 457293 467985 432804 446541 472025 454578 428932
3791 428932 447975 452612 471678 460121 441396 432587 431270 443257 441134 453079 462008 426468 417611
3778 417611 459333 453280 445078 418478 421612 435948 430611 414505 401362 421243 441253 449368 422845
3765 422845 411727 418026 412453 403871 376597 395767 407035 422685 399669 384871 399902 418813
3753 418813 416841 447354 430194 401146 402476 416786 424024 371473 389106 415312 414152 420743 420532
3740 420532 407058 403546 426948 421939 403686 374063 400459 384508 362278 384131 393353 380749
3728 380749 392543 391510 380337 420497 405764 373495 366438 374246 378941 393188 388145 381804 384030
$$ packed form
3816D49512L1202o697k622O713m206m2187j1225N1669p444j7502K854j6361M0233
3803D73939M317j2722J0189Q704P222l4356J0692l5181J3737K5484j7447k5646
3791D28932J9043M637J9066j1557j8725q809j317J1987k123J1945Q929l5540q857
3778D17611M1722o053q202k6600L134J4336n337j6106j3143J9881K0010Q115k6523
3765D22845j1118O299n573q582k7274J9170J1268J5650k3016j4798J5031J8911
3753D18813j972L0513j7160k9048J330J4310P238n2551J7633K6206j160O591k11
3740D20532j3474l512K3402n009j8253k9623K6396j5951k2230K1853R222j2604
3728C80749J1794j033j1173M0160j4733l2269p057P808M695J4247n043o341K226
$$ plain form
3715 384030 395512 402689 405851 389587 359912 347471 350981 361105 348028 334617 358501 370388
3703 370388 397489 404285 373861 364200 346916 351267 337930 338310 331690 326941 349612 384611 362039
3690 362039 330061 346239 363811 363913 343915 339875 338171 352140 379659 367463 349721 320034
3678 320034 311617 331729 371321 372919 357990 341894 312387 318794 335709 347471 362088 343462
3666 343462 326847 329043 335215 353686 336533 315633 334960 354833 327839 327583 318883 331214 349997
3653 349997 343815 331308 332689 295818 334631 294200 315675 317204 304886 334088 347739 337683
3641 337683 351971 377998 341755 341094 320425 325876 320209 307897 314326 320578 308003 316739 328723
3628 328723 314130 336732 337213 333975 337486 301754 290033 301301 309901 303296 313420 304087 323524
$$ packed form
3715C84030J1482P177L162j6264k9675j2441L510J0124j3077j3411K3884J1887
3703C70388K7101O796l0424r661j7284M351j3337L80o620m749K2671L4999k2572
3690C62039l1978J6178J7572J02j9998m040j704J3969K7519j2196j7742k9687
3678C20034q417K0112L9592J598j4929j6096k9507O407J6915J1762J4617j8626
3666C43462j6615K196O172J8471j7153k0900J9327J9873k6994k56q700J2331J8783
3653C49997o182j2507J381l6871L8813m0431K1475J529j2318K9202J3651j0056
3641C37683J4288K6027l6243o61k0669N451n667j2312O429O252j2575Q736J1984
3628C28723j4593K2602M81l238L511l5732j1721J1268Q600o605J0124r333J9437
$$ plain form
3615 323524 329415 282509 305878 309914 296582 326573 314489 325131 288847 294684 298478 302921 313205
3602 313205 297415 273054 270157 282357 295021 298040 279034 271057 278521 300943 311032 305254 297794
3589 297794 282749 293283 303202 258470 262585 289221 301883 299341 291300 287545 279092 306068 297765
3576 297765 264018 285834 283522 267949 251551 268643 258940 256483 279727 252349 294141 305824
3564 305824 280648 302262 290497 291982 320092 287878 233569 233618 249105 253860 279207 274467 279915
3551 279915 278205 256458 264405 262943 266034 259790 270338 264572 258666 273232 276619 270750 282740
3538 282740 285849 262582 250517 256987 278709 256147 242424 270670 260872 246689 246610 253531 248163
3525 248163 233407 236536 263108 259002 250274 262423 246223 261010 259328 254710 252050 252244 247339
$$ packed form
3615C23524N891m6906K3369M036j3332K9991j2084J0642l6284N837L794M443J0284
3602C13205j5790k4361k897J2200J2664L019j9006p977P464K2422J0089n778p460
3589B97794j5045J0534R919m4732M115K6636J2662k542q041l755q453K6976q303
3576B97765l3747K1816k312j5573j6398J7092r703k457K3244k7378M1792J1683
3564C05824k5176K1614j1765J485K8110l2214n4309M9J5487M755K5347m740N448
3551B79915j710k1747P947j462L091o244J0548n766n906J4566L387n869J1990
3538B82740L109k3267j2065O470K1722k2562j3723K8246r798j4183p9O921n368
3525B48163j4756L129K6572m106q728J2149j6200J4787j682m618k660J94m905
$$ plain form
3512 247339 228808 227130 234734 247482 259742 252785 247726 250565 257898 270823 230915 232104 283877
3499 283877 260236 259273 241024 247282 257411 241146 239742 247578 244700 235694 239172 271980 284250
3486 284250 260294 252463 233114 218395 274139 287159 229824 260076 286190 278305 245250 256812
3474 256812 269201 259968 248375 249328 253553 276771 301460 269622 272354 242782 257069 268787 304655
3461 304655 288246 251284 294999 300385 298462 256722 272370 288641 295199 303550 320019 311577 327863
3448 327863 354067 357223 359400 371953 364289 371073 373813 421430 443379 472199 485768 475160 509932
3435 509932 528118 563062 570491 548264 536391 507895 480763 461357 444720 405390 393852 390040
3423 390040 374360 377181 389593 383686 350875 338710 343299 374016 381505 371799 387309 396845 402118
$$ packed form
3512B47339j8531j678P604J2748J2260o957n059K839P333J2925l9908J189N1773
3499B83877k3641r63j8249O258J0129j6265j404P836k878r006L478L2808J2270
3486B84250k3956p831j9349j4719N5744J3020n7335L0252K6114p885l3055J1562
3474B56812J2389r233j1593R53M225K3218K4689l1838K732k9572J4287J1718L5868
3461C04655j6409l6962M3715N386j923m1740J5648J6271O558Q351J6469q442J6286
3448C27863K6204L156K177J2553p664O784K740M7617K1949K8820J3569j0608L4772
3435E09932J8186L4944P429k2227j1873k8496k7132j9406j6637l9330j1538l812
3423C90040j5680K821J2412n907l2811j2165M589L0717P489r706J5510R536N273
$$ plain form
3410 402118 415408 442195 455472 484050 501524 511268 518036 501790 491708 470544 425725 393647
3398 393647 378619 360273 381368 339733 345581 323213 298252 301972 316762 303685 308654 302338
3386 302338 285195 297387 293040 285929 285538 293770 311051 328836 334674 330417 357594 340537 358932
3373 358932 364138 342902 307766 279992 285390 256600 261279 265466 232067 242979 244024 269618 267270
3360 267270 226449 219428 210151 218343 219678 201928 174340 184288 221013 225075 220593 222025 209475
3347 209475 229083 235309 233506 203798 210112 228175 225538 192440 185036 177842 177321 166552 180135
3334 180135 180694 161699 175516 182365 166284 178540 180275 199697 196392 159042 143723 178646 185421
3321 185421 191336 188373 182930 162019 171281 176765 192162 222795 198447 203394 167967 166912 157473
$$ packed form
3410D02118J3290K6787J3277K8578J7474R744O768j6246j0082k1164m4819l2078
3398C93647j5028j8346K1095m1635N848k2368k4961L720J4790j3077M969o316
3386C02338j7143J2192m347p111l91Q232J7281J7785N838m257K7177j7057J8395
3373C58932N206k1236l5136k7774N398k8790M679M187l3399J0912J045K5594k348
3360B67270m0821p021r277Q192J335j7750k7588R948L6725M062m482J432j2550
3347B09475J9608O226j803k9708O314J8063k637l3098p404p194n21j0769J3583
3334A80135N59j8995J3817O849j6081J2256J735J9422l305l7350j5319L4923O775
3321A85421N915k963n443k0911R262N484J5397L0633k4348M947l5427j055r439
$$ plain form
3308 157473 185484 178998 164351 158631 142251 139907 160116 173890 162714 160111 159344 160906 161200
3295 161200 165384 179451 172641 175804 151597 157223 168195 156822 142721 135277 103993 139541 145395
3282 145395 146043 156321 147400 157757 147493 166029 161430 156513 112014 123213 130755 125820 99008
3269 99008 151449 159162 138170 128199 134176 134200 140079 167109 148200 118504 160508 178696 181774
3256 181774 173140 158541 148526 136298 146497 147204 167938 156999 141277 156776 137288 129047
3244 129047 143886 143286 150213 118266 121544 124965 139340 135965 121882 135615 124088 150644 162179
3231 162179 131279 135385 136836 143854 131332 121946 136789 141046 147852 154050 171682 178035 161482
3218 161482 163084 162185 152197 126719 135442 158617 166870 170935 187006 143515 121910 141213 175458
$$ packed form
3308A57473K8011o486j4647n720j6380k344K0209J3774j1176k603p67J562K94
3295A61200M184J4067o810L163k4207N626J0972j1373j4101p444l1284L5548N854
3282A45395O48J0278q921J0357j0264J8536m599m917m4499J1199P542m935k6812
3269I9008N2441P713k0992r971N977K4N879K7030j8909k9696M2004J8188L078
3256A81774q634j4599j0015j2228J0199P07K0734j0939j5722J5499j9488q241
3244A29047J4839o00O927l1947L278L421J4375l375j4083J3733j1527K6556J1535
3231A62179l0900M106J451P018j2522r386J4843M257O806O198J7632O353j6553
3218A61482J602q99r988k5478Q723K3175Q253M065J6071m3491k1605J9303L4245
$$ plain form
3205 175458 179517 173041 150919 128539 167800 171321 145422 150674 123239 141498 152374 175238
3193 175238 180168 157590 164495 165136 152856 182905 179142 170260 161996 160818 183013 164066 125221
3180 125221 139661 157134 166857 199743 168562 147630 151597 156675 135568 141090 137738 135355 140962
3167 140962 144870 178472 153420 143040 146484 138955 161162 131292 146443 155404 136329 150988
3155 150988 132097 119227 153833 140881 186344 181559 180514 163626 152741 144429 137308 141569 156174
3142 156174 148997 185941 200163 142563 143558 149670 132949 114943 114926 119765 118943 132344 141143 117568
3128 117568 127098 136594 148467 123754 124202 116118 123617 141195 109692 117074 123702 87243 96356
3115 96356 117908 134461 133045 113568 120746 135780 143365 145604 126880 127401 142941 139870 144176
$$ packed form
3205A75458M059o476k2122k2380L9261L521k5899N252k7435J8259J0876K2864
3193A75238M930k2578O905O41j2280L0049l763q882q264j178K2195j8947l8845
3180A25221J4440J7473R723L2886l1181k0932L967N078k1107N522l352k383N607
3167A40962L908L3602k5052j0380L444p529K2207k9870J5151Q961j9075J4659
3155A50988j8891j2870L4606j2952M5463m785j045j6888j0885q312p121M261J4605
3142A56174p177L6944J4222n7600R95O112j6721j8006j7M839q22J3401Q799k3575
3128A17568R530R496J1873k4713M48q084P499J7578l1503P382O628l6459R113
3115I6356K1552J6553j416j9477P178J5034P585K239j8724N21J5540l071M306
$$ plain form
3102 144176 90548 92585 107459 126178 107955 109768 91457 79862 104625 91596 132089 122369
3090 122369 146919 140172 122090 114908 97630 107426 108168 95446 117572 142899 123525 98513 102043
3077 102043 105566 129139 120167 94302 82254 107905 98918 116009 117416 105408 84887 101936
3065 101936 116324 86081 93196 83410 69999 76058 85300 71062 81180 69148 78276 74761 117122
3052 117122 106631 86302 80923 68628 47992 60429 78005 95255 130583 83250 58721 62208
3040 62208 90419 91719 55125 66338 57162 87285 93705 99980 88989 64323 58703 82763 81206
3027 81206 54050 68176 94355 90446 67071 87132 81394 74842 94478 99683 70299 64849 83263
3014 83263 72955 62156 98587 83605 58303 69427 67257 72789 98450 63467 81017 95835
$$ packed form
3102A44176n3628K037J4874J8719j8223J813j8311j1595K4763j3029M0493r720
3090A22369K4550o747j8082p182j7278R796P42j2722K2126K5327j9374k5012L530
3077A02043L523K3573q972k5865j2048K5651q987J7091J407j2008k0521J7049
3065A01936J4388l0243P115r786j3411O059R242j4238J0118j2032R128l515M2361
3052A17122j0491k0329n379j2295k0636J2437J7576J7250L5328m7333k4529L487
3040F2208K8211J300l6594J1213r176L0123O420O275j0991k4666n620K4060j557
3027H1206k7156J4126K6179l909k3375K0061n738o552J9636N205k9384n450J8414
3014H3263j0308j0799L6431j4982k5302J1124k170N532K5661l4983J7550J4818
$$ plain form
3002 95835 93463 69162 66203 42472 31546 49550 79490 71749 73010 54451 63024 60091 65206
2989 65206 81668 86066 77086 70725 95078 77205 80231 99284 83325 86894 91865 52535 71009
2976 71009 70562 62655 61363 86869 88810 97339 61870 40130 30160 61382 72856 51536 67138
2963 67138 89099 65262 43371 57626 95417 79602 64232 48009 79440 67060 36780 41429
2951 41429 28152 25596 56789 79434 71094 75225 73050 46890 46855 64055 61431 55030 72576 55992
2937 55992 36022 16453 41302 66754 26088 41627 57619 99883 94829 74684 74473 70449 44570
2924 44570 77228 67418 65706 78146 57530 79574 87264 81579 87642 79309 56158 61204 63383
2911 63383 56804 49370 50953 43096 58061 67175 33049 49752 55360 60643 50932 62037 72329
$$ packed form
3002I5835k372k4301k959k3731j0926J8004K9940p741J261j8559Q573k933N115
2989F5206J6462M398q980o361K4353j7873L026J9053j5959L569M971l9330J8474
2976G1009m47p907j292K5506J941Q529l5469k1740r970L1222J1474k1320J5602
2963F7138K1961k3837k1891J4255L7791j5815j5370j6223L1431j2380l0280M649
2951D1429j3277k556L1193K2645q340M131k175k6160l5J7200k624o401J7546j6584
2937E5992j9970j9569K4849K5452m0666J5539J5992M2264n054k0145k11m024k5879
2924D4570L2658r810j712J2440k0616K2044P690n685O063q333k3151N046K179
2911F3383o579p434J583p857J4965R114l4126J6703N608N283r711J1105J0292
$$ plain form
2898 72329 93723 65086 59446 48450 51390 47284 56920 71929 62235 53644 6348 21694 52649
2885 52649 61570 40785 61866 70850 56309 30287 63818 71140 53995 65931 56477 27608 43261
2872 43261 71834 91298 77858 49939 44382 60768 69709 28225 28275 43403 7463 36240 47124
2859 47124 60001 49380 52798 71504 47252 52510 39238 62437 74697 42973 31098 46696
2847 46696 73555 86286 54766 74835 94746 76755 36076 52936 37313 47596 75901 52556
2835 52556 71583 63037 48362 39557 41415 50732 55063 48865 25148 71645 87089 83811 71076
2822 71076 35644 40598 52042 46841 44066 50423 42893 44137 34243 41478 70242 63271 53906 66171
2808 66171 88003 72399 48252 26077 13594 44262 16013 31388 13237 30657 40427 39753
$$ packed form
2898G2329K1394k8637n640j0996K940m106R636J5009r694q591m7296J5346L0955
2885E2649Q921k0785K1081Q984j4541k6022L3531P322j7145J1936r454k8869J5653
2872D3261K8573J9464j3440k7919n557J6386Q941m1484N0J5128l5940K8777J0884
2859D7124J2877j0621L418J8706k4252N258j3272K3199J2260l1724j1875J5598
2847D6696K6859J2731l1520K0069J9911j7991m0679J6860j5623J0283K8305k3345
2835E2556J9027q546j4675q805J858R317M331o198k3717M6497J5444l278j2735
2822G1076l5432M954J1444n201k775O357p530J244r894P235K8764o971r365J2265
2808F6171K1832j5604k4147k2175j2483L0668k8249J5375j8151J7420R770o74
$$ plain form
2796 39753 40433 37698 65494 42099 41068 48040 25101 23645 36440 55818 67701 52901 29154
2783 29154 8738 880 -1897 8356 9832 14908 4772 12501 25266 26382 45554 23985 30782
2770 30782 58517 56184 60625 42600 31555 45418 60386 43867 33450 60976 40586 50117
2758 50117 34738 30579 42363 24945 36088 22795 1882 -24003 -8314 -9300 -6102 26130 55479
2745 55479 39791 34710 27714 11006 35686 9105 12670 35562 22214 15746 15139 -8326 8573
2732 8573 16450 18769 43935 10110 17979 45704 5624 19736 19078 8124 18492 355 23302
2719 23302 -135 7009 31627 15590 2533 34263 15630 10122 18279 1806 -954 4870 15331
2706 15331 28178 37051 27456 21180 20829 42732 46245 22767 30481 15906 23892 18175 37112 71649
$$ packed form
2796C9753O80k735K7796k3395j031O972k2939j456J2795J9378J1883j4800k3747
2783B9154k0416p858k777J0253J476N076j0136P729J2765J116J9172k1569O797
2770C0782K7735k333M441j8025j1045J3863J4968j6519j0417K7526k0390R531
2758E0117j5379m159J1784j7418J1143j3293k0913k5885J5689r86L198L2232K9349
2745E5479j5688n081o996j6708K4680k6581L565K2892j3348o468o07k3465J6899
2732H573P877K319K5166l3825P869K7725m0080J4112o58j0954J0368j8137K2947
2719B3302k3437P144K4618j6037j3057L1730j8633n508Q157j6473k760N824J0461
2706A5331J2847Q873r595o276l51K1903L513k3478P714j4575P986n717J8937L4537
$$ plain form
2692 71649 41698 32192 8695 39702 47107 25843 16862 -11414 11748 -734 -17080 9774
2680 9774 30234 15776 10177 6543 -29167 -18344 -12325 -4980 21825 23926 36985 60541 39265
2667 39265 12231 76249 49907 8721 -9241 -5177 12951 37346 42794 17547 35109 1105
2655 1105 7253 19975 38381 38154 38312 26557 32237 52668 63701 55948 52107 61305 40930 38013
2641 38013 26520 28287 50619 42221 20676 20397 34224 56366 63533 56477 29365 -1766 8188
2628 8188 33112 22106 25853 11550 -3143 16583 25962 31014 31341 25263 24299 19098 26984 38867
2614 38867 31366 34884 22117 21658 17114 43734 19462 14881 21037 21710 12585 7446 43530 53601
2600 53601 36631 28701 19414 28587 29604 26406 20812 54109 53572 11837 8055 10238 15912 25187
$$ packed form
2692G1649k9951r506k3497L1007P405k1264q981k8276K3162j2482j6346K6854
2680I774K0460j4458n599l634l5710J0823O019P345K6805K101J3059K3556k1276
2667C9265k7034O4018k6342m1186j7962M064J8128K4395N448k5247J7562l4004
2655A105O148J2722J8406k27J58j1755N680K0431J1033p753l841R198k0375k917
2641C8013j1493J767K2332q398k1545k79J3827K2142P167p056k7112l1131R954
2628H188K4924j1006L747j4303j4693J9726R379N052L27o078r64n201P886J1883
2614C8867p501L518j2767m59m544K6620k4272m581O156O73r125n139L6084J0071
2600E3601j6970p930r287R173J017l198n594L3297n37m1735l782K183N674R275
$$ plain form
2586 25187 27142 11763 27051 49833 29830 34481 45063 22423 7543 5625 10380 26353 25581
2573 25581 12992 11575 1570 -7441 6812 29592 4941 12211 29061 -3442 -484 9990 9737
2560 9737 2586 -13008 8950 -992 -120 7219 11393 37536 39839 53679 12731 22640 44374 26713
2546 26713 2618 9642 20538 -10225 -3009 45333 39399 10693 40996 55303 57874 42852 27991
2533 27991 12909 14691 20511 57030 41593 24672 11675 34863 33139 25878 -2355 396 16336
2520 16336 39165 37060 37511 51359 62295 53468 34746 18718 53093 58658 103499 107498 125582
2507 125582 121102 116551 109875 95492 60628 65886 84373 44744 44077 54041 95584 84683 77339
2494 77339 69773 86827 67202 73622 50948 89294 97078 83139 93861 87604 94239 126520 119334
$$ packed form
2586B5187J955j5379J5288K2782k0003M651J0582k2640j4880j918M755J5973p72
2573B5581j2589j417j0005r011J4253K2780k4651P270J6850l2503K958J0474k53
2560I737p151j5594K1958r942Q72P339M174K6143K303J3840m0948R909K1734j7661
2546B6713k4095P024J0896l0763P216M8342n934k8706L0303J4307K571j5022j4861
2533B7991j5082J782N820L6519j5437j6921j2997K3188j724p261k8233K751J5940
2520A6336K2829k105M51J3848J0936q827j8722j6028L4375N565M4841L999J8084
2507A25582m480m551o676j4383l4864N258J8487l9629o67R964M1543j0901p344
2494G7339p566J7054j9625O420k2674L8346P784j3939J0722o257O635L2281p186
$$ plain form
2481 119334 124371 91914 101735 102917 115706 110148 101523 125164 141487 143618 159530 193686 154518
2468 154518 146673 170483 201732 204587 198880 181752 185110 197404 196894 217229 223798 212466 197905
2455 197905 244296 245405 229722 263518 260188 271194 285013 317943 327700 354713 380051 377916
2443 377916 376659 382371 388616 411263 449950 481876 482368 499383 527912 554759 597808 620446 642144
2430 642144 685955 741998 757660 793671 881926 990639 1072491 1150677 1256202 1395599 1566584
2419 1566584 1723173 1865713 2037430 2302664 2592436 2930593 3360582 3821200 4417765 5112888
2409 5112888 6029295 7217220 8701115 9903030 9982532 8743679 7436842 6251085 5005842
2400 5005842 4103914 3434954 2956553 2604763 2353964 2146205 2006180 1854146 1751930 1628876
$$ packed form
2481A19334N037l2457R821J182J2789n558q625K3641J6323K131J5912L4156l9168
2468A54518p845K3810L1249K855n707j7128L358J2294n10K0335O569j1332j4561
2455A97905M6391J109j5683L3796l330J1006J3819L2930R757K7013K5338k135
2443C77916j257N712O245K2647L8687L1926M92J7015K8529K6847M3049K2638K1698
2430F42144M3811N6043J5662L6011Q8255J08713Q1852P8186J05525J39397J70985
2419A566584J56589J42540J71717K65234K89772L38157M29989M60618N96565O95123
2409E112888R16407J187925J483895J201915P9502j238853j306837j185757j245243
2400E005842r01928o68960m78401l51790k50799k07759j40025j52034j02216j23054
$$ plain form
2390 1628876 1489805 1387857 1251241 1102577 1023921 987162 943034 909645 866485 813937 784297
2379 784297 742630 747676 715637 702491 648315 606357 573638 568532 557632 521179 473387 465369
2367 465369 431991 416412 412184 439345 437384 408193 387449 377445 357602 311044 327814 343894
2355 343894 328346 287970 272826 268964 279612 268811 235099 231560 245460 231743 218296 223909
2343 223909 231416 220670 209165 211431 231159 222668 227602 214807 191391 174146 165579 150619 169874
2330 169874 181544 180367 187294 151414 142642 121855 131031 144230 127948 123536 147067 117527 136194
2317 136194 145863 141644 123879 114886 126484 153879 142984 119855 114729 126350 151936 105775
2305 105775 103759 106731 100184 76930 101247 82492 62548 64366 78999 76173 40019 58169 79009
$$ packed form
2390A628876j39071j01948j36616j48664p8656l6759m4128l3389m3160n2548k9640
2379G84297m1667N046l2039j3146n4176m1958l2719n106j0900l6453m7792q018
2367D65369l3378j5579m228K7161j961k9191k0744j0004j9843m6558J6770J6080
2355C43894j5548m0376j5144l862J0648j0801l3712l539J3900j3717j3447N613
2343B23909P507j0746j1505K266J9728q491M934j2795k3416j7245q567j4960J9255
2330A69874J1670j177O927l5880q772k0787R176J3199j6282m412K3531k9540J8667
2317A36194R669m219j7765q993J1598K7395j0895k3129n126J1621K5586m6161
2305A05775k016K972o547k3254K4317j8755j9944J818J4633k826l6154J8150K0840
$$ plain form
2292 79009 80334 72038 94974 107491 111519 83576 60449 24121 39903 85046 59476 54909 51316
2279 51316 53889 25345 35137 41217 49148 45256 49217 63659 47574 45543 64403 65188 56767 41816
2265 41816 43257 43117 44938 23372 3570 30811 57277 40410 20351 14904 37066 57200 44351
2252 44351 72072 75264 22812 10930 17279 41669 27940 20453 12410 7533 22546 34472 48105
2239 48105 69165 75888 31827 36602 35864 16422 27925 36470 10868 1405 31595 30394 28516
2226 28516 43550 13589 13176 64513 43186 -1504 -3163 23596 29108 9799 -1830 -12500 -5133
2213 -5133 -25163 -12380 -9186 -12080 -12240 -1166 27125 46027 14488 10530 11321 16725 24554 21195
2199 21195 5892 -967 4989 -6610 -1695 -96 9834 27220 19053 7953 -14089 -10881 9980
$$ packed form
2292G9009J325q296K2936J2517M028k7943k3127l6328J5782M5143k5570m567l593
2279E1316K573k8544R792O080P931l892L961J4442j6085k031J8860P85q421j4951
2265D1816J441j40J821k1566j9802K7241K6466j6867k0059n447K2162K0134j2849
2252D4351K7721L192n2452j1882O349K4390j3729p487q043m877J5013J1926J3633
2239D8105K1060O723m4061M775p38j9442J1503Q545k5602r463L0190j201j878
2226B8516J5034k9961m13N1337k1327m4690j659K6759N512j9309j1629j0670P367
2213e133k0030J2783L194k894j60J1074K8291J8902l1539l958P91N404P829l359
2199B1195j5303o859N956j1599M915J599R930J7386q167j1100k2042L208K0861
$$ plain form
2186 9980 25223 45459 51379 14851 -10506 -13815 -908 11887 -23963 -17201 -6961 -21427 -2545
2173 -2545 8843 -6502 -18819 7229 21862 22903 68069 81477 46394 46867 40991 37458 33900
2160 33900 16816 29839 11078 3963 20553 34030 49853 48129 40382 29710 27253 -1299 3174
2147 3174 46446 36930 38740 39988 8054 12036 16298 -5072 9363 14513 36217 26637 -2902
2134 -2902 -18131 -10860 -2367 -10308 6938 14280 -12148 -19919 9181 32572 6714 -3567 23660
2121 23660 1597 -529 -15081 -14156 -16083 -27885 -6426 -30710 -26709 -27482 -30867 -30851 -462 27300
2107 27300 12427 -10854 14752 30676 30008 23794 13940 12064 -3779 11940 -8313 -3426 7373
2094 7373 12509 23938 -8369 15779 15639 5182 -2728 12233 24098 6151 -13232 -505 -25353
$$ packed form
2186I980J5243K0236N920l6528k5357l309J2907J2795l5850O762J0240j4466J8882
2173b545J1388j5345j2317K6048J4633J041M5166J3408l5083M73n876l533l558
2160C3900j7084J3023j8761p115J6590J3477J5823j724p747j0672k457k8552M473
2147C174M3272r516J810J248l1934L982M262k1370J4435N150K1704r580k9539
2134b902j5229P271Q493p941J7246P342k6428p771K9100K3391k5858j0281K7227
2121B3660k2063k126j4552R25j927j1802K1459k4284M001p73l385J6L0389K7762
2107B7300j4873k3281K5606J5924o68o214r854j876j5843J5719k0253M887J0799
2094G373N136J1429l2307K4148j40j0457p910J4961J1865j7947j9383J2727k4848
$$ plain form
2081 -25353 -16196 -971 70 3646 -31972 -28511 726 12440 -1770 -13711 -23158 9609 11219
2068 11219 12632 2249 30487 15737 -6819 -1940 -5835 -27945 -33775 -37203 -29067 -19007 -1546
2055 -1546 -11435 -22140 -19774 -10303 -2511 -8179 -35476 -8425 -12773 -39803 -12785 1179 10689
2042 10689 12818 -368 15209 -172 -22144 -5431 2348 17453 -1464 -21231 -1702 21025
2030 21025 15582 -13409 -11019 -50980 -59177 -40978 -34875 -41021 -13579 -10163 -31492 -17504 -16768
2017 -16768 -3374 -6163 -8959 3474 -9171 -13598 4952 -13868 12951 -22201 -16790 -21098 -26083
2004 -26083 -54542 -68278 -48007 -40334 -62786 -45937 -31341 -19876 -31380 -18682 -3318 -19394
1992 -19394 -33369 -9355 -19347 8082 -31750 -48799 -24557 -11996 10255 -31489 -22437 -31918
$$ packed form
2081b5353R157J5225J041L576l5618L461K9237J1714j4210j1941r447L2767J610
2068A1219J413j0383K8238j4750k2556M879l895k2110n830l428Q136J0060J7461
2055a546r889j0705K366R471P792n668k7297K7051m348k7030K7018J3964R510
2042A0689K129j3186J5577j5381k1972J6713P779J5105j8917j9767J9529K2727
2030B1025n443k8991K390l9961q197J8199O103o146K7442L416k1329J3988P36
2017a6768J3394k789k796J2433j2645m427J8550j8820K6819l5152N411m308m985
2004b6083k8459j3736K0271P673k2452J6849J4596J1465j1504J2698J5364j6076
1992a9394j3975K4014r992K7429l9832j7049K4242J2561K2251m1744R052r481
$$ plain form
1980 -31918 -17338 -19147 -29832 -34732 -26731 -40661 -56009 -28016 -15438 -27587 -21727 -23170 -18181
1967 -18181 -5684 5295 -11729 -24908 -16230 -18512 -31524 -26998 -20855 -9916 -1202 -21264 -15329
1954 -15329 -16311 -21428 -3474 -29164 -10369 -5643 -34006 -18746 17513 3275 -33264 -20134 -10348
1941 -10348 10967 26667 12843 -140 -6424 13451 -12348 10276 -4535 -18320 -24603 1033
1929 1033 -5880 -11712 -21551 -16944 1249 -25715 -3647 -32212 -22689 -18434 -6163 -12933 -14301 -10924
1915 -10924 -21909 -39083 -35282 666 21061 -13905 -10943 11400 -17961 -51353 -58590 -12246
1903 -12246 -23837 -31761 -32562 -29105 -18090 -11082 -46469 -30689 10996 19008 23273 -11069 -52586
1890 -52586 -41364 -2479 -12470 -32791 -43385 -17262 -11023 -43213 -29782 -35685 -31621 -23854 -11389
$$ packed form
1980c1918J4580j809j0685m900Q001j3930j5348K7993J2578j2149N860j443M989
1967a8181J2497J0979j7024j3179Q678k282j3012M526O143J0939Q714k0062N935
1954a5329r82n117J7954k5690J8795M726k8363J5260L6259j4238l6539J3130R786
1941a0348K1315J5700j3824j2983o284J9875k5799K2624j4811j3785o283K5636
1929A033o913n832r839M607J8193k6964K2068k8565R523M255J2271o770j368L377
1915a0924j0985j7174L801L5948K0395l4966K962K2343k9361l3392p237M6344
1903a2246j1591p924q01L457J1015P008l5387J5780M1685Q012M265l4342m1517
1890e2586J1222L8885r991k0321j0594K6123O239l2190J3431n903M064P767J2465
$$ plain form
1877 -11389 -538 -4280 -22032 -12256 5937 -30394 -27233 -24415 -41677 -36278 -12885 -5426 6546
1864 6546 12280 13846 -9574 1188 5716 -10640 -13996 -20531 -12622 -5445 -21186 -11612 -5663 18353
1850 18353 27796 -2268 -11087 -27784 -48237 -37631 -42841 -63051 -40816 -35546 -35065 -31269 -34533
1837 -34533 -42704 -35549 -31551 -31831 -5782 -27463 -32299 -10039 -8672 9501 42610 1110 -13524
1824 -13524 14014 494 -6380 -14592 -5728 -1089 -9758 6002 -11978 10857 18121 -3788 -18374
1811 -18374 -57620 -35524 -27106 -42251 -37833 -33658 -8513 -12029 -25116 -11336 34923 9852 -11597
1798 -11597 -21263 -15186 -29843 -35569 -38471 -6272 7642 -1949 -6652 -20837 -13546 -23686 -29769
1785 -29769 -10139 -13344 -23223 13867 -12589 -5682 -9342 -16599 -20169 -28565 3085 11304 8364 -4340
$$ packed form
1877a1389J0851l742j7752R776J8193l6331L161K818j7262N399K3393P459J1972
1864F546N734J566k3420J0762M528j6356l356o535P909P177j5741R574N949K4016
1850A8353R443l0064q819j6697k0453J0606n210k0210K2235N270M81L796l264
1837c4533q171P155L998k80K6049k1681m836K2260J367J8173L3109m1500j4634
1824a3524K7538j3520o874q212Q864M639q669J5760j7980K2835P264k1909j4586
1811a8374l9246K2096Q418j5145M418M175K5145l516j3087J3780M6259k5071k1449
1798a1597r666O077j4657n726k902L2199J3914r591m703j4185P291j0140o083
1785b9769J9630l205r879L7090k6456O907l660p257l570q396L1650Q219k940j2704
$$ plain form
1771 -4340 -46693 -15436 -17948 1808 -1702 -3122 4077 14139 4020 27358 -10857 -16391 -20168
1758 -20168 -34000 -40365 -26269 -13669 -28801 -24101 -36485 -16421 -14129 1686 1929 -14829 -44876
1745 -44876 -23905 -17632 -31226 -27080 -27512 10614 -3635 -12164 -15560 -61723 -74656 -26471 14429
1732 14429 -1188 -634 -23061 -24491 -34886 -32031 -27251 -46432 -42477 -33109 -16639 -31342 -28749
1719 -28749 -20510 -20126 -50419 -33339 -20247 -52827 -49311 -47751 -14794 -14820 -12703 -16676 -23704 -4900
1705 -4900 -33566 -55351 -31559 -20713 -23038 -19786 -27701 -24976 -20858 -22159 -13665 8724 18717 -4537
1691 -4537 -18087 -26128 -15642 -10102 -26807 -42114 -31618 -30128 -3048 -13128 8375 3111 -2353
1678 -2353 -2200 -18250 -8146 28984 19417 -12868 -19314 -30868 -24375 -9793 -5561 -40096 -49930
$$ packed form
1771d340m2353L1257k512J9756l510j420P199J0062j0119K3338l8215n534l777
1758b0168j3832o365J4096J2600j5132M700j2384K0064K292J5815K43j6758l0047
1745d4876K0971O273j3594M146m32L8126j4249q529l396m6163j2933M8185M0900
1732A4429j5617N54k2427j430j0395K855M780j9181L955R368J6470j4703K593
1719b8749Q239L84l0293J7080J3092l2580L516J560L2957k6K117l973p028J8804
1705d900k8666k1785K3792J0846k325L252p915K725M118j301Q494K2389R993k3254
1691d537j3550q041J0486N540j6705j5307J0496J490K7080j0080K1503n264n464
1678b353J53j6050J0104L7130r567l2285o446j1554O493J4582M232l4535r834
$$ plain form
1665 -49930 -21512 -15741 -12191 -17167 -33546 -38558 -33150 -24020 -16581 -5237 -867 -7325 -4137 14970
1651 14970 -8642 -7064 -20807 -28519 -35853 -59126 -53036 -40633 -29463 -34179 -17187 -38435 -11501
1638 -11501 9002 10769 -9900 -26252 -6401 -19176 -18307 5797 -10740 -25708 -27993 -21531 -297
1625 -297 -351 -27964 -34101 -17019 -20581 -43166 -44450 -20914 -20882 -13066 -8735 -23813 -31056 -21512 -35409
1610 -35409 -20585 -11765 -14119 -18433 8287 -30669 -35477 -51962 -10525 689 -21955 -30202 -38075
1597 -38075 -23160 -16083 -19418 -42065 -6094 20536 -14793 -722 2067 -22155 -11894 -24636
1585 -24636 -47383 -38527 -34156 -43704 556 -5157 -5470 -18132 -12478 -514 -9741 9666 -12028
1572 -12028 -32748 -37558 -32611 -13303 -20868 -4513 -16531 -26197 -64090 -37855 -35253 -27909 21445
$$ packed form
1665d9930K8418N771L550m976j6379n012N408R130P439J1344M370o458L188J9107
1651A4970k3612J578j3743p712p334k3273O090J2403J1170m716J6992k1248K6934
1638a1501K0503J767k0669j6352J9851j2775Q69K4104j6537j4968k285O462K1234
1625b97n4k7613o137J7082l562k2585j284K3536L2P816M331j5078p243R544j3897
1610c5409J4824Q820k354m314K6720l8956m808j6485M1437J1214k2644q247p873
1597c8075J4915P077l335k2647L5971K6630l5329J4071K789k4222J0261j2742
1585b4636k2747Q856M371r548M4260n713l13j2662N654J1964r227J9407k1694
1572a2028k0720m810M947J9308p565J6355j2018r666l7893K6235K602P344M9354
$$ plain form
1559 21445 -1441 320 -17381 -2572 -8557 9891 -4259 -6801 -11652 1370 -6915 -18364 -14703
1546 -14703 -4795 -11953 -14049 -25111 -25747 -12099 -22353 -47429 -45855 -2416 1112 -4983 -4134 4050
1532 4050 6396 20357 -17922 -37942 -17582 -13866 -41152 -46894 -24813 6111 -42896 -36054 -37196
1519 -37196 -32434 -18378 316 -18548 -29205 7624 8419 -14499 -35153 -11626 10342 -11830
1507 -11830 -16349 -11683 -10440 -11248 -27035 -27195 -19255 -19079 4994 9165 -3576 -14979 -5063 -5063 -5687
1492 -5687 -22755 -16794 -11407 -37294 -39937 -24351 -10281 -18376 -26331 -25956 -834 -314 -22004 -27951
1478 -27951 -18347 -23165 -19241 5299 -6948 -7908 13333 -9709 -22303 -29938 1570 1262 -18843
1465 -18843 -25636 -1211 -25740 -22519 -21881 -41252 -11384 -14315 -24944 -35771 -51682 -29207 -36025
$$ packed form
1559B1445k2886J761j7701J4809n985J8448j4150k542m851J3022q285j1449L661
1546a4703R908p158k096j1062o36J3648j0254k5076J574M3439L528o095Q49Q184
1532D050K346J3961l8279k0020K0360L716k7286n742K2081L0924m9007O842j142
1519c7196M762J4056J8694j8864j0657L6829P95k2918k0654K3527K1968k2172
1507a1830m519M666J243q08j5787j60P940J76K4073M171j2741j1403R916%o24
1492e687j7068N961N387k5887k643J5586J4070q095p955L75K5122N20k1690n947
1478b7951R604m818L924K4540j2247r60K1241k3042j2594p635L1508l08k0105
1465a8843o793K4425k4529L221O38j9371K9868k931j0629j0827j5911K2475o818
$$ plain form
1452 -36025 -40381 -51680 -37892 4816 8243 -21866 -36696 -25947 -9263 -14461 -12001 -11168 -8242
1439 -8242 10771 -11740 -15246 -27305 -48998 -39288 -15406 -53537 -77533 -52056 -41531 -26051
1427 -26051 -47031 -24317 -28999 -30793 910 -2706 -17679 1956 -1760 -22504 -28427 -11117 -16735
$$ packed form
1452c6025m356j1299J3788M2708L427l0109j4830J0749J6684n198K460Q33K926
1439h242J9013k2511l506j2059k1693R710K3882l8131k3996K5477J0525J5480
1427b6051k0980K2714m682j794L1703l616j4973J9635l716k0744n923J7310n618
$$ [...]
##END NTUPLES=NMR SPECTRUM
##END=
