##TITLE=1H_CA-8927-2
 CDCl3,8 sc, 
 20.9.2021
##JCAMPDX= 6.0         $$ Bruker NMR JCAMP-DX V2.0
##DATA TYPE= NMR SPECTRUM
##DATA CLASS= NTUPLES
##ORIGIN= UXNMR, Bruker Analytische Messtechnik GmbH
##OWNER= root
$$ XWIN-NMR		Version 3.5
$$ Mon Sep 20 11:58:37 2021 Russian Standard Time (UT+4h)  she@DPX200
##.OBSERVE FREQUENCY= 200.1314
##.OBSERVE NUCLEUS= ^1H
##.ACQUISITION MODE= SIMULTANEOUS
##.ACQUISITION SCHEME= undefined
##.AVERAGES= 8
##.DIGITISER RES= 18
##SPECTROMETER/DATA SYSTEM= spect
##.PULSE SEQUENCE= zg30
##.SOLVENT NAME= CDCl3
##.SHIFT REFERENCE= (INTERNAL, CDCl3, 0, 17.0976)
##AUDIT TRAIL= $$ (NUMBER, WHEN, WHO, WHERE, WHAT)
$$ ##TITLE= Audit trail, XWIN-NMR		Version 3.5
$$ ##JCAMPDX= 5.01
$$ ##ORIGIN= Bruker BioSpin GmbH
$$ ##OWNER= she
$$ F:/spectra/data/she/nmr/H-F/1/pdata/1/auditp.txt
$$ ##AUDIT TRAIL=  $$ (NUMBER, WHEN, WHO, WHERE, WHAT)
(   1,<2021-09-20 11:57:17.46 +0400>,<she>,<DPX200>,
      <created by zg, POWCHK disabled, PULCHK disabled
       configuration hash MD5:
       00 E9 B6 7A A2 85 ED C7 34 08 36 98 17 FE 4E 26
       data hash MD5: 16K
       94 19 9C 11 5C 6A 18 0D A6 42 EB F0 1F 88 E2 EE>)
(   2,<2021-09-20 11:57:19.79 +0400>,<she>,<DPX200>,
      <Start of raw data processing
       efp BC_mod = 2 LB = 0.24 FT_mod = 6 PKNL = 1 PHC0 = -13715.54 PHC1 = 13.8009 SI = 16K 
       data hash MD5: 16K
       77 FE 72 19 C4 58 6D C4 73 99 3B BB E8 22 E8 4E>)
(   3,<2021-09-20 11:57:44.01 +0400>,<she>,<DPX200>,
      <pk PHC0 = -162.1214 PHC1 = 5.4 
       data hash MD5: 16K
       4F 13 A7 A0 9E B5 61 7D 61 85 73 9D 0D CD C8 7C>)
(   4,<2021-09-20 11:57:47.85 +0400>,<she>,<DPX200>,
      <abs ABSG = 5 
       data hash MD5: 16K
       65 4D 94 EC D1 5F 79 20 CD 05 3E 60 9E 1A 5C 1B>)
$$ ##END=
$$ 
$$ hash MD5
$$ 34 8A 21 78 5D BF 8D 80 7D 4E DF F9 54 D8 72 52
##$RELAX= 
##$RELAX= 
##$RELAX= 
##$RELAX= 
##$RELAX= 
##$RELAX= 
$$ Bruker specific parameters
$$ --------------------------
##$DU= <F:/spectra>
##$EXPNO= 1
##$NAME= <H-F>
##$PROCNO= 1
##$TYPE= <nmr>
##$USER= <she>
##$AMP= (0..31)
100 100 100 100 100 100 100 100 100 100 100 100 100 100 100 100 100 100 
100 100 100 100 100 100 100 100 100 100 100 100 100 100 
##$AQSEQ= 0
##$AQ_mod= 1
##$AUNM= <au_zg>
##$AUTOPOS= <>
##$BF1= 200.13
##$BF2= 200.13
##$BF3= 200.13
##$BF4= 200.13
##$BF5= 200.13
##$BF6= 200.13
##$BF7= 200.13
##$BF8= 200.13
##$BYTORDA= 1
##$CFDGTYP= 0
##$CFRGTYP= 5
##$CHEMSTR= <none>
##$CNST= (0..31)
1 1 145 1 1 1 1 1 1 1 1 1 1 1 1 1 1 1 1 1 1 1 1 1 1 1 1 1 1 1 1 1 
##$CPDPRG= <>
##$CPDPRG1= <>
##$CPDPRG2= <>
##$CPDPRG3= <>
##$CPDPRG4= <mlev>
##$CPDPRG5= <mlev>
##$CPDPRG6= <mlev>
##$CPDPRG7= <mlev>
##$CPDPRG8= <mlev>
##$CPDPRGB= <>
##$CPDPRGT= <>
##$D= (0..31)
0 1.2 0 0 0 0 0 0 0 0.06 0 0.03 0 0 0 0 0.0002 0 0 0 0 0 0 0 0 0 0 0 0 
0 0 0 
##$DATE= 1632124636
##$DBL= (0..7)
120 120 120 120 120 120 120 120 
##$DBP= (0..7)
150 150 150 150 150 150 150 150 
##$DBP07= 0
##$DBPNAM0= <>
##$DBPNAM1= <>
##$DBPNAM2= <>
##$DBPNAM3= <>
##$DBPNAM4= <>
##$DBPNAM5= <>
$$ [...]
##$SUBNAM3= <"">
##$SUBNAM4= <"">
##$SUBNAM5= <"">
##$SUBNAM6= <"">
##$SUBNAM7= <"">
##$SUBNAM8= <"">
##$SUBNAM9= <"">
##$SW= 20.0188988654967
##$SWIBOX= (0..15)
0 0 2 0 0 0 0 0 0 0 0 0 0 0 0 0 
##$SW_h= 4006.41025641026
##$TD= 16384
##$TD0= 1
##$TE= 0
##$TE2= 300
##$TE3= 300
##$TEG= 300
##$TL= (0..7)
0 120 120 120 120 120 120 120 
##$TP= (0..7)
150 150 150 150 150 150 150 150 
##$TP07= 0
##$TPNAME0= <>
##$TPNAME1= <>
##$TPNAME2= <>
##$TPNAME3= <>
##$TPNAME4= <>
##$TPNAME5= <>
##$TPNAME6= <>
##$TPNAME7= <>
##$TPOAL= (0..7)
0.5 0.5 0.5 0.5 0.5 0.5 0.5 0.5 
##$TPOFFS= (0..7)
0 0 0 0 0 0 0 0 
##$TUNHIN= 0
##$TUNHOUT= 0
##$TUNXOUT= 0
##$USERA1= <user>
##$USERA2= <user>
##$USERA3= <user>
##$USERA4= <user>
##$USERA5= <user>
##$V9= 5
##$VALIST= <valist>
##$VCLIST= <CCCCCCCCCCCCCCC>
##$VD= 0
##$VDLIST= <DDDDDDDDDDDDDDD>
##$VPLIST= <PPPPPPPPPPPPPPP>
##$VTLIST= <TTTTTTTTTTTTTTT>
##$WBST= 1024
##$WBSW= 4
##$XGAIN= (0..3)
0 0 0 0 
##$XL= 0
##$YL= 0
##$YMAX_a= 344170
##$YMIN_a= -339227
##$ZGOPTNS= <>
##$ZL1= 120
##$ZL2= 120
##$ZL3= 120
##$ZL4= 120
##$ABSF1= 16.94115
##$ABSF2= -3.077887
##$ABSG= 5
##$ABSL= 3
##$ALPHA= 0
##$AQORDER= 0
##$ASSFAC= 0
##$ASSFACI= 0
##$ASSFACX= 0
##$ASSWID= 0
##$AUNMP= <proc_1d>
##$AZFE= 0.1
##$AZFW= 0.1
##$BCFW= 0
##$BC_mod= 2
##$BYTORDP= 0
##$COROFFS= 0
##$CY= -3
##$DATMOD= 1
##$DC= 0
##$DFILT= <>
##$DTYPP= 0
##$F1P= 0
##$F2P= 0
##$FCOR= 1
##$FTSIZE= 16384
##$FT_mod= 6
##$GAMMA= 0
##$GB= 0
##$INTBC= 1
##$INTSCL= 1.334414e-10
##$ISEN= 128
##$LB= 0.24
##$LEV0= 0
##$LPBIN= 0
##$MAXI= 10000
##$MC2= 0
##$MEAN= 0
##$ME_mod= 0
##$MI= 1.114404
##$NCOEF= 0
##$NC_proc= -6
##$NLEV= 6
##$NOISF1= 3.799351
##$NOISF2= 2.8
##$NSP= 0
##$NTH_PI= 0
##$NZP= 0
##$OFFSET= 17.09756
##$PC= 1
##$PHC0= -13877.66
##$PHC1= 19.2009
##$PH_mod= 1
##$PKNL= yes
##$PPARMOD= 0
##$PSCAL= 0
##$PSIGN= 0
##$REVERSE= no
##$SF= 200.129981469715
##$SI= 16384
##$SIGF1= 3
##$SIGF2= 2
##$SINO= 5.538805
##$SIOLD= 16384
##$SREGLST= <1H.CDCl3>
##$SSB= 0
##$STSI= 16384
##$STSR= 0
##$SW_p= 4006.41025641027
##$SYMM= 0
##$S_DEV= 0
##$TDeff= 16384
##$TDoff= 0
##$TI= <>
##$TILT= no
##$TM1= 0
##$TM2= 0
##$TOPLEV= 0
##$USERP1= <user>
##$USERP2= <user>
##$USERP3= <user>
##$USERP4= <user>
##$USERP5= <user>
##$WDW= 1
##$XDIM= 16384
##$YMAX_p= 423258370
##$YMIN_p= -109439
$$ End of Bruker specific parameters
$$ ---------------------------------
##NTUPLES= NMR SPECTRUM
##VAR_NAME=  FREQUENCY,     SPECTRUM/REAL,   SPECTRUM/IMAG
##SYMBOL=    X,             R,               I
##VAR_TYPE=  INDEPENDENT,   DEPENDENT,       DEPENDENT
##VAR_FORM=  AFFN,          ASDF,            ASDF
##VAR_DIM=   16384,         16384,           16384
##UNITS=     HZ,            ARBITRARY UNITS, ARBITRARY UNITS
##FACTOR=    0.244546801953871, 1,           1
##FIRST=     3421.73454260573, 0,            0
##LAST=      -584.67571380454, 0,            0
##MIN=       -584.67571380454, -109439,      0
##MAX=       3421.73454260573, 423258370,    0
$$ Real data points
##PAGE= N=1
##DATA TABLE= (X++(R..R)), XYDATA
$$ [...]
7964E705157m1136p4034J6522l6622m4338n3969j3337k0134N655j8533l0116j1906
7952E383209j4491p048k2465m2218k5887m9444K9128j0303l5291L4688k136m2269
7940E195473k2193k702L7879J70k6642J4407j0307M840l1087K128J9346l956O384
7927E183740l8022M979J9995j2100l8471L301N0885M799o958M8363k8772k6857
7915E164882J0707J7098N668J4037K234n697r313L8689J9532n449j3025K2099
7903E261462N3492J5401m6791N4773j3033L8200M1604K9542K4253n738N7599K5117
7891E535881k4676M5552M3995N2297K3085L3523N9451R726M1284L9835L4591M7931
7879E942475N6101L4241N4372N0591L3273M0056M1605O3748P6224P8691M7902
$$ y = [5705157, 5664021, 5589987, 5606509, 5569887, 5525549, 5471580, 5458243, 5438109, 5443764, 5425231, 5395115, 5383209, 5368718, 5361670, 5339205, 5296987, 5271100, 5221656, 5250784, 5240481, 5205190, 5239878, 5237742, 5195473, 5173280, 5170578, 5208457, 5208627, 5181985, 5196392, 5186085, 5190925, 5159838, 5161966, 5181312, 5177356, 5183740, 5145718, 5150697, 5170692, 5158592, 5120121, 5123422, 5174307, 5179106, 5172148, 5220511, 5191739, 5164882, 5175589, 5192687, 5198355, 5212392, 5214626, 5208929, 5199616, 5238305, 5257837, 5252388, 5239363, 5261462, 5314954, 5330355, 5283564, 5338337, 5325304, 5363504, 5405108, 5434650, 5458903, 5453165, 5510764, 5535881, 5511205, 5556757, 5600752, 5653049, 5676134, 5709657, 5769108, 5778834, 5820118, 5859953, 5894544, 5942475, 5998576, 6032817, 6087189, 6137780, 6171053, 6211109, 6252714, 6316462, 6392686, 6471377, 6519279]
7868F519279N3538J8347J6737J14415J6130P7042P2637L6720K6637L8243O0190
7857G049915J6710J3911O6458L7918N9083K6603P1511l238P3841P2534K7569M4405
7845G557220L1859P690Q3703J21859K15387k2516m1676R2139n59M3583N2646L5240
7833H176575N2508Q0120N4840R0486K4935l3M0137M7818L6178L9451O2136N4367
7821H759518L7536L1987M4004j1947M2790M3044Q104L4196M0555O0756m0724O0322
7809I110141R8997O8104L4674L0904J6700J9939J06815O1999M1549M1510P2204
7798I703536J07488J20081Q0472J07193Q5289R8424Q5976P0770J06146R3605J36780
7787A0795760J30387J46776J47177J39068J76161J65665J18416J56784J93484
$$ y = [6519279, 6572817, 6591164, 6607901, 6722316, 6738446, 6815488, 6888125, 6924845, 6951482, 6989725, 7049915, 7066625, 7080536, 7146994, 7184912, 7243995, 7270598, 7342109, 7338871, 7412712, 7485246, 7512815, 7557220, 7589079, 7596769, 7680472, 7802331, 8017718, 7995202, 7953526, 8045665, 8045106, 8088689, 8141335, 8176575, 8229083, 8309203, 8364043, 8454529, 8479464, 8479431, 8519568, 8567386, 8603564, 8643015, 8705151, 8759518, 8797054, 8829041, 8873045, 8861098, 8903888, 8946932, 8955036, 8989232, 9029787, 9090543, 9049819, 9110141, 9209138, 9277242, 9311916, 9342820, 9359520, 9379459, 9486274, 9548273, 9589822, 9631332, 9703536, 9811024, 9931105, 10011577, 10118770, 10204059, 10302483, 10388459, 10459229, 10565375, 10658980, 10795760, 10926147, 11072923, 11220100, 11359168, 11535329, 11700994, 11819410, 11976194, 12169678]
7778A2169678J71242J70689J99897J87222J71846K00727K04604K19051J75478
7769A3870434J51494J39592J22405J13950R8540J28711N3262O6788O0265K1000
7759A4826441J2856q466J5573m1014m7015l5705p853M7096m7408L274l147j4441
7747A4700191L2885Q4236P1354o573N6537R2323o06M3127M2195J3408J1759l357
7735A5137479J6662n659k8092m9476n9684p1597q8054m4678j08130j59493j28299
7724A4410979j16515j39912j63717j49204j16273j51619j46322j31051j49066
7715A3147300j72601j51986j19642j17189j28473j65251j37371j02919j74563
7706A1877305j36994j35483j42153j37965j74594j63272j57695j13818j41522
$$ y = [12169678, 12340920, 12511609, 12711506, 12898728, 13070574, 13271301, 13475905, 13694956, 13870434, 14021928, 14161520, 14283925, 14397875, 14496415, 14625126, 14678388, 14745176, 14805441, 14826441, 14839297, 14830831, 14846404, 14805390, 14758375, 14722670, 14714817, 14761913, 14714505, 14717779, 14714632, 14700191, 14733076, 14817312, 14888666, 14882093, 14938630, 15030953, 15030347, 15073474, 15115669, 15129077, 15140836, 15137479, 15154141, 15148482, 15120390, 15070914, 15011230, 14939633, 14851579, 14806901, 14698771, 14539278, 14410979, 14294464, 14154552, 13990835, 13841631, 13725358, 13573739, 13427417, 13296366, 13147300, 12974699, 12822713, 12703071, 12585882, 12457409, 12292158, 12154787, 12051868, 11877305, 11740311, 11604828, 11462675, 11324710, 11150116, 10986844, 10829149, 10715331, 10573809]
7697A0573809j09979j29448j13684j32408j49675q8881j23454j11978j34193j15483
7687I364626r2813p8195q5038r9823j06119j08913p6325r8335p4290p2284j13725
7676H358766p4474o6366o7912m5518p7065o0114o0528l8882r0092p6646m4503
7665G656666o3540q052m2084o3763l8803m6671m8564j9136n6006o8652k6679R993
7653G184709m5288l3356O089n6909n3685j9261J5519j9493l1376K4994n0625m351
7641F916967j4023k7174r296l6168k3794m0931O542m6395l153j1222l0896K0551
7629F701008p728k0090k942k5903o2394n700m0538O54L8988l6991m2569r775j7492
7616F468528k0308j4435K2710k2927l5206j271m9447n25l2942m7297l8503q127
$$ y = [10573809, 10463830, 10334382, 10220698, 10088290, 9938615, 9849734, 9726280, 9614302, 9480109, 9364626, 9271813, 9193618, 9108580, 9008757, 8902638, 8793725, 8717400, 8619065, 8544775, 8472491, 8358766, 8284292, 8217926, 8150014, 8104496, 8027431, 7967317, 7906789, 7867907, 7777815, 7701169, 7656666, 7593126, 7585074, 7542990, 7479227, 7440424, 7393753, 7345189, 7326053, 7270047, 7201395, 7174716, 7184709, 7139421, 7106065, 7112154, 7055245, 7001560, 6982299, 6997818, 6978325, 6946949, 6971943, 6921318, 6916967, 6902944, 6875770, 6866474, 6830306, 6806512, 6765581, 6772123, 6725728, 6722575, 6711353, 6680457, 6701008, 6693280, 6673190, 6670248, 6644345, 6581951, 6576251, 6535713, 6536367, 6575355, 6538364, 6495795, 6486020, 6468528, 6448220, 6433785, 6456495, 6433568, 6398362, 6397091, 6347644, 6347119, 6314177, 6266880, 6228377, 6220250]
7604F220250n4424M063J249r816l3012l0793r444n1408m2041K3463m2871m7338
7592E927878k2043j3786k5232m3710r838k0189n5087l0235j8043k910q6911J6433
7580E616327l6425J872o4714r5107R360l4332o7066l4842k4815n8980k9619l9316
7568E142343k6831p3989j1174l1642k8871p6661n2969m0986l9483m7165k4457
7557D688115Q248m5058m2157m9488o8865q430l6380n7736n5175J3321j7011n8856
7545D270528m9632l2895k6114k2473j1740o3404l9882L586J327k4814l3184k6701
7533C944602l4188k1528m8936J7389l7675k1037j1259j9642K06o001l8571j9085
7521C704275j3345N583J8132r881k2721k6868P781q091Q031P604m4488k0477J7473
$$ y = [6220250, 6165826, 6169889, 6171138, 6161322, 6128310, 6097517, 6088073, 6036665, 5994624, 6018087, 5975216, 5927878, 5905835, 5892049, 5866817, 5823107, 5813269, 5793080, 5737993, 5707758, 5689715, 5686805, 5599894, 5616327, 5579902, 5581774, 5517060, 5421953, 5431313, 5396981, 5329915, 5295073, 5270258, 5211278, 5181659, 5142343, 5115512, 5041523, 5030349, 4998707, 4969836, 4893175, 4840206, 4799220, 4759737, 4712572, 4688115, 4696363, 4651305, 4609148, 4559660, 4490795, 4482365, 4445985, 4388249, 4333074, 4346395, 4329384, 4270528, 4220896, 4188001, 4161887, 4139414, 4127674, 4064270, 4024388, 4027974, 4029301, 4004487, 3971303, 3944602, 3910414, 3888886, 3839950, 3857339, 3819664, 3798627, 3787368, 3767726, 3767932, 3761931, 3723360, 3704275, 3690930, 3696513, 3714645, 3704764, 3682043, 3655175, 3662956, 3654865, 3662896, 3670500, 3626012, 3605535, 3623008]
7508C623008m9003n5215j2700o1844n2219p984m4934j6140n7583p8128K4736m5003
7496C166991o6200K547n4509j3000n4594n2445j3907o1572j5630J0583m8864o0356
7484B739044l4673k5958J5794m5298o523k7808k7121p301l2526r446l0064k3109
7472B485011j6531K313l3334J2943k6678o0765j4436J8951o144l0848k8347m1928
7460B260207M7225k1382q636k1796P029l2264k048l8242k1165J5308r706l2430
7448B142100l673R472l6050J2854m5860O38l0118R422N662l1722j8003K455m4030
7435A973147J8514l3481n4951k012K7003l3393l5458K6364j026p0287k4515K0642
7423A810547o308r411m3301l175M032l9883j2650m4524L1185J610n4964q065j6104
$$ y = [3623008, 3574005, 3518790, 3506090, 3444246, 3392027, 3384043, 3339109, 3322969, 3265386, 3187258, 3211994, 3166991, 3100791, 3103338, 3048829, 3035829, 2981235, 2928790, 2914883, 2853311, 2837681, 2848264, 2799400, 2739044, 2704371, 2678413, 2694207, 2648909, 2642386, 2614578, 2587457, 2580156, 2547630, 2538184, 2508120, 2485011, 2468480, 2470793, 2437459, 2450402, 2423724, 2362959, 2348523, 2367474, 2361330, 2330482, 2302135, 2260207, 2307432, 2286050, 2277414, 2255618, 2262647, 2230383, 2228335, 2190093, 2168928, 2184236, 2174530, 2142100, 2138427, 2147899, 2111849, 2124703, 2078843, 2079481, 2049363, 2058785, 2064447, 2032725, 2014722, 2017177, 1973147, 1991661, 1958180, 1903229, 1901217, 1928220, 1894827, 1859369, 1885733, 1884707, 1814420, 1789905, 1810547, 1804239, 1794828, 1751527, 1748352, 1752384, 1712501, 1699851, 1655327, 1686512, 1688122, 1633158, 1625093, 1608989]
7410A608989Q109J8170k1216p3204L4671j6342n5336q770k1741n1291M2972M6341
7398A511352l1880j7063j5828K646J4809l0475j8095j1654k6205K154j5329k2636
7386A341796j5082k8402J2233K1018o624K0300o5299n076O565m0677j460k7904
7374A211388K6253M8140n8386L923J6582j4405p1436L578Q498k2146k3823J3587
7362A141753l754J081L1297l3280j3906j3156q464q453l7379J4811L5517n807
7350A100260k523l9711l820k39p370j3599j9492k8315K1979k2694q207L2918K7478
7337A036665o9334N3952r940k4609j2312k4059P2n789r294m8555K6569o819j3154
7324H93393K7250K7483j8438q716k4038K8534m8422M23K4614m291k5093O265j0414
$$ y = [1608989, 1617098, 1635268, 1614052, 1540848, 1575519, 1559177, 1503841, 1495071, 1473330, 1422039, 1465011, 1511352, 1479472, 1462409, 1446581, 1449227, 1464036, 1433561, 1415466, 1403812, 1377607, 1379761, 1364432, 1341796, 1326714, 1298312, 1310545, 1331563, 1324939, 1345239, 1279940, 1274864, 1281429, 1240752, 1239292, 1211388, 1237641, 1285781, 1227395, 1231318, 1247900, 1233495, 1162059, 1165637, 1174135, 1151989, 1128166, 1141753, 1137999, 1139080, 1170377, 1137097, 1123191, 1110035, 1101571, 1093118, 1055739, 1070550, 1106067, 1100260, 1097737, 1058026, 1054206, 1053967, 1046597, 1032998, 1013506, 985191, 1007170, 984476, 976269, 1009187, 1036665, 967331, 1021283, 1011343, 986734, 974422, 950363, 950435, 944646, 935352, 886797, 913366, 906547, 893393, 920643, 948126, 929688, 920972, 896934, 925468, 877046, 877469, 902083, 897792, 872699, 878964, 868550]
7311H68550j1892M803K2732O096k1691n0659j8677j0777j7248M5302k3102K4694
7299H18131n4832k8497M5753Q937K471k8581j1020K2799j0809j4499k7235L3999
7287G56617k4989k506K1442l3790K724L3784m1295J3075J954j4579L9028o849
7275G44616o374K0578m013Q792k3002k1707J9335j1480Q207K859M879k7521O772
7262G21941k1969L630k387j7925r069L1700P142m281L5903l0478j5787l2489j6709
7249F49222K5494m333j2783R374j9383n832k3751j646L1288k124r556k9293k3024
7236E83653K8294j586N35j9591l3042K0167j457J7547j7611k3888j8999O416M1664
7223E82102J8199n2229l6913m969j1262M0866K683j6563j8181p853K8089J3348
$$ y = [868550, 856658, 861461, 884193, 890289, 868598, 817939, 799262, 788485, 771237, 816539, 793437, 818131, 763299, 734802, 780555, 789492, 791963, 763382, 752362, 775161, 764352, 749853, 722618, 756617, 731628, 729122, 750564, 716774, 719498, 753282, 711987, 725062, 727016, 712437, 751465, 744616, 738242, 758820, 754807, 763599, 740597, 718890, 738225, 726745, 734952, 737811, 742690, 715169, 721941, 699972, 703602, 701215, 683290, 674221, 705921, 713063, 708782, 744685, 714207, 698420, 665931, 649222, 674716, 670383, 657600, 666974, 647591, 641759, 618008, 616362, 647650, 645526, 635970, 606677, 583653, 611947, 610361, 610896, 591305, 558263, 578430, 576973, 594520, 576909, 553021, 534022, 540438, 582102, 600301, 548072, 511159, 506190, 494928, 535794, 538477, 521914, 503733, 495880, 523969, 537317]
7211E37317n73m3343L662L2568J1654m6414p939n04J0661j614J4152j9300j5064
7198D75263K1394j3777O095J0150l5077K5410j4580j7143r258P575J2046l8524
7186D29574k0910J8228K3213K655J9845l7260O98P733j0104K6849P765K8303K255
7173D98844m4566j1903M814L0491m5539j372Q109J9648l5205N949l1695K1439
7161D19014k221j5171M31K5261N6226m5235m1988N2585q583m3566K2244L2144
7149D51141m5641o721Q396K6193M61k0102l8415L0760j3028k6606k510Q930N2140
7136D24998o0065L6046j9550o590k1775N947K7442l1023n1501M3320J7432K3355
7124C88036P78j8496k9988J9457J0320L303q288K5858o79j5146r356J847O927
$$ y = [537317, 536744, 493401, 497063, 529631, 541285, 494871, 486932, 486428, 497089, 495475, 509627, 490327, 475263, 496657, 482880, 488975, 499125, 464048, 489458, 474878, 457735, 448477, 456052, 468098, 429574, 408664, 426892, 450105, 452760, 472605, 435345, 436043, 443776, 433672, 460521, 468286, 496589, 498844, 454278, 442375, 447189, 477680, 432141, 430769, 438878, 458526, 423321, 429270, 397575, 419014, 416793, 401622, 402053, 427314, 483540, 438305, 396317, 448902, 440319, 396753, 418997, 451141, 405500, 398779, 407175, 433368, 433829, 413727, 375312, 406072, 393044, 366438, 363928, 372858, 424998, 364933, 400979, 381429, 374839, 353064, 359011, 386453, 355430, 303929, 347249, 364681, 388036, 388814, 370318, 340330, 359787, 370107, 373410, 365122, 390980, 390301, 375155, 365799, 367646, 374573]
7111C74573j5230q099k7500J6538N0437n919k5763k474K46j0446j5585L071R300
7098C43149l6886N521L015J9659M824k1720K9629J7542j761J9451j7921k0455
7086C44047J6549L972K7410r041n0759l1986J7763l32J7434j614l0460P875j6977
7073B93881q684O2912l7399J7312n8564o599K6987M142K2668k8506R238K363l002
7060B96749L777o216K3993r501k7888k8198M9603J7715k2614J537k709J5411o482
7047C05177j1591M547J3171k7634J6490k5792M0002j4423n1661j0228J9140K283
7035B59481J4752j6829L2126J2880l0351l811k4128K5250K2279L4250k4828k2543
7023B78528o721L2914j5042j9718k400n641J7054o559J4504J666m4426J4468J2627
$$ y = [374573, 359343, 351244, 323744, 340282, 390719, 384800, 359037, 356563, 356809, 346363, 330778, 333849, 343149, 306263, 311784, 314799, 334458, 339282, 317562, 347191, 364733, 362972, 382423, 364502, 344047, 360596, 364568, 391978, 382937, 332178, 300192, 317955, 317623, 335057, 333443, 302983, 310858, 293881, 285197, 348109, 310710, 328022, 269458, 262859, 289846, 293988, 316656, 288150, 297388, 299751, 296749, 300526, 294310, 318303, 308802, 280914, 252716, 302319, 320034, 297420, 298957, 296248, 311659, 305177, 293586, 298133, 311304, 283670, 300160, 274368, 314370, 299947, 248286, 238058, 257198, 259481, 274233, 257404, 289530, 302410, 272059, 268248, 244120, 269370, 291649, 325899, 301071, 278528, 271807, 304721, 289679, 269961, 267561, 261920, 278974, 272415, 286919, 288585, 244159, 258627, 271254]
7010B71254m0357l700M738O735J9433N3142m3449m1362P127j5871q504j705M2840
6997B50321j0784J3026J5713j7633K5819L7671m7066m2639l8548L6754K3317k169
6985B43782n654L6434k236j7205p297m1055K9012J0793j3687K4405n858n36J5323
6972B66221r24k946k7290k9567J208j5836K8989m735L635k1443m0902M3665N1521
6959B51596l1468n566K5417k2144K4192K9534k6273l2927J5581l2312L5741K8494
6947B59865m797m1565K5061j3156m3462l824J4796K060J1436J7113K91j3994j6416
6934A93408l812L4225L520J2704J6112o622n6054J7772j2777j3346J8736k584
6922B01282L7604n52m834P297l1791K0445J1843l7240l2020O339K7495n635k593
$$ y = [271254, 230897, 227197, 231935, 238670, 258103, 311245, 267796, 226434, 233561, 217690, 209186, 207481, 250321, 239537, 252563, 268276, 250643, 276462, 314133, 267067, 224428, 185880, 222634, 245951, 243782, 238128, 274562, 272326, 255121, 247824, 206769, 235781, 246574, 232887, 257292, 251434, 250898, 266221, 265297, 262351, 235061, 205494, 206702, 190866, 219855, 215120, 218755, 197312, 156410, 200075, 251596, 220128, 214562, 239979, 217835, 242027, 271561, 245288, 212361, 227942, 195630, 231371, 259865, 255068, 213503, 238564, 225408, 181946, 178122, 192918, 194978, 206414, 223527, 223818, 209824, 193408, 189596, 223821, 227341, 240045, 256157, 249535, 193481, 211253, 198476, 185130, 203866, 201282, 238886, 238334, 233500, 240797, 209006, 229451, 241294, 204054, 172034, 178373, 205868, 200233, 197640]
6909A97640k565L0443J0608j419l3547M377K3147Q298k4161J2398m25q538K6636
6896B42892l1431J5381j2577j4619K9307M205l4790j3089L9109q071J9379m131
6884B31565J640k1891k6467P1645j1314k501j1468O034j0402m2085L3268J1928
6872B29952J9704k3345O632j7050Q699O764N693o051J8348K2972k9901J7006k6597
6859B32826j2171P347K1761m3660m6145J8484M4915K8295l5849K6304k3694J2638
6847B31051j2209K8621l0940m457J4676l751L7022J0333j2931j5049J0644j7579
6835B35431R985j0837q061J3194m910J0078J3776j9002L5013l7670l5136n60K9156
6822B30457L7530j2809J8304L6094o342j0760l0884K7266K4637n6576J1144M252
$$ y = [197640, 195075, 225518, 236126, 234707, 201160, 205537, 228684, 236982, 212821, 225219, 224794, 216256, 242892, 211461, 226842, 214265, 199646, 228953, 233158, 198368, 185279, 224388, 216317, 235696, 231565, 233205, 211314, 184847, 256492, 245178, 242677, 231209, 237243, 226841, 184756, 218024, 229952, 249656, 226311, 232943, 215893, 224592, 231356, 237049, 230998, 249346, 272318, 242417, 259423, 232826, 220655, 228002, 249763, 206103, 159958, 178442, 223357, 251652, 215803, 242107, 218413, 231051, 218842, 247463, 216523, 212066, 226742, 222991, 260013, 270346, 257415, 242366, 253010, 235431, 245416, 234579, 226518, 239712, 234802, 244880, 258656, 239654, 274667, 236997, 201861, 201301, 230457, 267987, 255178, 273482, 309576, 303234, 292474, 261590, 288856, 313493, 256917, 268061, 272313]
6810B72313k1721P851L9574j0820j4630K1552l740K4487J6518m075o3643K1624
6798B85290j8077L0554L5986K9734j9436j1565m785k226L1062l4942p661L6463
6786C50397J3732P799l7872J4326K3732k6562L2209J0121J2610o847K722K6698
6774D23065M248m13L851l4395K2409K573J7849J9485J356R708J9931m4810p6168
6761C68689k1317J8282K6202J373k015j2842j5028j9300o264n964K5237L0533
6749C87586m4228K7941p79P620n53J3537p833m7004j2713j2857K7889K7067k4405
6736C41268k1514P454J6596j5567l5941j8007J8803K4145l283l6855j7608q762
6724B50729J5549J4745N59k9473L6247j7692k420J1754P726l4038k0023L8006
$$ y = [272313, 250592, 258443, 298017, 287197, 272567, 294119, 290379, 314866, 331384, 327309, 263666, 285290, 267213, 297767, 333753, 363487, 344051, 332486, 327701, 325475, 356537, 321595, 313934, 350397, 364129, 371928, 334056, 348382, 372114, 345552, 377761, 387882, 400492, 393645, 396367, 423065, 427313, 426900, 430751, 396356, 418765, 421338, 439187, 458672, 460028, 469736, 489667, 444857, 368689, 347372, 365654, 391856, 393229, 391214, 378372, 363344, 344044, 337780, 331816, 357053, 387586, 343358, 371299, 370520, 378140, 377587, 391124, 383291, 336287, 323574, 310717, 338606, 365673, 341268, 319754, 327208, 343804, 328237, 292296, 274289, 293092, 317237, 313954, 277099, 259491, 250729, 266278, 281023, 281582, 252109, 288356, 270664, 268244, 279998, 287724, 253686, 233663, 271669]
6712B71669l3053p634N6281q271o1048M2491K9686K6373k0073j6099k5042J2079
6700B67359L7311j4239k8246k8873N7549J0091N815P265l2874k1901J4425R859
6688B83541J331p418L7384J1915n2807k4958j4024M9229k5278K5132K7271m331
6676C06987l7285l445o789P260J0377Q541K3351j6980Q698K2961l2634L0918J5094
6663C37054j8963o744j4994j2519J634j374j2079M5049J8576l2561k0431m052
6651B78596J0384j417M938j2876M69L5879k0674j8655J1618J8530J8977j6608
6639C09161K4858p026J0140J2046q902p612r627j3257J0947j6394L3741l2943
6627C05132k0631N6627k8010m2795J8339J7986j1941K0734J593N118J6536K1695
$$ y = [271669, 238616, 230982, 287263, 278992, 217944, 260435, 290121, 316494, 296421, 280322, 255280, 267359, 304670, 290431, 262185, 233312, 290861, 300952, 306767, 314032, 281158, 259257, 273682, 283541, 284872, 277454, 314838, 326753, 273946, 248988, 234964, 284193, 258915, 284047, 311318, 306987, 269702, 266257, 259468, 266728, 277105, 285646, 308997, 292017, 300715, 323676, 291042, 321960, 337054, 318091, 311347, 296353, 283834, 285468, 284094, 272015, 317064, 335640, 303079, 282648, 278596, 288980, 287563, 292501, 279625, 280094, 315973, 295299, 276644, 288262, 306792, 325769, 309161, 334019, 326993, 337133, 349179, 340277, 332665, 323038, 309781, 320728, 304334, 338075, 305132, 284501, 341128, 313118, 270323, 288662, 306648, 294707, 315441, 317034, 322152, 338688, 360383]
6615C60383k5551k1433L7650r794j3695j3903k823K6584j1294k7328R176o279
6603C01693Q97L7551q58O953q969K8824J3186l2024k3589K7957L828j7215j1992
6590C26242m3000M3081Q681J7915n24J2727k2828o46M0052p590k13k932m707p966
6576C58292L881J2941j3876J6884N0553k4208K3589m0960j2118J4846J3196M793
6564D07813K174l6471j7201K5094K5619P58j9852K4718L8543j1555l302L387l069
6551D36656k8365J8388J5563L8520k2356R321J8419n123j4466J9456j2317M171
6539D77867o053N2297l5246R321p341L1551K0253j5460K5836L387K0254Q394J0219
6526E95279m5977J2842J9779L4163K2929k572K809k0711J6530L895J413L5577
$$ y = [360383, 334832, 313399, 351049, 341255, 327560, 313657, 310834, 337418, 326124, 298796, 307972, 301693, 302590, 340141, 339283, 346236, 337267, 366091, 379277, 347253, 323664, 351621, 355449, 338234, 326242, 283242, 326323, 335004, 352919, 352395, 365122, 342294, 341648, 381700, 374110, 373897, 370965, 366258, 358292, 362173, 375114, 361238, 378122, 428675, 404467, 428056, 387096, 374978, 389824, 403020, 407813, 409987, 373516, 356315, 381409, 407028, 407786, 387934, 412652, 451195, 439640, 436338, 439725, 436656, 408291, 426679, 442242, 480762, 458406, 467727, 486146, 481023, 466557, 486013, 473696, 477867, 471814, 524111, 488865, 498186, 490845, 522396, 542649, 527189, 553025, 556412, 576666, 585060, 595279, 549302, 562144, 581923, 616086, 639015, 636443, 639252, 618541, 635071, 638966, 640379, 675956]
6514F75956L1574j1161J6287M114j4821L0282j7871K678k4874r485K6312p86M2687
6501G50892n803K692j0536k0279J8337q76L4827n1994L516q592N811J9027J4686
6488G51708m2420K8668J1977J4040j8146K0036J5454k0815n6051Q794K443L5321
6476G51009J9176k7788k5777P328l4158J9855P380K6644l1594j2201j8731r378
6464F71765J6015O185k5828k3574M901j5838P04j5590l1957L245L2245k3668K3684
6451F22289m6102l3131L2686M6066J0396m9699j332Q260N47j9656n9814J7812
6439E28322J8420j4981J3058M005o418K535k6883J7158k9089l326J2356j5110
6427E00047J1916k049j5079M3395r71n903q912k119l6963J6154j3837K6452j6620
$$ y = [675956, 707530, 696369, 712656, 716770, 701949, 732231, 714360, 717038, 692164, 682679, 708991, 708205, 750892, 745089, 747781, 737245, 716966, 735303, 734427, 769254, 717260, 720776, 712184, 717995, 737022, 751708, 709288, 737956, 749933, 763973, 745827, 765863, 781317, 760502, 704451, 713245, 715688, 751009, 770185, 742397, 716620, 723948, 689790, 709645, 717025, 743669, 712075, 699874, 681143, 671765, 687780, 693965, 668137, 644563, 649464, 633626, 634330, 618740, 586783, 590028, 622273, 598605, 622289, 576187, 543056, 575742, 621808, 632204, 582505, 581173, 589433, 589980, 570324, 510510, 528322, 546742, 531761, 544819, 548824, 542406, 544941, 518058, 535216, 506127, 502801, 515157, 500047, 511963, 509914, 494835, 538230, 537259, 531356, 522444, 520325, 483362, 499516, 485679, 512131, 495511]
6414D95511k2787O6618k4912k3128k1525J0108K7185l4509K4756K4853l4083j2018
6402D76069o53p280J1642k4224O780J2706r249J2230k1524m887J4222k4877M0941
6389D81896M0094l7349j7009l470J6871O269J1248m6133j3513N9081j622j2409
6377D83954m949m4505J4979M3588r139J5217J7506l8467j4511J8089J2670K3864
6365E18296j7757q986R115Q097j564N674K4569L0689J2538k0155j1518L0812j2670
6352E67140K79j4242J6520O918o665J8044o574j3020k2667j7070j3912K7100K4591
6339E66442L21j6066K1451J1614m0706K1989J4154j3973Q880r080J0134P316m576
6326E77900L277L2167l9610k7605J5672K0190K2344l4402J9836J4630l2542k1941
$$ y = [495511, 472724, 539342, 514430, 491302, 469777, 479885, 507070, 472561, 497317, 522170, 488087, 476069, 475416, 468136, 479778, 455554, 462334, 475040, 465791, 478021, 456497, 451610, 465832, 440955, 481896, 521990, 484641, 467632, 464162, 481033, 487302, 498550, 452417, 438904, 497985, 496363, 483954, 479005, 434500, 449479, 493067, 483928, 499145, 516651, 478184, 463673, 481762, 494432, 518296, 500539, 491553, 500668, 508765, 507201, 512875, 537444, 568133, 580671, 560516, 548998, 579810, 567140, 567419, 553177, 569697, 576615, 569950, 587994, 581420, 568400, 545733, 528663, 514751, 541851, 566442, 566763, 550697, 572148, 583762, 543056, 565045, 579199, 565226, 574106, 565026, 575160, 582476, 577900, 581177, 613344, 573734, 546129, 561801, 581991, 604335, 569933, 589769, 604399, 571857, 549916]
6314E49916j9114K4134L6559L7971k0195k6870J9190K926k1798L91q764M107l0805
6301E47648J6420L79K288L8041r979r16L2270l026J068J9663M2286N290l4580
6288F56852J5092K5525j6365R452r576k3126l007K2445M774M413L515j6702j6843
6275F56449J9218J4640j726n378J4802k10l9620P813r699J9257l5961L0123J7564
6262F87272l887P555J5291q694L3949l2085m973j7186M5503K7477j7486k2999
6250G09737k7189M1260n679j1928J9922N4103l866j4062K7729l3437k6992l2960
6238F96638Q8745L224L380k8167k3221Q728J0220K2869m8692J2172O85Q204L0486
6225G85271L2408j3424O626n172k0408p639O2163n9778K6507j7240k6715L0257
$$ y = [549916, 530802, 554936, 591495, 629466, 609271, 582401, 601591, 604517, 582719, 583110, 574346, 578453, 547648, 564068, 564447, 566735, 604776, 594797, 593881, 626151, 623125, 624193, 643856, 686142, 691432, 656852, 671944, 697469, 681104, 690556, 680980, 657854, 654847, 677292, 682066, 686479, 689994, 673292, 656449, 675667, 690307, 688581, 683203, 698005, 697795, 658175, 665988, 656289, 675546, 639585, 669708, 687272, 683385, 690940, 706231, 697537, 731486, 699401, 694428, 677242, 722745, 750222, 732736, 709737, 682548, 723808, 718129, 706201, 726123, 780226, 776360, 762298, 790027, 756590, 729598, 696638, 785383, 788607, 791987, 763820, 740599, 749327, 759547, 782416, 733724, 745896, 746581, 754785, 785271, 817679, 804255, 810881, 805709, 785301, 777662, 839825, 780047, 806554, 789314, 762599, 792856]
6213G92856J6401J2372J2950J0699m2133k7593R301M1921L4454l9492K1814K6689
6201H70239L2217n4744j4540J1743Q791l7280N758K5344L4456l1272k178k9681
6189H18853o549P7355k3205j5349k6151K7742P856J6658k6977k4448L7032k715
6177H60102j1745L5110L0201m3780K8488J9396m334N433n28k8395m466M3454P255
6164I36191l3982k723K0665J733K0286k2490K5532J3688R730L5882p322P080Q69
6151A005139K327k511q712j2341K3906n989n0582L1494K685L7101K7093M505L0863
6138A084978Q794l1138J717n189Q720r544Q814K100Q687Q947J3213k1891J9725
6125A097933K614K2007n069K1996K0636N2227J2543m8591k9147j5177K0322L967
$$ y = [792856, 809257, 821629, 834579, 845278, 803145, 775552, 784853, 826774, 861228, 821736, 843550, 870239, 902456, 847712, 833172, 844915, 853706, 816426, 822184, 847528, 881984, 850712, 848534, 818853, 812304, 889659, 866454, 851105, 824954, 852696, 860552, 877210, 850233, 825785, 862817, 860102, 848357, 883467, 913668, 869888, 898376, 917772, 913438, 918871, 918343, 889948, 885482, 928936, 936191, 902209, 899486, 920151, 921884, 942170, 919680, 945212, 958900, 968630, 1004512, 997190, 1004270, 1005139, 1007466, 1004955, 996243, 983902, 1007808, 1001819, 951237, 982731, 985416, 1022517, 1049610, 1054115, 1084978, 1093772, 1062634, 1064351, 1059162, 1067882, 1058338, 1067152, 1069252, 1077939, 1086886, 1100099, 1078208, 1097933, 1100547, 1122554, 1117485, 1139481, 1160117, 1212344, 1224887, 1176296, 1147149, 1131972, 1152294, 1156261]
6113A156261J1165L1777J5906j4157P489M1836p519N0940K0707j7229m0420K1234
6101A277990K1067J0099L4668k5049K0069K9587l039K7560J4582k2934K8755K0554
6089A433909L8314L0728o645K015N840j2560R401M3330k0947l403Q227N1773N7228
6076A637210r663l437j8095K2091K5385L87k3117m955J7106J6013J290m855K9160
6063A684520K0580J065q699N345O589p00j74j7357J0609k7836P821j1682K1376
6050A691457n7378J5733K6422l0468l9870L114N324L9763j6693m1093l675m989
6038A587647K953J6008p633L8196m499m2914r842K2607J702j4942J2740O62J4743
6025A617428l7387k5854J3938J7293j5198Q513j6403L019J2879p722l4406K8689
$$ y = [1156261, 1167426, 1199203, 1215109, 1200952, 1208441, 1250277, 1242758, 1293698, 1314405, 1297176, 1256756, 1277990, 1299057, 1309156, 1343824, 1318775, 1338844, 1368431, 1365392, 1392952, 1407534, 1384600, 1413355, 1433909, 1472223, 1502951, 1496306, 1498321, 1504161, 1491601, 1501002, 1544332, 1523385, 1519982, 1528209, 1579982, 1637210, 1627547, 1624110, 1606015, 1628106, 1653491, 1653878, 1630761, 1625806, 1642912, 1658925, 1660215, 1655360, 1684520, 1705100, 1706165, 1697466, 1702811, 1709400, 1708700, 1708526, 1691169, 1701778, 1673942, 1681763, 1670081, 1691457, 1634079, 1649812, 1676234, 1645766, 1605896, 1609010, 1614334, 1654097, 1637404, 1596311, 1592636, 1587647, 1590600, 1606608, 1598975, 1637171, 1632672, 1589758, 1579916, 1602523, 1604225, 1589283, 1602023, 1602685, 1617428, 1580041, 1554187, 1568125, 1585418, 1570220, 1578733, 1562330, 1565349, 1578228, 1570506, 1536100, 1564789]
6013A564789L043j2043k0290k7780J9379j3329J1793N6599k3959l3283J1891N605
6001A542415K6277m8977J7665M0298m3198n2583k0275M5170L851k22k7289j1915
5989A471217l851Q48l8181k0246K5506K6098m595l8893n359J2493m300k2542l1405
5976A366790j3758N1681j3185M0765k3633l4365j5342j3553l988K4977K9509l3020
5964A362878m084J056K127k8427K6400m91J7131K5324l6058J3353N732J8788k4506
5951A379223m0719M9103k2527J5989J3887P684p904k091L2139K5033k2023m5655
5939A382139K9543J4175j9939q857M7799J2325l5501k0840j5407K4521J808k4909
5927A386857O1713r581J991l8585K3062J937J8031M6663J3580J8847j2165M9257
$$ y = [1564789, 1567832, 1555789, 1535499, 1507719, 1527098, 1513769, 1525562, 1582161, 1558202, 1524919, 1536810, 1542415, 1568692, 1519715, 1537380, 1577678, 1534480, 1481897, 1461622, 1506792, 1510643, 1510421, 1483132, 1471217, 1467366, 1468214, 1430033, 1409787, 1435293, 1461391, 1456796, 1417903, 1412544, 1425037, 1420737, 1398195, 1366790, 1353032, 1404713, 1391528, 1432293, 1408660, 1374295, 1358953, 1345400, 1341412, 1366389, 1395898, 1362878, 1358794, 1359850, 1361977, 1333550, 1359950, 1359459, 1376590, 1401914, 1365856, 1379209, 1384941, 1403729, 1379223, 1338504, 1387607, 1365080, 1381069, 1394956, 1402640, 1394736, 1392645, 1424784, 1449817, 1427794, 1382139, 1411682, 1425857, 1405918, 1397061, 1444860, 1457185, 1421684, 1400844, 1385437, 1409958, 1411766, 1386857, 1448570, 1438989, 1440980, 1402395, 1425457, 1427394, 1445425, 1492088, 1505668, 1524515, 1512350, 1561607]
5915A561607j6116J2765k4280k0608M326j9524L9192J3676q037J0139R561K9762
5903A592463k2058Q841K2578K1504J408m78K5758K9396k4262l63j2419j264K3675
5890A664779M0532k1635J8573r00O465J0345j453j8569J0111K8763J0598J1187
5878A758796r737j1064J1877L5604K3452k1712j2484J8302J3138j3428M813J7859
5866A815416j1577M5608M4708j4277l2355O713J4813J9936j8978L3311L1670N5664
5854A990652o5586M5775N8410l1851P958O120L7310l3616J9969J815N203K6381
5842B068540O73L5963K1399K6153q232K5413j3495P985J3101K2186K9077J5253
5830B244016L0939P511L0529P938k5513J227M3979L4989J8770N617n5323L9593
$$ y = [1561607, 1545491, 1558256, 1533976, 1513368, 1517694, 1498170, 1537362, 1551038, 1543001, 1553140, 1562701, 1592463, 1570405, 1579246, 1601824, 1623328, 1624736, 1624258, 1650016, 1679412, 1655150, 1654787, 1642368, 1641104, 1664779, 1705311, 1683676, 1702249, 1701349, 1707814, 1718159, 1716706, 1698137, 1708248, 1737011, 1747609, 1758796, 1749059, 1737995, 1749872, 1785476, 1808928, 1787216, 1774732, 1793034, 1806172, 1792744, 1797557, 1815416, 1803839, 1849447, 1894155, 1879878, 1847523, 1854236, 1869049, 1888985, 1870007, 1903318, 1934988, 1990652, 1925066, 1970841, 2029251, 1997400, 2005358, 2011478, 2048788, 2015172, 2035141, 2036956, 2042159, 2068540, 2069213, 2105176, 2126575, 2152728, 2144496, 2169909, 2156414, 2164399, 2177500, 2199686, 2228763, 2244016, 2274955, 2282466, 2312995, 2320933, 2295420, 2296647, 2340626, 2375615, 2394385, 2400002, 2344679, 2384272]
5818B384272L7278j2317J7406j5483L8160R039o221K5980L2087J5500J9127K1479
5806B566307k4129R339K9942m1609J6303j187J4493J208k5380R840N949L3220
5794B594296j5340J140L4384l6338J1806j1985K3929O44L731j0079j9287Q064
5782B584965q188J9768K0463o363M425L049J4136j4444q210K0993P612O0572l204
5769B695574n584k8152J9865K0517J0228J6599j8397k5021k412Q097K6721K5304
5757B743339M6688K1440L4689k7415j7291J2179J7919J1400K9315J5189L4884
5746B922336J0994o93l9634J2570J5070R708K3947j6203J6621M4126K4399k6551
5734B996690j0463K3909K9291R35l2166j7861N4153j8586l0640o980J7247l014
$$ y = [2384272, 2421550, 2409233, 2426639, 2411156, 2449316, 2458355, 2452134, 2478114, 2510201, 2525701, 2544828, 2566307, 2542178, 2551517, 2581459, 2539850, 2556153, 2554966, 2569459, 2570667, 2545287, 2555127, 2561076, 2594296, 2578956, 2580096, 2614480, 2578142, 2589948, 2577963, 2601892, 2602536, 2606267, 2596188, 2576901, 2584965, 2576777, 2596545, 2617008, 2610645, 2615070, 2618119, 2632255, 2617811, 2609601, 2630594, 2638206, 2698778, 2695574, 2689990, 2661838, 2681703, 2702220, 2712448, 2729047, 2710650, 2685629, 2683217, 2691314, 2718035, 2743339, 2790027, 2811467, 2846156, 2818741, 2801450, 2813629, 2831548, 2842948, 2872263, 2887452, 2922336, 2933330, 2932637, 2893003, 2905573, 2920643, 2930351, 2954298, 2938095, 2954716, 2998842, 3023241, 2996690, 2986227, 3010136, 3039427, 3040362, 3008196, 2990335, 3044488, 3025902, 2995262, 2988282, 3005529, 3002515]
5722C002515K5940k1914j4454N368k0698k1729J0590M1611N315L6570j3750k7613
5710C007751k4859j0864o643L4225m961R083J4099J4309Q269j6612M9931j3367
5698C060361R520K1661J7472r852m1696L8755K2193K137Q0587K2931j8730O203
5686C211542K5470l2878N3654r793J465o922n026K3689k3639K606j4409R860J7075
5673C252694k3335O192M349J7950J0533k5209k6590l4606k0786J4281J2873j3937
5661C174409l8495j6647p60M966m754j4824j56j7941l5296k4827L732J7833k6173
5648C021067l1673Q126k4304k6823k602J0465p201q539J5414n9166j4552J4953
5636B895165L988Q778K278J4802k0812p939J1471k6003k7541J2099m6528K0131
$$ y = [3002515, 3028455, 3006541, 2992087, 2997455, 2976757, 2955028, 2965618, 3007229, 3012544, 3049114, 3035364, 3007751, 2982892, 2972028, 2965385, 2999610, 2994649, 3003732, 3017831, 3032140, 3040409, 3023797, 3073728, 3060361, 3069881, 3091542, 3109014, 3099162, 3057466, 3096221, 3118414, 3120551, 3201138, 3224069, 3205339, 3211542, 3237012, 3204134, 3257788, 3247995, 3249460, 3242538, 3237512, 3261201, 3237562, 3240168, 3225759, 3235619, 3252694, 3229359, 3235551, 3239900, 3257850, 3268383, 3243174, 3216584, 3181978, 3161192, 3175473, 3188346, 3174409, 3135914, 3119267, 3118507, 3123473, 3118719, 3103895, 3103739, 3085798, 3050502, 3025675, 3029407, 3047240, 3021067, 2989394, 2997520, 2973216, 2946393, 2943791, 2954256, 2947055, 2938516, 2953930, 2894764, 2880212, 2895165, 2899153, 2907931, 2910209, 2925011, 2904199, 2896260, 2907731, 2881728, 2854187, 2866286, 2819758, 2839889]
5624B839889K3304k657k1591k4297M1603m421j2493k3209l0290j4264R927j0612
5612B770889p420K741l8022L72J6296j7669j9762k0670Q987q546n686L1549M400
5599B717459j0364l8848K1281m3853j6562J925j0066J166m229j2636J9066J7976
5587B642315n745J2985P734m3317p064K5541k3677k5344L448j1895J2372K2387
5575B609740l2347K2845k5780m5125J1406J0822j4609k0955K7847k3992k07L1013
5563B550658K3924J5670n5067k9992K6238R680L0189L208r621Q232K114p297q787
5550B559149l0804N0127L0908n404r186l6583n731K4304J2289P732K3196j1464
5538B608533k1684P215K3939K7137k14j4307L1232Q020j5632J3453J1609q619
$$ y = [2839889, 2863193, 2860536, 2838945, 2814648, 2856251, 2851830, 2839337, 2816128, 2785838, 2771574, 2781501, 2770889, 2763469, 2766210, 2728188, 2728560, 2744856, 2727187, 2707425, 2686755, 2695742, 2687196, 2681510, 2713059, 2717459, 2707095, 2668247, 2689528, 2645675, 2629113, 2631038, 2620972, 2622138, 2617909, 2605273, 2624339, 2642315, 2636570, 2649555, 2657289, 2613972, 2606908, 2632449, 2608772, 2583428, 2586876, 2574981, 2587353, 2609740, 2577393, 2600238, 2574458, 2529333, 2540739, 2551561, 2536952, 2515997, 2543844, 2519852, 2519645, 2550658, 2574582, 2590252, 2535185, 2505193, 2531431, 2541111, 2571300, 2574508, 2564887, 2573119, 2575233, 2567936, 2559149, 2528345, 2578472, 2609380, 2603976, 2594790, 2558207, 2552476, 2576780, 2589069, 2596801, 2619997, 2608533, 2586849, 2594064, 2618003, 2645140, 2644926, 2630619, 2661851, 2669871, 2654239, 2667692, 2679301, 2670682]
5526B670682K8192K048j1973J5018M345J1353J3299R738M0603m1402L3479L9760
5514B815142l7537L1315Q398M813J4046J733M1232O20o291L3201P0626K0218L0021
5501C027537p834J0080j6079O0606M7252j2673K6104K3382P577K820K8655J5180
5489C212607K7054M7038K0185j7580M3467l8405n826L0173K0746R5613j8144m3122
5477C373806L6772J7177k9679J7771L379L8780L8703l3499N933q691L1197n545
5465C486104J7072K284k445j8009K7908J0098m6744r743L1077k5194q135K8308
5453C492581r919l3477j4366K0558r269J009p319l3125j942J1575J6241m193L9714
5440C468068M5072k3612l6744j2948j6701L3251K3925k9536J6563L9130m808j757
$$ y = [2670682, 2698874, 2700922, 2688949, 2703967, 2708312, 2719665, 2732964, 2742702, 2783305, 2741903, 2775382, 2815142, 2777605, 2808920, 2817318, 2822131, 2836177, 2837910, 2879142, 2879762, 2873471, 2906672, 2977298, 2997516, 3027537, 3019703, 3029783, 3013704, 3074310, 3121562, 3108889, 3134993, 3158375, 3165952, 3168772, 3197427, 3212607, 3239661, 3286699, 3306884, 3289304, 3332771, 3294366, 3288540, 3318713, 3339459, 3435072, 3416928, 3373806, 3410578, 3427755, 3398076, 3415847, 3419226, 3458006, 3496709, 3463210, 3469143, 3460452, 3491649, 3486104, 3503176, 3505460, 3503015, 3485006, 3512914, 3523012, 3476268, 3466525, 3497602, 3472408, 3464273, 3492581, 3482662, 3449185, 3434819, 3455377, 3446108, 3447117, 3439798, 3406673, 3404731, 3416306, 3432547, 3428354, 3468068, 3513140, 3489528, 3452784, 3439836, 3423135, 3456386, 3480311, 3450775, 3467338, 3506468, 3501660, 3499903]
5428C499903j0221q087O849K2043J5393j3575M4398j0928K0437L4217j6697j7338
5416C566394K1186J0857m5668k8936K9061k9483m690l3086K2545M1700m2829j5563
5404C491488J4774k6742O787l887j6614L2428L435l7080l3497J3773J2212k1339
5392C435738J4658j3551j5049j7396j26j7809J6823M2082l0718N967J6292l0188
5380C406723m5431L5282j3202l1509k627p761K8015K4714M043l2209L731K4375
5368C394144M6015l8072m1158R009L8664O3420Q79l5182J3021L4718K932K9263
5356C517653o93J5468K6991J4658j8589K6077m083Q835M8877J1168J779j8941
5344C629200L4174K2856M606K283o144M5255q158M0782J4576j8949L4809l4263
$$ y = [3499903, 3489682, 3481595, 3488444, 3510487, 3525880, 3512305, 3556703, 3545775, 3566212, 3600429, 3583732, 3566394, 3587580, 3598437, 3552769, 3523833, 3552894, 3523411, 3518721, 3485635, 3508180, 3549880, 3507051, 3491488, 3506262, 3479520, 3486307, 3482420, 3465806, 3498234, 3501669, 3464589, 3431092, 3444865, 3457077, 3435738, 3450396, 3436845, 3421796, 3404400, 3404274, 3386465, 3403288, 3445370, 3414652, 3420619, 3436911, 3406723, 3361292, 3396574, 3383372, 3351863, 3349236, 3341475, 3369490, 3394204, 3398247, 3366038, 3369769, 3394144, 3440159, 3402087, 3360929, 3369938, 3408602, 3472022, 3472901, 3437719, 3450740, 3485458, 3488390, 3517653, 3516960, 3532428, 3559419, 3574077, 3555488, 3581565, 3577482, 3586317, 3635194, 3646362, 3648141, 3629200, 3663374, 3686230, 3690836, 3693119, 3686975, 3732230, 3724072, 3764854, 3779430, 3760481, 3795290, 3761027]
5332C761027P48L8169l1813j4821J8823m347j5765M5560k6164L334j2207j9119
5320C743425k3694J5410K1609n1341J5209j717K6631l219l3708M216k0447P707
5308C700081p643k9107K3145M8591j7735K6222L6829l6814R255M7276l1702Q251
5296C776649K1657m889K0519K0249p805p674J4444j5090k6373M4974L7269l578
5284C870352L59l0059l59L2560M1208r782M1939R954n6669K1805j0950k1264p273
5271C881821Q11K9223j6504j0145j4078n4033k4175P364K2036l0113j2228k2487
5259C757492p3141j2783K0024j5050p8769Q593l2641K4633k5111J1708J0678l6943
5247C558690k144Q33J6815m4649J8675k4173n5897j4004L8389l80j9113j9421
$$ y = [3761027, 3761775, 3799944, 3768131, 3753310, 3772133, 3767786, 3752021, 3797581, 3771417, 3774751, 3762544, 3743425, 3719731, 3735141, 3756750, 3705409, 3720618, 3718901, 3745532, 3742313, 3708605, 3712821, 3692374, 3700081, 3692438, 3663331, 3686476, 3735067, 3717332, 3743554, 3780383, 3743569, 3752824, 3800100, 3768398, 3776649, 3798306, 3793417, 3813936, 3834185, 3826380, 3818706, 3833150, 3818060, 3791687, 3836661, 3873930, 3870352, 3870711, 3840652, 3840293, 3872853, 3914061, 3904279, 3946218, 3956172, 3899503, 3921308, 3910358, 3889094, 3881821, 3882632, 3911855, 3895351, 3885206, 3871128, 3817095, 3792920, 3800284, 3822320, 3792207, 3779979, 3757492, 3684351, 3671568, 3691592, 3676542, 3597773, 3606366, 3573725, 3598358, 3573247, 3584955, 3595633, 3558690, 3556546, 3557379, 3574194, 3529545, 3548220, 3524047, 3468150, 3454146, 3492535, 3492155, 3473042, 3453621]
5235C453621k6440p176j1116P600Q961j3774k7975M7545R904n6873P044j6804
5223C374517K9039j9676j9908K0635k6106k0028O909J4082Q459K3701J4452k663
5211C403413j5669j3722j0538j2860p225L5012R891k228L3911K6954l9385Q843
5199C416397M4363M5785m7556k7390j6238O4832k0496k5991L159L0586K3157r440
5187C481168k836J764j575j6603J8153O870K0956m4255J3645K8410J4446J6176
5175C536319K044O433K1015L5354l4210K9668L0422J9967j6302k5782J8192P351
5163C630471O218k6371K353N198m756K8730O2077K172j2049l4737L6470P133j3624
5150C689285M9043k1466J9047M5489L9437K0937P028K5087R668J6523O5952K7283
$$ y = [3453621, 3427181, 3420005, 3408889, 3416489, 3425450, 3411676, 3383701, 3431246, 3441150, 3384277, 3391321, 3374517, 3403556, 3383880, 3363972, 3384607, 3358501, 3338473, 3345382, 3359464, 3367923, 3391624, 3406076, 3403413, 3387744, 3374022, 3363484, 3350624, 3343399, 3378411, 3388302, 3386074, 3419985, 3446939, 3407554, 3416397, 3460760, 3506545, 3458989, 3431599, 3415361, 3480193, 3459697, 3433706, 3436865, 3467451, 3490608, 3481168, 3478332, 3480096, 3478521, 3461918, 3480071, 3486941, 3507897, 3463642, 3477287, 3505697, 3520143, 3536319, 3538363, 3544796, 3565811, 3601165, 3566955, 3596623, 3627045, 3647012, 3630710, 3604928, 3623120, 3630471, 3636689, 3610318, 3612671, 3617869, 3613113, 3641843, 3703920, 3706092, 3694043, 3659306, 3695776, 3702909, 3689285, 3738328, 3716862, 3735909, 3781398, 3820835, 3841772, 3848800, 3873887, 3883555, 3900078, 3966030, 3993313]
5138C993313j4874M8866m397o693j9110k036N5082L8876p360J9678J5125J0688
5126D127158k594K7086L183L6015L67j5205J8366N5217L3240L7241J7017k2006
5114D315085L8785P2139K2138N9634J2668r951M6418O956M222L9191M2251J800
5102D651336P442M1609J9890M143L9066N9783J1449L3059L1838L4973K2614P5784
5090E032986N7044M4824O7882J4835L9935L4880O8090N2512L6969P1994O1084
5079E583035q043R7988O1973J8709J10336N7861P2047Q5870J00301J04157J16473
5068F400707Q6810R7838J44919J09922J38475J23801J12517J20398J24509J13343
5058G573239J02061J18394O3664M4911O4628M7936M9174j0248l1506p633j5087
$$ y = [3993313, 3978439, 4027305, 4022908, 4016215, 3997105, 3995069, 4050151, 4089027, 4081667, 4101345, 4116470, 4127158, 4124564, 4151650, 4154833, 4190848, 4191215, 4176010, 4194376, 4249593, 4282833, 4320074, 4337091, 4315085, 4353870, 4426009, 4448147, 4507781, 4520449, 4510498, 4556916, 4563872, 4568094, 4607285, 4649536, 4651336, 4658778, 4700387, 4720277, 4724420, 4763486, 4823269, 4834718, 4867777, 4899615, 4934588, 4957202, 5032986, 5090030, 5134854, 5202736, 5217571, 5257506, 5292386, 5360476, 5412988, 5449957, 5521951, 5583035, 5574992, 5672980, 5734953, 5753662, 5863998, 5921859, 5993906, 6079776, 6180077, 6284234, 6400707, 6487517, 6585355, 6730274, 6840196, 6978671, 7102472, 7214989, 7335387, 7459896, 7573239, 7675300, 7793694, 7857358, 7902269, 7966897, 8014833, 8064007, 8053759, 8022253, 8014620, 7999533]
5047G999533j9626k3792k2798K7721j7867L4846O3560J0930M1343M2842O0328
5036H197020Q8306L8879O6707N9059N3197M5696J05685P3535M8122P2542J07423
5025H956171R5663P0401N8945O4522P8344J44396R8549O7894J56567J26110R6865
5014A0014427J25565J37110J20686J15782J38079J23266J40727J49494J59767
5005A1224903J41185Q9479J62158J07351J34500Q9180K0119M9983O001J7275o2503
4994A1979631r5625k9216o4265n8922j0153l0474j9267m6280J454k5088L9963
4983A1641758Q7045J9045K3103N3624K5494K8768L5218M7902j3319N3229M5536
4972A2047403J8917N1632L1461J05264L4403J5795K6447J9663M4355M5340N1813
$$ y = [7999533, 7979907, 7956115, 7933317, 7961038, 7943171, 7978017, 8041577, 8052507, 8093850, 8136692, 8197020, 8285326, 8324205, 8390912, 8449971, 8503168, 8548864, 8654549, 8728084, 8776206, 8848748, 8956171, 9051834, 9122235, 9181180, 9245702, 9324046, 9468442, 9566991, 9634885, 9791452, 9917562, 10014427, 10139992, 10277102, 10397788, 10513570, 10651649, 10774915, 10915642, 11065136, 11224903, 11366088, 11455567, 11617725, 11725076, 11859576, 11948756, 11968875, 12018858, 12024859, 12042134, 11979631, 11884006, 11854790, 11790525, 11731603, 11721450, 11690976, 11671709, 11625429, 11626883, 11601795, 11641758, 11728803, 11747848, 11770951, 11824575, 11850069, 11878837, 11914055, 11961957, 11948638, 12001867, 12047403, 12066320, 12117952, 12149413, 12254677, 12289080, 12304875, 12331322, 12350985, 12395340, 12440680, 12492493]
4961A2492493J3101K0699L6991N2821K7504J5640j2380q133M7060j7649N748K3891
4949A2697786M3845J5587K0906p035L9525N1967M9956L917K8296J385N7204J6950
4937A3020289M8213L6085M1762K3652O2607Q6717N0693N2994N6026J00747J40295
4926A3720080P8347R2724P9704O5687R7253J30649J58746J15404J09253R8758
4916A4746605J24706J40116J12002J09575J31804R7289J69213J32585J46772J62000
4906A6072667J47836K06211K44670K04952K36706K00425K52952K45627K11295
4897A8023341L25793K91299K92503L46887L51685L63216L43780L64907L42547
4888B1045958L75598L76809L64199L45051L27294L78043L72039K47319K13674
$$ y = [12492493, 12505594, 12526293, 12563284, 12616105, 12643609, 12659249, 12646869, 12638736, 12685796, 12668147, 12673895, 12697786, 12741631, 12757218, 12778124, 12771089, 12810614, 12862581, 12912537, 12916454, 12944750, 12946135, 13003339, 13020289, 13068502, 13104587, 13146349, 13170001, 13232608, 13319325, 13370018, 13423012, 13479038, 13579785, 13720080, 13798427, 13891151, 13970855, 14036542, 14133795, 14264444, 14423190, 14538594, 14647847, 14746605, 14871311, 15011427, 15123429, 15233004, 15364808, 15462097, 15631310, 15763895, 15910667, 16072667, 16220503, 16426714, 16671384, 16876336, 17113042, 17313467, 17566419, 17812046, 18023341, 18349134, 18640433, 18932936, 19279823, 19631508, 19994724, 20338504, 20703411, 21045958, 21421556, 21798365, 22162564, 22507615, 22834909, 23212952, 23584991, 23832310, 24045984]
4879B4045984K79372J73523J86185K04291J49222J65884J81834R3700J49073J33931
4869B5762999J52002J79732J66680K43166J85636K30292K51870K29797L05596
4860B7707770L02933K96316L19454L90431M05748M03632M38162M06864M85040
4851C1156350N29979N82170N37023N34819N15199N90086N88865N86596N65284
4842C6186371N44243N38733N47879N42993N23580N43249N42858O14823O44064
4833D1228793O70955O97350P49978P85301Q62214Q97251R52928R75001J057612
4824D8877383J126275J145996J165971J239439J322915J330059J464804J537236
4816E9210078J590784J657350J769866J886621J946864K086679K271875K401694
$$ y = [24045984, 24325356, 24498879, 24685064, 24889355, 25038577, 25204461, 25386295, 25479995, 25629068, 25762999, 25915001, 26094733, 26261413, 26504579, 26690215, 26920507, 27172377, 27402174, 27707770, 28010703, 28307019, 28626473, 29016904, 29422652, 29826284, 30264446, 30671310, 31156350, 31686329, 32268499, 32805522, 33340341, 33855540, 34445626, 35034491, 35621087, 36186371, 36730614, 37269347, 37817226, 38360219, 38883799, 39427048, 39969906, 40584729, 41228793, 41899748, 42597098, 43347076, 44132377, 44994591, 45891842, 46844770, 47819771, 48877383, 50003658, 51149654, 52315625, 53555064, 54877979, 56208038, 57672842, 59210078, 60800862, 62458212, 64228078, 66114699, 68061563, 70148242, 72420117, 74821811]
4808G4821811K585519K749840K943992L207531L399033L673472L943827M274592
4800A01599617M526318M873281N272663N643401O111434O625314P153137P780047
4792A49585212Q417174R137135R908981J0628550J1450315J2257641J3048289
4785B24433297J3735325J4275433J4646910J4744991J4506585J3900818J2765419
4778C23008778J1018653Q646858N760645K391803j244651m977039q507744j1505722
4770C24591581j3699304j4980026j5376354j5047935j4201594j3208935j1974867
4763B26102566j0753949r633165q487996p439797o520426n656438m876330m191698
4755A68542767l563315k981230k372277j862489j326786q65806l73973O9757N01244
$$ y = [74821811, 77407330, 80157170, 83101162, 86308693, 89707726, 93381198, 97325025, 101599617, 106125935, 110999216, 116271879, 121915280, 128026714, 134652028, 141805165, 149585212, 158002386, 167139521, 177048502, 187677052, 199127367, 211385008, 224433297, 238168622, 252444055, 267090965, 281835956, 296342541, 310243359, 323008778, 334027431, 342674289, 348434934, 350826737, 349582086, 344605047, 336097303, 324591581, 310892277, 295912251, 280535897, 265487962, 251286368, 238077433, 226102566, 215348617, 205715452, 197227456, 189787659, 183267233, 177610795, 172734465, 168542767, 164979452, 161998222, 159625945, 157763456, 156436670, 155570864, 155196891, 155266648, 155767892]
4746A55767892R59494J352301J829770K260170K680575L198207L651593M202589
4738A75902591M835476N543557O277461P064879Q012191R022444J0022752J1079460
4730B37760811J2257142J3350191J4459514J5477586J6342110J6976207J7337453
4723C43961014J7319685J6663181J5224948J2940344R865081N934089J350028
4716D23258370l607896q666211j3304368j7005621j9550076k0562847k0441419
4709C20119932j9551921j8210913j6787778j5402759j3938912j2631873j1532177
4702B12063599j0488567r554857q693641p915385p291832o693119o172156n652432
4694A49601610n281386m900834m501699m180682l921909l711904l532266l343908
$$ y = [155767892, 156727386, 158079687, 159909457, 162169627, 164850202, 168048409, 171700002, 175902591, 180738067, 186281624, 192559085, 199623964, 207636155, 216658599, 226681351, 237760811, 250017953, 263368144, 277827658, 293305244, 309647354, 326623561, 343961014, 361280699, 377943880, 393168828, 406109172, 415974253, 421908342, 423258370, 419650474, 410984263, 397679895, 380674274, 361124198, 340561351, 320119932, 300568011, 282357098, 265569320, 250166561, 236227649, 223595776, 212063599, 201575032, 192020175, 183326534, 175411149, 168119317, 161426198, 155254042, 149601610, 144320224, 139419390, 134917691, 130737009, 126815100, 123103196, 119570930, 116227022]
4686A16227022l218853l064575l020532k906806k785569k739948k625778k536948
4678I3328013k356807k301749k170715k049856j924067j830129j779499j676750
4670G7238441j647586j518066j470666j460101j355519j354932j240372j229823
4662F5961376j146765j203308j123105j081078j091849j025220j022761r77531
4654E7289759r29345r30810r12152r12142q32601q42895q73021q14808q22367
4645D9419618p70061p42497q00439q08469p53820p30295p11073p33184o90034
4636D2679746o52667o64889o56269o18488o18579n79766n72511n26364n03749
4627C7286464m74896m99442n37855m94171m71570m49052m14707m35729m65155
$$ y = [116227022, 113008169, 109943594, 106923062, 104016256, 101230687, 98490739, 95864961, 93328013, 90971206, 88669457, 86498742, 84448886, 82524819, 80694690, 78915191, 77238441, 75590855, 74072789, 72602123, 71142022, 69786503, 68431571, 67191199, 65961376, 64814611, 63611303, 62488198, 61407120, 60315271, 59290051, 58267290, 57289759, 56360414, 55429604, 54517452, 53605310, 52772709, 51929814, 51056793, 50241985, 49419618, 48649557, 47907060, 47106621, 46298152, 45544332, 44814037, 44102964, 43369780, 42679746, 42027079, 41362190, 40705921, 40087433, 39468854, 38889088, 38316577, 37790213, 37286464, 36811568, 36312126, 35774271, 35280100, 34808530, 34359478, 33944771, 33509042, 33043887]
4618C3043887m72290m23084m31315m54600m03626m10033m18709l97376k77566
4609B9355288l75923l62846l10962l02050k93371l19405l20304l21964k69213
4600B6479250k93225l07045k52766k14598l14235k45372k45735k38421k45347
4591B4122506k38290j92839k68869k61615k27687k18796k51800k47335k22197
4582B1993078k36933k61892k37107k70539k46635k20538k35516k54288j96446
4573A9833184k08594k31661k23953k41109k40841j88903k13272k19146k25425
4564A7840280k05278j94474k54089k43681k10900k14123k36372j87982k20858
4555A5872523k23336j73705j75921j64579j35806j87942j51637j68948j39955
$$ y = [33043887, 32571597, 32148513, 31717198, 31262598, 30858972, 30448939, 30030230, 29632854, 29355288, 28979365, 28616519, 28305557, 28003507, 27710136, 27390731, 27070427, 26748463, 26479250, 26186025, 25878980, 25626214, 25411616, 25097381, 24852009, 24606274, 24367853, 24122506, 23884216, 23691377, 23422508, 23160893, 22933206, 22714410, 22462610, 22215275, 21993078, 21756145, 21494253, 21257146, 20986607, 20739972, 20519434, 20283918, 20029630, 19833184, 19624590, 19392929, 19168976, 18927867, 18687026, 18498123, 18284851, 18065705, 17840280, 17635002, 17440528, 17186439, 16942758, 16731858, 16517735, 16281363, 16093381, 15872523, 15649187, 15475482, 15299561, 15134982, 14999176, 14811234, 14659597, 14490649, 14350694]
4546A4350694j27679j31109p9518q7451j39686j28657q5994q9818j00199o2430
4536A3318153l0554r5885o6266p0245m4594m5154r5458o3019l1670r3795q3561
4525A2597952l7063q3566r2642j13265p2089q095m2195m5491n9636o1850k3541
4514A1958519n3544m5172n8582j0865r090l2104j2504k1869l9689k0949l5007
4503A1619144n1866k9417j5234L4342n27o0120o6646J407j906l8587n1982n7016
4491A1281592p9548r5221p7177j51716j18041j38858j57835j11806j10238r3457
4481A0147695j37943q8055q2145l7035o5404p9796l1265q1721j9602k9984n7295
4470I437450p3611j6367m1786M203O186O639l7730j944j9888J3513J7111R123
$$ y = [14350694, 14223015, 14091906, 14012388, 13924937, 13785251, 13656594, 13570600, 13480782, 13380583, 13318153, 13287599, 13191714, 13125448, 13055203, 13010609, 12965455, 12869997, 12806978, 12775308, 12681513, 12597952, 12560889, 12477323, 12384681, 12271416, 12199327, 12191232, 12149037, 12103546, 12043910, 11982060, 11958519, 11904975, 11859803, 11801221, 11790356, 11781266, 11749162, 11736658, 11714789, 11675100, 11654151, 11619144, 11567278, 11537861, 11522627, 11556969, 11556442, 11496322, 11429676, 11431083, 11429177, 11390590, 11338608, 11281592, 11202044, 11106823, 11029646, 10877930, 10759889, 10621031, 10463196, 10351390, 10241152, 10147695, 10009752, 9921697, 9839552, 9802517, 9737113, 9657317, 9626052, 9544331, 9524729, 9494745, 9437450, 9363839, 9347472, 9305686, 9309889, 9316075, 9322714, 9284984, 9283040, 9263152, 9276665, 9293776, 9302899]
4458I302899L1296L9820J8459J9146L2919N5480N9933M0863N1690O1979J8372
4447I732856M1785L6858K4715R0139N9549M3836P3415Q8330K2151R2796N1693
4436A0358123L9289R596k2424P898L624o4927q4005j31799j60798j38854j37016
4425I678707j34864j29675j48041j18774j44423j00814j29551r9828j06595p0836
4415H495306q9226o1364q1155l8357m8412q4541q7291n4883o7937j13037n5773
4404G713330k5274o5745p0467n4813n7496o4941q8083n4084o6856q5579n2171
4393G027821l8894m3942n1965p1392n6897n9296r0714o5762j16488o4169o3802
4382F304500n8072o5404o6392r9531n0829k8613n0906m7908r5137m0740j04809
$$ y = [9302899, 9334195, 9374015, 9392474, 9411620, 9444539, 9500019, 9559952, 9600815, 9652505, 9714484, 9732856, 9774641, 9811499, 9836214, 9926353, 9985902, 10029738, 10103153, 10191483, 10213634, 10306430, 10358123, 10397412, 10407008, 10384584, 10392482, 10396106, 10331179, 10247174, 10115375, 9954577, 9815723, 9678707, 9543843, 9414168, 9266127, 9147353, 9002930, 8902116, 8772565, 8672737, 8566142, 8495306, 8406080, 8344716, 8263561, 8225204, 8176792, 8092251, 8004960, 7950077, 7882140, 7769103, 7713330, 7688056, 7622311, 7551844, 7497031, 7439535, 7374594, 7286511, 7232427, 7165571, 7079992, 7027821, 6988927, 6944985, 6893020, 6821628, 6764731, 6705435, 6614721, 6548959, 6432471, 6368302, 6304500, 6246428, 6181024, 6114632, 6015101, 5964272, 5935659, 5884753, 5836845, 5741708, 5700968, 5596159]
4371E596159p1077q2112o9400l0916m5905j12719l0353p6772n6982q0888o7194
4360D871841k5327o0467o8742n1095o6165p0770m6560m0352k5194o7142o1020
4349D289007j0617n7282q53q0152l3548k019p1440n1888o868l798o4383p9391
4337C826768k2937R631Q605l8356o1116m4266m0781n8496q306J9973m0041k7026
4325C523652l0322l4905m4869p2285n7763p680j9771k798j5699P238j2732m7718
4313C184348l2992J479k9370m9367l0190L4221q281n5891l6245l1971j6964k7891
4301B900886k1971k7053J41M943k2745k6857j3713r645k648J4747k2949o4522
4289B708614j739Q322l0163k2691J0285p455j2357j2880J7960k6008J3122k5865
$$ y = [5596159, 5525082, 5442970, 5373570, 5342654, 5296749, 5184030, 5153677, 5076905, 5019923, 4939035, 4871841, 4846514, 4786047, 4717305, 4666210, 4600045, 4529275, 4482715, 4442363, 4417169, 4350027, 4289007, 4278390, 4221108, 4220255, 4140103, 4106555, 4104536, 4033096, 3981208, 3974340, 3970542, 3906159, 3826768, 3803831, 3813462, 3822067, 3783711, 3722595, 3678329, 3637548, 3579052, 3570746, 3590719, 3550678, 3523652, 3493330, 3458425, 3413556, 3341271, 3283508, 3275828, 3256057, 3253259, 3237560, 3244798, 3232066, 3184348, 3151356, 3152835, 3123465, 3074098, 3043908, 3078129, 3069848, 3013957, 2977712, 2945741, 2928777, 2900886, 2878915, 2851862, 2852003, 2856946, 2834201, 2807344, 2793631, 2783986, 2781338, 2796085, 2773136, 2708614, 2706875, 2715197, 2685034, 2662343, 2672628, 2665173, 2652816, 2639936, 2657896, 2631888, 2645010, 2619145]
4277B619145l7959K8601J7215q445j7611j0326L115o339M468l446l4006l6469
4265B517943j7702J6939j1115j2k2466n3262K3730N523k1408l9846m6974J5739
4253B367089k7259j2364K5043N551k7927k4600j5971j1382j4113j3914J5499L5730
4241B301382l3344j2257l9223j2821n744l189M8690l773o3569J0955J2496l8542
4229B161061l7172M8483j4222J375k2950k377K4749k8866J0468k0823k3245l8952
4217B057529L795N452n427N491J2982K6835l6374j63j9771L211j6411K5778K773
4204B065700l3266r571l6820J8239J6588m3401j1217O973j2984N478j92N013k7668
4191A942872J766j2638J0506j2252j977p273j8513J9460p266J331j7225L0236
$$ y = [2619145, 2581186, 2609787, 2627002, 2618557, 2600946, 2590620, 2593735, 2587396, 2591864, 2588418, 2554412, 2517943, 2500241, 2517180, 2506065, 2506053, 2483587, 2430325, 2454055, 2459578, 2438170, 2398324, 2351350, 2367089, 2339830, 2327466, 2352509, 2358060, 2330133, 2305533, 2289562, 2278180, 2264067, 2250153, 2265652, 2301382, 2268038, 2255781, 2216558, 2203737, 2197993, 2194804, 2243494, 2239721, 2176152, 2187107, 2199603, 2161061, 2123889, 2172372, 2158150, 2159525, 2136575, 2134198, 2158947, 2130081, 2140549, 2119726, 2096481, 2057529, 2061324, 2066776, 2061349, 2066840, 2079822, 2106657, 2070283, 2070120, 2050349, 2053560, 2037149, 2062927, 2065700, 2032434, 2022863, 1986043, 2004282, 2020870, 1977469, 1966252, 1973225, 1960241, 1965719, 1965527, 1970540, 1942872, 1944638, 1932000, 1942506, 1930254, 1928277, 1921004, 1902491, 1921951, 1914685, 1916016, 1898791, 1929027]
4179A929027L0137k3778k773Q02o442M284k6230l6196J5780J7725M0757q065M107
4166A939135M1053m0040j8910M4426q082L2380J8151P27q217P021J6834k281j5761
4153B006436K7032K3637l123m5226l246M5593L1440k3412k5529l256k8206j9224
4141A982916j7451J1436n9818m7765o4209q2202K11l844p7954k8434K8300n145
4129A636041J6991r689k2127o957L454J7175j7527n4858k1797j92l5600p595J5848
4116A513167p5994K1216L4571k1218k6366k183J7500m1370J2294K1085j5957J9032
4104A455777l3750j8951J2310j5819j261L823J1834L5057j0362j3580j1010O783
4092A420851j2620j9447J5791J6496j9817k7581R866R226k8349K288J3778k1049
$$ y = [1929027, 1959164, 1935386, 1932613, 1933415, 1926973, 1931257, 1905027, 1868831, 1884611, 1902336, 1943093, 1935028, 1939135, 1980188, 1940148, 1921238, 1965664, 1957582, 1989962, 2008113, 2008840, 2000623, 2007644, 2024478, 2022197, 2006436, 2033468, 2057105, 2053982, 2008756, 2005510, 2051103, 2082543, 2059131, 2033602, 2030346, 2002140, 1982916, 1965465, 1976901, 1917083, 1869318, 1805109, 1722907, 1723118, 1719274, 1641320, 1612886, 1641186, 1636041, 1653032, 1643343, 1621216, 1614259, 1617713, 1634888, 1617361, 1562503, 1540706, 1540514, 1504914, 1497319, 1513167, 1437173, 1458389, 1492960, 1471742, 1445376, 1443193, 1460693, 1419323, 1431617, 1452702, 1436745, 1455777, 1422027, 1403076, 1415386, 1399567, 1398306, 1402129, 1413963, 1449020, 1438658, 1425078, 1414068, 1420851, 1408231, 1388784, 1404575, 1421071, 1401254, 1373673, 1383539, 1392765, 1364416, 1366704, 1380482, 1359433]
4080A359433k488k9102M2805m8317o402j8887M4670J3402p119q176q028K4316
4068A356107j5755K2476o617J3101J281n1278K7731O50J5813J1884l3553K4581
4056A366421j2887J0970m5078j5593j0004m968j7098M340P718l7095m9408K0040
4044A217358k4374K0742J7450n6451j519L985n3942O279N4181n012k0931l3691
4032A124075Q783L169j2642K4751k6821M3R819M859j2076l2024K8794l2486k2923
4019A065321P975L0592r094j2379n493l381k3373L6916j7120l6464j6551J1792
4007A028741L0100J5854K5648m9277n4691M019q316K8953P480K1045Q088m852
3995A052792j4395j5024m760l3172J190J9648K335L404k356j979J3432Q107N63
$$ y = [1359433, 1356945, 1327843, 1370648, 1322331, 1315929, 1297042, 1341712, 1355114, 1347995, 1339819, 1331791, 1356107, 1340352, 1362828, 1356211, 1369312, 1370593, 1319315, 1347046, 1347696, 1363509, 1375393, 1341840, 1366421, 1353534, 1364504, 1319426, 1303833, 1293829, 1288861, 1271763, 1276103, 1283821, 1246726, 1197318, 1217358, 1192984, 1213726, 1231176, 1174725, 1173206, 1177191, 1123249, 1129528, 1183709, 1178697, 1157766, 1124075, 1132858, 1136027, 1123385, 1148136, 1121315, 1121358, 1131177, 1136036, 1123960, 1091936, 1120730, 1088244, 1065321, 1073296, 1103888, 1094794, 1082415, 1076922, 1073541, 1050168, 1087084, 1069964, 1033500, 1016949, 1028741, 1058841, 1074695, 1100343, 1051066, 996375, 1000394, 992078, 1021031, 1028511, 1049556, 1057644, 1052792, 1038397, 1023373, 1018613, 985441, 986631, 1006279, 1008614, 1012018, 1009662, 1007683, 1021115, 1029222, 1029785]
3982A029785L7334l170m295k0419j585M0874j2132J00M38j5639L912K8470l5968
3969A047705j1792k3942j7791M1749j9674j2876p511k2551k0149j1797J4164k3846
3957I31689j3470p888j8864l55l9549J8020R216j0923r606j6851M0800m1365O789
3944H47643J1065n1598j4782k3945j3075M2577J1896l5624J2341L0615k8111K810
3932G91812J232k1635r402M513J4715j8407k4378j843j6565L578k1064L1314j6570
3919G17300J1436J3428j2854q921K984k6402l735J1900l2942J8455p543Q650j3634
3906F78122L0235r844m626l725k5458j4597l141J1142l8891O2982K4954n3411
3894F53742q665n983J552M0138n645J0485l6945k7742R411L6534J4997q753k4147
$$ y = [1029785, 1067119, 1063949, 1059654, 1039235, 1037650, 1078524, 1066392, 1066492, 1066930, 1051291, 1055203, 1083673, 1047705, 1035913, 1011971, 994180, 1035929, 1016255, 1003379, 995868, 973317, 953168, 941371, 955535, 931689, 918219, 910331, 891467, 891112, 851563, 869583, 878799, 867876, 858270, 841419, 882219, 840854, 847643, 858708, 807110, 792328, 768383, 755308, 797885, 809781, 774157, 786498, 817113, 789002, 791812, 793044, 771409, 762007, 766520, 781235, 762828, 738450, 736607, 720042, 723620, 702556, 733870, 717300, 728736, 742164, 729310, 720389, 723373, 696971, 693236, 705136, 672194, 690649, 683106, 691756, 678122, 708357, 698513, 693887, 690162, 664704, 650107, 646966, 658108, 619217, 682199, 707153, 653742, 645077, 639094, 640646, 680784, 675139, 685624, 648679, 620937, 630348, 666882, 681879, 673126, 648979]
3881F48979l5532R618R25J6118j5851j4933l0927p60L197O249j723K3669Q810
3868F17839k2676k8325j6226J8256q806O7018n129J3824j9032k8655j0054J4816
3856E92850k5630J8796M8600l5131L6287O219m2695L236K6292j8408n9689l6050
3844E14677K355P6425q02k7928J1323K2567L6396m6480O69m0817L555L175K8826
3831E83941J4255r265j9356k4484L0293k53l3889J6330l8883M9365j1886Q848
3819E65016l7396o628J2459R749K0642N256l4671o736J0739q963N425l958K1951
3806E52885m022m6369J2076O608k5837r998K6409K944J576K0046m5983K4164K3996
3793E38495r01l47J7186l9729M0989r023n8495k4621J7732M8165n70m9140J3178
$$ y = [648979, 613447, 623065, 623990, 640108, 624257, 609324, 578397, 577637, 580834, 587083, 585360, 609029, 617839, 595163, 566838, 550612, 568868, 560062, 627080, 621951, 635775, 616743, 588088, 578034, 592850, 567220, 586016, 634616, 599485, 635772, 641991, 599296, 602532, 628824, 610416, 550727, 514677, 517032, 593457, 592655, 564727, 576050, 598617, 635013, 588533, 589202, 548385, 551940, 555115, 583941, 598196, 588931, 569575, 545091, 575384, 575131, 541242, 557572, 518689, 568054, 556168, 565016, 527620, 520992, 533451, 543200, 563842, 569098, 534427, 527691, 538430, 529467, 534892, 530934, 552885, 548863, 502494, 514570, 521178, 495341, 485343, 511752, 514696, 516272, 536318, 490335, 514499, 538495, 537594, 537247, 554433, 514704, 555693, 546670, 488175, 463554, 481286, 529451, 528881, 479741, 492919]
3780D92919l1599M077N0255L6162M0543l8162k0974j5681n060K625K9184j0630
3768E33659r853j4982r326L3715k2074n802R530l6629j0641j5716L3839K9945
3756E15665J7865n19n4518j7850j3196k8496K066L6581R034J3918l772Q711l6175
3743D49314O174j3716M6119k2990L7182m0043l9167K3633p763L0497n6198N168
3731D18210K555M166k3008K7628Q457k3552N281P642q190j2686p372J4240J3139
3718D26510j7155K9355k5225j0181j3751K6133k290Q887l3436J1888n313j6372
3706C79050L5265K0738l538j6089J0946L444L840l089L5372k2570k4789l5804
3694C82776J2164k847k8431K9547j0617j8513K6020K5264j8344j9638J8356L0876
$$ y = [492919, 461320, 465397, 515652, 551814, 592357, 554195, 533221, 517540, 512480, 515105, 544289, 533659, 523806, 508824, 499498, 533213, 511139, 505337, 514867, 478238, 467597, 451881, 485720, 515665, 533530, 533011, 478493, 460643, 447447, 418951, 421017, 457598, 466632, 480550, 476778, 485489, 449314, 455488, 441772, 487891, 464901, 502083, 462040, 422873, 446506, 438743, 469240, 413042, 418210, 420765, 424931, 401923, 429551, 438008, 414456, 419737, 427379, 419189, 406503, 399131, 413371, 426510, 409355, 438710, 413485, 403304, 389553, 415686, 413396, 422283, 388847, 400735, 395422, 379050, 414315, 435053, 431515, 415426, 426372, 429816, 433656, 430567, 465939, 443369, 418580, 382776, 394940, 392093, 363662, 393209, 382592, 364079, 390099, 415363, 397019, 377381, 395737, 426613]
3682D26613Q964l3538K181K4106j4698l3165M6513m2822k3835J6477J6856O289
3670C99941N043j327r195j4745J2732q522k337k0886J9532p868L4944J9132j1474
3657D14970k0172L7212l2021j3966N1710m315M809n675l5555L807L2045r019K8892
3644D52722n614J0744n38j766J3954Q725q900M4464l9275p338Q912Q229l968k3203
3630D57148J33Q482k723k7476q366J7055j063L7364K5163j7852j7270K7152m2188
3617D55559l3759L9175J8027l5864q3R447m2483J8463m028K6233K8017k2670o52
3604D55382m4359L992L3657J284j7952k3204K2593J0671k712j2340n647o697j4710
3591C99958l2832L731J7181K807K0196j4211K3617j637j0967r052k0747j1992
$$ y = [426613, 435577, 402039, 404220, 428326, 413628, 380463, 426976, 384154, 360319, 376796, 393652, 399941, 404984, 403657, 394462, 379717, 392449, 383927, 381590, 360704, 380236, 372368, 407312, 426444, 414970, 394798, 432010, 399989, 386023, 437733, 433418, 438227, 432552, 396997, 400804, 432849, 423830, 452722, 447108, 457852, 457314, 455548, 469502, 478227, 469327, 513791, 474516, 467178, 476090, 484319, 480351, 457148, 457281, 465763, 463040, 435564, 427198, 444253, 443190, 480554, 505717, 487865, 470595, 497747, 455559, 421800, 460975, 479002, 443138, 443055, 452502, 410019, 428482, 424454, 450687, 478704, 456034, 455382, 411023, 415015, 448672, 449956, 432004, 408800, 431393, 442064, 439352, 427012, 421365, 414668, 399958, 367126, 370857, 388038, 390845, 411041, 396830, 420447, 418810, 407843, 398791, 378044, 366052]
3579C66052K3945J2880k5453K4382J4180J860j2096K3272j0780Q870O884J9639
3567D53635K942k3686K7040l0608j3926K1417j1995l6468N4123k3644K882L1921
3555D53633k7132J5881k67p4778N0131M4199J946J0702q908K6367l5854N564L4713
3542D96197J4733k5417k9715j1535K7057O620J7086J1028N912l520K7200k8253
3530E07393j0661J8249J7544J1656M431J7593L0755r169K1482L471k9247M2263
3518F25760J9066j658O15m93P387M854L6898O27J36k3986O887K9985K0080l941
3504G22217j6003K1457N1806J8706k0544r582J3548J4560J9482J8570m036j1895
3492H18286M5733M243p633M4142k629k81k9476K206J0140R843L4760J0291m652
$$ y = [366052, 389997, 402877, 377424, 401806, 415986, 417846, 405750, 429022, 418242, 427112, 433996, 453635, 456577, 432891, 459931, 429323, 415397, 436814, 424819, 388351, 442474, 418830, 421712, 453633, 426501, 442382, 442115, 367337, 417468, 461667, 463613, 474315, 465407, 491774, 455920, 461484, 496197, 510930, 485513, 455798, 444263, 471320, 477940, 495026, 506054, 511966, 508446, 535646, 507393, 496732, 514981, 532525, 544181, 548612, 566205, 596960, 587791, 609273, 612744, 583497, 625760, 644826, 643168, 643783, 643290, 650677, 655531, 692429, 693056, 693192, 669206, 676093, 706078, 726158, 722217, 706214, 727671, 779477, 798183, 777639, 768057, 781605, 796165, 815647, 834217, 830181, 818286, 864019, 868262, 860629, 904771, 902142, 901861, 872385, 874591, 884731, 894574, 929334, 939625, 934973]
3479I34973j3485N543N2036k8322K2914p80L3043j4438n364K1095j24J3520L5261
3466A055872J4351K4781r482K6501O2398M4423K5223L5301n273l4403K6102J3749
3454A279543K8401q387J8775L5270j5819K4475N0200L8284p378J5159k1735p69
3442A436019O9040L1743L7240L0714Q9650K14J3929M8629M3619L424L4453L1756
3430A870430P829M1313L4815M7958L1342L4783L3048J603K9046j1535j1373K9955
3418B139214l0199k9666k2858L700K5582m3589l0575P189O308j9766m5370M441
3406A964411P493m9488j5293k2506m6702l2257k7478l5664l6557j5603m594l3044
3394A652718k7415l4455k6908M542j2311l4517M935J3152k8938J439J1631J3406
$$ y = [934973, 921488, 927031, 979067, 950745, 973659, 972879, 1005922, 991484, 986120, 1007215, 1007091, 1020611, 1055872, 1070223, 1095004, 1085522, 1112023, 1174421, 1218844, 1244067, 1279368, 1274095, 1239692, 1265794, 1279543, 1307944, 1299557, 1318332, 1353602, 1337783, 1362258, 1412458, 1450742, 1443364, 1458523, 1436788, 1436019, 1505059, 1536802, 1574042, 1604756, 1694406, 1694620, 1708549, 1757178, 1800797, 1804221, 1838674, 1870430, 1878259, 1919572, 1954387, 2002345, 2033687, 2068470, 2101518, 2103121, 2132167, 2120632, 2109259, 2139214, 2109015, 2079349, 2056491, 2060191, 2085773, 2042184, 2011609, 2018798, 2025106, 2005340, 1959970, 1964411, 1971904, 1922416, 1907123, 1884617, 1837915, 1805658, 1778180, 1742516, 1705959, 1690356, 1685762, 1652718, 1625303, 1590848, 1563940, 1568482, 1556171, 1521654, 1526589, 1539741, 1510803, 1512242, 1523873, 1537279]
3382A537279p768l3758j5528l1660k4377K9130k5120K4142K147j6279r59k0901
3370A416348k1039m3864J4984J4015k6133p2726m997L89m0783k2236j8134K4332
3358A220156k3224J785P090m6113k3421K0044k8486n9321J4775m289l6214l3321
3346A009461j4733N496j4606j0074l0850j9776j2773j7957k2087o371k5264j1428
3334H29038k6149J1368J7848l1556k8798j8305O721K7902l5476k6120r527K2403
3322G39349K1044k4839n0621j3910L523k8608K075J1608K510l8857J3623J9584
3310F56481k0285q662j6467l7193m330L5615J222l0542l380l0769K0432J0660
3298E72782J3266n416k4892j8315l8656K7565K1390L004K8515l0555k7833K313
$$ y = [1537279, 1529511, 1495753, 1480225, 1448565, 1424188, 1453318, 1428198, 1452340, 1454487, 1438208, 1437249, 1416348, 1395309, 1351445, 1366429, 1380444, 1354311, 1281585, 1276588, 1276977, 1236194, 1213958, 1195824, 1220156, 1196932, 1198717, 1205807, 1159694, 1136273, 1156317, 1127831, 1068510, 1083285, 1078996, 1042782, 1009461, 994728, 1000224, 985618, 975544, 944694, 924918, 912145, 894188, 872101, 865730, 840466, 829038, 802889, 814257, 832105, 800549, 771751, 753446, 760167, 788069, 752593, 726473, 716946, 739349, 760393, 735554, 684933, 671023, 674546, 645938, 648013, 659621, 662131, 623274, 636897, 656481, 636196, 627534, 611067, 573874, 569544, 605159, 606381, 575839, 572459, 541690, 562122, 572782, 586048, 580632, 555740, 537425, 498769, 526334, 547724, 550728, 579243, 548688, 520855, 523168]
3286E23168J3189q914M4191J881K2196p0422k014J5894k2707N638L880j8431l5650
3273D71899K1599K1439k3844j2443J7830J2850J2308m6155l1166P491j901k4182
3261D25725K0920M458k6899J18o41K7263N042k3028J2291j8350j2814j843j4044
3248C98198N660J5846j454m7020m4001J5109J008k1768J2590j26j2929J8086k519
3235C36680K5171K1430q788j9320J1240m3920j9N2833J9605k9846J5148k7232
3223C52982q792k5859j3656Q4J6077N721j8078J1983M755N629j3637R806J2572
3210C39587p395l1625o336J5219L27l4817J4187L0630n623J847o2Q781j3806K7264
3196C38178j7270J6161J0379J1156j803j9672K389K2692q277j1040o420L4156
$$ y = [523168, 536357, 527443, 571634, 573515, 595711, 525289, 523275, 539169, 516462, 522100, 525980, 507549, 471899, 493498, 514937, 491093, 478650, 496480, 509330, 521638, 475483, 444317, 451808, 449907, 425725, 446645, 451103, 424204, 424322, 423681, 450944, 455986, 432958, 445249, 426899, 414085, 412242, 398198, 403858, 419704, 418250, 371230, 327229, 342338, 343346, 321578, 334168, 334042, 321113, 339199, 336680, 361851, 383281, 374493, 355173, 366413, 322493, 322474, 375307, 394912, 365066, 380214, 352982, 344190, 318331, 304675, 304759, 320836, 326557, 308479, 320462, 325217, 330846, 317209, 327015, 339587, 332192, 300567, 294231, 309450, 309777, 274960, 289147, 319777, 314154, 316001, 315939, 324720, 310914, 338178, 320908, 337069, 347448, 358604, 356801, 337129, 339518, 362210, 353933, 342893, 336473, 370629]
3184C70629J3346m0512J1029P55Q394o421m719k6336n856k4432N4699k233l8456
3171C09887L7671L2021m1751p635j8896M0111j6435N161j3675m920r90l1159N314
3158B94704J2215J2599j6079O6560j7002j8823O237J0462O062J6888k2266M2748
3146C94305j1662l2852K4460k5287l5167J9378L9687l8639J4619M94J541M399
3134C55276L1186j4929K1229J020k0111N0820m851m287O631k2940j5386K4965
3122D08623J4188m652J4679K1535k6473J1652k7740L8469L5322o992q039K1898
3110D92470L6396k7465O528Q765R453K3844L997k8157o451N858j088N4645M5572
3097F24367j2471j2743J4681m297L4108M9256J1601k4643P233J5274k7184N2141
$$ y = [370629, 383975, 343463, 354492, 355247, 363641, 357220, 352501, 326165, 320309, 295877, 350576, 348343, 309887, 347558, 379579, 337828, 330193, 311297, 351408, 334973, 340134, 326459, 321539, 320549, 289390, 294704, 306919, 319518, 303439, 369999, 352997, 334174, 340411, 350873, 356935, 373823, 351557, 394305, 382643, 349791, 374251, 348964, 313797, 333175, 372862, 334223, 348842, 349336, 350877, 355276, 386462, 371533, 392762, 393782, 373671, 424491, 419640, 415353, 421984, 399044, 383658, 408623, 422811, 418159, 432838, 454373, 427900, 439552, 411812, 450281, 485603, 478611, 470572, 492470, 528866, 501401, 507929, 516694, 526147, 549991, 553988, 525831, 519380, 525238, 524150, 578795, 624367, 611896, 599153, 613834, 609537, 643645, 692901, 704502, 679859, 687092, 702366, 675182, 727323]
3085G27323L7187J1518Q188K1339J8961J6585N686N506M8178l316o487J5822l5968
3072H70522M5985M009l3003j8596m7219k6937J7465K404k3048q567Q769p0779
3060G21005n6875P733j7859n5503k308j5498k4986l2456k2188J7818l6324j7471
3048D65088j4172m3240n6437K6886K5565m5544m362N13j9578j061l9851L014M2395
3035C39216n1975n364j3785M258K6724M988m3677r411l0986j3951O708l1387K9846
3022B11204K715j8570M615J5737m2885J9948k0231K4110J1152m1170K1966p948
3010A80643o428k8723j2538J7642j8973R367L2418p498n7162J7944R781K3106
2998A59579k7225O917k1265q184K4271j4910j2526r370J0968l308K8436O92j0144
$$ y = [727323, 764510, 776028, 784216, 805555, 824516, 841101, 846787, 852293, 900471, 897155, 890668, 906490, 870522, 916507, 920516, 887513, 868917, 821698, 794761, 812226, 814630, 791582, 783015, 791784, 721005, 664130, 671863, 654004, 598501, 596193, 580695, 555709, 523253, 501065, 518883, 482559, 465088, 450916, 407676, 351239, 378125, 403690, 358146, 353784, 354297, 334719, 333658, 293807, 296821, 339216, 287241, 281877, 268092, 272350, 299074, 304062, 260385, 250974, 219988, 206037, 212745, 181358, 211204, 213919, 195349, 199964, 215701, 172816, 192764, 172533, 196643, 207795, 166625, 188591, 180643, 174215, 145492, 132954, 150596, 131623, 140990, 173408, 165910, 108748, 126692, 136473, 159579, 132354, 139271, 118006, 109822, 134093, 119183, 106657, 97287, 108255, 104947, 133383, 134075, 123931]
2985A23931j465K8349j3895k6415K1479L913j8422l080j8321P704M3340k6603
2973A20515k2305M690j3731M2877l0424k6852O600k0542J7668O674J9821k3387
2961H1604O758j8037L73q704j9783K392J5499o275l7337N7484K8106k1669j3054
2948F7357J71J9778l8612J1828K9174j7830l5434n643J472O704k883K4109j1015
2935D9176m624L3420n5643K1995K5908o715P929o4127p334L7077M865K7193J9334
2922H8454m2337p891O11L6279j4980k6421K4804p709J7100l0932q985j1264M751
2909B1480J2759k500M401M3438m4013j6777L4397L1834O29j8620o18j0317J0330
2896F6423j7923J6773J0927l0697q829K0004J5498j1327n5396P445M9911J631
$$ y = [123931, 122466, 150815, 136920, 110505, 131984, 135897, 117475, 114395, 96074, 103778, 147118, 120515, 98210, 102900, 89169, 132046, 101622, 74770, 81370, 60828, 78496, 85170, 104991, 81604, 88362, 70325, 70698, 61994, 42211, 44603, 60102, 53827, 16490, 73974, 102080, 80411, 67357, 67528, 87306, 48694, 60522, 89696, 71866, 36432, 30789, 32261, 38965, 36082, 60191, 49176, 44552, 77972, 22329, 44324, 70232, 63517, 71446, 7319, -15, 37062, 41927, 69120, 88454, 46117, 38226, 38837, 75116, 60136, 33715, 58519, 50810, 67910, 36978, 27993, 16729, 21480, 34239, 31739, 36140, 79578, 35565, 18788, 53185, 85019, 85648, 67028, 66410, 56093, 66423, 48500, 65273, 76200, 45503, 36674, 56678, 72176, 60849, 5453, 12898, 62809, 64440]
2884F4440m013n84j3096J1941L8280o4688K6906k099K3069k1452J7361k6400K3960
2871G3625K3129J609k6620k3183M7986p972L8161l3043n0139q592J8962k6324
2859B7599j395J1072J2009J2365k3294J4653j0664j067L7803J2872n3073j5532
2847B3348J2847l2081M2106r362l3792J3887J8916K0750l024l555P199p723j3795
2834C5721q896P8257J4644m5375j1606K087K050k6965r197K1035j0434N62K808
2821D4691o754Q990Q303J165j4513L7597k8579m5735J8023K4463O426K381m264
2808E2194J5638L0581l8729J2361k0360o5763K4759L0669l0722J398N195R124
2796B6345j9629k7745L6245J3988j8342J3904J1945m612l0574O161k0717K5845
$$ y = [64440, 60427, 59843, 46747, 58688, 96968, 32280, 59186, 57087, 80156, 58704, 76065, 49665, 73625, 96754, 98363, 71743, 48560, 96546, 88574, 126735, 93692, 43553, 34961, 53923, 27599, 26204, 37276, 49285, 61650, 38356, 53009, 42345, 41278, 79081, 91953, 38880, 23348, 36195, 4114, 46220, 36858, 3066, 16953, 35869, 56619, 53595, 50040, 57239, 49516, 35721, 26825, 105082, 119726, 74351, 62745, 64832, 66882, 39917, 30720, 51755, 41321, 41883, 44691, 37937, 46927, 55230, 56395, 41882, 79479, 50900, 5165, 23188, 47651, 54077, 56458, 52194, 67832, 98413, 59684, 72045, 51685, -14078, 10681, 41350, 10628, 12026, 17221, 26345, 6716, -21029, 15216, 29204, 10862, 24766, 36711, 32099, 1525, 7686, -13031, 12814]
2784A2814m3N0973m4109l6940r314r833M5576j2691n67k1155K9960J6334j1412
2771I593N556j8415r0O692k3722k8159K7662K5037n830K8599l8201Q477J5605
2758A2804l7220J0039K7620j4861R858N947k3658J3774o379n0779J6140J8791
2746a7924J6802L9130j8254k9906M0754R985n3655J0889q958j7955o963L0758
2734e297L957j8154J8886J6878k0423N499k1897j704k5439p900L2602Q277J2280
2721b435j893N305j2836J88J8471j5108J2090O57k3874l6857J2734N9025k0703
2708e236L4986m6447l4043J6767J8997k2044k4448K4736K221k845J6678n7895
2696g8573K0647J1851L1958J5810l1444O562k3612J1299J0847J6167J6045l6474
$$ y = [12814, 12771, 63744, 19635, -17305, -26619, -36452, 9124, -3567, -4134, -25289, 4671, 21005, 9593, 15149, -3266, -3356, 3336, -20386, -48545, -20883, 4154, -1676, 26923, -11278, -2801, 12804, -24416, -14377, 13243, -1618, 8240, 14187, -9471, 4303, -2076, -52855, -36715, -17924, -1122, 38008, 19754, -10152, 30602, 40587, -13068, -2179, -11137, -29092, -36055, -5297, -1340, -19494, -608, 16270, -4153, 1346, -20551, -22255, -47694, -55594, -22992, -14715, -2435, -4328, 977, -11859, -11671, 6800, -8308, 3782, 4439, -19435, -56292, -43558, 15467, -5236, 29750, -16697, -50740, -33973, -14976, -37020, -61468, -36732, -34511, -37356, -20678, -78573, -57926, -46075, -14117, 1693, -29751, -23189, -46801, -35502, -24655, -8488, 7557, -28917]
2684b8917O100L2303j5956o3817k2151O3925J8088l3712K5662o255K6921m1510
2672c9319L4512J8812k1061j2972J732J9918n818K0808l8462k0229k8573L8635
2660c2017J5970M041l5119R165K856J9885k8648K3898p495K5222l4816j9748J0677
2647d6129m157L6340J6230p45j7224L4292j4364K6880q65j0564m1488L8465K740
2634A9411k0563k1788k1098M3153J8820k026l862J0472l6314k7772M995J9649
2622a6923P474j1773J6426j5874R322m232j2066N5L5512r614j341n598j6268l0177
2608e5077Q837J3848j9630L2572N1732m2759O746K1219n3255M2170l0225q004
2596c1826o640J6817l756k4353K9253J0550K1755K6444k371k1518J2784j6548
$$ y = [-28917, -22817, 9486, -6470, -70287, -92438, -28513, -10425, -44137, -18475, -24730, 2191, -39319, -4807, 14005, -7056, -20028, -18296, 1622, -4196, 16612, -21850, -42079, -70652, -32017, -16047, -12006, -47125, -37960, -35104, -15219, -43867, -19969, -27464, -2242, -37058, -56806, -46129, -50286, -13946, 2284, 1539, -15685, 18607, 4243, 31123, 30258, 19694, -21794, 16671, 19411, -1152, -22940, -44038, -885, 17935, 15909, 12047, 22519, -13795, -41567, -36572, -16923, -9449, -21222, -4796, -20670, -11348, -15580, -27646, -27591, 7921, -1693, -3034, -8632, -24900, -55077, -46240, -32392, -52022, -19450, 32282, -10477, -3731, 17488, -35767, 6403, -23822, -31826, -38466, -21649, -25405, -49758, -20505, -9955, 11800, 38244, 35873, 14355, 27139, 10591]
2584A0591m7829k1575l654L1909N4626P748j8424J1274N614l5783j1314o435J8022
2571e230Q007n4142n115L8721J8303K6821k5619k0129N083k0741J7365p524M2035
2558A7835l372l1920j4109N328R818K2052l02k3838K8314k2133m7710J7519K7785
2545a4733K5278p345M479k1438p927p908j843m5321L9613O0497k4803l4023K1298
2532a4176j0175J4318n711L3793j2414l3456j0366J930K4505l163l723J7136R61
2519e41k5333N5162m166k715J7010R282m137n0909O542n176j8145J603J0090k5851
2505c7284K2400r587K074L0421K9307L3063n0135k1334m1140N2538J2199J8412
2493D0934L2199q829l6190n839M616M0708L7494J5225k2610k3203l5089J7225
$$ y = [10591, -37238, -58813, -62467, -30558, 24068, 31816, 13392, 24666, 30280, -5503, -16817, -23252, -5230, 2777, -51365, -56480, -17759, 544, 27365, 1746, -18383, -13300, -34041, -16676, -24200, 17835, 14463, -17457, -31566, -26238, -16420, 5632, 5330, -18508, 9806, -12327, -60037, -42518, -14733, 10545, 3200, 7679, -13759, -21686, -29594, -31437, -76758, -37145, 23352, -1451, -35474, -14176, -24351, -10033, -15744, 18049, 5635, -27821, -38187, -36257, -11752, -14915, -18638, -1502, -541, -25874, 29288, 25122, 22407, 39417, 48699, 44562, -6347, 195, -4981, -23126, -21523, -11433, -37284, -14884, -24471, -22397, 8024, 37331, 70394, 20259, -1075, -42215, 10323, 22522, 40934, 73133, 64304, 28114, 22275, 26891, 67599, 105093, 120318, 97708, 74505, 39416, 56641]
2481E6641Q755J969l1400j3210J1847J7453Q794L979k9626K4348J8465j7309k3257
2468C7449K7970j5916l5752J1006P656L0866K1837P781p180K5039J8832J2389
2456A41977j158Q412j3593j6336K4789j9340P920k1490n156K3128p356j0102N2085
2443A63780J8261J8762J6284n401k4265k178L6905P736j755K8399K6959P000J2016
2430C02503L121K2239j0421L0959j2673K785J6990N9389M94N3467L5064M1000
2418E44917K9139K9151O9649L1147J4401N8795R3002Q9720P8541R1794Q1533R6129
2406A307918J17899J32620J48261J88357J78540J58276K43612K66177K41141K22656
2396C205457K33728K75543K66881K30683J67476N0341j5479j05285j94365l05925
$$ y = [56641, 65396, 67365, 35965, 22755, 34602, 52055, 60849, 64828, 35202, 59550, 78015, 60706, 37449, 65419, 49503, 13751, 24757, 32413, 63279, 85116, 92897, 85717, 110756, 129588, 141977, 140819, 149231, 135638, 119302, 144091, 124751, 132671, 111181, 106025, 129153, 121797, 111695, 163780, 182041, 200803, 217087, 211686, 187421, 185243, 222148, 229884, 228129, 256528, 283487, 290487, 302503, 305624, 327863, 317442, 348401, 335728, 338513, 355503, 414892, 415386, 468853, 503917, 544917, 574056, 603207, 672856, 704003, 718404, 777199, 870201, 959921, 1038462, 1130256, 1211789, 1307918, 1425817, 1558437, 1706698, 1895055, 2073595, 2231871, 2475483, 2741660, 2982801, 3205457, 3439185, 3714728, 3981609, 4212292, 4379768, 4430109, 4414630, 4309345, 4114980, 3809055]
2386C809055l70076l44468k85179k89981k73371j81529j60380j67033j14863j56118
2376A466057j18373q0410p4676r6916r5306l1063n2664o9508k8270O079o8633
2365G56317j3722k6271p2337Q697j4808m9650q2124M815N348m1919J159k2384
2353D53121N562k2015k3620m0658M626j8186J5283m3826j9951P720j6225J0659
2341C12490m1426P108M031k7876o67l964n356l1294j9564n014l1356l603L45j4192
2327A39662M535K1757j2815j057K0323j7021j4761J0626j9704o638k0K974k2416
2314A05445P106J4745J4120m0227k2268N977o0003N0761J3085k4713L9244m1576
2302F1696p608R559R403k1860j6361o871K2440J8963k5797l9241L2116L4759j7263
$$ y = [3809055, 3438979, 3094511, 2809332, 2519351, 2245980, 2064451, 1904071, 1737038, 1622175, 1466057, 1347684, 1267274, 1192598, 1095682, 1000376, 969313, 916649, 847141, 818871, 824950, 756317, 742595, 716324, 643987, 652684, 637876, 588226, 506102, 510917, 516265, 474346, 475505, 453121, 458683, 436668, 413048, 372390, 377016, 358830, 374113, 330287, 310336, 318056, 301831, 312490, 271064, 278172, 282203, 254327, 253660, 249696, 244340, 213046, 193482, 188468, 157112, 153509, 153854, 139662, 144197, 165954, 153139, 152082, 172405, 155384, 140623, 151249, 131545, 124907, 124887, 127861, 105445, 112551, 127296, 141416, 101189, 78921, 84898, 24895, 75656, 88741, 64028, 103272, 61696, 54088, 63647, 73050, 51190, 34829, 27958, 50398, 69361, 43564, 4323, 36439, 71198, 53935]
2289E3935o132k1589o596j1507k4214M653L2747m713j2778N676J8623j8347K5577
2276C5335J2347k6293q519j7306K121N832K0154n5680J9111M2304J971K9384j4257
2263D6504m4699P22L0823j5133l7174J7815M5656p027P282k5925J9415j0910Q7
2250B7436J0837R642k7095Q898L252j1917p09p95N473R645j4371k937q933M984
2236A3410K2371n6705J0977K9267l4691N104M1335J745m264J4014j140j4501K067
2223B8989J5317j2187j7346j0699o372L1188l9135J2884k065J197j9462o908K5780
2210A181j4158m0179M6169M725K3627j8016R46J3474l1750k7664K2727N486P467
2197e965J0997l2942M870K4813k7639j881J4237j9248l2638K5834J8364N762J4103
$$ y = [53935, 47803, 26214, 19618, 8111, -16103, -11450, 21297, 16584, 3806, 9482, 28105, 9758, 35335, 47682, 21389, 12870, -4436, -2315, 3517, 23671, -32009, -12898, 29406, 31377, 60761, 46504, 1805, 2527, 33350, 18217, -18957, -1142, 44514, 37487, 44769, 18844, 38259, 27349, 27436, 38273, 47915, 20820, 29718, 32970, 21053, 20344, 19549, 25022, 34667, 20296, 17359, 8426, 13410, 35781, -20924, -9947, 19320, -15371, -10267, 31068, 32813, 28549, 42563, 41423, 26922, 28989, 44306, 32119, 14773, 4074, -2298, 28890, -10245, 2639, 574, 1771, -17691, -24599, 1181, -12977, -53156, -6987, -2262, 21365, 3349, 4295, 17769, -13981, -41645, -18918, -13432, -5965, 5032, -27910, -23040, 1773, -25866, -27747, -13510, -32758, -65396, -39562, -21198, -15436, -1333]
2184a333j3797k4846K48L8009m1290M0783p062l0870k1046K8852R159J1127k3603
2171c5669l5907j0831L0841K3734J3021L4393l4927j5135K3160l7114L1833L5338
2159B2737k5984k3289j3896M9959j1594l5902J378R373k2478p018M8218K7342
2147A8846k5047k9334J9896K6309j5539j7107J249R791j475k7852M2964j2705
2135a0004m980o680N464N45k1158K0926J657l1144J291j4747J7182Q531J6740
2122a6377l382J690j5701J0503J7991O51k5623l481l1504Q333N8867P22J6340
2109A9029p0472P544J461k9191J0602K8265k1613K0282r234J1795L7081j3404
2097g855j5901k932L3922K3271n0322k7557L6184m646J078o313n145L1499Q644
$$ y = [-1333, -15130, -39976, -39728, -1719, -43009, -2226, -9288, -40158, -61204, -32352, -23193, -12066, -35669, -71576, -82407, -51566, -27832, -14811, 19582, -15345, -30480, -7320, -44434, -12601, 22737, -3247, -26536, -40432, 9527, -2067, -37969, -36591, -27218, -49696, -56714, -8496, 18846, -6201, -35535, -15639, 10670, -4869, -21976, -20727, -10936, -12411, -40263, 2701, -10004, -14984, -21664, -16200, -15655, -36813, -15887, -14230, -45374, -44083, -58830, -41648, -33117, -16377, -19759, -18069, -33770, -23267, -5276, -4625, -30248, -33729, -65233, -56900, 1967, 2689, 19029, -51443, -43899, -42438, -71629, -61027, -32762, -54375, -34093, -43327, -31532, 5549, -7855, -23756, -26688, 7234, 30505, -19817, -47374, -11190, -15836, -14758, -21071, -26216, 5283, 13927]
2084A3927j7361j0031K386o875J7316o335l1285l3597K2722L5830k4509j2086
2072d9898K3610j728l6795K6019L2522m1875k1631k92M0219K2987J4953r820r678
2059a1407l820M464J3527m80j8833J5105m246l9464J7729m326K204j5630K9786
2046a5391j0004j7085K9142j4267j9711n954N0209L195n2720J5602k2020J2001
2034d7003J2201J4770K1828j502l6312M5465k5108l1034K3094l1355J9841q306
2022d3421J444o796L8210n084l4326K3986J9785k633N668j2897o765q665L0998
2009d96k1020N990J230j4051j6501j6978M375J5614J1228L8074k515r586j32j8878
1995b3646O370Q125J7075j8359j3132j8986J3377K0184q608J4986k3232k8675
$$ y = [13927, -3434, -13465, -11079, -17954, -638, -6973, -38258, -71855, -49133, -13303, -37812, -49898, -26288, -28016, -64811, -38792, -6270, -48145, -69776, -70068, -29849, -6862, 8091, -1729, -11407, -15227, -10763, 2764, 2284, -16549, -1444, -5690, -45154, -27425, -31751, -29547, -45177, -15391, -25395, -42480, -13338, -27605, -47316, -53270, -3061, 134, -52586, -36984, -59004, -47003, -34802, -20032, 1796, 294, -36018, 9447, -15661, -46695, -23601, -54956, -35115, -43421, -41977, -48773, -10563, -15647, -49973, -25987, -6202, -8835, -3167, -16064, -22829, -31494, -496, -21516, -15526, -14296, -28347, -44848, -61826, -57451, -41837, -30609, 7465, 4950, -4636, -4768, -23646, -17276, -9151, 7924, -10435, -23567, -42553, -29176, -8992, -17600, -2614, -25846, -54521]
1983e4521n4K0864J8448k80l5366k2237k349J3702J7377j0901m922K9138l7078
1970f8179J3217L119J2418J7053n7145M907J7736k7292O904M5601J3720k0540
1958c8481k5495J9662j8575K2600n274j6969J3910M2516J5641j1876J5826J5731
1946B9216l3979N40k5120j6053K4454P214k0820j4972j8839J0513J4071K6519
1934a7256j3002K6666J9575k7404j9109L609k3067L1829k12k054N451J937K4724
1921A1687J3659K0496l8587L279l4145K0237m542n0795N3975N882r84j3115m068
1908a7021l6410K2488j776J2532K6654m1074k7828O0514N884n4495K4345O115
1896b0072Q561J8494k0039k4244K8834j7113N574k0266L1984j246j4661K354J009
$$ y = [-54521, -54575, -33711, -15263, -15543, -50909, -73146, -75495, -61793, -44416, -55317, -60239, -31101, -68179, -54962, -51843, -39425, -22372, -79517, -74610, -56874, -84166, -77262, -31661, -17941, -38481, -63976, -44314, -62889, -40289, -45563, -62532, -48622, -6106, 9535, -2341, 13485, 29216, -4763, -4223, -29343, -45396, -20942, -13728, -34548, -49520, -68359, -57846, -43775, -17256, -30258, -3592, 15983, -11421, -30530, -26921, -49988, -18159, -18371, -20425, -14974, -13037, 11687, 25346, 45842, 7255, 10534, -23611, -3374, -7916, -58711, -4736, 1146, 162, -12953, -17021, -53431, -30943, -32719, -20187, 6467, -34607, -62435, -1921, 3963, -50532, -26187, -20072, -11511, 6983, -13056, -37300, -8466, -25579, -20005, -40271, -8287, -9533, -24194, -21840, -20831]
1883b0831K3828l1486J1453N341l4487O180Q391J8001K240O325l5678J9173K196
1870a9354K938R249R543m3762l3570J3466O4847m7375O843Q1575k213m0453m281
1857b547L2554l0263j7492J2211k6261J1488q644j6282K5054r037m903O325j3742
1844d1539k4709K6690J939L1065m335l0492J4789j1265L5362J3809l8287l516
1832c0489K2508K9702q251m4447o5078L7168J4967m1725M9532L1864k6774j1024
1820d2047j2586K2857j8111K3117L4460l4908j4818j1257M2892J6767l6547M0635
1808A0454k3621l1860l3616R237K0055J2804J8500j6457L5526j0502l2168K8175
1796a3473J0326l5953k0664O741R030l3565L4790J6629l582j625R606J02R960
$$ y = [-20831, 2997, -28489, -17036, -11695, -46182, -40002, -31611, -13610, -11370, -5045, -40723, -21550, -19354, -16416, -7167, 2376, -41386, -74956, -61490, 3357, -44018, -37175, 44400, 42187, 1734, -2547, 30007, -256, -17748, -5537, -31798, -20310, -28954, -45236, -20182, -29219, -34122, -27797, -41539, -66248, -39558, -37619, -6554, -10889, -41381, -26592, -37857, -2495, 11314, -26973, -30489, -7981, 21721, 13470, -30977, -96055, -58887, -43920, -85645, -36113, -4249, -31023, -42047, -54633, -31776, -49887, -26770, 7690, -27218, -42036, -53293, -10401, 6366, -30181, 10454, -13167, -45027, -78643, -69406, -49351, -36547, -18047, -34504, 1022, -9480, -41648, -13473, -3147, -39100, -59764, -53023, -43993, -77558, -42768, -26139, -29721, -31346, -21740, -21638, -11678]
1783a1678m332l0152K4230k0717n872J287J4987J0921J055L0828J7221j7481k2862
1770a2565P88K1955j0150J9216m2176J8382J1322m5793M785L4823l0056j3375
1758d2844J883k5626K1085L1207M1819j8133J689n847l3202R00L2310J1366k9568
1745a2961j0102J4108k2016K5764l0981j6252M8455M017j4549N216o687o94l1348
1732d8030J0402R257J5141n50J377k4997k9162j63j265K5829j588K3688M743L437
1718a1881K3327m355l5688j500K255j1611J3358O286k0308K8009J1559N861j1074
1705e762J0310q454m0809J2543L4442k10Q28j749n509j098K189k6442M506K7015
1691A800j8225k3234k6883J6827J8031K1774J7153q213k4317j4776Q878J2343
$$ y = [-11678, -16010, -46162, -21932, -42649, -48521, -47234, -32247, -21326, -20271, 10557, 27778, 10297, -12565, -11777, 10178, 28, 19244, -22932, -4550, 6772, -39021, -34236, 587, -29469, -42844, -40961, -66587, -45502, -14295, 27524, 9391, 11080, 5233, -27969, -27069, 5241, 16607, -12961, -23063, -8955, -30971, -5207, -36188, -52440, -3985, 32, -14517, -9301, -15988, -16682, -48030, -37628, -28371, -13230, -13780, -12403, -37400, -66562, -66725, -67990, -42161, -43749, -20061, -15318, -11881, 11446, 7091, -28597, -30097, -27842, -39453, -26095, -19809, -40117, -12108, -549, 5312, -5762, 4548, -3906, -44715, -32172, 2270, 2060, 2888, 1139, -4370, -5468, -3279, -29721, -25215, 1800, -16425, -39659, -66542, -49715, -31684, -9910, 7243, -970, -25287, -40063, -31185, -18842]
1679a8842r928k1763j1647J2064K0189J9653K78j6333p88n012K9937M814k541
1666H1J5234m519l8410J1172K663j8850j0918J7663K7612J2244j6985m956l095
1653a1064l704J2271k1850j024K1777J4781k2826n390l626J4134q781P810K4937
1640A7445j3516k1159O652p537q465l6129R374Q478Q534j433Q568R517o662J9383
1626f950p347n3727L1797J9324j4737k3807J9088J0021r418J7276o1457K4590
1614e5347J0647j3631k259K8795l498J3020L0790j137j1697o645k101j1444L8212
1601A3705m065l4827K6320K704j4648j8053N092M006K0095q211K1890L286l9990
1588b2696J3647J7620l1146r520J7722j7430J7460J8123k720L9084j550n5025
$$ y = [-18842, -28770, -50533, -62180, -50116, -29927, -10274, -9996, -26329, -27117, -32129, -2192, 2622, 81, 15315, 10796, -27614, -16442, -13779, -32629, -43547, -25884, 1728, 13972, -3013, -7969, -11064, -14768, -2497, -24347, -25371, -3594, 11187, -11639, -17029, -20655, -6521, -15302, -7492, 17445, 3929, -17230, -10578, -18115, -26580, -62709, -53335, -44857, -36323, -37756, -29188, -19671, -26333, -6950, -14297, -68024, -36227, -16903, -31640, -55447, -36359, -26338, -35756, -18480, -79937, -55347, -44700, -58331, -60590, -31795, -35293, -22273, 8517, 7380, -4317, -10962, -13063, -24507, 13705, 9640, -25187, 1133, 3837, -10811, -28864, -23772, -19766, 329, -7882, 14008, 17294, -22696, -9049, 8571, -22575, -32095, -14373, -31803, -14343, 3780, 1060, 40144, 38594, -16431]
1576a6431J4543j0282j2408j6067j1335K9927K0207J6372J7389m9698L058j5473
1564c0198J6101j3368j7626K5258K6838Q206k4002o779L718j3877J6288J8070
1552H629m9546m30J3760K676l101o835M2101O044k3083K43K329j4948M5705M329
1538B7873m3813K2611J55j6337r414L526k4499M3837l9942N275K0936l690q78
1525a4360j8983m0812J1458L8117M9344J5001j8660j77k7577J7621m483j3586
1513g097K4063J5043J2620l8613J3467Q556l4076q212q654k4063N392P496q144
1500d2222m277l221L9622j8911j9791L608K7000L2447k1784k2603J5684o654j8412
1487c9514K4564k0532J0994q63J8213L4653j5432J8942l7145o240K3618j8524
$$ y = [-16431, -1888, -12170, -24578, -40645, -51980, -22053, -1846, 14526, 31915, -17783, -14725, -30198, -14097, -27465, -45091, -19833, 7005, 15211, -8791, -15570, -11852, -25729, -9441, 8629, -40917, -41347, -27587, -24911, -28012, -34847, 7254, 13298, -9785, -9542, -7213, -22161, 23544, 27873, -15940, 6671, 6826, -9511, -18925, -15399, -39898, 3939, -36003, -30728, -9792, -13482, -14360, -33343, -74155, -62697, -24580, 24764, 39765, 21105, 20928, -6649, 10972, 6489, -7097, 16966, 32009, 44629, 6016, 19483, 28039, -6037, -14249, -22903, -46966, -41574, -34078, -42222, -46499, -49720, -10098, -29009, -48800, -45192, -18192, 14255, -7529, -30132, -14448, -21102, -39514, -14950, -35482, -24488, -25351, -7138, 27515, 12083, 31025, -6120, -12360, 11258, -7266]
1475g266r376K9404j0637k4917j5849J6666o053k1088M048L3174M462o652J3072
1462a012J1748j4402J0851l804j3708J4195J4034j8363j3673O426l3216L07N2884
1449A2267j3580K093l140j2403l469m360J8535K166k7052P872n761J5155L8701
1436B7024l7479j1767N230K3725M563j0587j4710J0434k5947l9981k08J6141L4000
1423a9562l787J253J5385L0459j2860n9165l33L2428j814j5796K5629P2969r267
1410E5539m0298l8210J4658J6474r519J8578l3747J7270l4236k854p417M1769
1398a993J0121K203J6673J5214J3797l0408j5658o091l523k2714j0580K324L3382
1385B747K2109n6146M5973J7881m2213o693J4426K059J2529L752k4685R712L957
$$ y = [-7266, -16642, 12762, 2125, -22792, -38641, -21975, -28028, -49116, -45068, -11894, -7432, -14084, -1012, 10736, -3666, 7185, 3381, -10327, 3868, 17902, -461, -14134, -7708, -40924, -40617, 12267, -1313, 780, -2360, -14763, -18232, -22592, -4057, -1891, -28943, -21071, -26832, -11677, 27024, -10455, -22222, -16992, 6733, 11296, 709, -14001, -3567, -29514, -69495, -69703, -53562, -19562, -23349, -22096, -6711, 23748, 10888, -48277, -48610, -16182, -17996, -33792, -8163, 64806, 55539, 15241, -22969, -8311, 8163, -1356, 17222, -16525, 745, -33491, -36345, -43762, -1993, 8128, 10331, 27004, 42218, 56015, 25607, 9949, 3858, 335, -22379, -32959, -30635, 2747, 24856, -31290, 14683, 32564, -9649, -16342, -1916, 143, 12672, 16424, -8261, 1451, 5408]
1372E408l3149J7977m463l6621O1148j6581O448L0348j5401l6256L0921J0984
$$ y = [5408, -27741, -9764, -14227, -50848, 10300, -6281, 167, 30515, 15114, -21142, 9779, 20763]
$$ [...]
##END NTUPLES=NMR SPECTRUM
##END=
