##TITLE=1H_CA-8927-1
 CDCl3,8 sc, 
 20.9.2021
##JCAMPDX= 6.0         $$ Bruker NMR JCAMP-DX V2.0
##DATA TYPE= NMR SPECTRUM
##DATA CLASS= NTUPLES
##ORIGIN= UXNMR, Bruker Analytische Messtechnik GmbH
##OWNER= root
$$ XWIN-NMR		Version 3.5
$$ Mon Sep 20 11:47:09 2021 Russian Standard Time (UT+4h)  she@DPX200
##.OBSERVE FREQUENCY= 200.1314
##.OBSERVE NUCLEUS= ^1H
##.ACQUISITION MODE= SIMULTANEOUS
##.ACQUISITION SCHEME= undefined
##.AVERAGES= 8
##.DIGITISER RES= 18
##SPECTROMETER/DATA SYSTEM= spect
##.PULSE SEQUENCE= zg30
##.SOLVENT NAME= CDCl3
##.SHIFT REFERENCE= (INTERNAL, CDCl3, 0, 16.9412)
##AUDIT TRAIL= $$ (NUMBER, WHEN, WHO, WHERE, WHAT)
$$ ##TITLE= Audit trail, XWIN-NMR		Version 3.5
$$ ##JCAMPDX= 5.01
$$ ##ORIGIN= Bruker BioSpin GmbH
$$ ##OWNER= she
$$ F:/spectra/data/she/nmr/H-F/1/pdata/1/auditp.txt
$$ ##AUDIT TRAIL=  $$ (NUMBER, WHEN, WHO, WHERE, WHAT)
(   1,<2021-09-20 11:45:54.25 +0400>,<she>,<DPX200>,
      <created by zg, POWCHK disabled, PULCHK disabled
       configuration hash MD5:
       00 E9 B6 7A A2 85 ED C7 34 08 36 98 17 FE 4E 26
       data hash MD5: 16K
       84 71 37 70 5F DA A5 7A 5E E7 AC 62 C4 A3 DB DE>)
(   2,<2021-09-20 11:45:56.53 +0400>,<she>,<DPX200>,
      <Start of raw data processing
       efp BC_mod = 2 LB = 0.24 FT_mod = 6 PKNL = 1 PHC0 = -13718.47 PHC1 = 14.4009 SI = 16K 
       data hash MD5: 16K
       0C E6 C9 AE 9C 1A 72 73 DA 89 D2 25 31 93 01 EB>)
(   3,<2021-09-20 11:46:00.23 +0400>,<she>,<DPX200>,
      <abs ABSG = 5 
       data hash MD5: 16K
       C6 83 FC 10 C5 06 02 34 E3 E8 68 02 85 80 85 65>)
(   4,<2021-09-20 11:46:22.17 +0400>,<she>,<DPX200>,
      <pk PHC0 = -3.499777 PHC1 = 7.400002 
       data hash MD5: 16K
       8F 42 82 DF D4 6F 70 51 56 BB D6 95 7E 5D AD E6>)
(   5,<2021-09-20 11:46:25.25 +0400>,<she>,<DPX200>,
      <abs ABSG = 5 
       data hash MD5: 16K
       2E FB 8D B4 24 9C D4 FA B7 E3 D8 82 D9 63 EA F3>)
$$ ##END=
$$ 
$$ hash MD5
$$ DE EB F9 BE A7 57 1C 5F E4 91 FE 02 F7 18 74 62
##$RELAX= 
##$RELAX= 
##$RELAX= 
##$RELAX= 
##$RELAX= 
##$RELAX= 
$$ Bruker specific parameters
$$ --------------------------
##$DU= <F:/spectra>
##$EXPNO= 1
##$NAME= <H-F>
##$PROCNO= 1
##$TYPE= <nmr>
##$USER= <she>
##$AMP= (0..31)
100 100 100 100 100 100 100 100 100 100 100 100 100 100 100 100 100 100 
100 100 100 100 100 100 100 100 100 100 100 100 100 100 
##$AQSEQ= 0
##$AQ_mod= 1
##$AUNM= <au_zg>
##$AUTOPOS= <>
##$BF1= 200.13
##$BF2= 200.13
##$BF3= 200.13
##$BF4= 200.13
##$BF5= 200.13
##$BF6= 200.13
##$BF7= 200.13
##$BF8= 200.13
##$BYTORDA= 1
##$CFDGTYP= 0
##$CFRGTYP= 5
##$CHEMSTR= <none>
##$CNST= (0..31)
1 1 145 1 1 1 1 1 1 1 1 1 1 1 1 1 1 1 1 1 1 1 1 1 1 1 1 1 1 1 1 1 
##$CPDPRG= <>
##$CPDPRG1= <>
##$CPDPRG2= <>
##$CPDPRG3= <>
##$CPDPRG4= <mlev>
##$CPDPRG5= <mlev>
##$CPDPRG6= <mlev>
##$CPDPRG7= <mlev>
##$CPDPRG8= <mlev>
##$CPDPRGB= <>
##$CPDPRGT= <>
##$D= (0..31)
0 1.2 0 0 0 0 0 0 0 0.06 0 0.03 0 0 0 0 0.0002 0 0 0 0 0 0 0 0 0 0 0 0 
0 0 0 
##$DATE= 1632123953
##$DBL= (0..7)
$$ [...]
##$SUBNAM3= <"">
##$SUBNAM4= <"">
##$SUBNAM5= <"">
##$SUBNAM6= <"">
##$SUBNAM7= <"">
##$SUBNAM8= <"">
##$SUBNAM9= <"">
##$SW= 20.0188988654967
##$SWIBOX= (0..15)
0 0 2 0 0 0 0 0 0 0 0 0 0 0 0 0 
##$SW_h= 4006.41025641026
##$TD= 16384
##$TD0= 1
##$TE= 0
##$TE2= 300
##$TE3= 300
##$TEG= 300
##$TL= (0..7)
0 120 120 120 120 120 120 120 
##$TP= (0..7)
150 150 150 150 150 150 150 150 
##$TP07= 0
##$TPNAME0= <>
##$TPNAME1= <>
##$TPNAME2= <>
##$TPNAME3= <>
##$TPNAME4= <>
##$TPNAME5= <>
##$TPNAME6= <>
##$TPNAME7= <>
##$TPOAL= (0..7)
0.5 0.5 0.5 0.5 0.5 0.5 0.5 0.5 
##$TPOFFS= (0..7)
0 0 0 0 0 0 0 0 
##$TUNHIN= 0
##$TUNHOUT= 0
##$TUNXOUT= 0
##$USERA1= <user>
##$USERA2= <user>
##$USERA3= <user>
##$USERA4= <user>
##$USERA5= <user>
##$V9= 5
##$VALIST= <valist>
##$VCLIST= <CCCCCCCCCCCCCCC>
##$VD= 0
##$VDLIST= <DDDDDDDDDDDDDDD>
##$VPLIST= <PPPPPPPPPPPPPPP>
##$VTLIST= <TTTTTTTTTTTTTTT>
##$WBST= 1024
##$WBSW= 4
##$XGAIN= (0..3)
0 0 0 0 
##$XL= 0
##$YL= 0
##$YMAX_a= 740250
##$YMIN_a= -978682
##$ZGOPTNS= <>
##$ZL1= 120
##$ZL2= 120
##$ZL3= 120
##$ZL4= 120
##$ABSF1= 16.97049
##$ABSF2= -3.04855
##$ABSG= 5
##$ABSL= 3
##$ALPHA= 0
##$AQORDER= 0
##$ASSFAC= 0
##$ASSFACI= 0
##$ASSFACX= 0
##$ASSWID= 0
##$AUNMP= <proc_1d>
##$AZFE= 0.1
##$AZFW= 0.1
##$BCFW= 0
##$BC_mod= 2
##$BYTORDP= 0
##$COROFFS= 0
##$CY= -3
##$DATMOD= 1
##$DC= 0
##$DFILT= <>
##$DTYPP= 0
##$F1P= 0
##$F2P= 0
##$FCOR= 1
##$FTSIZE= 16384
##$FT_mod= 6
##$GAMMA= 0
##$GB= 0
##$INTBC= 1
##$INTSCL= 1.334414e-10
##$ISEN= 128
##$LB= 0.24
##$LEV0= 0
##$LPBIN= 0
##$MAXI= 10000
##$MC2= 0
##$MEAN= 0
##$ME_mod= 0
##$MI= 1.114404
##$NCOEF= 0
##$NC_proc= -5
##$NLEV= 6
##$NOISF1= 3.799351
##$NOISF2= 2.8
##$NSP= 0
##$NTH_PI= 0
##$NZP= 0
##$OFFSET= 16.94116
##$PC= 1
##$PHC0= -13721.97
##$PHC1= 21.8009
##$PH_mod= 1
##$PKNL= yes
##$PPARMOD= 0
##$PSCAL= 0
##$PSIGN= 0
##$REVERSE= no
##$SF= 200.130012771557
##$SI= 16384
##$SIGF1= 3
##$SIGF2= 2
##$SINO= 5.538805
##$SIOLD= 16384
##$SREGLST= <1H.CDCl3>
##$SSB= 0
##$STSI= 16384
##$STSR= 0
##$SW_p= 4006.41025641027
##$SYMM= 0
##$S_DEV= 0
##$TDeff= 16384
##$TDoff= 0
##$TI= <>
##$TILT= no
##$TM1= 0
##$TM2= 0
##$TOPLEV= 0
##$USERP1= <user>
##$USERP2= <user>
##$USERP3= <user>
##$USERP4= <user>
##$USERP5= <user>
##$WDW= 1
##$XDIM= 16384
##$YMAX_p= 372354120
##$YMIN_p= -194961
$$ End of Bruker specific parameters
$$ ---------------------------------
##NTUPLES= NMR SPECTRUM
##VAR_NAME=  FREQUENCY,     SPECTRUM/REAL,   SPECTRUM/IMAG
##SYMBOL=    X,             R,               I
##VAR_TYPE=  INDEPENDENT,   DEPENDENT,       DEPENDENT
##VAR_FORM=  AFFN,          ASDF,            ASDF
##VAR_DIM=   16384,         16384,           16384
##UNITS=     HZ,            ARBITRARY UNITS, ARBITRARY UNITS
##FACTOR=    0.244546801953871, 1,           1
##FIRST=     3390.43460759653, 0,            0
##LAST=      -615.97564881374, 0,            0
##MIN=       -615.97564881374, -194961,      0
##MAX=       3390.43460759653, 372354120,    0
$$ Real data points
##PAGE= N=1
##DATA TABLE= (X++(R..R)), XYDATA
$$ [...]
7938B9433679O59390O81316O78830P29838Q44222Q75315Q66384J004190J040731
7929C6813895J114164J237927J312109J336954J515472J560622J686130J749415
7921D8326688J855024J950879J999636K067912K101594K056796K103860K084148
7913F4546537K060163K047145J913236J784427J585056J448727J321931J155720
7905G7862942Q86427O50879M29044J69267k6475l43090m54449p01057r01300r18319
7895G6653869j129733j247396j255872j389922j391691j403452j450672j451457
7887F5933674j405530j321159j300060j334931j233015j281614j132041j099676
7879E5825648j053995j031305r75235r01854q41683p69167p37443o91873p14582
$$ plain form
7938 29433679 30093069 30774385 31453215 32183053 33027275 33902590 34768974 35773164 36813895
7929 36813895 37928059 39165986 40478095 41815049 43330521 44891143 46577273 48326688
7921 48326688 50181712 52132591 54132227 56200139 58301733 60358529 62462389 64546537
7913 64546537 66606700 68653845 70567081 72351508 73936564 75385291 76707222 77862942
7905 77862942 78749369 79400248 79829292 79998559 79972084 79628994 79174545 78473488 77572188 76653869
7895 76653869 75524136 74276740 73020868 71630946 70239255 68835803 67385131 65933674
7887 65933674 64528144 63206985 61906925 60571994 59338979 58057365 56925324 55825648
7879 55825648 54771653 53740348 52765113 51863259 51021576 50252409 49514966 48823093 48108511
7870D8108511n82910o17244n57061m65082n52026m55010m61491m42089m91196
7861D3484402m83022m91111m76250m74328n38700o35201n66624o68471p09036
7852C8441659o88271p58518p16750p49416p81008q47178q30172q69916q23214
7843C1377216q19960q89949j045357o65968p27474q11705o94108o97447o56292
7834B4368956o12659o79694o73687o44857n45739n39303n01753m57309n38576
7825A9175379l76139l74607l63244l64674l43533l41374l25772k62947l08122
7816A6114967k53441l14010l08193k65293j82721k24434k81659j18645k19540
7807A3947031j49021j39635k07254j76030j91141j25132j67563q2080j16447j35289
$$ plain form
7870 48108511 47525601 46908357 46351296 45886214 45334188 44879178 44417687 43975598 43484402
7861 43484402 43001380 42510269 42034019 41559691 41020991 40385790 39819166 39150695 38441659
7852 38441659 37753388 36994870 36278120 35528704 34747696 33900518 33070346 32200430 31377216
7843 31377216 30557256 29667307 28621950 27955982 27228508 26416803 25722695 25025248 24368956
7834 24368956 23756297 23076603 22402916 21758059 21212320 20673017 20171264 19713955 19175379
7825 19175379 18799240 18424633 18061389 17696715 17353182 17011808 16686036 16423089 16114967
7816 16114967 15861526 15547516 15239323 14974030 14791309 14566875 14285216 14166571 13947031
7807 13947031 13798010 13658375 13451121 13275091 13083950 12958818 12791255 12709175 12592728 12457439
7797A2457439j39399j06009o3285j19521j07928l851q0176q5041j04520j35054
7787A1512655j5303p0671n1170m0157j3356n0265j03179m4353q555k8235p5402
7776A1012009k2027n1189m8482J708K5527j888p8725j5234o614O2087l988r7709
7764A0775475q4910N2978O4812l0628n6268j6044K8174k5768j7623M2474N072
7753A0737744p6158j4046p2012P910l3956q9284L2043P5062j0321j13482j2141
7742A0431359K5742p4001o1567n1111k9420K8159m3745j34657q8309k3521k2120
7731I956809o5979r7442o5999n7940m3943j20722n0208j1267k4831n4425j61160
7720I202893o7083q3939p4214q5336j24730o4322p6207o7742j19435m5271o2393
$$ plain form
7797 12457439 12318040 12212031 12148746 12029225 11921297 11917446 11837270 11752229 11647709 11512655
7787 11512655 11497352 11426681 11375511 11335354 11321998 11271733 11168554 11124201 11115646 11087411 11012009
7776 11012009 10989982 10938793 10890311 10892019 10917546 10915658 10836933 10821699 10815085 10877172 10873184 10775475
7764 10775475 10690565 10743543 10808355 10777727 10721459 10705415 10733589 10707821 10690198 10732672 10737744
7753 10737744 10661586 10647540 10575528 10583438 10549482 10460198 10492241 10567303 10556982 10443500 10431359
7742 10431359 10457101 10383100 10321533 10270422 10241002 10269161 10225416 10090759 10002450 9978929 9956809
7731 9956809 9890830 9793388 9727389 9669449 9625506 9504784 9454576 9443309 9418478 9364053 9202893
7720 9202893 9135810 9051871 8977657 8892321 8767591 8703269 8627062 8559320 8439885 8394614 8332221
7709H332221r4716j08069j30930m2570p3385j11446j04162j03963q2231p2960
7699G407789j44895q0452r1451q9780m9078j11847q3066q9306m6174o3546o4425
7688F493769l6535j37327j17709p9377L1784p9191q4724K4690k4403j39820m1618
7677E809539n4004j55775l2499n8951j02493j3420j9109q2895m4985q4204J675
7666E162879k6695o5516q3225m700m539l9244j46563m9910j2986o4550j11356
7655D553595l6771l8323r8478j0029p9657l4870r128m8505o4o3804k092m7957
7643D083917n6852M767j29250l3977P59p9753j351o5409m0876q7381p4875j9275
7631C500444k5469k8637m3657j3573K6012p452j02632l3845n5729j7636k3255
$$ plain form
7709 8332221 8237505 8129436 7998506 7955936 7882551 7771105 7666943 7562980 7480749 7407789
7699 7407789 7262894 7182442 7090991 7001211 6952133 6840286 6757220 6667914 6621740 6558194 6493769
7688 6493769 6457234 6319907 6202198 6122821 6154605 6075414 5990690 6015380 5990977 5851157 5809539
7677 5809539 5755535 5599760 5567261 5508310 5405817 5392397 5373288 5290393 5245408 5161204 5162879
7666 5162879 5136184 5070668 4987443 4982743 4978204 4938960 4792397 4742487 4729501 4664951 4553595
7655 4553595 4516824 4478501 4380023 4369994 4290337 4255467 4246339 4197834 4197770 4133966 4131874 4083917
7643 4083917 4027065 4031832 3902582 3868605 3869364 3789611 3788260 3722851 3681975 3594594 3519719 3500444
7631 3500444 3474975 3446338 3402681 3389108 3415120 3407668 3305036 3271191 3215462 3197826 3174571
7620C174571J694j2462j7941J2182j17217k8005J7231j05647m8631O0800o1816
7609B874759q7278M3049p4079l7159N9109K6218m2645l4712k3090q0129J9675
7598B643718j5663L862L910j3593K9460l6811K5114K3804j3349k3989m399K4993
7586B647057j4030l8502P233o8261J3202j3941o267m615J2201l5002p88n2665
7574B445622l839K2182q7467k7102P757N523n4849k3896P027J8529J1834P3p2473
7561B248921k4427p738j13851k1760M4149l1714j3637L0505o2752p7363O572l0431
7549A946474J2160l6878p748L8187m9364l5323M490p321J4470m98K8651k4562
7537A882738r2177J3426M776p0007j8481q0607J0135P2932J7232M8226j06960
$$ plain form
7620 3174571 3176265 3163803 3145862 3158044 3040827 3012822 3030053 2924406 2875775 2936575 2874759
7609 2874759 2787481 2830530 2756451 2719292 2778401 2804619 2761974 2727262 2704172 2624043 2643718
7598 2643718 2628055 2631917 2635827 2622234 2651694 2614883 2639997 2663801 2650452 2626463 2622064 2647057
7586 2647057 2633027 2594525 2601758 2533497 2546699 2532758 2526491 2521876 2534077 2499075 2498287 2445622
7574 2445622 2441783 2463965 2376498 2349396 2357153 2362676 2307827 2283931 2290958 2309487 2321321 2321394 2248921
7561 2248921 2224494 2216756 2102905 2081145 2125294 2093580 2079943 2110448 2047696 1970333 1976905 1946474
7549 1946474 1958634 1921756 1914008 1952195 1902831 1867508 1871998 1864677 1879147 1878649 1907300 1882738
7537 1882738 1790561 1803987 1808763 1738756 1720275 1639668 1649803 1722735 1739967 1788193 1681233
7526A681233J2479J7734q7855k0709m1314o0913O3479J3313l8740k6771Q2L1563
7514A543581o7844k570N0221o185J2610o8952o1890n078J0575j8977n8827M734
7502A331398K7743L4805j3013K5867p304n3745K6047k2470k3121n3771M53K9101
7490A301990M074m3322O160q226J201K5156K1032k4392r0340K7827r969j6008
7478A195183j6979k665M1774J1298q9931J0173M068L2251J0379k985L4694m5484
7466A181776p4278p873K0302J9645k7784j0031N3915r1554q1914Q1952k7108L12
7454A037360l0504L1149O3662Q82l3656j5765M6603l9391j8123k9916N8658N1056
7442A122015o6792K9327n4556k9897M1013m9678J147P6393M977o1706m231J5170
$$ plain form
7526 1681233 1693712 1711446 1623591 1602882 1561568 1500655 1564134 1577447 1538707 1511936 1512018 1543581
7514 1543581 1475737 1473167 1523388 1517203 1529813 1460861 1398971 1393893 1404468 1385491 1326664 1331398
7502 1331398 1359141 1393946 1380933 1406800 1399496 1345751 1371798 1349328 1326207 1272436 1272889 1301990
7490 1301990 1306064 1262742 1268902 1260676 1261877 1287033 1308065 1283673 1193333 1221160 1211191 1195183
7478 1195183 1178204 1175539 1217313 1228611 1138680 1148853 1152921 1185172 1195551 1192566 1227260 1181776
7466 1181776 1107498 1099625 1119927 1139572 1111788 1101757 1155672 1064118 982204 1064156 1037048 1037360
7454 1037360 1006856 1038005 1101667 1102549 1068893 1053128 1099731 1060340 1042217 1012301 1070959 1122015
7442 1122015 1055223 1084550 1029994 1000097 1041110 991432 992579 1068972 1073949 1012243 1008012 1023182
7430A023182p154j1239N9006j7815n1307M4758J0249p4519j1292K16r529P6836
7418A031392J1838r513j6002R771J8629K9199J0407l2625M875k4740l6311J2937
7406A009857M1850m9710j3293o790k5143k992j0175k7170K8260m6153M3879r203
7394I33217k8192m2042K9002r820k556k439k7354R2652o6380o28Q831j5774l2482
7381H36035J4450o513M7559n0336M9683k7029k1655L2209n1029K0447p2321o5332
7369G06168L8134P174j0854J6293p080J7897l130K7083K0445n5636n9179K7022
7357G24337K5001k2960l3107n098k4865L7155K390l5397M0046l5418j9909L2780
7345F84955m1380K8949K2142j5285N254L9089j3408k9570K1564j5167n3910o726
$$ plain form
7430 1023182 1016028 1004789 1063795 1045980 994673 1039431 1049680 975161 963869 964085 954556 1031392
7418 1031392 1043230 1033717 1017715 1027486 1046115 1075314 1085721 1053096 1057971 1033231 996920 1009857
7406 1009857 1051707 1001997 988704 981914 956771 953779 943604 916434 944694 898541 942420 933217
7394 933217 905025 862983 891985 882165 879609 877170 849816 942468 876088 875460 884291 868517 836035
7381 836035 850485 843972 891531 841195 890878 863849 842194 874403 823374 843821 771500 706168
7369 706168 744302 751476 740622 756915 749835 767732 764602 791685 812130 756494 697315 724337
7357 724337 749338 726378 693271 688173 663308 700463 702853 667456 707502 672084 652175 684955
7345 684955 643575 672524 694666 679381 684635 723724 710316 680746 702310 687143 633233 626507
7333F26507p45K5477m6020M538L5980j4956O1992n2197l5986K1095l5155M3007
7321F33537k6568L2901J7074m5210N1222j8879n8015j3873R719J4075K7640j1520
7309F12103k5035J9156L33n1273L8830m0810l2368M0963m5941J05321L0552q3289
7297E68542m856N0097K196J262j2471J5699k7795o1548P7770l1986K9763l226
7285F03447n3535J1762R49j1089pM524l0543L7961J7094j0663o0837j3449J7647
7272E13261l2376q333K2870L0442l3633r579O6023P830o0232k0568L2791K804
7260E11300p543r401l8887k1443L3402O7295l8264j4535L5206k6435j1844J8425
7248D97276l8151k2161R062K5984M078J0879j274L246l044l0528n954L3673J98
$$ plain form
7333 626507 625762 651239 605219 609757 645737 630781 692773 640576 604590 625685 590530 633537
7321 633537 606969 639870 656944 611734 662956 644077 586062 572189 581908 595983 623623 612103
7309 612103 587068 606224 606557 555284 594114 553304 520936 561899 515958 621279 651831 568542
7297 568542 563686 613783 615979 617241 604770 620469 592674 531126 608896 576910 606673 603447
7285 603447 549912 561674 562623 551534 551527 556051 525508 563469 580563 569900 509063 495614 513261
7272 513261 480885 472552 495422 525864 492231 482652 548675 556505 496273 475705 508496 511300
7260 511300 503757 494356 455469 434026 467428 534723 496459 481924 517130 490695 478851 497276
7248 497276 459125 436964 446026 472010 476088 486967 485693 488939 485895 455367 449413 483086 483284
7235D83284K0846J0545q0070N283J0786J1278K588n541R467n455K5680k2171K2987
7222D89507R35l8871j7385j7478k8216M5219r407j9934L4618j2501K272J0915
7210D39674j5856L8289n1748Q384M3361r859l1659P141j3953m915k3440k1968
7198C63451M3685J0205N834k8297K8744k2302L0311M529l7250j2132J2466P753
7186D06997j714Q396j1189J9540J401O395m3050m3800J2028K3606L3994n1623
7174C60981M7166M8781o3390l6753j1574J4339k0138j8615N1720L43L5560l7705
7162C70715j5671j2477n426N598L7111j0313j0696K3480J5994L6804m4402n4192
7150C36525j7086K8456Q395j9442l9537j4162K1104J3543J2752o534L6209J9431
$$ plain form
7235 483284 504130 514675 434605 439888 450674 461952 464540 458999 468466 463011 488691 466520 489507
7222 489507 490442 451571 434186 416708 388492 433711 424304 404370 438988 426487 428759 439674
7210 439674 423818 462107 410359 418743 462104 452245 420586 427727 413774 408859 385419 363451
7198 363451 407136 417341 423175 394878 423622 401320 431631 436160 398910 386778 399244 406997
7186 406997 405283 413679 402490 422030 423431 429826 386776 342976 355004 378610 412604 360981
7174 360981 408147 456928 393538 356785 345211 359550 339412 320797 372517 372860 408420 370715
7162 370715 355044 342567 337141 342739 379850 369537 358841 382321 398315 435119 390717 336525
7150 336525 319439 347895 356290 336848 297311 283149 304253 317796 330548 324014 360223 379654
7138C79654k6121k3555k4152J170Q000O552K4431L2202k457k0033k393j3279K6762
7125C66781L1761o9340k4736N1099J896J2697k760m7827R647j8957o4039J4797
7113B61019K3602J6511J4070J5648O5049K5196J6929n9242q9976K1228l216K0840
7101C27658J8476m0777j4016P638O2390k5763J953r319J3521l3234k8426M5789
7089C25890J247l2373j1664K3905k6278l9368O6038P2262l9869m1243P971m574
7077C01944k7401L7091Q5339L890q7695j9390M5540k0747l8657K3785K2688j0893
7065C15494m1646J4380j0754j8325n423N3559M3124J4758J1606K7855K760l707
7053D03681m5271k1684q63k804M9201k5008n7192m8378J15706L4443r467L9988
$$ plain form
7138 379654 353533 329978 305826 306996 314996 321548 345979 378181 375724 355691 353298 340019 366781
7125 366781 398542 329202 304466 355565 357461 370158 367398 319571 329218 310261 246222 261019
7113 261019 284621 301132 315202 330850 395899 421095 438024 378782 288806 310034 306818 327658
7101 327658 346134 305357 291341 298979 361369 335606 337559 328240 341761 308527 280101 325890
7089 325890 327137 294764 283100 307005 280727 241359 307397 379659 339790 298547 306518 301944
7077 301944 274543 311634 396973 400863 313168 293778 339318 318571 279914 303699 326387 315494
7065 315494 273848 288228 277474 259149 253726 307285 350409 365167 376773 404628 407388 403681
7053 403681 358410 336726 335863 333059 382260 357252 300060 251682 367388 401831 392364 432352
7041D32352m9743j5959k4812Q897M0561m4224k4667L6892J6350j058l8337k7497
7029C08755K5705J2787j3413m6230P7823K0594N015K3303k2521o7011j2382j3056
7017B99369L9271L442L3985j715k2300k1279j2574P5965K4745k6430k1605J4012
7005C84886p701o597k2743K0487p2720K6701N6736J1047J030O395J8842j3663
6993D02700l4138L224J1743o022j3282L7108M7416k9802m0509j1584r24o562l1556
6980C27812K1740j0462P664N7477K0967p0238P940L0902j7421Q105p220J0508
6968C87774K0641l7687j7207L790L0993K8612j2802k903K9919r541n3850m2845
6956C24894N8733J796k40L0378M3497j5066k9165j7578k7783J9561J8101j7494
$$ plain form
7041 432352 382609 366650 341838 350735 391296 347072 322405 359297 375647 374589 336252 308755
7029 308755 334460 347247 333834 287604 365427 386021 391036 414339 391818 324807 312425 299369
7017 299369 338640 342082 376067 374352 352052 330773 318199 394164 418909 392479 370874 384886
7005 384886 377185 370588 347845 368332 295612 322313 379049 390096 391126 397521 416363 402700
6993 402700 368562 371786 383529 377507 364225 401333 448749 418947 378438 366854 365930 359368 327812
6980 327812 349552 339090 346754 404231 425198 354960 362900 393802 376381 384486 377266 387774
6968 387774 408415 370728 353521 357311 388304 416916 404114 401211 431130 421589 367739 324894
6956 324894 383627 385423 385183 415561 459058 443992 414827 397249 369466 389027 407128 389634
6944C89634O4031n2591o3690M7011o112M4052k4639N4017j2940M995P729o589
6932D44908k941J5587m8524J9827o687K0695l0813J6224J2505k066M07n2336L3486
6919D20272L1651J9321M0784J1016q418o3851m6806P4977k3703K465m4286j3842
6907C99580J8908j235O2424p958r0076l008Q1722k7699J1134K3322M9964p143
6895E09935n8405m5683L2824P659k8907K4238L6358r537k589M4574o2260j750
6883D46457L779L4579R851l2647L8425L5764M7950m1115q4295K0984k6634j3058
6871D40040Q06K4040n9749O487m152M8958M390K8469m411j7108M1819K353l2411
6858D79531l034J5919L7775L0941p1565o860K0505K7397j0367N8915J2004k4382
$$ plain form
6944 389634 453665 401074 337384 384395 378283 422335 397696 451713 438773 443768 451497 444908
6932 444908 441967 457554 409030 428857 422170 442865 412052 428276 440781 438715 439122 386786 420272
6919 420272 451923 471244 512028 523044 514626 450775 403969 478946 455243 457708 413422 399580
6907 399580 418488 417253 479677 471719 381643 378635 460357 432658 443792 467114 517078 509935
6895 509935 451530 405847 438671 446330 417423 441661 478019 468482 465893 510467 448207 446457
6883 446457 450236 484815 494666 462019 500444 536208 584158 543043 458748 479732 453098 440040
6871 440040 440846 464886 405137 411624 407472 456430 460820 489289 484878 467770 509589 511942 479531
6858 479531 476497 492416 530191 561132 489567 482707 503212 530609 520242 579157 591161 566779
6846E66779n7563N3795n2651l6470L9852N7378M513l7232l0366n004O2538M954
6834E70523o611K2933j7044n780l169l8036l6209k6006j9725j9537L7206L286
6822D61831j0503p913M7621L3127k8328k1357L8667l6267K1946N1639k2047M27
6810E28843j878l646j4726M0528J7187r3230K6260P5381j4711Q323l8055r030
6798E21246L8679k4208O9109m8481m4394M5807N3730l5653l1159J7395j3482n737
6786E42852J1722J4451j1233M082k7121l1653k3585q358N6598L6168m7111O5749
6774E82561n6905J0913j941n6330J3734o946j6899m110j5248r45k6030q054j2669
6761D01131J6219O7753p1355k2077O6197j0191l5645j5423J8232M1458j0000L
$$ plain form
6846 566779 509216 563011 510360 473890 513742 571120 575633 538401 508035 503031 565569 570523
6834 570523 563912 586845 569801 564021 560852 522816 486607 460601 440876 421339 458545 461831
6822 461831 451328 443415 491036 524163 495835 474478 513145 476878 498824 550463 528416 528843
6810 528843 526965 523319 508593 549121 566308 473078 499338 574719 560008 568331 530276 521246
6798 521246 559925 535717 604826 556345 511951 557758 611488 575835 544676 562071 548589 542852
6786 542852 554574 569025 557792 561874 534753 503100 479515 471157 527755 563923 516812 582561
6774 582561 525656 536569 534628 478298 492032 485086 468187 464077 448829 447884 421854 413800 401131
6761 401131 417350 485103 413748 391671 457868 447677 412032 396609 414841 456299 446299 446302
6749D46302K336N547J4473J2785j9107j3731K9603r847n1646M8628j3298J556
6737D53601L0124k9609L9309j447k3996m0870J0400M3782J5270m3946o4139K0916
6725D09395j0155K0826Q235l7249q418R0575l5582k242L3511k5490l6030L0414
6713D37790L5512j2714j5580J3085l4639L8236l0718j4878m467O982M2771p3155
6701C88225O1506J6745j2918K771l2762j417K3782M2636j4544l7959L9148l6760
6689D38453j7813K4269M6335p747l949k4500m7378N6438K4973l4101K0826M0568
6677E16374J1883J7949K9159q4486n5356L5533j3236k4514M5345o0428n492j6988
6665C95743P4217m886M836k7660J0706O3196m4591p4805N4111L1647K8996Q064
$$ plain form
6749 446302 448638 454185 468658 481443 462336 448605 478208 468361 416715 465343 452045 453601
6737 453601 483725 454116 493425 491978 467982 427112 437512 481294 496564 452618 388479 409395
6725 409395 399240 420066 428301 391052 382634 473209 437627 435385 468896 443406 407376 437790
6713 437790 473302 460588 445008 458093 423454 461690 430972 416094 411627 418609 461380 388225
6701 388225 449731 466476 453558 456329 423567 422150 445932 488568 474024 436065 475213 438453
6689 438453 420640 444909 491244 483497 479548 455048 407670 464108 489081 454980 475806 516374
6677 516374 528257 546206 575365 490879 435523 471056 457820 433306 478651 418223 412731 395743
6665 395743 469960 465074 469910 442250 452956 516152 471561 396756 450867 482514 511510 519574
6653E19574k4581j6780L1683J9073N1091n291m7813Q06L1808O6783J573N5689
6641F83615o3398j3028k263M9142J8137n3603N3197J2574m962k0274P701J7279
6629F84117l6691L2687Q204P1360J9903M2228k5442M2552M2380K5834O42L1196
6617I38970J6425l8352N9404N1687L0836J7746j9784M5209M8023P5911l9048l2508
6605A154519Q872L4807K7984J7102L2730l153o1288k8262J0315J2110k6979l4148
6593A144609n3646L0210P580m0569K6800J9797j1628j64n790l2281l711K1638
6581A102845M3922J3618m5513o4715q844m867n3404j5576K7994r300j7855k6911
6569I41394M5807Q235m3418J0561n0956j16654J825j1194m4244l7445O7458j4487
$$ plain form
6653 519574 494993 478213 509896 528969 580060 574769 526956 527762 559570 626353 627926 683615
6641 683615 620217 607189 604926 654068 672205 618602 671799 684373 679411 659137 666838 684117
6629 684117 647426 680113 688317 759677 779580 821808 796366 838918 881298 907132 907774 938970
6617 938970 955395 917043 976447 1028134 1058970 1076716 1056932 1102141 1150164 1226075 1187027 1154519
6605 1154519 1163391 1198198 1226182 1243284 1276014 1272861 1211573 1183311 1193626 1205736 1178757 1144609
6593 1144609 1090963 1121173 1128753 1088184 1114984 1134781 1123153 1122989 1117199 1084918 1081207 1102845
6581 1102845 1146767 1160385 1114872 1050157 1041313 1036446 983042 967466 995460 986160 968305 941394
6569 941394 987201 995436 952018 962579 911623 794969 796794 785600 741356 703911 771369 756882
6557G56882R243n0699k1984n0659k6197O3884j1299k0774j9729J1148L7689N712
6545F83217m9870j9245o7894R523N9641l3678J0519k0919l0834K2334k326k4973
6533E35495n106J073m1967L1384o150j2200L0878L9374m403m6946l7658J1524
6521D95298K4982L5666n6981o8705J5025L3297N8761j4034n2297L568M2998J2192
6509E29770n3546k7625m9871J5217O5883k9781K4327m4355M7858l7122m4654J12376
6497E08477m1601L3681J5100m8679k9069j5318O7786q355k4448j4205L1170L2379
6485E06918k1519k027K3404l2768K6405M4507r702M6623l8842o1436m980J9287
6473D95870L0771r217k9435j1790O1261l1794p975O1112m029n9231N5018j4057
$$ plain form
6557 756882 766125 715426 693442 642783 616586 680470 669171 648397 628668 639816 677505 683217
6545 683217 633347 614102 546208 555731 615372 581694 592213 571294 540460 562794 560468 535495
6533 535495 530389 531462 489495 520879 514729 502529 533407 572781 568378 521432 483774 495298
6521 495298 520280 555946 498965 430260 445285 478582 537343 523309 471012 474580 517578 529770
6509 529770 476224 448599 398728 413945 479828 450047 474374 430019 477877 440755 396101 508477
6497 508477 466876 500557 515657 466978 437909 422591 490377 482022 457574 443369 474539 506918
6485 506918 485399 483372 506776 474008 500413 544920 535218 581841 542999 481563 476583 495870
6473 495870 526641 517424 487989 476199 537460 505666 497691 558803 554774 495543 550561 536504
6461E36504k6312J6327K5181K6635l3842J5407r303K304J202k4378J3024L7903
6449E80652l3684J8243K6061p6666K1386k9613J9462N2250j990J3299o5586j2396
6437E11418k4871P6528L9958q3823M49n7195L1465J30091p2782l927M279J9449
6425E71039L0044l3417m5393P338M3949n742j0844L5182k5577m0258P0194j1150
6413E85365l1985K3498j4684N6984o0925k3580r725J0908P1954O559J100j0032
6401F05437J0111n4515m8332M5892q585J1252M4938N4586j5609j1295j5222l3319
6389E85339K8880r791q63j0460j439K8397j5375l4600M4695j9803J3206M5095
6377F53281J2011j7202K5132R094k5121K7983Q314M1144l1469j3517L0002l694
$$ plain form
6461 536504 510192 526519 551700 578335 544493 559900 550597 552901 554103 529725 542749 580652
6449 580652 546968 565211 591272 514606 535992 506379 525841 578091 576101 589400 523814 511418
6437 511418 486547 563075 603033 519210 519659 462464 493929 624020 551238 547311 551590 571039
6425 571039 601083 567666 522273 529611 573560 567818 556974 592156 566579 526321 596515 585365
6413 585365 553380 576878 562194 619178 558253 534673 524948 535856 607810 614369 615469 605437
6401 605437 615548 561033 512701 558593 550008 561260 606198 660784 645175 633880 618658 585339
6389 585339 614219 604428 603565 593105 591666 620063 604688 570088 614783 594980 608186 653281
6377 653281 665292 648090 673222 682316 657195 685178 693492 734636 703167 689650 719652 715958
6365G15958j02089M9295P0925n8093J6991P926j129K3472j22q6181K0529N5785
6353G13267L1620k3920J1595O658j8763J1700J6594J4735j5184M393m3792q086
6341G00817R5817j01836m8666Q7967O607Q1680L6918k4384r5487j2522M2435L276
6329G72622Q26l9557R263q5259J2315N9140K6096k8266L4094J1260o3297j5908
6317F93329o186Q127L812m356k1356L7616L8186m7767l897j4141j4622J4030J5930
6304F98705K4414o491o9l7555O3694o6799M5184J5228K467N364l3549P343n6401
6291F61535Q978k4516L9121k3423J1516L3530Q558o9692L8481J7747j8669k1648
6279F61518j9341M2543M8979J9523J1211J3342n8273K7440Q830k4237M802j683
$$ plain form
6365 715958 613869 663164 734089 675996 692987 700913 699784 723256 723134 636953 657482 713267
6353 713267 744887 720967 732562 739220 720457 732157 748751 763486 748302 752695 708903 700817
6341 700817 796634 694798 646132 734099 740706 822386 859304 834920 739433 726911 769346 772622
6329 772622 773448 733891 743154 657895 670210 729350 755446 727180 761274 772534 709237 693329
6317 693329 687143 695270 699082 694726 673370 710986 749172 701405 697508 683367 668745 682775 698705
6304 698705 723119 716628 716559 679004 742698 675899 721083 736311 738778 744142 710593 717936 661535
6291 661535 670513 645997 685118 661695 673211 706741 715299 645607 684088 701835 683166 661518
6279 661518 642177 684720 733699 753222 764433 777775 719502 746942 755772 731535 736337 734654
6267G34654N4224J732l1025k1882l7630N1273J0008R934j091l4487l48Q963M1418
6254G85743N0535k8354o82m1422M5944N2727j0567m1497M7577l5056k2028L0974
6242H33894j4189J1293o0370L3363K6282j3681J0534j1590n563Q052K4923k3692
6230H19256j8728N3941m446m976l0078j6303j032K37l296o907o430O0874k7122
6217H14990k5064j6173M8298P993r380K6349J5121k1139r961n813k1693M8031
6205H51559K702M1884k6194n461J2886j4727m1857N2280l18J1641l4859M2021
6193H91557M2005M2245m3374k9348J6153l0340M4587M7531k1104L451K3038J047
6181I87448k3471m025m4634N306L8033K1441J3659l9842J8727n1078J05550k5108
$$ plain form
6267 734654 788878 790610 759585 737703 700073 751346 761354 771288 770197 735710 735362 744325 785743
6254 785743 836278 807924 807242 765820 811764 864491 853924 812427 860004 824948 802920 833894
6242 833894 819705 830998 770628 803991 830273 816592 827126 815536 809973 818025 842948 819256
6230 819256 800528 854469 850023 845047 814969 798666 797634 797871 794575 787668 781238 842112 814990
6217 814990 789926 773753 822051 830044 820664 847013 862134 840995 831034 825221 803528 851559
6205 851559 854261 896145 869951 864490 877376 862649 820792 873072 872754 884395 849536 891557
6193 891557 933562 975807 932433 903085 919238 888898 933485 981016 959912 963363 986401 987448
6181 987448 963977 959952 915318 920624 958657 980098 993757 953915 972642 921564 1027114 1002006
6169A002006q4120N6719K5334n867L3208o8372r9807J1692M7897L7273j20l266
6157I52577j1909J0286N1400k3162K226K8951Q8826n3140J2546k3040k3284r646
6145A002631l6278j9113N2382M7442J619N3504Q7k1096m2480o44P4622M133p2921
6132A043888l8818L1745M0097n027M1332J5947j2142J9983j6889K7506K844p5144
6120A075322K2895J21151k2939n2916K2022P4504K3466o5033j9141k792q992L1529
6108A199076k0265j0234K9812p1121O3417m81K4527J2982l2240R593K1795o663
6096A220198J4327m4524M0158K7391l9012K6778K569k9123L1413L2605l2587Q589
6084A258782n446n859O9324n1293P803K7046j2352K0475m8511j6699P4629m4098
$$ plain form
6169 1002006 917886 974605 999939 994072 1027280 958908 859101 870793 918690 955963 955843 952577
6157 952577 940668 950954 1002354 979192 981418 1010369 1099195 1046055 1058601 1035561 1012277 1002631
6145 1002631 966353 947240 999622 1047064 1048683 1102187 1102274 1081178 1038698 1038054 1112676 1116809 1043888
6132 1043888 1005070 1036815 1076912 1071885 1113217 1129164 1117022 1137005 1120116 1147622 1150466 1075322
6120 1075322 1098217 1219368 1196429 1143513 1165535 1240039 1263505 1198472 1179331 1176539 1167547 1199076
6108 1199076 1178811 1168577 1198389 1127268 1190685 1190204 1214731 1227713 1195473 1205066 1226861 1220198
6096 1220198 1234525 1190001 1230159 1257550 1218538 1245316 1247885 1218762 1250175 1282780 1250193 1258782
6084 1258782 1253336 1247477 1316801 1265508 1273311 1300357 1288005 1308480 1259969 1243270 1317899 1273801
6072A273801k5404K3118J3301J1789j8537P0813l4126k7536L6258l5666L0074
6061A317885P880j6732n458P5697j0379p7092K6649K9240j5985L1944k7506n751
6049A330392M0174k6928k3408M1108J1505j3763K0899K2944J5095k5561j4496
6038A377961j6951L9143j3540K0869j4594P3394J1127Q752j7268K5013L564l2717
6026A464753K0412M5600j0123m332o959n275K8829L1350p33o4838O3486J7024
6014A579194J8095n9829j7105K8298j6065P3401M586L7135M7741J359r9308M921
6002A602423K8785K7804l8528j8234J2117n458L3096K4976K3735l199l4846r5251
5990A557420L6854J0300P3658K8451m3577j0209L7414k4484P960K1566M8446r538
$$ plain form
6072 1273801 1248397 1271515 1284816 1296605 1278068 1348881 1314755 1287219 1323477 1287811 1317885
6061 1317885 1325765 1309033 1303575 1379272 1368893 1291801 1318450 1347690 1331705 1363649 1336143 1330392
6049 1330392 1370566 1343638 1320230 1361338 1372843 1359080 1379979 1402923 1418018 1392457 1377961
6038 1377961 1361010 1400153 1386613 1407482 1392888 1466282 1477409 1486161 1468893 1493906 1497470 1464753
6026 1464753 1485165 1530765 1520642 1516310 1509351 1504076 1532905 1564255 1563522 1498684 1562170 1579194
6014 1579194 1597289 1537460 1520355 1548653 1532588 1605989 1610575 1647710 1695451 1696810 1597502 1602423
6002 1602423 1631208 1659012 1620484 1602250 1614367 1608909 1642005 1666981 1690716 1687517 1652671 1557420
5990 1557420 1594274 1604574 1678232 1706683 1663106 1652897 1690311 1665827 1673787 1695353 1743799 1734261
5978A734261l5150L4363k9469J6876R298K2050L6174n9055j3089M6996N4345l3200
5966A784400j5075R344J9879j419N3172N9129j4824J4167j3099K770N775N9866
5954A964085k965M4697P910L7382K6618j1879K7857M0722m8471q733M8137O97
5942B126057M0101M4648L1696l6501K5307O99L73L3918M909N5123K781P096j8239
5929B317968J61986K1295j910O3868k5062L9425K5903M2074K3377k5941N9474
5918B702457N1461n571r810N4069P6078L4235L5314N9825O1262j9101J28228N6717
5906C225164j6981L4492K5695Q9428j1265J8768L4751P7893J08820K6441P7758
5895C690964N4504M7182R5142J5120R433Q4470L9735M6316L6511R3187N2081J54206
$$ plain form
5978 1734261 1699111 1733474 1704005 1720881 1730179 1752229 1788403 1729348 1716259 1763255 1817600 1784400
5966 1784400 1769325 1778669 1798548 1797129 1850301 1909430 1894606 1908773 1895674 1898444 1904219 1964085
5954 1964085 1961120 2005817 2013727 2051109 2077727 2065848 2093705 2134427 2085956 2077223 2125360 2126057
5942 2126057 2166158 2210806 2242502 2206001 2231308 2232007 2232380 2266298 2271207 2326330 2329111 2336207 2317968
5929 2317968 2479954 2501249 2499339 2563207 2538145 2577570 2603473 2645547 2668924 2642983 2702457
5918 2702457 2753918 2748347 2738537 2792606 2868684 2902919 2938233 2998058 3059320 3040219 3168447 3225164
5906 3225164 3208183 3242675 3268370 3357798 3346533 3365301 3400052 3477945 3586765 3613206 3690964
5895 3690964 3745468 3792650 3887792 3902912 3912345 3996815 4036550 4082866 4119377 4212564 4264645 4418851
5883D418851J14685K0240O5687J78604R8258P9265J27307J11538P6855R7585J75952
5872E564827K07174J53058J15617N5956K09833J50805J84789K14942J96926J57421
5862G211348J52860K66918K64288K77408K60073J34439K51558K48952J97300K38468
5852I503612J96999J43327J71769J77210J61146Q3661J21581J67056O6340P2560
5842A0865261O5767J0664n0865K713Q594J2676m1675m8653j30552r1771q6676
5831A0515483o5073j12407p4883j19343m5788r9415j15534J420l0167o4235n7053
5820I733005p149j9298k0919J3459m3755M9301K1719K6216O651J08529J21431
5809I989190J20720J10817R5106J72391J52504J87366K20068J92831J44063K04785
$$ plain form
5883 4418851 4533536 4553776 4619463 4798067 4896325 4975590 5102897 5214435 5291290 5388875 5564827
5872 5564827 5772001 5925059 6040676 6096632 6306465 6457270 6642059 6857001 7053927 7211348
5862 7211348 7364208 7631126 7895414 8172822 8432895 8567334 8818892 9067844 9265144 9503612
5852 9503612 9700611 9843938 10015707 10192917 10354063 10437724 10559305 10726361 10792701 10865261
5842 10865261 10931028 10941692 10890827 10893540 10902134 10914810 10873135 10824482 10693930 10602159 10515483
5831 10515483 10450410 10338003 10263120 10143777 10097989 9998574 9883040 9884460 9854293 9790058 9733005
5820 9733005 9725856 9706558 9685639 9699098 9655343 9704644 9726363 9752579 9759230 9867759 9989190
5809 9989190 10109910 10220727 10315833 10488224 10640728 10828094 11048162 11240993 11385056 11589841
5799A1589841K58402K81698K05275J47946K86859K43323J45541K02586K66699
5790A3628170J84884J15456J51482J00721Q9168L9317J1703M4331J2108l2145
5780A4345195r8566q9200j50188k06183k22319j59410j91437k40804k68502l41878
5770A2376708k61262k98955k70189l16313l26634l14113l14387l10749k54936
5761I709170k44286k49076k46159k68537k23307k43837k38568j86825k60231j53470
5751G394874j47698j84670j62112j46528j36890j76196j04478j58789n3576j47476
5741E976461j15806p8901j15318q9072j06634m3650q7676j11801p653p9705o2283
5730E077962p1156l7597J0617q8901l5259j435o8565j9576p6080k1084l0415o698
$$ plain form
5799 11589841 11848243 12129941 12335216 12483162 12770021 13013344 13158885 13361471 13628170
5790 13628170 13813054 13928510 14079992 14180713 14269881 14309198 14320901 14365232 14377340 14345195
5780 14345195 14246629 14157429 14007241 13801058 13578739 13419329 13227892 12987088 12718586 12376708
5770 12376708 12115446 11816491 11546302 11229989 10903355 10589242 10274855 9964106 9709170
5761 9709170 9464884 9215808 8969649 8701112 8477805 8233968 7995400 7808575 7548344 7394874
5751 7394874 7247176 7062506 6900394 6753866 6616976 6440780 6336302 6177513 6123937 5976461
5741 5976461 5860655 5781754 5666436 5577364 5470730 5427080 5339404 5227603 5219950 5140245 5077962
5730 5077962 5006806 4969209 4979826 4890925 4855666 4854231 4785666 4766090 4690010 4668926 4638511 4631813
5718D631813j6813P39N4592j22977M658l3695J0851o8008l9698j8447M588o357
5706D401246M7946k1336l7928p1273j3414M2760Q4826K3244o0183K528j0741j1130
5694D376545J17888J5108L3342K485k0364J3843L7021M8657K6217Q4465n842M0603
5682D769968M5469L0819L9039Q7332J5106O4397Q7269M8571M9705N2253R7718
5671E387646Q4858M5280O5769J22853J25537Q4945J7576J64143J26791R2590J27111
5660F445099J32950J69935J33901J66340J00806J74431J91774K00728J97692K19927
5650H133583J97540J92606K45113K27100K77442K77223L09436K53862K54665L08661
5640A0677231L10032L12748K92384K96380K78447K72615K81988K62021K07356
$$ plain form
5718 4631813 4615000 4615739 4670331 4547354 4552012 4518317 4529168 4461160 4421462 4403015 4407603 4401246
5706 4401246 4449192 4427856 4389928 4318655 4305241 4348001 4432827 4456071 4395888 4398416 4387675 4376545
5694 4376545 4494433 4509541 4542883 4545368 4525004 4538847 4575868 4624525 4650742 4735207 4729365 4769968
5682 4769968 4815437 4846256 4885295 4972627 4987733 5052130 5139399 5187970 5237675 5289928 5387646
5671 5387646 5472504 5517784 5583553 5706406 5831943 5916888 5934464 6098607 6225398 6317988 6445099
5660 6445099 6578049 6747984 6881885 7048225 7149031 7323462 7515236 7715964 7913656 8133583
5650 8133583 8331123 8523729 8768842 8995942 9273384 9550607 9860043 10113905 10368570 10677231
5640 10677231 10987263 11300011 11592395 11888775 12167222 12439837 12721825 12983846 13191202
5631A3191202K73906J73312K51103J53137J46119J59427J18354J39388J35783
5622A4741731L9132L6550k8763J4263r3078n8706l6837r2944l6142j31166j51856
5611A4202184j49610j83260j25256j85997k05839k09081k09677j74880k11839
5602A2546745k12466j99851j34669k06149j57152j77702j25577j17430j83446
5593A1032303r7139o2355j58452q4537j0345m0205n9828k0746m0211O159L9992
5582A0504636L8722p1109N0247O7620J08078M2159P0203R8207M6568N0665K1980
5571A1027976P0238O6304K6391L86M0919K0675J8961k7590M757r624o8196n3293
5559A1117904k7170n1944j39235q1043n8315j67983j32494p4972j54702j13346
$$ plain form
5631 13191202 13465108 13638420 13889523 14042660 14188779 14348206 14466560 14605948 14741731
5622 14741731 14780863 14817413 14788650 14802913 14709835 14651129 14614292 14521348 14485206 14354040 14202184
5611 14202184 14052574 13869314 13744058 13558061 13352222 13143141 12933464 12758584 12546745
5602 12546745 12334279 12134428 11999759 11793610 11636458 11458756 11333179 11215749 11032303
5593 11032303 10935164 10872809 10714357 10629820 10619475 10579270 10519442 10498696 10458485 10464644 10504636
5582 10504636 10543358 10472249 10522496 10590116 10698194 10740353 10810556 10908763 10955331 11005996 11027976
5571 11027976 11098214 11164518 11190909 11191295 11232214 11252889 11271850 11244260 11249017 11239393 11171197 11117904
5559 11117904 11090734 11038790 10899555 10818512 10760197 10592214 10459720 10384748 10230046 10116700
5549A0116700j97112k07047j61053k15524j44614j92200k14605j97363k03607
5540H383575k05837j46921j89316j59558j36342j76164j56472j29975o4500j61903
5530F856587r0784j43932j24261j07116j91802m2342m2403j16882j29168n7062
5520E810835k1596q3075j11278n0795n2354k6123n9069l3372j08518J8240p2730
5509E210165k5246o7484p3582p486j0228L1727n0242m2589n4342r516p329j9007
5497D874841o1023m8402o1712M5896m9617l8729M0645J645j3720k9075o297J0035
5485D664487k258M9154J8477l6284k0168j5852P416K2942k355m4486N0549K3079
5473D714701L614l728K233P025n4148O0535j0668M8041N649l9587K1402k912L35
$$ plain form
5549 10116700 9919588 9712541 9551488 9335964 9191350 8999150 8784545 8587182 8383575
5540 8383575 8177738 8030817 7841501 7681943 7545601 7369437 7212965 7082990 7018490 6856587
5530 6856587 6765803 6621871 6497610 6390494 6198692 6156350 6113947 5997065 5867897 5810835
5520 5810835 5789239 5706164 5594886 5544091 5491737 5465614 5406545 5373173 5264655 5282895 5210165
5509 5210165 5184919 5117435 5043853 5036367 5026139 5057866 5007624 4965035 4910693 4901177 4893848 4874841
5497 4874841 4813818 4765416 4703704 4749600 4699983 4661254 4701899 4703544 4689824 4660749 4654452 4664487
5485 4664487 4662229 4711383 4729860 4693576 4673408 4657556 4664972 4687914 4685559 4641073 4691622 4714701
5473 4714701 4718315 4714587 4716820 4723845 4669697 4730232 4719564 4767605 4773254 4733667 4755069 4752157 4752492
5460D752492q699l1894l0875j3131J4609L5835L99q920M2408P1852j4190J8361
5448D828247M6265K8371L6781M3433M0285L2869N1675Q0379J9345l1884N0875
5437E226641M9396K6275M5459L8064K7151L2298P0199M4310K3776K5470L9451
5426E648490j4960K2435N6593j3972l146R6452N431j2669P6337l0094M5115N230
5414E881242L7676o117M4884j2129l390P2158l3093m7993l9537m8204j8534j2210
5402E814753l4705K4331o0111o384m3206J2458m2436k1977j2987k6624k1201j5422
5390E566489P397O6527r956J6294J4324p2961o2219J3228r867m2097K4141q369
5378E502931j702m1569n5072K4604m8494k9610n5430k3559K4267l2021j0027o6308
$$ plain form
5460 4752492 4743793 4711899 4681024 4667893 4682502 4718337 4718736 4709816 4752224 4824076 4809886 4828247
5448 4828247 4874512 4902883 4939664 4983097 5023382 5056251 5107926 5188305 5207650 5175766 5226641
5437 5226641 5276037 5302312 5347771 5385835 5412986 5445284 5515483 5559793 5583569 5609039 5648490
5426 5648490 5633530 5655965 5712558 5698586 5695440 5791892 5797323 5784654 5860991 5830897 5876012 5881242
5414 5881242 5918918 5912801 5957685 5945556 5942166 6014324 5981231 5933238 5893701 5845497 5826963 5814753
5402 5814753 5780048 5804379 5744268 5737884 5694678 5707136 5664700 5642723 5629736 5603112 5581911 5566489
5390 5566489 5573886 5640413 5630457 5646751 5661075 5588114 5525895 5539123 5529256 5487159 5511300 5502931
5378 5502931 5501229 5459660 5404588 5429192 5380698 5351088 5295658 5272099 5296366 5264345 5254318 5188010
5366E188010M04N86J1364k7907k2379k8155n912j6626L1677o5312j276l0113J8501
5353E052862K0607p1473K918j9959j0832J4234Q812J369K7957k1489K7974K8859
5341E061839j8743J6627n9669J7838J0922M0461J567j4866l6973l0879L079N0297
5329E041500j6780l5700O678L5810O754p7999L2339o6601K5133L8758K3454r7346
5317D916000L4632O8397J9861M3082l4475M4380K1919Q897L0013k5224L4305j9413
5305E142374K6876K5112l0124L8889L8748N8510j3254K0251L5538J7015L2278
5294E392213M7794l5611N0511M0739p164J24335k20j8503L8985O1099m57K7704
5282E721425O2541N5501k5187K1092P8809L1956N3232J5162N1627J6416O2494
$$ plain form
5366 5188010 5188414 5189000 5200364 5172457 5150078 5121923 5116011 5099385 5131062 5065750 5064474 5034361 5052862
5353 5052862 5073469 5001996 5004914 4984955 4974123 4988357 4997169 4998538 5026495 5005006 5032980 5061839
5341 5061839 5043096 5059723 5000054 5017892 5028814 5069275 5070842 5055976 5019003 4988124 4991203 5041500
5329 5041500 5024720 4989020 4995698 5031508 5038262 4960263 4992602 4926001 4951134 4989892 5013346 4916000
5317 4916000 4950632 5019029 5038890 5081972 5047497 5091877 5113796 5122693 5152706 5127482 5161787 5142374
5305 5142374 5169250 5194362 5164238 5203127 5241875 5300385 5287131 5307382 5342920 5359935 5392213
5294 5392213 5440007 5404396 5454907 5495646 5488482 5612817 5612597 5594094 5633079 5694178 5693721 5721425
5282 5721425 5783966 5839467 5814280 5835372 5914181 5946137 5999369 6014531 6066158 6082574 6145068
5271F145068Q1613J9115P74N4616N2765M9345L4222N1820M3689Q9993Q7976n2481
5259F658515K1126J10217N2539O6875K1471K5644J23719N9412Q6302O3097R1836
5248G380753O0226O0311L7248J24330O2380J54271J77449J3301P4152J29742Q8683
5237H362846J49648J47398J23607J35574M2283Q1678J51866J87473J49185J06013
5227I637571J16465J74243K22917K09856K14403J39051K44581J65597J48786K50971
5217A1524441K64250K47073K23125L22335J83895L38172K81498L10195L19535
5208A4014519L10799L38601M15581L73432M08147M33868M73410M81408M67173
5199A7716938N05469M96086N08246N14036N44097N94524O64587O87018N65836
$$ plain form
5271 6145068 6226681 6245796 6246570 6301186 6353951 6403296 6437518 6489338 6533027 6623020 6710996 6658515
5259 6658515 6679641 6789858 6842397 6909272 6930743 6956387 7080106 7139518 7225820 7288917 7380753
5248 7380753 7440979 7501290 7538538 7662868 7725248 7879519 8056968 8070269 8144421 8274163 8362846
5237 8362846 8512494 8659892 8783499 8919073 8961356 9043034 9194900 9382373 9531558 9637571
5227 9637571 9754036 9928279 10151196 10361052 10575455 10714506 10959087 11124684 11273470 11524441
5217 11524441 11788691 12035764 12258889 12581224 12765119 13103291 13384789 13694984 14014519
5208 14014519 14325318 14663919 15079500 15452932 15861079 16294947 16768357 17249765 17716938
5199 17716938 18222407 18718493 19226739 19740775 20284872 20879396 21543983 22231001 22796837
5190B2796837O52349O55546O89396P53772P06002P22953O92787O95822P94180
5181B9159644Q75841P59142P29696P73175Q17936P87572Q49439P87969P27508
5172C6267922P97215P62459P48427P41644O93832O00778O74070O07185N38667
5163D2432199O04789N85847N81573N31681N82859O46098O46954O13597O51025
5154D7876622O86548P97911P90350Q47462Q60807R25280Q64268Q50251Q98165
5145E5397664Q18163Q07736P09342O81805O83183N92346N24021M82545M54492
5136F1151297L70196L58133L47461L72993K87266K52458L03247K21928J92173
5127F3857152K18925J27638Q1972J31265p1153j07357k02133k38970m30049n79796
$$ plain form
5190 22796837 23449186 24104732 24794128 25547900 26253902 26976855 27669642 28365464 29159644
5181 29159644 30035485 30794627 31524323 32297498 33115434 33903006 34752445 35540414 36267922
5172 36267922 37065137 37827596 38576023 39317667 40011499 40612277 41286347 41893532 42432199
5163 42432199 43036988 43622835 44204408 44736089 45318948 45965046 46612000 47225597 47876622
5154 47876622 48563170 49361081 50151431 50998893 51859700 52784980 53649248 54499499 55397664
5145 55397664 56215827 57023563 57732905 58414710 59097893 59690239 60214260 60696805 61151297
5136 61151297 61521493 61879626 62227087 62600080 62887346 63139804 63443051 63664979 63857152
5127 63857152 64076077 64203715 64285687 64416952 64345799 64238442 64036309 63797339 63367290 62787494
5117F2787494o21207o97093q21422r14297r98989j030692j072931j082056j150139
5108E4398668j136999j103081j157429j185270j067928j095515j041564j007933
5100D5602949j006557r10408r65042q77659r26180r05652r35082q53340r20396
5091C7302633q98172r18544p99025q70414p76781q35578p08348p57650p34542
5082C0003579p36209o69006n30643o05114n45155n48780m43821l96478l95215
5073B5133158l01663k78378k74357j81059j49818j44646j45066q4302l3741j5158
5063B3524970Q6662N9635L2600J46171R3990J45128K33379K68928K78249L47843
5053B5217555L49684L40819L77217M32752L98010M58894L60619M12656L52828
$$ plain form
5117 62787494 62166287 61469194 60647772 59733475 58734486 57703794 56630863 55548807 54398668
5108 54398668 53261669 52158588 51001159 49815889 48747961 47652446 46610882 45602949
5100 45602949 44596392 43685984 42720942 41843283 40917103 40011451 39076369 38223029 37302633
5091 37302633 36404461 35485917 34686892 33816478 33039697 32204119 31495771 30738121 30003579
5082 30003579 29267370 28598364 28067721 27462607 26917452 26368672 25924851 25528373 25133158
5073 25133158 24831495 24553117 24278760 24097701 23947883 23803237 23658171 23573869 23540128 23524970
5063 23524970 23611632 23671267 23703867 23850038 23944028 24089156 24322535 24591463 24869712 25217555
5053 25217555 25567239 25908058 26285275 26718027 27116037 27574931 27935550 28348206 28701034
5044B8701034L05634K98113K18373P9431O8206J11798K6269K024n9367j36235
5034B9615280l6421j13196m8346o0320j22067p2415p5800l1994N9164R8748J19557
5023B9332190J69527K12905K42433L84312L65190M16863N83978N97720N85289
5014C2890407O18411O79513O68413P45235O94880O07978O44156O00434N87330
5005C8736757N00720N05717M33540L33815L51242K92861K61289J05488N8340r5075
4995D1484694j20837k19773l18480l58819m51307m60728m59754n47619n42167
4986C8005210n00183m95842m96182m48806m44600l98845l52460k93086k27383
4977C4347823j95135j10566r3295P9224N0666J17046J48911J45731K04896K61364
$$ plain form
5044 28701034 29006668 29304781 29523154 29602585 29670791 29782589 29808858 29810882 29751515 29615280
5034 29615280 29578859 29465663 29417317 29356997 29234930 29162515 29086715 29054721 29113885 29212633 29332190
5023 29332190 29501717 29714622 29957055 30341367 30706557 31123420 31707398 32305118 32890407
5014 32890407 33508818 34188331 34856744 35601979 36296859 36904837 37548993 38149427 38736757
5005 38736757 39237477 39743194 40176734 40510549 40861791 41154652 41415941 41521429 41579769 41484694
4995 41484694 41363857 41144084 40825604 40466785 40015478 39554750 39094996 38547377 38005210
4986 38005210 37505027 37009185 36513003 36064197 35619597 35220752 34868292 34575206 34347823
4977 34347823 34152688 34042122 33948827 34028051 34078717 34195763 34344674 34490405 34695301 34956665
4967C4956665K51077K55507K22628K55148K76326K22607K18729J78276K65416
4958C7102379K37803J53035K42798K05432K68506K78100K92766L77299K89599
4949C9447717M15218M92979N44814N09245P05801P35932Q70546Q87311R32234
4940D5541797J038279J146357J165654J194517J282049J367811J368652J404354
4932E5509470J388623J362724J414122J430979J400428J431425J490584J508850
4924F6937205J475584J427982J476255J345417J329672J358971J358241J327361
4916G8036688J190800J190900J226552J072092J050542J028947R72549R88905
4908H6757975J012689R80039R41653R84947Q59878Q88546Q78577P84398Q87185
$$ plain form
4967 34956665 35207742 35463249 35685877 35941025 36217351 36439958 36658687 36836963 37102379
4958 37102379 37340182 37493217 37736015 37941447 38209953 38488053 38780819 39158118 39447717
4949 39447717 39862935 40355914 40900728 41409973 42115774 42851706 43722252 44609563 45541797
4940 45541797 46580076 47726433 48892087 50086604 51368653 52736464 54105116 55509470
4932 55509470 56898093 58260817 59674939 61105918 62506346 63937771 65428355 66937205
4924 66937205 68412789 69840771 71317026 72662443 73992115 75351086 76709327 78036688
4916 78036688 79227488 80418388 81644940 82717032 83767574 84796521 85769070 86757975
4908 86757975 87770664 88750703 89692356 90677303 91537181 92425727 93304304 94088702 94975887
4899I4975887Q78756Q97667P38220Q06046R49613R30517R46608J026699J011578
4890A03161591J156956J132570J228277J181569J203851J213604J226968J245401
4882A12750787J271978J297179J252667J297532J424970J454764J502302J600991
4874A23853170J660497J746711J820086J827896J887175J908245K050972K145277
4866A38900029K198595K432944K522507K632466K870130L080805L314326L585353
4858A61537155L855783M277189M667672N015697N435786N989951O534151P178662
4850B04492046P782015Q489656R194902J0012458J0749562J1593800J2159591
4843B74474030J2575525J2924708J3035891J2691612J1865521J0536761Q981379
$$ plain form
4899 94975887 95854643 96752310 97490530 98296576 99246189 100176706 101123314 102150013 103161591
4890 103161591 104318547 105451117 106679394 107860963 109064814 110278418 111505386 112750787
4882 112750787 114022765 115319944 116572611 117870143 119295113 120749877 122252179 123853170
4874 123853170 125513667 127260378 129080464 130908360 132795535 134703780 136754752 138900029
4866 138900029 141098624 143531568 146054075 148686541 151556671 154637476 157951802 161537155
4858 161537155 165392938 169670127 174337799 179353496 184789282 190779233 197313384 204492046
4850 204492046 212274061 220763717 229958619 239971077 250720639 262314439 274474030
4843 274474030 287049555 299974263 313010154 325701766 337567287 348104048 357085427
4836C57085427P094566M969753K708047M96327j629331l618241n484539p008305
4828C54613704q405663r558541j0628102j1385014j2011792j2558236j2727456
4821B77338900j2598437j2309753j1907712j1362925j0760386j0027713r451144
4814A98920830q839932q235588p640342p022313o588169o140431n669282n337957
4806A43446816m918092m610415m368573m152130l971565l783243l512232l377519
4798A10753047l194901l011223k949898k837465k643414k581299k359633k292166
4790H8883048k147060k095680k005300j880408j697267j652721j614112j517233
4782G4273267j467276j291228j288197j247776j149576j117981j020946j015660
$$ plain form
4836 357085427 364179993 369149746 371857793 372354120 370724789 367106548 361622009 354613704
4828 354613704 346208041 336649500 326021398 314636384 302624592 290066356 277338900
4821 277338900 264740463 252430710 240522998 229160073 218399687 208371974 198920830
4814 198920830 190080898 181845310 174204968 167182655 160594486 154454055 148784773 143446816
4806 143446816 138528724 133918309 129549736 125397606 121426041 117642798 114130566 110753047
4798 110753047 107558146 104546923 101597025 98759560 96116146 93534847 91175214 88883048
4790 88883048 86735988 84640308 82635008 80754600 79057333 77404612 75790500 74273267
4782 74273267 72805991 71514763 70226566 68978790 67829214 66711233 65690287 64674627
4774F4674627r30874r25075q09827p43698p64847p32976o65361o45869n89378
4765E7866722n46171n21642m88047m32663l58208k80999k24630k20750j34953
4756E4658659k10643Q793J0052j5550P1839l0997n8772j5220Q097o1692j07362
4745E4257204j47840j92832j94608k26997k81741l92662m20440m49777m48826
4736E1501481m79728m95275n69792n46886n86500o81720o39243o26438o26747
4727D6249152o72889o49231p08114p88598p83870p55229p81409p33087p42493
4718C9634232p54012q59207q14239p92531q13759p79200p25011p38475o95225
4709C2662573o79308p18721n95518n78298o69356n68850m42719n18499m33344
$$ plain form
4774 64674627 63743753 62818678 62008851 61265153 60500306 59767330 59101969 58456100 57866722
4765 57866722 57320551 56798909 56310862 55878199 55519991 55238992 55014362 54793612 54658659
4756 54658659 54448016 54456809 54466861 54451311 54523150 54492153 54433381 54418161 54426258 54364566 54257204
4745 54257204 54109364 53916532 53721924 53494927 53213186 52820524 52400084 51950307 51501481
4736 51501481 51021753 50526478 49956686 49409800 48823300 48141580 47502337 46875899 46249152
4727 46249152 45576263 44927032 44218918 43430320 42646450 41891221 41109812 40376725 39634232
4718 39634232 38880220 38021013 37206774 36414243 35600484 34821284 34096273 33357798 32662573
4709 32662573 31983265 31264544 30669026 30090728 29421372 28852522 28409803 27891304 27457960
4700B7457960m33745m57790m36798l54960l32312k71251l61444l31746k89914
4691B4188000k72073k51047k21616k59076j60306j38721k54030k47377k47499
4682B2136255r8997j68904j35912j25957j74534j00425p7342o7781o7192p9578
4672B1039633r8456m6372k1308J2848L4745j346K5832J339L8228J98773J44972
4661B1328888J50841J49992K71302K69923K69017L45382L85413M33897N50055
4652B4154710O07395O73236O89854P40423Q48571Q89770R78987R49270R55261
4643C1487477R26407R45780R79237R33443P86631P72485P57062O14315M74749
4634C8677586M23988L56985L02043K03932J09703K2257p077k4369o534o8739j36660
$$ plain form
4700 27457960 27024215 26566425 26129627 25774667 25442355 25171104 24809660 24477914 24188000
4691 24188000 23915927 23664880 23443264 23184188 23023882 22885161 22631131 22383754 22136255
4682 22136255 22037258 21868354 21732442 21606485 21431951 21331526 21254184 21186403 21119211 21039633
4672 21039633 20941177 20894805 20873497 20886345 20921090 20919744 20945576 20946915 20985143 21183916 21328888
4661 21328888 21479729 21629721 21901023 22170946 22439963 22785345 23170758 23604655 24154710
4652 24154710 24762105 25435341 26125195 26865618 27714189 28603959 29582946 30532216 31487477
4643 31487477 32413884 33359664 34338901 35272344 36058975 36831460 37588522 38202837 38677586
4634 38677586 39101574 39458559 39760602 39964534 40074237 40096494 40089417 40065048 40058514 39989775 39853115
4623C9853115j88506k41555l00877l35567m74093n79123m87935o57679p83378
4614C5804402p69663q54128r81334r94319j001418j074872j039410j016407j069574
4605B7003277j075868j036823r86958r54951q86280q05381q34631p86338p02404
4596A8933643o62296o41463n55651n53780m93690l74150l94753m38198l01109
4587A4518553l04840k85559k65861k98717k20953k25499k69319k37200j68130
4578A2242475j94445j16468r8469j61704j58379n6367j10006j72838l6489m1218
4568A1096092n2454p6611j29177o7409r993R902j6666m5717o8702l5536o9539
4557A0534190j13191r0160j43726r4543j27821j46866j29807j25693j77830j80629
$$ plain form
4623 39853115 39664609 39423054 39122177 38786610 38312517 37733394 37245459 36587780 35804402
4614 35804402 35034739 34180611 33199277 32204958 31203540 30128668 29089258 28072851 27003277
4605 27003277 25927409 24890586 23903628 22948677 22062397 21257016 20422385 19636047 18933643
4596 18933643 18271347 17629884 17074233 16520453 16026763 15652613 15257860 14819662 14518553
4587 14518553 14213713 13928154 13662293 13363576 13142623 12917124 12647805 12410605 12242475
4578 12242475 12048030 11931562 11833093 11671389 11513010 11456643 11346637 11173799 11137310 11096092
4568 11096092 11043638 10967027 10837850 10770441 10760448 10770350 10753684 10707967 10639265 10603729 10534190
4557 10534190 10420999 10330839 10187113 10092570 9964749 9817883 9688076 9562383 9384553 9203924
4547I203924j57749j64743j88211j48202j46539k01088j47823j33402j32392j39414
4537G644361j01081j54279j03822j92165j05118j21787q4219l6531j47724p0102
4527F527533m0568q4991m7788p0501j74431o2595l2512j27294o634j0399j37850
4516E731970p3148K3395n2629k2782m3580m5242n1547o3067j8763n938p3412k945
4504E302312K6964p8597j10466p1406M3576j7927k9106L530m3095l9776J5369
4493E001378n8329l6544J8177P891m3781p3711k1177J04071o2910j04873q266
4482D721926L4787n0158l8383j1443p1861m5932j3275n027n5406j07202M614q8334
4470D274306n7376n3132m8188k02j02801l0931M0603n8547q4247n1933n7597m5777
$$ plain form
4547 9203924 9046175 8881432 8693221 8545019 8398480 8197392 8049569 7916167 7783775 7644361
4537 7644361 7543280 7389001 7285179 7093014 6987896 6866109 6781890 6745359 6597635 6527533
4527 6527533 6486965 6401974 6354186 6283685 6109254 6046659 6014147 5886853 5880219 5869820 5731970
4516 5731970 5658822 5682217 5629588 5606806 5563226 5517984 5466437 5403370 5384607 5378669 5305257 5302312
4504 5302312 5329276 5250679 5140213 5068807 5112383 5094456 5065350 5068880 5025785 4986009 5001378
4493 5001378 4943049 4906505 4924682 4932573 4888792 4815081 4793904 4897975 4835065 4730192 4721926
4482 4721926 4756713 4706555 4668172 4656729 4584868 4538936 4525661 4520634 4465228 4358026 4362640 4274306
4470 4274306 4216930 4163798 4115610 4115408 4012607 3981676 4022279 3963732 3879485 3827552 3769955 3724178
4458C724178l0650n90j4278m1955k4242j0798o0816K2207p8825n6428Q083r0952
4446C344934o4932l7393n5452N2898j4930k3629p313P459j3532p8799j9047n5511
4434C034753n0613k2461K9532M8025l8588n817o14q322m2470k0104j4210j602
4422B907509O2858p3113r2144L9790l913J4150L0393l4690k7047J1386J3476M6005
4410B894660l3665L475r993J8422j5257m4157l8053p753M7086Q754k1337L3572
4398B835754j0711r3221Q939p357J7409m3922l2938J0848L3378p8274j7056k2649
4386B600200M0486o326n0692r966k1104n7228j9825N6135K159k0995l4073j2881
4374B465890O8275L1911m2595m6309m5067K7662K6516j5714n320N3553l6827k6236
$$ plain form
4458 3724178 3693528 3692938 3678660 3636705 3612463 3601665 3540849 3563056 3484231 3427803 3435886 3344934
4446 3344934 3280002 3242609 3187157 3240055 3225125 3201496 3194183 3201642 3188110 3109311 3090264 3034753
4434 3034753 2984140 2961679 2991211 3039236 3000648 2994831 2994217 2985895 2943425 2923321 2909111 2907509
4422 2907509 2970367 2897254 2805110 2844900 2840987 2855137 2885530 2850840 2823793 2835179 2848655 2894660
4410 2894660 2860995 2864470 2854477 2872899 2857642 2813485 2775432 2767679 2814765 2823519 2802182 2835754
4398 2835754 2825043 2731822 2740761 2733404 2750813 2706891 2673953 2684801 2718179 2639905 2622849 2600200
4386 2600200 2640686 2634360 2583668 2573702 2552598 2495370 2475545 2531680 2533839 2512844 2478771 2465890
4374 2465890 2534165 2566076 2523481 2477172 2432105 2459767 2486283 2470569 2465249 2518802 2481975 2455739
4362B455739j7186K3301P525k1348K6268p34m7973m8391l1862O4035M1679l3442
4350B417611j1129k0974k6861L6009Q262p1919j8208O6014j4269n6287K2792J2903
4338B343944K8374K7117M257q535j2960K904k0201J7348l24k219L5493m9980l8901
4325B326317J1114J9252k5365M3724K0019k0945J3375j6272M7499J6970o7732
4314B367956j954J04879n6718j1552m1415J7577j7662l0645M8842%K9226k6353
4302B382181L1547J1351R271k7177J4961K3040O3915Q861L0888J4191q801K3693
4290B577921M7662N4942L3326N1156N0725N6442L0491k2105N7760J08473P4277
4279C121070Q4736J01735Q1405J18061J93662J90145O1181Q8160J15539J18964
$$ plain form
4362 2455739 2438553 2461854 2469379 2448031 2474299 2473565 2425592 2377201 2345339 2409374 2451053 2417611
4350 2417611 2406482 2385508 2358647 2394656 2402918 2330999 2312791 2378805 2364536 2308249 2331041 2343944
4338 2343944 2372318 2399435 2403692 2395157 2382197 2385101 2364900 2382248 2381924 2379705 2415198 2365218 2326317
4325 2326317 2337431 2356683 2331318 2375042 2395061 2374116 2387491 2371219 2418718 2435688 2367956
4314 2367956 2366002 2470881 2414163 2402611 2361196 2378773 2361111 2330466 2379308 2379308 2408534 2382181
4302 2382181 2413728 2425079 2434350 2407173 2422134 2445174 2509089 2517950 2548838 2563029 2554228 2577921
4290 2577921 2625583 2680525 2713851 2765007 2815732 2872174 2902665 2880560 2938320 3046793 3121070
4279 3121070 3205806 3307541 3388946 3507007 3700669 3890814 3951995 4040155 4155694 4274658
4269D274658L6068K2361M908n780n4131q0559k0599o4458j16561j40192j34328
4258C721387j74379K6169j68561j99922j28318r9527q3404l7131l5863j31670
4248B688781o5623j01019m6763k9323n1114n4087n4620k0944p961m560m4289j6597
4236B191881J7635n1604L4211m1665q6287K3278J3765J2634l2973l24K634k7625
4224B055560J7964k7439J4196o436l6107k32m1094K9680K6307j6270q604j9168
4212A988357n8559R214J6116k7935J4901m5845q3422L4666m3352k4979l3507k7740
4200A717915p213k8759j9859o8158O151L3743m6893m0830K0575j1742J9899j2138
4188A562691m5031m6592P0745M328l5828k0877l3018l2155m0999N1152M0122K4081
$$ plain form
4269 4274658 4310726 4333087 4337995 4332215 4278084 4197525 4176926 4112468 3995907 3855715 3721387
4258 3721387 3547008 3573177 3404616 3204694 3076376 2976849 2893445 2856314 2820451 2688781
4248 2688781 2623158 2522139 2475376 2446053 2394939 2340852 2286232 2265288 2257327 2252767 2208478 2191881
4236 2191881 2209516 2157912 2192123 2150458 2064171 2087449 2101214 2113848 2080875 2080551 2083185 2055560
4224 2055560 2073524 2046085 2060281 2053845 2017738 2017506 1976412 2006092 2032399 2016129 2007525 1988357
4212 1988357 1929798 1939012 1955128 1927193 1942094 1896249 1812827 1847493 1804141 1779162 1745655 1717915
4200 1717915 1710702 1681943 1662084 1593926 1600077 1633820 1586927 1546097 1566672 1554930 1574829 1562691
4188 1562691 1517660 1471068 1541813 1546141 1510313 1489436 1456418 1424263 1383264 1434416 1474538 1498619
4176A498619l4882l0435K7624k5605m1967r820K936M773K8689K1341n6088n0358
4164A334827Q1358n137o0160L2091M82o03n9266j2258m7308L504N942J9696j7188
4151A275980l6166M2039k8371k3873L9949j8840j0624K0233j465l9207l7564K7926
4139A210017m0358m179J9534K5461J0373J6006n352l1190k2651M77j3968l0040
4127A134130j9996N3798K7555N937o9178l8561L5936N1830l5882j6007j7335O364
4115A118591P2017l4584o9155q5692N8029J33M8244K0244m0060J3829k0666p5559
4103A005371K8868M3640K0709q3K1675l4285q0k2696k8439M4551l544n3o2714
4090A012920k530O2496L913r994J2055q3783n382l5318j1555K1954K5964J9427
$$ plain form
4176 1498619 1463737 1433302 1460926 1435321 1393354 1383534 1386470 1391243 1419932 1441273 1385185 1334827
4164 1334827 1416185 1411048 1350888 1382979 1383461 1382858 1323592 1311334 1264026 1267530 1273472 1293168 1275980
4151 1275980 1239814 1281853 1253482 1229609 1269558 1250718 1240094 1260327 1258862 1219655 1182091 1210017
4139 1210017 1169659 1165480 1185014 1210475 1220848 1236854 1231502 1200312 1177661 1178138 1164170 1134130
4127 1134130 1114134 1167932 1195487 1201424 1132246 1093685 1129621 1181451 1145569 1129562 1112227 1118591
4115 1118591 1190608 1156024 1086869 1001177 1059206 1059339 1107583 1127827 1087767 1101596 1080930 1005371
4103 1005371 1034239 1077879 1098588 1098505 1120180 1085895 1085815 1063119 1034680 1079231 1075687 1075634 1012920
4090 1012920 1010390 1072886 1076799 1066805 1078860 995077 989695 954377 942822 964776 990740 1010167
4078A010167j4660K9977J6728j4666j3967n5913o0042K5942L309J2317N5787j0755
4066I84224k667k2762L7330K199n4823L7186r174K9295J2143o5692o127j6444
4054I24688L2940L9091m2135K1792K1806j8550Q708K9020M5492m8347o1307K329
4042I55527J6145K9739p345M2694J0962l7498o3890k4058L1948J7863L3821n2632
4030I53276K5645M0912p9538k2159M3772q2317J6427R629j391q097Q144k1675
4018H82628J1466n6884L2337M2889o0264O152j8422M3101j0045K2638M3476l1701
4006I07371O810N370j0191N0593n6631k2243J1732m932r1190m0810K5081L1772
3994H12732L3787J5307p397k3215j7799J2959J569L9082l3882k2593l664R3905
$$ plain form
4078 1010167 995507 1025484 1042212 1027546 1013579 957666 897624 923566 926875 939192 994979 984224
4066 984224 981557 958795 996125 998324 943501 980687 971513 1000808 1012951 947259 941132 924688
4054 924688 957628 996719 954584 976376 998182 979632 988340 1017360 1062852 1014505 953198 955527
4042 955527 971672 1001411 994066 1036760 1047722 1010224 946334 922276 954224 972087 1005908 953276
4030 953276 978921 1019833 940295 918136 961908 879591 896018 905647 904256 896159 904303 882628
4018 882628 894094 837210 869547 912436 852172 858324 839902 883003 872958 895596 939072 907371
4006 907371 914181 919551 909360 959953 903322 881079 892811 887879 796689 755879 780960 812732
3994 812732 846519 861826 854429 831214 813415 826374 827943 867025 833143 810550 806886 900791
3982I00791l8263k7407n975N211K3139k1555k7312r6388J6602J7050O0859k1733
3970G85019J6475L1494j059l8789O443O1632k5148l5690o3935M9856j3086J5063
3958G88275J23O4158J1378m5636K5586k5435J8370j0941k5486j3575J5756q630
3946G93943l3771O4702K4310l5635j7567O042Q150m9801m265J490K5234l4911
3934G47921M9571N683n2518m426M1153N0640M1797m8126j4621k1105m185J0341
3922H02125n510j7198J6813o268K7271O693l8225l5082j3642K8994K2725K3688
3910H12384k5364L2189k6860K2822m717Q276j0818k2734k2628J1994L7661J3545
3898H25750k2429M9597K789r0221l0446j8979K4561N4687j244M4644p8161L1307
$$ plain form
3982 900791 862528 835121 829146 834357 857496 835941 808629 712241 728843 745893 806752 785019
3970 785019 801494 832988 831929 793140 799583 861215 836067 800377 736442 786298 773212 788275
3958 788275 788398 852556 863934 818298 843884 818449 836819 825878 800392 786817 802573 793943
3946 793943 760172 824874 849184 813549 795982 802024 810174 760373 756108 757598 782832 747921
3934 747921 797492 803175 750657 746231 787384 838024 879821 831695 817074 795969 791784 802125
3922 802125 796615 779417 796230 789962 817233 823926 785701 750619 736977 765971 788696 812384
3910 812384 787020 819209 792349 815171 810454 818730 807912 785178 762550 774544 812205 825750
3898 825750 803321 852918 855707 765486 735040 716061 740622 795309 794065 838709 760548 791855
3886G91855K9659l5890J0411r1925N9761Q21l0329M3449r974M440o485j2069N1792
3873H05516m1921p8348M9595O9210J1638P6718n5014k3784m3275j5208k4102N9748
3861G90773L8561o3529m4127l7082N256O8431l544j205Q5457p2488j9595N4748
3849H01656q4273J975J16178l5924k2542m055m7426K0887J9326M9416n3551K1968
3837G83635j9961r206L3762L960q729n5792N6370n6800j981R138N1745K3208p9063
3824G30286O4462N7774k8481m1542n0095n9530K5751P2860l0130J473K6268m2707
3812G26389p2004j0056L9346K8792m278n401J2922L6701J2014m1010l2821J7056
3800G07650K5401M7187l3602n7548o9019O6745k4498M1584N2484p63k0448L9247
$$ plain form
3886 791855 821514 785624 796035 704110 763871 764692 734363 777812 767838 772278 765793 753724 805516
3873 805516 763595 685247 734842 804052 815690 892408 837394 813610 770335 755127 731025 790773
3861 790773 829334 765805 721678 684596 689852 758283 754739 753534 838991 766503 746908 801656
3849 801656 717383 719358 835536 799612 777070 773015 725589 746476 765802 815218 761667 783635
3837 783635 763674 754468 788230 792190 783461 727669 784039 727239 725258 734396 786141 809349 730286
3824 730286 794748 852522 824041 782499 732404 672874 698625 771485 741355 742828 769096 726389
3812 726389 654385 644329 683675 712467 708189 702788 715710 752411 764425 723415 690594 707650
3800 707650 733051 780238 746636 689088 620069 686814 662316 703900 756384 755621 735173 774420
3788G74420m8273O2535j0548m5436J5269q1736l3309K0151P1445n0661m6124M9972
3776F77705M4369k5204m2945m0685L7198L5023K5908J6448l7731k2708o583Q182
3764F68977L9405m784p930m7047K9261n3129m2623K0965N4016j6805j3043J5229
3752F42492L6082o6107N9382j466k4608j5598K3268L6093k0963M8827n6550O232
3740F67084K9727n523K7118K298Q300l3405J5243K8990j2478n1927j8326L458
3728F60559M3520l553l3500k684n120N828O4008m915p2640M3556L5915k5790l2903
3715F72281j3572M7295J2758l7996L6032j3176L7644M7282k1476L0364j9982m8062
3703G29392q773L4848M0076J6368R865k8524k7287J6631L9352q404P613j2957
$$ plain form
3788 774420 726147 788682 778134 732698 747967 666231 632922 653073 724518 673857 627733 677705
3776 677705 722074 696870 653925 613240 650438 685461 711369 727817 690086 667378 660795 668977
3764 668977 708382 703598 695668 648621 677882 624753 582130 603095 657111 640306 627263 642492
3752 642492 678574 612467 671849 670383 645775 630177 653445 689538 668575 717402 660852 667084
3740 667084 696811 691288 718406 720704 729004 695599 710842 739832 727354 675427 657101 660559
3728 660559 704079 700526 667026 664342 659222 665050 729058 724143 651503 695059 730974 705184 672281
3715 672281 658709 706004 718762 680766 716798 703622 741266 788548 767072 797436 777454 729392
3703 729392 720619 755467 795543 811911 821776 793252 765965 782596 821948 813544 821157 808200
3691H08200O5773m3206L5084m4399p929M7830O3353J420l8868K4216j4484k6211
3679H70779j9653K6536L4294L040K0297J0212j8959j969M1778k9140j8517m483
3667I14215K2458L9772K3164J3526k240L8502J7095J860K7215J7072k7715o558
3655A078366M4090j0356P6590N1084r375L4781O1869O6964j07777Q369j8730O7284
3643A343159N7510J3503j5407L5918Q378K5352k999k4619J7874J2006Q419O0056
3631A539150O8522q742N9061l1222k902O1315j9626N0105M9240K1382J0584n166
3619A791701J23533J757r724K6278M6818l4515L9147J5875r132J531R5357K8236
3607B116862j06791J2856L643J02542n519K737j5630n9513M8076N0970N1898J5115
$$ plain form
3691 808200 873973 830767 865851 821452 813523 861353 924706 926126 887258 911474 896990 870779
3679 870779 851126 877662 911956 914996 935293 945505 926546 924577 966355 937215 918698 914215
3667 914215 936673 976445 999609 1013135 1010895 1049397 1066492 1068352 1095567 1112639 1084924 1078366
3655 1078366 1122456 1112100 1188690 1239774 1230399 1265180 1327049 1394013 1286236 1294605 1275875 1343159
3643 1343159 1400669 1414172 1398765 1434683 1443061 1468413 1465414 1440795 1458669 1470675 1479094 1539150
3631 1539150 1607672 1598930 1657991 1626769 1623867 1685182 1665556 1715661 1764901 1786283 1796867 1791701
3619 1791701 1915234 1916991 1907267 1933545 1980363 1945848 1984995 2000870 1991738 1993269 2088626 2116862
3607 2116862 2010071 2022927 2026570 2129112 2123593 2126330 2110700 2051187 2099263 2150233 2202131 2217246
3595B217246q433K6194l1880l686M0212N3882K2831l1333N9776K8017J8649K0696
3583B412171J65J8702r3415j6484J33080P7711J220L8613k1395O9686N9096O175
3571B685325R3170Q6745K6377N3887M0485N5925M1045M7936R5947J18882R7215
3560C442939J33522R1585J54474J58826L4293P4362O5349Q7251J39529M3498M8371
3549D473999L2971o7895K1020k5258R673J6102j03503j25638p6208r2497j13145
3538C949621j17984p9058p9340j14233r9512r4569j22647j16293r7426m8753k5395
3527B954411o4372n7883q3104n3964o203l8447j34372k1323j2133k4742o3974
3516B393894j02591p226k6745o6186p0338n7379k63O7235n0688N2660m7215j14972
$$ plain form
3595 2217246 2208813 2235007 2203127 2199441 2239653 2293535 2316366 2285033 2344809 2372826 2391475 2412171
3583 2412171 2412336 2431038 2337623 2321139 2454219 2531930 2533150 2571763 2550368 2620054 2679150 2685325
3571 2685325 2778495 2865240 2891617 2945504 2985989 3041914 3082959 3130895 3226842 3345724 3442939
3560 3442939 3576461 3668046 3822520 3981346 4015639 4090001 4155350 4242601 4382130 4425628 4473999
3549 4473999 4506970 4439075 4460095 4434837 4444510 4460612 4357109 4231471 4155263 4062766 3949621
3538 3949621 3831637 3752579 3673239 3559006 3459494 3364925 3242278 3125985 3028559 2979806 2954411
3527 2954411 2890039 2832156 2749052 2695088 2688885 2650438 2516066 2494743 2482610 2457868 2393894
3516 2393894 2291303 2284077 2257332 2191146 2120808 2063429 2063166 2130401 2079713 2132373 2085158 1970186
3504A970186o0104m0701j5457J7122M675p6548p0803o6300J7173P736m8345j1947
3492A626687r998O443K6301l6955k6534r662k0225o3264n9405L2889m5946P9012
3480A499343l5268o1113M3526m0400q4383j4155N0823m5617K4143n2716m8901
3469A235282q764J6802R087m5913O0832j7194k9138k9353k4693J954k6232n7299
3457A085371K4543P532l8035o127j1998M304o2467j2521O2991l1258j8243J495
3445A005587K3412N0726j9588o1289p8727j3622M1608q219r518j6181k4333M1366
3433I31222n0082n5252M2375J243n13n8193J5678K1136K7267J3292n8825k5092
3421H04256M720j60J0030J4938o6320M8820O0447n6722l4636q728L4162j3290
$$ plain form
3504 1970186 1910082 1869381 1853924 1871046 1875721 1799173 1728370 1662070 1679243 1686979 1638634 1626687
3492 1626687 1616689 1623132 1649433 1612478 1585944 1576282 1556057 1492793 1433388 1466277 1420331 1499343
3480 1499343 1464075 1402962 1446488 1406088 1321705 1307550 1358373 1312756 1336899 1284183 1235282
3469 1235282 1226518 1243320 1252407 1206494 1267326 1250132 1220994 1191641 1166948 1168902 1142670 1085371
3457 1085371 1109914 1117446 1079411 1073284 1061286 1065590 1003123 990602 1053593 1022335 1004092 1005587
3445 1005587 1028999 1079725 1060137 998848 920121 906499 948107 939888 930370 914189 889856 931222
3433 931222 881140 825888 868263 869506 868993 810800 826478 847614 874881 888173 829348 804256
3421 804256 808976 808816 818846 833784 767464 816284 876731 820009 785373 776645 810807 797517
3409G97517n6841o57K2724N361j8493J1865j8664K9087N583N1346n4357r270N0187
3396H15388k0868k6910M5268j9916j7936L264m295j8878o906l0879J1922L9302
3384G68556j5267K2088j2648L7195J2685J746k9251k7340n540o263P1508k5252
3372G92217q800j1808N741N3904M6297N467k1350l2855Q336j5939M4489J4987
3360H80686l126l6135M647L4353M2521L1978L860M0542j0483K56K0852K0460J7837
3347A048248P6178k5297J0514K9188n381M6839K4330J6069M1134L31L7504M5629
3335A345286L4633l832J7486N541k4320L6368L0639j2654J4301K0858j9139M0744
3323A485911p587r829P3737M7769O2038o366r4265J8248O3571K9378Q3715O9467
$$ plain form
3409 797517 740676 740019 762743 768104 749611 761476 742812 771899 777482 828828 774471 765201 815388
3396 815388 794520 767610 812878 792962 775026 778290 773995 755117 748211 717332 729254 768556
3384 768556 753289 775377 762729 799924 812609 814355 785104 757764 752224 745961 817469 792217
3372 792217 783417 771609 777350 831254 877551 883018 861668 828813 837149 821210 865699 880686
3360 880686 877560 841425 846072 880425 922946 954924 958784 999326 988843 989099 1009951 1030411 1048248
3347 1048248 1124426 1099129 1109643 1138831 1133450 1180289 1204619 1220688 1261822 1262153 1299657 1345286
3335 1345286 1379919 1376087 1393573 1399114 1374794 1411162 1441801 1429147 1443448 1464306 1445167 1485911
3323 1485911 1478324 1468495 1542232 1590001 1652039 1645673 1551408 1569656 1633227 1662605 1746320 1815787
3311A815787L2031j1296J4998J6367P2445N3360R22k3815k0296j6982K1162j4630
3299A940053L289M6906j0861m6605J2800m608m7798k3582k4341o0899m406N49
3287A780497J5439p4935k2991M0725K558j7918M1503M722M6915q6992k4369N0441
3275A755595m3597O982O184N6602m2315j9424j5879J2116L0213p7314k1461k4807
3263A622895j6616m4878N6410j9040Q361r234k8490k4856k9512j8210m9777Q229
3251A455282m3493M4231l4219K4661n5090r4850K0598K1483L1564P2902l8751
3240A404318l2046J2485L5650j0185n7233o350m1516J6775J1630j2766J8677j04758
3228A234681N077L790k8491L6734K7996m0282n7910L9275J2154j1044l7588k4992
$$ plain form
3311 1815787 1847818 1836522 1851520 1867887 1940332 1993692 1994614 1970799 1950503 1933521 1954683 1940053
3299 1940053 1943342 1990248 1979387 1932782 1945582 1940974 1893176 1869594 1845253 1784354 1779948 1780497
3287 1780497 1795936 1721001 1698010 1738735 1741293 1723375 1764878 1769600 1816515 1729523 1705154 1755595
3275 1755595 1711998 1718980 1725164 1781766 1739451 1720027 1704148 1716264 1746477 1669163 1647702 1622895
3263 1622895 1606279 1561401 1617811 1598771 1607132 1597898 1569408 1544552 1515040 1496830 1447053 1455282
3251 1455282 1411789 1456020 1421801 1446462 1391372 1296522 1317120 1338603 1370167 1443069 1404318
3240 1404318 1372272 1384757 1420407 1410222 1352989 1346639 1305123 1321898 1333528 1320762 1339439 1234681
3228 1234681 1239758 1243548 1215057 1251791 1279787 1239505 1181595 1220870 1233024 1221980 1184392 1159400
3216A159400J8178o1288Q593m6939J7160R137K8504l2473K0078N2993p6381n1332
3204A045630k727L0799j1804o9559K7728j21356J3212J6171l6013O916K7898o7916
3192H58979m2064q386L0246J0348m7069p283o6308Q233o8846J1542M886m0121
3180F44157N674L3035j0846k9081j5139L9106k8202o740m9256j5321j7146k8384
3168E21857J0089p00n0739j9475L9537l889M5180r991l056m0008k3499L1116Q377
3155E04799J3615p5923k0835j7891O2247n0122K6588J5718q7122L7541k5803m3093
3143C39719K9416J4850N591K1203p0498n0077R0630K8695Q5q2379k2807p824P1566
3130C68170K011L4659r4866r333L8497p2787n25K440J3309k544M3936L578J6608
$$ plain form
3216 1159400 1177578 1116290 1124883 1077944 1095104 1104241 1132745 1100272 1120350 1173343 1096962 1045630
3204 1045630 1042903 1073702 1061898 992339 1020067 898711 911923 928094 892081 898997 926895 858979
3192 858979 816915 808529 838775 849123 802054 794771 728463 736696 667850 679392 684278 644157
3180 644157 649831 682866 672020 642939 627800 666906 638704 631964 582708 567387 550241 521857
3168 521857 531946 531246 480507 461032 500569 496680 541860 531869 528813 488805 465306 496422 504799
3155 504799 518414 442491 421656 403765 466012 415890 442478 458196 371074 408615 382812 339719
3143 339719 369135 383985 389576 410779 340281 290204 380834 409529 409614 327235 304428 296604 368170
3130 368170 370181 404840 309974 300641 339138 266351 265826 268266 281575 279031 322967 326545 343153
3117C43153p0621j7875k8282M1628K9002K0559j9294K9825j0962j2684J352n5697
3105B50104j0384K339M7452K3667j9883n331J1159M565p230m8668M6385M050m8412
3092B49813P773n2505R6023L126n0092j6999k8116K0316K2997l7379l1911J0253
3080A93299l2299k0136L2887R831j9429K5474o7793O1P5133j6069n271N9479m3060
3067A92107n2781M7736J946K1731J3230N805J3004l4210q12J8426n277q548L0585
3054B42942m4940K9970J654K4106r701K3650J7437k2656j7905J108M9045j9733
3042B74977N235j1499L3155K032j0593m13n8566L9044M6815j6813N0008P0427
3030D23809m5392J57L9444k4034J5750n3405j2536r294L6073j8374L8201k8937
$$ plain form
3117 343153 272532 254657 226375 268003 297005 317564 298270 328095 317133 304449 305801 250104
3105 250104 239720 242059 289511 313178 293295 287964 299123 303688 296458 247790 294175 298225 249813
3092 249813 257586 205081 301104 304230 254138 237139 209023 229339 252336 214957 183046 193299
3080 193299 161000 140864 173751 183582 164153 189627 121834 121895 197028 180959 175688 235167 192107
3067 192107 139326 187062 189008 210739 223969 229774 242778 208568 207756 226182 220905 212357 242942
3054 242942 198002 227972 229626 253732 244031 267681 285118 262462 244557 245665 294710 274977
3042 274977 280212 268713 301868 303900 293307 292894 234328 273372 320187 303374 353382 423809
3030 423809 378417 378574 418018 393984 409734 356329 343793 334499 370572 352198 390399 361462
3018C61462L579Q482j3948K3614L1900M6123q258K7109M0593Q722l0408K8421
3006E27391J9796k3483J7065K4094L3567K1534l2958p200K3482j7538k7371P1025
2994F29404K2829o2895m387N7574K2439J7511q574o064k5693N5150K4431n3177
2982F68548M9713k2640M5917L844j1659J1455k5158L0273K0129n552L6002K4089
2970H24961k1185N7723m8854j3678j9310N3167l863o4911Q0982P098p0237l639
2958G78254M2230K3635N3828O184p3522j2325k0270o0681K614L4775l2401r113
2946G33208L6648o5648K169j8866R474M4256k12n420l7889J2257M5837j0582p8333
2933F66899j6133m4183j4207N4663k3952M665k2820l9376j4318M0276l1196l7157
$$ plain form
3018 361462 365041 373523 359575 383189 415089 461212 452954 480063 520656 529378 498970 527391
3006 527391 547187 523704 540769 564863 598430 619964 587006 579806 603288 585750 558379 629404
2994 629404 652233 589338 584951 642525 664964 682475 673901 667837 642144 697294 721725 668548
2982 668548 718261 695621 741538 745382 733723 745178 720020 750293 770422 764870 800872 824961
2970 824961 803776 861499 812645 798967 779657 832824 828961 764050 845032 852130 781893 778254
2958 778254 820484 844119 897947 904131 830609 818284 798014 737333 739947 774722 742321 733208
2946 733208 769856 704208 706377 687511 696985 741241 741029 735609 697720 709977 755814 745232 666899
2933 666899 650766 606583 592376 647039 623087 627752 604932 565556 551238 591514 560318 523161
2921E23161n274l6557J416K304K4976j5781p6319k9002P009O8410m3439n9762
2909C61142L3628l1348q13j3192M4339J9913K3204K0117p3527k9153o0242l3957
2897B60111M3845J3284n899n1089q884m552J4623j553q3661n1M9010N1265j5617
2884B60832m0841L8260O454k9987l9709n1998R028j9627P361M7018r718j3110
2872A63963k8455k9505N155o656N5776j1220j0935j3577k3554O513q87j2945n0171
2859D3502O0366q786k7671k4529k1050L2656P1590k0523m0226J8032k51k3453
2847E9657m409m034K8790k9976K6995J4717J3683l5056m068k7722K5276O7305
2835A31158J018l9722l5632q115L7661K8145m5306j4985J2276k6554J9075m0129
$$ plain form
2921 523161 517887 481330 482746 485050 510026 494245 417926 388924 395933 464343 420904 361142
2909 361142 394770 363422 362609 349417 393756 413669 436873 456990 383463 354310 294068 260111
2897 260111 303956 317240 311341 260252 251368 246816 261439 259886 176225 176174 225184 276449 260832
2884 260832 219991 258251 264705 234718 195009 143011 152039 132412 139773 186791 177073 163963
2872 163963 135508 106003 111158 104502 160278 149058 138123 124546 100992 107505 106618 93673 43502
2859 43502 103868 95082 67411 42882 21832 54488 126078 105555 65329 83361 83110 59657
2847 59657 55248 51214 80004 50028 77023 91740 105423 70367 66299 38577 63853 131158
2835 131158 132176 92454 56822 48707 86368 114513 69207 54222 66498 39944 59019 18890
2823A8890r473L2580O906M107J9789L2636n3100K348l3483n5979k4263P7666M9266
2810F7890k7067K414J0469L2286j5396k6394l8702j9830M8067P896j7103k4784
2798b54N4531j3044j9992n3629J12969K2253l1066k7886m1284J8137K1269m6701
2786d697P6724J6163k6256K7940j1103o7595K3145L0560l3568K0793j293k4259
2774B6554l021k5665M0691q928j6012M4899j6112p4499L2907M2381K5998M5076
2762A14269l1195o4086k3359N007L496J3113P415J1917r218j0361M4919K5841
2750H7758l4652J2445j7762K6553J9664k2864K655n430j4632O0150n8071k0671
2738C5143K592j1552M787J3012N0088L890p1698n0700L7629K2667r4356K8435
$$ plain form
2823 18890 9417 41997 48903 53010 72799 105435 52335 54683 21200 -34779 -59042 18624 67890
2810 67890 40823 43237 53706 85992 70596 44202 5500 -14330 33737 41633 24530 -254
2798 -254 54277 41233 21241 -32388 80581 102834 71768 43882 2598 20735 42004 -4697
2786 -4697 72027 88190 61934 89874 78771 11176 34321 64881 31313 52106 50813 26554
2774 26554 23533 -2132 38559 29631 13619 58518 42406 -32093 814 43195 69193 114269
2762 114269 83074 18988 -4371 636 4132 17245 24660 36577 27359 16998 61917 87758
2750 87758 53106 65551 47789 74342 94006 71142 73797 68367 53735 113885 55814 35143
2738 35143 37735 26183 30970 43982 94070 97960 26262 -24438 13191 35858 -58498 -30063
2726c0063K5552P1489J8176L4678j6840n8151l503q2943J5971J3476j535J2599
2714a094J8887J7346L6065m357n3553r834J764k7369M6461O5339n1182q618m299
2701B5556l001n3714O8704l168j7237M9557k6115R681j8499j3469j2632P7352
2689H3015j1160k6110J7726k9067K8843k269o127j1555k137l5237L973J2113P3131
2676I5139q012q4349m2052M215N0268n515m02J8041R698L1906r227o1916o697
2663h903M9729K3588N4980p9353R031K5943l2759l7722K9226K6910m8239L2913
2651D5344J261J1144J6474J9624m8276j7288j4859M1537L6014j6742J7078J9893
2639A11204k5692q318K4734M9875j6832n3568L4859k4909m4805L3347J9464J2826
$$ plain form
2726 -30063 -4511 66978 85154 119832 102992 44841 41338 -41605 -25634 -12158 -13693 -1094
2714 -1094 17793 35139 71204 66847 13294 3460 5224 -22145 24316 89655 38473 29855 25556
2701 25556 22555 -31159 37545 34377 17140 66697 40582 50263 31764 18295 5663 83015
2689 83015 71855 45745 63471 34404 63247 60978 54851 43296 41159 5922 9895 22008 95139
2676 95139 87127 2778 -39274 -35059 15209 9694 9292 27333 37031 68937 59710 -2206 -8903
2663 -8903 40826 64414 119394 40041 49072 75015 42256 4534 33760 60670 12431 45344
2651 45344 46605 57749 74223 93847 45571 28283 13424 54961 90975 74233 91311 111204
2639 111204 85512 77194 101928 151803 134971 81403 116262 91353 46548 79895 99359 112185
2627A12185r368J3939n4944K5575K7270M7022J7198l4687q4895J01934J6539j2298
2615A65470K076j4235n6039L3066J8563j1185N5129j4927k7914P0387r864Q983
2603B19510J8130k9095k9555m2718Q0821R908o926j6258M291J9151K5231j6778
2591B35712k8734K6254l4733q923Q0663K1601m3289k2254K8302K9751J6484L014
2579C03848K8892J1923Q5121n9400l4534O6026K9552m3228j4705N9426j3617R237
2567D28541K4921P7187K2887j5039M6189K8256m8008Q4273M2978k2842J8447N2927
2555G40717P8424k0607O031K9498P7133p183M1598Q8948N1848L709R3478J13896
2543A297490K3694N2661J44680Q6175J31683Q0080J17857Q4193J17578J66806
$$ plain form
2627 112185 102817 116756 61812 87387 114657 161679 178877 144190 59295 161229 177768 165470
2615 165470 167546 153311 97272 130338 148901 137716 192845 177918 150004 220391 210527 219510
2603 219510 237640 208545 178990 136272 217093 227001 220075 203817 208108 227259 252490 235712
2591 235712 206978 233232 198499 189576 270239 291840 248551 226297 254599 284350 300834 303848
2579 303848 332740 344663 429784 370384 335850 401876 431428 388200 373495 432921 419304 428541
2567 428541 453462 530649 553536 538497 584686 612942 564934 649207 692185 669343 687790 740717
2555 740717 819141 798534 804565 834063 911196 904013 945611 1034559 1086407 1090116 1183594 1297490
2543 1297490 1321184 1373845 1518525 1604700 1736383 1816463 1934320 2018513 2136091 2302897
2533B302897K23296K63429K12197L24908L33205L43301L36029L79694K87818K17444
2523E224218J33943J25610N4414k4188r2768j51921j48386j23656j87766j90611
2513D618889j46874k78581k88664l00606l00962k42288k08842j91553j70435j83243
2503B306841j63973j72591n8983j44611q9912q6720j12470j49789r9499n0716
2493A177577j1510p4410l6155l3290o3151o7253p4280j9033k5356o5134l9504
2482F68501l5896j0180j15m2468J8986n4417j8415l0249j1951p1081o713m2071
2470C63931p081K8067N0998j4720L9471j0852q9012m2009n2128L2107M7044o410
2458C39406k2700l7294J7815o0056l0580K1727o931L5059J3667j9108o571l516
$$ plain form
2533 2302897 2526193 2789622 3001819 3326727 3659932 4003233 4339262 4718956 5006774 5224218
2523 5224218 5358161 5483771 5538185 5513997 5421229 5269308 5120922 4997266 4809500 4618889
2513 4618889 4472015 4193434 3904770 3604164 3303202 3060914 2852072 2660519 2490084 2306841
2503 2306841 2142868 1970277 1911294 1766683 1676771 1590051 1477581 1327792 1228293 1177577
2493 1177577 1166067 1091657 1055502 1022212 959061 891808 817528 798495 773139 708005 668501
2482 668501 632605 622425 622310 579842 598828 544411 525996 495747 483796 412715 406002 363931
2470 363931 356850 384917 435915 421195 460666 449814 360802 318793 266665 298772 345816 339406
2458 339406 316706 279412 297227 237171 206591 228318 221387 256446 270113 251005 244434 240918
2446B40918k3521k9117j9864k1550j1104K3369l6781J0367L9001l2053K867J2102
2434A54634J3010m1958k586R4454k7321q054l0716n5062j4506O634M191j2727
2422G9993J0247L8346L8361l1949K7539o6644J678K9162o93m5792l8804Q5122
2410A26566l9019J8566o4k1846J4905J1898J4047q571n833p0356M4308m5778P2085
2397A10908M4867k3963o2594k1608K1751Q061l985J1L377m4178J5887J2759n507
2384E5786j3599j6555K12k6660j4875Q7338p611L6984l1053o340l37j4605J4039
2371F2724M3708J0512N316m5361j1300R904l103K5481n3958j4414J8184K8667
2359G6360J3673k9227m444j2387m3457k1771l5202L6190N0332K6416l6237K3404
$$ plain form
2446 240918 217397 188280 168416 146866 135762 159131 122350 132717 171718 139665 142532 154634
2434 154634 167644 125686 123100 217554 190233 182179 151463 96401 81895 88529 92720 79993
2422 79993 90240 128586 166947 134998 162537 95893 97571 126733 126040 80248 41444 126566
2410 126566 87547 106113 106049 84203 99108 111006 125053 116482 110649 40293 84601 38823 110908
2397 110908 155775 131812 69218 47610 69361 77422 73437 73448 76825 32647 48534 61293 55786
2384 55786 42187 25632 25844 -816 -15691 71647 64036 101020 69967 63627 63290 48685 62724
2371 62724 106432 116944 122260 76899 65599 75503 72400 97881 43923 29509 47693 76360
2359 76360 90033 60806 56362 43975 518 -21253 -56455 -20265 30067 56483 20246 43650
2347D3650K193r852M1709o1823m3138J30884n4128n9366L9142k0029j8831J5731
2335F142L5710o6719M9588M675j8017j7445M6710k289J0848l0213J8363l8350
2323i97M958j7663k462m0669l4438R766N2063l186K1092j0214m266L7954l6861
2310b4923n18M8813L2888j6091j0428K587m858m3205L2891q494j9437K9327J113
2297A9665k1026N3271l9419p506M3894j244Q844p317K2495l7258n4159l1846J8886
2284c2720Q4816j8205k6147k0919J9050J6875R551L487M7781o029k7835k7757
2272B1948q407o319J6233l6763l78J3414m5008N8750m411l2188L1600J9223k9376
2259a682l8904K7844P936m6036J2776K8202n1743J4520J8209K7857m8850J2733
$$ plain form
2347 43650 45843 35991 77700 15877 -27261 103623 49495 -9871 29271 9242 -9589 6142
2335 6142 41852 -24867 24721 29396 11379 -6066 40644 38355 49203 18990 37353 -997
2323 -997 3961 -13702 -16164 -56833 -91271 -81505 -29442 -32628 -11536 -21750 -26016 11938 -24923
2310 -24923 -25441 23372 56260 40169 29741 32328 27470 -15735 17156 8662 -10775 18552 19665
2297 19665 -1361 51910 12491 4985 48879 47635 56479 49162 71657 34399 -19760 -51606 -32720
2284 -32720 52096 33891 7744 -13175 5875 22750 32301 35788 83569 77540 49705 21948
2272 21948 13541 7222 23455 -13308 -13686 -272 -45280 13470 9059 -23129 8471 27694 -1682
2259 -1682 -40586 -12742 -4806 -50842 -38066 -9864 -61607 -47087 -28878 -1021 -49871 -37138
2247c7138l060K7179J538L258n8545K5629k8864K3844P1500n1499k2515K6072
2235b2601N9047j00576j5480J0373O7540k5082l5523J8553l2437m023N4145M125
2223b1939K4844n9421k3515L7441N3295j7532L090k5504n301M0359j7217l589
2211a4989L2276O614j01529j2630M1963K3496l2290L0853k3247k6237O4042L2612
2199B0934m5745M2114N9550o8902l9819q224j4232N2639m412j7772k6275j9090
2187f9234J2673K8578k8953j478K3339l5037L3562K1886m4569j9957K0674P638
2175e0878Q7473q374m7137J0386m998M111o407N641m361L8198n1949L961N2583
2162B8249K610m1596l4436K619k3733K2111r361k0908L0238P4717l9136l1867
$$ plain form
2247 -37138 -40198 -13019 -11481 -8223 -66768 -41139 -70003 -46159 25341 -26158 -48673 -22601
2235 -22601 36446 -64130 -79610 -69237 -1697 -26779 -62302 -43749 -76186 -80209 -26064 -21939
2223 -21939 2905 -56516 -80031 -42590 10705 -6827 -3737 -29241 -34542 5817 -11400 -14989
2211 -14989 17287 23901 -77628 -90258 -48295 -24799 -57089 -26236 -49483 -75720 -11678 20934
2199 20934 -24811 17303 76853 7951 -31868 -40092 -54324 -1685 -6097 -23869 -50144 -69234
2187 -69234 -56561 -27983 -56936 -58414 -35075 -70112 -36550 -14664 -59233 -79190 -58516 -50878
2175 -50878 36595 28221 -18916 -8530 -13528 -9417 -15824 -10183 -14544 23654 -28295 -24334 28249
2162 28249 30859 -10737 -45173 -42554 -66287 -44176 -53537 -74445 -44207 30510 -8626 -40493
2150d0493j860J590n4416L0840L0465j7967K8074O6127m9877l9346K888N002L7796
2137a177J5328o988m1253k951K4045k5164R659P9643l121m8761m1196j7601J6611
2124d2926l00K4806p0536J1341N3951L598M814l9860K8113q384P6405k4857m9580
2111c3415P25M986J992j2272Q21Q37L5822J342m2694R971K3594j9270K9961M1178
2097D3578k5622l8884m2710n078Q495k4963J900R990J2484J9973l220J273K6977
2084a5807J1335J6560l7033l64J5891j6883q3990L5886K8153N3416P796q3175
2072f8215j038N753R674q698R120R657p625L7511j0929M4456Q682l3353L7670
2059C2665k3375k2782k0418M7207m9780m2150N5078J2647j3239o210k7028M1695
$$ plain form
2150 -40493 -42353 -40763 -95179 -64339 -33874 -51841 -23767 42360 -7517 -46863 -43975 -38973 -1177
2137 -1177 14151 7163 -34090 -37041 -12996 -38160 -28501 51142 48021 -740 -41936 -59537 -42926
2124 -42926 -43226 -18420 -88956 -77615 -23664 -20066 -15252 -55112 -26999 -35383 41022 16165 -33415
2111 -33415 -32690 -27704 -25712 -37984 -37163 -36326 -504 838 -41856 -31885 -8291 -27561 2400 43578
2097 43578 17956 -20928 -63638 -68716 -60221 -85184 -83284 -73294 -60810 -40837 -44057 -42784 -15807
2084 -15807 -4472 12088 -24945 -25309 -9418 -26301 -110291 -74405 -46252 7164 14960 -68215
2072 -68215 -69253 -63500 -53826 -62524 -53404 -43747 -51372 -13861 -24790 19666 28348 -5005 32665
2059 32665 9290 -13492 -33910 13297 -36483 -78633 -23555 -10908 -24147 -30357 -57385 -15690
2047a5690N3004j3148l5024k4928L2214J913o5596O7195R95M439K5509o8556J6583
2034b1090m133l3577K8693J0409j3004J6908l4904O149J756Q268j3157K9857K0116
2021B291l3958L6242Q752m0838k2274j859L2240J9427o8913K9454L4211l0596
2009c5821K8433L1474o7644M3398k7211N415k9217p035L4525Q495j4044P1427
1997D2195j9861o9234M2845q559n2630J8100R980P341k4524j2322j0307K134K469
1984g2373N8250O924jm3371j9933K9230K2459L3057j05558O4081K0617P702j4143
1971a3059M7983m293n420o2348m2058J5096J7759r793o841N9014k1791M0368r550
1958E067k8323K3000k3131J6732n4887m9017L5113P1209J4854M4875o5312m640
$$ plain form
2047 -15690 37314 24166 -10858 -35786 -3572 -1659 -67255 -60 935 5374 30883 -37673 -21090
2034 -21090 -25223 -58800 -30107 -19698 -32702 -15794 -50698 -44549 -42793 -34525 -47682 -17825 2291
2021 2291 -31667 4575 13327 -27511 -49785 -51644 -19404 23 -68890 -39436 -5225 -35821
2009 -35821 -7388 24086 -43558 -160 -27371 -21956 -51173 -58208 -23683 -15188 -29232 42195
1997 42195 22334 -46900 -4055 -12614 -65244 -47144 -37164 -29823 -54347 -66669 -76976 -74842 -72373
1984 -72373 -14123 -7199 -7200 -50571 -70504 -41274 -18815 14242 -91316 -27235 -6618 1084 -13059
1971 -13059 34924 30631 25211 -37137 -79195 -64099 -46340 -56133 -62974 -3960 -25751 14617 5067
1958 5067 -23256 -256 -23387 -6655 -61542 -110559 -75446 -4237 10617 55492 -9820 -14460
1946a4460j5601P357N4920p023n0631Q810j6751J7032L2957q750j8445j464J8350
1933F301k7274k8891q430N7181j5694o919k2012N1577m6060K0740N7637m3234
1921e078L1997n9114j6097j899r254k1514j0775o203O1737n9507J2026M1430O904
1908c5347k7920O237L6466j2930J5861n2027N0673R490K4329l0400L3205k2079
1896d442l9670j7156L2326k4676M8807K1660o7748K403N110K3879O067j2287j6146
1883d1873K7917k5078j6885L6669J265j1400N724j9522j7291O0793K3785l7060
1871a2956k5187j6857M4768K491l4949k3107K9190J7329J9205l6089J7500K299
1859a6363n5513K7517N2061m2269K8335N1337p0341J629L7822l7879j5041N3929
$$ plain form
1946 -14460 -30061 -22704 32216 25193 -25438 -16628 -33379 -16347 16610 7860 -10585 -12049 6301
1933 6301 -20973 -49864 -58294 -1113 -16807 -23726 -45738 5839 -40221 -19481 38156 -5078
1921 -5078 26919 -32195 -48292 -50191 -59445 -80959 -91734 -97937 -36200 -95707 -83681 -42251 -35347
1908 -35347 -63267 -57030 -20564 -33494 -17633 -69660 -18987 -9497 14832 -15568 17637 -4442
1896 -4442 -44112 -61268 -28942 -53618 -4811 16849 -50899 -48496 -43386 -19507 -13440 -25727 -41873
1883 -41873 -13956 -39034 -55919 -19250 -17985 -29385 -23661 -43183 -60474 319 24104 -12956
1871 -12956 -38143 -55000 -10232 -7741 -42690 -65797 -36607 -19278 -73 -36162 -18662 -16363
1859 -16363 -71876 -44359 7702 -34567 -6232 45105 -25236 -23607 14215 -23664 -38705 15224
1847A5224k0122K8493m9113J4927k2695M580J3645J1345l2625O04M8920J0362
1835B3545j7771L2391m8457J2527P2314p8846K6033P357n3499p2548J9712K206
1823g5036j6157J9696K7597m809m1915L1204J3165K9004l9289k1637Q7832L2287
1811D1942m3115j1684j6700n5178N7861k5992o980K3280L3476n928p1415Q3662
1799C229m468r708K5358m3556J0439m5835j5672J6334N2526N897Q105k9744L7525
1786A0430k4338j4988j4157p613K7377l0384M0153K3735m0895j7903Q0845o132
1774B6130j7775j3900J6303k9691J0985O5020l1035p6634j2688P8078l469j2533
1762a209L0537k3953q789p682L0815O446k4298L3801k0581p915l6804j7733K3590
$$ plain form
1847 15224 -4898 23595 -25518 -10591 -33286 -28706 -15061 -3716 -36341 -35737 13183 23545
1835 23545 5774 38165 -10292 2235 74549 -4297 21736 29093 -24406 -96954 -77242 -75036
1823 -75036 -91193 -71497 -43900 -48709 -90624 -59420 -46255 -17251 -56540 -78177 9655 41942
1811 41942 -1173 -12857 -29557 -84735 -26874 -52866 -59846 -36566 -3090 -9018 -80433 3229
1799 3229 -1239 -10947 14411 -29145 -18706 -64541 -80213 -63879 -11353 -5456 2649 -27095 10430
1786 10430 -13908 -28896 -43053 -50666 -23289 -53673 -13520 10215 -30680 -48583 32262 26130
1774 26130 8355 -5545 10758 -18933 -7948 57072 26037 -50597 -63285 14793 11324 -1209
1762 -1209 29328 5375 -3414 -11096 19719 26165 1867 35668 15087 7172 -29632 -47365 -23775
1749b3775M855j3094J872m4330L8282M3450k3433m510k8889M1687L3237k5778
1737d26m9838P140n6362K2462N4299J8795k7633J5160o788l3152r593M7565j4127
1724c2498k9765O7554K7402l1561n6543M9619J2682m4644j918J4344o2812M8968
1712c9172M4568m1753Q410J5181J6113l0792m8191N9739L3896P682k2280J4709
1700A8110j4085P60m3083J4487L2799l7203L45J6329K0014o3910l9147N8248L1635
1687d701J8866l2522J5296O0206m2673j26187K4473j4131M4432M1212n7378J8399
1675e4708j0629M4760N883M5184o8232J2715L4985l9349O695R801n4662L2144
1663c5413M8366l64l9229j0479j0756n240j1043N0153L731n9589Q1220N3523q0721
$$ plain form
1749 -23775 -18920 -32014 -30142 -74472 -36190 7260 -16173 -20683 -49572 -7885 25352 -426
1737 -426 -50264 -43124 -99486 -77024 -22725 -3930 -31563 -16403 -23191 -56343 -65936 -18371 -32498
1724 -32498 -62263 5291 32693 1132 -55411 -5792 6890 -37754 -39672 -25328 -88140 -39172
1712 -39172 5396 -36357 -27947 -12766 3347 -27445 -75636 -15897 17999 25681 3401 18110
1700 18110 4025 4785 -38298 -23811 8988 -28215 -27870 -11541 8473 -55437 -94584 -36336 -4701
1687 -4701 14165 -18357 -3061 57145 14472 -111715 -87242 -101373 -56941 -15729 -73107 -54708
1675 -54708 -65337 -20577 -14694 30490 -37742 -25027 9958 -29391 -22696 -12895 -67557 -35413
1663 -35413 12953 12589 -26640 -37119 -47875 -53115 -64158 -14005 -10274 -69863 11357 64880 -15841
1650a5841J3396j6914k9859N2879o87m4806l0649P3788l3923r155k2991J4774
1638d9988K2046j5421J0738N8664M1665r1980J58j7943j7175R5438k1575r2308
1626g7681N2629l4289N4540K3858j4949M5078k7149l3672m8039J5882J12947l4337
1614C4818l1117j3965l5008J8548n0600j6459M3010N1542n6510N2471L6851n5786
1602b2205m314j8199q770P2873n8986K4384M5188j3520m0150J6400J5842l5966
1590b7423J5342L6845j8039K658K2962q0776j1840L1716M2225J7758l3068n3658
1578e5298O1776K8562p4806K3983m481J6259L1302n1814L0630k2215l7930o189
1566f0221J5956L4022l1242R463Q715J6691j9514J4987K2390n3702j7876j7995
$$ plain form
1650 -15841 -2445 -19359 -49218 3661 2974 -41832 -72481 1307 -32616 -41771 -64762 -49988
1638 -49988 -27942 -43363 -32625 26039 67704 -24276 -24118 -42061 -59236 36202 14627 -77681
1626 -77681 -25052 -59341 -4801 19057 4108 49186 22037 -11635 -59674 -43792 69155 34818
1614 34818 3701 -10264 -45272 -26724 -77324 -93783 -50773 769 -55741 -3270 33581 -22205
1602 -22205 -26519 -44718 -53488 19385 -39601 -15217 29971 16451 -23699 -7299 8543 -27423
1590 -27423 -12081 24764 6725 9383 32345 -48431 -60271 -28555 13670 31428 -1640 -55298
1578 -55298 6478 35040 -39766 -15783 -20264 -4005 27297 -24517 6113 -16102 -54032 -60221
1566 -60221 -44265 -10243 -41485 -32022 -23307 -6616 -26130 -11143 11247 -42455 -60331 -78326
1554g8326m980OJ3489K303J5065L0460j0351Q234M355K4159k9027j397k1995j7674
$$ plain form
1554 -78326 -83306 -83300 -69811 -67508 -52443 -21983 -32334 -24100 -19745 4414 -24613 -26010 -48005 -65679
$$ [...]
##END NTUPLES=NMR SPECTRUM
##END=
