##TITLE=1H_CA-8917
 CDCl3, 40 sc, 
 2.9.2021
##JCAMPDX= 6.0         $$ Bruker NMR JCAMP-DX V2.0
##DATA TYPE= NMR SPECTRUM
##DATA CLASS= NTUPLES
##ORIGIN= UXNMR, Bruker Analytische Messtechnik GmbH
##OWNER= root
$$ XWIN-NMR		Version 3.5
$$ Thu Sep  2 11:47:25 2021 Russian Standard Time (UT+4h)  she@DPX200
##.OBSERVE FREQUENCY= 200.1312
##.OBSERVE NUCLEUS= ^1H
##.ACQUISITION MODE= SIMULTANEOUS
##.ACQUISITION SCHEME= undefined
##.AVERAGES= 40
##.DIGITISER RES= 18
##SPECTROMETER/DATA SYSTEM= spect
##.PULSE SEQUENCE= zg30
##.SOLVENT NAME= CD2Cl2
##.SHIFT REFERENCE= (INTERNAL, CD2Cl2, 0, 17.8784)
##AUDIT TRAIL= $$ (NUMBER, WHEN, WHO, WHERE, WHAT)
$$ ##TITLE= Audit trail, XWIN-NMR		Version 3.5
$$ ##JCAMPDX= 5.01
$$ ##ORIGIN= Bruker BioSpin GmbH
$$ ##OWNER= she
$$ F:/spectra/data/she/nmr/H-F/1/pdata/1/auditp.txt
$$ ##AUDIT TRAIL=  $$ (NUMBER, WHEN, WHO, WHERE, WHAT)
(   1,<2021-09-02 11:46:07.57 +0400>,<she>,<DPX200>,
      <continue with go, POWCHK disabled, PULCHK disabled
       configuration hash MD5:
       00 E9 B6 7A A2 85 ED C7 34 08 36 98 17 FE 4E 26
       data hash MD5: 16K
       13 B6 EB F0 FB 08 31 C3 D4 C1 66 E4 77 AC 5B 3C>)
(   2,<2021-09-02 11:46:13.57 +0400>,<she>,<DPX200>,
      <Start of raw data processing
       efp BC_mod = 2 LB = 0.24 FT_mod = 6 PKNL = 1 PHC0 = -13353.98 PHC1 = 6.000969 SI = 16K 
       data hash MD5: 16K
       C1 6D 0E 58 17 0D E5 99 35 FA AD 8C 39 25 54 FE>)
(   3,<2021-09-02 11:46:31.67 +0400>,<she>,<DPX200>,
      <pk PHC0 = -25.14516 PHC1 = 32 
       data hash MD5: 16K
       3E 70 48 8C 6A 63 90 E6 8A F0 31 D6 C1 2C 4E C5>)
(   4,<2021-09-02 11:46:34.65 +0400>,<she>,<DPX200>,
      <abs ABSG = 5 
       data hash MD5: 16K
       2F AB C7 64 6D 4E B0 F5 60 98 02 F7 A2 0F EF 2A>)
$$ ##END=
$$ 
$$ hash MD5
$$ 0D F8 B6 8B 35 9E 2B 70 E8 10 05 AF 32 3F 15 A9
##$RELAX= 
##$RELAX= 
##$RELAX= 
##$RELAX= 
##$RELAX= 
##$RELAX= 
$$ Bruker specific parameters
$$ --------------------------
##$DU= <F:/spectra>
##$EXPNO= 1
##$NAME= <H-F>
##$PROCNO= 1
##$TYPE= <nmr>
##$USER= <she>
##$AMP= (0..31)
100 100 100 100 100 100 100 100 100 100 100 100 100 100 100 100 100 100 
100 100 100 100 100 100 100 100 100 100 100 100 100 100 
##$AQSEQ= 0
##$AQ_mod= 1
##$AUNM= <au_zg>
##$AUTOPOS= <>
##$BF1= 200.13
##$BF2= 200.13
##$BF3= 200.13
##$BF4= 200.13
##$BF5= 200.13
##$BF6= 200.13
##$BF7= 200.13
##$BF8= 200.13
##$BYTORDA= 1
##$CFDGTYP= 0
##$CFRGTYP= 5
##$CHEMSTR= <none>
##$CNST= (0..31)
1 1 145 1 1 1 1 1 1 1 1 1 1 1 1 1 1 1 1 1 1 1 1 1 1 1 1 1 1 1 1 1 
##$CPDPRG= <>
##$CPDPRG1= <>
##$CPDPRG2= <>
##$CPDPRG3= <>
##$CPDPRG4= <mlev>
##$CPDPRG5= <mlev>
##$CPDPRG6= <mlev>
##$CPDPRG7= <mlev>
##$CPDPRG8= <mlev>
##$CPDPRGB= <>
##$CPDPRGT= <>
##$D= (0..31)
0 1.2 0 0 0 0 0 0 0 0.06 0 0.03 0 0 0 0 0.0002 0 0 0 0 0 0 0 0 0 0 0 0 
0 0 0 
##$DATE= 1630568643
##$DBL= (0..7)
120 120 120 120 120 120 120 120 
##$DBP= (0..7)
150 150 150 150 150 150 150 150 
##$DBP07= 0
##$DBPNAM0= <>
##$DBPNAM1= <>
##$DBPNAM2= <>
##$DBPNAM3= <>
##$DBPNAM4= <>
$$ [...]
##$SUBNAM3= <"">
##$SUBNAM4= <"">
##$SUBNAM5= <"">
##$SUBNAM6= <"">
##$SUBNAM7= <"">
##$SUBNAM8= <"">
##$SUBNAM9= <"">
##$SW= 20.0189188712717
##$SWIBOX= (0..15)
0 0 2 0 0 0 0 0 0 0 0 0 0 0 0 0 
##$SW_h= 4006.41025641026
##$TD= 16384
##$TD0= 1
##$TE= 0
##$TE2= 300
##$TE3= 300
##$TEG= 300
##$TL= (0..7)
0 120 120 120 120 120 120 120 
##$TP= (0..7)
150 150 150 150 150 150 150 150 
##$TP07= 0
##$TPNAME0= <>
##$TPNAME1= <>
##$TPNAME2= <>
##$TPNAME3= <>
##$TPNAME4= <>
##$TPNAME5= <>
##$TPNAME6= <>
##$TPNAME7= <>
##$TPOAL= (0..7)
0.5 0.5 0.5 0.5 0.5 0.5 0.5 0.5 
##$TPOFFS= (0..7)
0 0 0 0 0 0 0 0 
##$TUNHIN= 0
##$TUNHOUT= 0
##$TUNXOUT= 0
##$USERA1= <user>
##$USERA2= <user>
##$USERA3= <user>
##$USERA4= <user>
##$USERA5= <user>
##$V9= 5
##$VALIST= <valist>
##$VCLIST= <CCCCCCCCCCCCCCC>
##$VD= 0
##$VDLIST= <DDDDDDDDDDDDDDD>
##$VPLIST= <PPPPPPPPPPPPPPP>
##$VTLIST= <TTTTTTTTTTTTTTT>
##$WBST= 1024
##$WBSW= 4
##$XGAIN= (0..3)
0 0 0 0 
##$XL= 0
##$YL= 0
##$YMAX_a= 237362
##$YMIN_a= -228080
##$ZGOPTNS= <>
##$ZL1= 120
##$ZL2= 120
##$ZL3= 120
##$ZL4= 120
##$ABSF1= 17.88937
##$ABSF2= -2.129707
##$ABSG= 5
##$ABSL= 3
##$ALPHA= 0
##$AQORDER= 0
##$ASSFAC= 0
##$ASSFACI= 0
##$ASSFACX= 0
##$ASSWID= 0
##$AUNMP= <proc_1d>
##$AZFE= 0.1
##$AZFW= 0.1
##$BCFW= 0
##$BC_mod= 2
##$BYTORDP= 0
##$COROFFS= 0
##$CY= -3
##$DATMOD= 1
##$DC= 0
##$DFILT= <>
##$DTYPP= 0
##$F1P= 0
##$F2P= 0
##$FCOR= 1
##$FTSIZE= 16384
##$FT_mod= 6
##$GAMMA= 0
##$GB= 0
##$INTBC= 1
##$INTSCL= 1.334414e-10
##$ISEN= 128
##$LB= 0.24
##$LEV0= 0
##$LPBIN= 0
##$MAXI= 10000
##$MC2= 0
##$MEAN= 0
##$ME_mod= 0
##$MI= 1.114404
##$NCOEF= 0
##$NC_proc= -7
##$NLEV= 6
##$NOISF1= 3.799351
##$NOISF2= 2.8
##$NSP= 0
##$NTH_PI= 0
##$NZP= 0
##$OFFSET= 17.87836
##$PC= 1
##$PHC0= -13379.13
##$PHC1= 38.00097
##$PH_mod= 1
##$PKNL= yes
##$PPARMOD= 0
##$PSCAL= 0
##$PSIGN= 0
##$REVERSE= no
##$SF= 200.129625215101
##$SI= 16384
##$SIGF1= 3
##$SIGF2= 2
##$SINO= 5.538805
##$SIOLD= 16384
##$SREGLST= <1H.CDCl3>
##$SSB= 0
##$STSI= 16384
##$STSR= 0
##$SW_p= 4006.41025641025
##$SYMM= 0
##$S_DEV= 0
##$TDeff= 16384
##$TDoff= 0
##$TI= <>
##$TILT= no
##$TM1= 0
##$TM2= 0
##$TOPLEV= 0
##$USERP1= <user>
##$USERP2= <user>
##$USERP3= <user>
##$USERP4= <user>
##$USERP5= <user>
##$WDW= 1
##$XDIM= 16384
##$YMAX_p= 297231464
##$YMIN_p= -1811457
$$ End of Bruker specific parameters
$$ ---------------------------------
##NTUPLES= NMR SPECTRUM
##VAR_NAME=  FREQUENCY,     SPECTRUM/REAL,   SPECTRUM/IMAG
##SYMBOL=    X,             R,               I
##VAR_TYPE=  INDEPENDENT,   DEPENDENT,       DEPENDENT
##VAR_FORM=  AFFN,          ASDF,            ASDF
##VAR_DIM=   16384,         16384,           16384
##UNITS=     HZ,            ARBITRARY UNITS, ARBITRARY UNITS
##FACTOR=    0.24454680195387, 1,            1
##FIRST=     3577.98963601585, 0,            0
##LAST=      -428.420620394397, 0,           0
##MIN=       -428.420620394397, -1811457,    0
##MAX=       3577.98963601585, 297231464,    0
$$ Real data points
##PAGE= N=1
##DATA TABLE= (X++(R..R)), XYDATA
$$ [...]
6911 10009366 10369325 10356265 10037679 10368317 9934511 9950930 9884190 9912377 9674899 9581241
6901 9581241 9916262 9450791 9143733 9292699 9743416 9571436 9699801 9251586 9551880 10015796
6891 10015796 10110798 10469622 10312164 9796896 9927557 10570678 10034461 9241606 9385590 9166992
6881 9166992 9183861 9143964 9008864 9047639 9317098 9214012 9200117 9500119 10049796 9805938
6871 9805938 9251608 9423450 8911882 9406325 9179123 8611618 9222213 9092206 9147873 8991806
6861 8991806 8923903 9159686 9033962 8704817 8715827 9019063 8884063 8703667 8799366 9376029
6851 9376029 9319365 9102237 8628523 8432371 8754643 9124325 8855126 8676395 8767710 8941689
6841 8941689 8779306 8682591 8466650 8745663 8734696 8410740 8456757 8733843 8772338 8888505
6831 8888505 9186074 8965051 8665484 8689020 8448423 8394244 8074420 8452893 8260057 8478326
6821 8478326 8441486 8317905 8533325 8458037 8611970 8294933 8082851 8532157 8909280 8370745
6811 8370745 8265938 8475816 8386940 8344294 7735843 7183652 7262229 8020420 8524765 8136697
6801 8136697 7820508 8186645 8307022 7503426 7857488 8110581 7949798 7543771 7989651 8014341
6791 8014341 8222244 8261958 7986653 8243546 8228320 8015711 8296145 8367184 8363888 8315700 8008292
6780 8008292 7989359 8200379 7974888 8302704 7984183 7916223 7807226 7838060 8001536 7658871
6770 7658871 7873259 8189666 7561679 7503128 7782002 7408303 7407080 7892147 8065709 7876275
6760 7876275 7408517 7264495 6874717 6919945 7008280 7690949 8206179 7631331 7701400 7610531
6750 7610531 8151032 7751744 7622241 8052608 7956961 8034683 7941399 7468298 7584793 7531683
6740 7531683 6739449 7072456 7215628 7130349 7869380 7607453 7434288 7163493 7451612 7450698
6730 7450698 7365002 6951420 6802324 7178697 7364334 7254686 7514374 7480607 7160107 7146271
6720 7146271 7384686 7263904 6959925 7222041 7167540 7009399 7089477 7235112 7359621 6725930
6710 6725930 6066399 6497645 6640347 6843607 7182502 6867962 6780002 6446807 6411794 7089889
6700 7089889 6875480 6789465 6786092 6460771 6398328 6398446 6482088 6788678 7209908 6924693 6636870
6689 6636870 6701768 6835163 6608570 6341882 6795674 6603924 6362304 6375244 5999308 5931305
6679 5931305 6197136 6534640 6502886 6567017 6875436 6754874 6515327 6289080 6352577 6103778
6669 6103778 6056693 6198829 6287259 5882783 6037532 6341775 6429525 5929409 5671927 5787924
6659 5787924 5447685 5595842 5786777 5752796 6159581 6249956 6059623 5776608 5739908 6178976
6649 6178976 6015787 5647096 5389413 5453664 6005144 6084422 5625403 5611782 5608997 5545072 5960416
6638 5960416 5944979 5720892 5279153 5212867 5437221 5347655 5213851 4724120 5329785 5923263
6628 5923263 5967848 5953337 6056866 5804510 5612402 5232480 5709370 5651562 5926433 5819003
6618 5819003 5498998 5488460 5922523 5887776 5771043 5483099 5691675 6181600 5284893 5410849
6608 5410849 5541091 5240469 4815611 5149011 4698302 4958096 5328492 5275454 5135303 5252935
6598 5252935 5441704 5155894 5014237 5365332 5322494 5029563 5169112 5627279 5794369 5549377
6588 5549377 5874745 5442038 5110471 5952807 5923642 5341361 5418150 5218676 5631618 5849389
6578 5849389 5004365 4755607 5008486 5174788 4657096 4826966 5249354 4861377 4658082 4573912
6568 4573912 4359660 4621919 4827230 4973257 5057696 5212474 5078735 4538255 4232054 4796520
6558 4796520 4910034 4815005 4715148 4891116 5014818 4792925 4639221 4931484 5092157 4978059
6548 4978059 5257695 4951979 4984779 4605409 4752344 4520176 4752201 4871657 4623043 4816548
6538 4816548 4239989 4517912 4554675 4819901 4589907 4821424 5096149 5114186 4855745 4586719
6528 4586719 4830446 4829839 5018332 4908698 4972159 4570876 4497372 4423568 4019212 4377651 4053095
6517 4053095 4093071 4314931 4294795 4270057 4458448 4638310 4200945 4495818 4341927 4423412
6507 4423412 4202094 4501674 4544617 4582152 4892222 4754358 4195644 4306187 3916084 3852772
6497 3852772 3746926 3801468 4209924 4282290 3915751 4232936 4262313 4026132 3852986 4231348
6487 4231348 4334938 4290438 4403269 4267030 4543753 4102202 4539699 4852523 4785257 3906661
6477 3906661 3907702 4310131 3872922 4115625 4482839 4316378 4302922 4804395 3957517 3729564
6467 3729564 4443818 4267308 4134773 3782601 3761607 4087745 4224050 4385895 4116672 4079003
6457 4079003 4029590 4053313 4286858 4266417 4359858 3694264 3960053 3903259 3959977 4064658 4303013
6446 4303013 4707634 4093633 3744652 4026305 3751991 3763169 3397690 3401670 4069872 4003717
6436 4003717 3649710 3659939 3874592 3825964 3418149 3672956 3952520 3428271 3430118 3804654
6426 3804654 3693845 3916557 3598417 3717273 4060164 3923484 3538921 3627196 3798185 3580274
6416 3580274 3560330 3715899 3660797 3604075 3479352 2969334 2991677 2850709 3067954 3553508
6406 3553508 2985718 2525946 3067264 3382779 2683310 3359117 3503159 3220183 3268103 3540137
6396 3540137 3699253 3134116 2976945 2937983 2631820 2682565 2778050 2640373 3339335 3316494
6386 3316494 3180905 3031459 3231350 3408362 3576718 3748037 3602225 3239112 3307512 2937777
6376 2937777 3276928 3536161 3833660 3452531 2970273 3188064 3005206 3055326 3769613 3212839
6366 3212839 2493173 2832987 3167708 2702005 2882350 2861347 3087799 2391710 2491412 2514129
6356 2514129 2226276 2709596 2715095 3310757 2911150 2856037 2668351 2462224 2908163 2823534
6346 2823534 2293193 2532559 2624647 2656433 2661483 2651879 2615540 2693137 3045957 2897323 3004887
6335 3004887 3191343 2967946 2750677 2555990 2603638 2884743 2969495 2964633 2505011 2274978
6325 2274978 2355201 2138777 2738422 2447826 1965251 1960655 2914300 2612804 2600502 2604940 2285634
6314 2285634 2234361 2525349 2338322 2378855 2725008 2244248 2558609 2911050 2864584 2692094
6304 2692094 2322470 2337815 2616584 2374981 2070266 2223301 2335778 2433712 2531430 2536292
6294 2536292 2972959 2772964 2873065 2617146 2506241 2585589 2585536 2739520 2537243 2333852
6284 2333852 2342337 2602300 2917808 2266041 2692868 2984592 2655191 2660661 2277415 2267134
6274 2267134 2135376 2244657 2436568 2832774 2562700 2066768 2409554 2819763 2868816 2424336
6264 2424336 2690859 2774666 2435548 2653732 2526325 2872804 3178435 2761958 2317626 2170424
6254 2170424 2081431 2621171 2435700 2038749 2385880 1973104 1940304 1980769 2074042 2640445
6244 2640445 2557640 2728669 2354485 2110166 2214692 2344715 2060593 1749312 1439288 1865214
6234 1865214 2055578 2307576 2733475 2305942 1902645 1867302 1528606 1398413 1861505 2036935
6224 2036935 2163583 2498755 2367559 2238413 2099363 1916395 2323943 1611806 1453019 1954797
6214 1954797 2034256 1842681 1697963 1842417 1774494 1551405 1417353 1810337 1685993 1072012
6204 1072012 1580291 1842413 1892778 1854009 1542815 1745923 1809281 1779538 2114051 2022517
6194 2022517 1968924 1520303 1877705 1445556 1505928 1533329 2058692 2094775 1939835 2180900
6184 2180900 1767995 1705155 1440954 1696343 1327206 1200608 1889301 1367776 1162005 713257
6174 713257 1335053 1664107 2191734 2358503 2034434 1548904 1732145 1954188 2072287 2067346
6164 2067346 1550115 1485508 1721842 1795414 1726086 1880200 1626447 1699709 1095496 1132716
6154 1132716 949718 1502738 1488581 1351061 1121706 1463968 1994842 1991472 1690274 1629746
6144 1629746 1348733 1619772 1346470 1025153 1116291 1598735 1599913 1557229 1799709 1381644
6134 1381644 1495093 2020982 1920945 1555329 1174035 1084426 784012 1257196 1331242 1597428
6124 1597428 1807931 1482951 1611330 1636298 2029960 2276714 2121179 1564168 1500351 1236404
6114 1236404 1235665 1183124 1265485 1341514 1468582 1229313 999316 911501 1140243 1431315 1508390
6103 1508390 2006926 1592003 1009716 1487270 1782436 1375485 1345653 1510310 1053502 830062
6093 830062 1063528 1014711 1412278 1278225 1347641 1874504 1547528 679650 997895 1445726
6083 1445726 1175456 893935 1129184 1127649 978296 477565 431744 1186538 1069178 847521
6073 847521 560104 673372 1316847 1468466 1280960 939552 1230063 1346954 1382926 877430
6063 877430 640613 593393 645549 719842 644401 1070793 1002558 1499769 1038809 1021259 1050821
6052 1050821 1321105 1033060 1220842 1307340 695835 843928 1027061 1445706 1457117 708537
6042 708537 702791 1028352 969668 960243 1076730 816253 1168391 1584578 931467 1082652 1190827
6031 1190827 1206434 1260989 886030 591140 935984 766599 851620 1370088 1133759 876567
6021 876567 744636 544008 1166244 974234 969971 1034358 608297 488080 724636 961022
6011 961022 687990 595779 407541 604079 448746 262666 659083 1393730 1428781 1326461
6001 1326461 763305 748659 410410 526921 270874 162960 -49352 433700 1091953 1105224
5991 1105224 746016 1033490 811413 947287 856758 511676 375602 616078 900200 745946
5981 745946 1238591 779259 801066 653005 620719 398845 134480 426473 470440 242845
5971 242845 710949 929626 182048 77363 364574 463252 186760 506323 787646 809805
5961 809805 430256 17326 589131 347872 630531 113500 420639 521409 735403 1201830
5951 1201830 1227571 769161 263118 472209 422388 532297 276107 -179265 73145 262205
5941 262205 143045 525488 263192 56448 474409 493558 946936 567994 549159 371609
5931 371609 451952 496228 833872 510758 69113 760762 641155 903591 813527 690795
5921 690795 712214 818626 545136 550241 356186 552523 547699 77233 400693 358326 412771
5910 412771 239072 417567 566180 431286 444640 163445 91976 80148 170114 288351
5900 288351 309215 409241 307538 607440 -215972 -189137 562251 508930 668455 737921
5890 737921 257623 227329 358315 27875 164970 933389 506573 315811 256161 -104517
5880 -104517 -65889 533375 425539 -26939 60928 129152 239589 -196078 -253181 -217163 458823
5869 458823 611520 800689 180786 322543 346191 -37537 369122 339081 185352 462942
5859 462942 537626 348037 -37609 115787 699470 434467 325317 3324 -190247 -199526
5849 -199526 -673525 -187071 329784 299894 284834 529108 449200 -79871 145988 304810
5839 304810 357980 96612 751193 594597 125308 -109540 -26241 -418652 -477535 -218467
5829 -218467 -460371 -61979 -206794 -106850 130958 480722 612918 181895 57527 366062
5819 366062 104222 59294 -52692 -63965 116089 326505 397664 596829 932712 721665
5809 721665 367782 -6855 -260125 -369789 -607066 -95650 -153588 -16521 114857 85160
5799 85160 -91827 -191522 -189814 406555 -49049 280239 723370 42413 -514659 -425134 -384866
5788 -384866 -6884 329997 -56439 -398156 -134065 -760507 -753062 -59674 -393360 -201501
5778 -201501 -123317 -36182 -533669 -373280 -26749 -334402 -443963 -397157 122674 285884
5768 285884 56406 95593 430108 222758 -303350 -161511 -404619 -105755 -214540 -337846
5758 -337846 135474 429808 130888 -240970 -29514 556718 401504 6614 -46758 62727
5748 62727 -121332 119373 -207669 -308310 208623 -241196 -221111 28126 83078 -345383
5738 -345383 -725028 -56629 260350 387166 469450 250959 -71259 -149497 -111280 150857
5728 150857 86304 -255585 -165319 -94578 -638779 -522763 -542336 -449301 294541 -127232 -213695
5717 -213695 169889 188768 -4697 -474878 -515120 -535446 -656027 -72843 -93265 -502870
5707 -502870 -689517 -431119 -320051 -434803 -458697 -210645 76946 -73448 158725 96380
5697 96380 -71320 18501 168491 54093 23231 67619 240597 288112 442724 268128 268914
5686 268914 -669379 -523049 -385422 -389822 -461037 -762263 -587844 -180530 -440243 -671952
5676 -671952 -322044 -40516 227140 -483435 -571739 -347545 -151710 -562468 -597962 -404468
5666 -404468 -181764 49597 180735 26270 -130264 -599184 -663013 -371417 -210947 -261211
5656 -261211 -278520 -625204 -487426 -457642 -757748 -529424 -483338 -173492 -550988 -352069
5646 -352069 -487988 -588333 -835895 -1163122 -1273388 -380341 -646610 -716539 -598186 -572133
5636 -572133 267460 -94716 -336854 -909018 -464847 -512254 -213599 -177189 -296256 -774203
5626 -774203 -1037297 -851229 -626463 -362801 -1205643 -1056117 -1331993 -1365364 -839795 -299406
5616 -299406 -397734 -223758 259813 -492213 -755522 -866504 -873551 -505552 -554715 -367833
5606 -367833 -534924 -1017434 -1043990 -529108 -272763 -801189 -283236 -284210 -315805 395103 -353679
5595 -353679 -245932 -199802 -436773 -185601 -327269 -65604 -465691 -5218 -281926 -454660
5585 -454660 28640 -210516 -581814 -1084628 -1187760 -773205 -691521 -68537 -254456 222082
5575 222082 -24234 -110392 -443291 -695731 -464102 -664189 -445718 -335702 -257419 -354938
5565 -354938 -665722 -345901 51617 225946 159533 -400623 -255004 -609024 -618488 -403032
5555 -403032 -991675 -1305054 -860595 -569500 -448925 -346257 -641998 -152120 114848 17230
5545 17230 -461302 -539537 -550175 -461124 -122152 -167478 -556847 -33188 325040 374689 -180830
5534 -180830 -98327 291824 -192669 -293664 -52491 348545 -13588 -279711 -416643 -143529
5524 -143529 -432741 -679303 -445074 -121565 -711352 -361652 -144448 -128230 -224673 -616155
5514 -616155 -364655 -301964 -338044 -15378 -333203 -493084 192465 -138975 -191867 171758
5504 171758 -56578 73148 -389159 -212068 220225 247550 -28633 -250050 305582 135955
5494 135955 -194880 -163822 -520183 133744 -249965 -185639 57946 -208783 -194458 -324516
5484 -324516 -472535 -342278 -149849 -620781 -543408 -495004 -826254 -673908 -825187 -635945
5474 -635945 -706377 -140421 2522 -604841 -710189 -486461 -401764 -444256 -521966 -483222 -515776
5463 -515776 -954644 -965450 -281166 -338106 -138938 -341513 -271938 -297402 -560916 -449894
5453 -449894 -398095 -367072 -396349 -246495 -127096 -682038 -756582 -703783 -657450 -744156 -404779
5442 -404779 -535683 -727598 -832520 -918406 -714349 -169821 -390476 -797819 -942336 -907687
5432 -907687 -587547 -689101 -1195686 -1095480 -880257 -1361801 -814511 -1109303 -937950 -823604
5422 -823604 -744105 -1200354 -801588 -450923 -589412 -654121 -461646 -397528 -700476 -625173
5412 -625173 -553841 -447166 -252869 -560325 -576435 -879763 -1048435 -1162665 -747511 -1092576
5402 -1092576 -810051 -837181 -871976 -320922 -251554 -542359 -564144 -747037 -931783 -700346
5392 -700346 -641168 -773250 -1054818 -855773 -919271 -1263208 -1188592 -832027 -536019 -542910 -191105
5381 -191105 -631934 -603993 -959193 -773908 -625061 -548931 -988411 -1153622 -1169327 -870371
5371 -870371 -685258 -818151 -988390 -780390 -414603 -524671 -837440 -875091 -835506 -771419
5361 -771419 -819235 -641983 -121117 -305102 -587073 -626875 -453488 -504383 -372327 -248037
5351 -248037 -412535 -838879 -540684 -644977 -1129416 -789836 -481685 -794295 -1235424 -1698569
5341 -1698569 -1386488 -823800 -1136474 -897725 -1063465 -1237440 -552792 -424874 -745963 -386694
5331 -386694 -187908 -1003643 -833328 -1344268 -1134073 -743520 -1011677 -876426 -478296 132215
5321 132215 -467687 -1229666 -1125857 -985481 -1165611 -914140 -933079 -1251095 -1011367 -1209192
5311 -1209192 -698384 -1220360 -796402 -642030 -445903 -490073 -631965 -454177 -1817 -178119
5301 -178119 -295623 -497138 -261332 -203342 -530147 -626528 -84520 60939 -923151 -800381
5291 -800381 -411362 -679643 -720900 -517335 -761443 -887264 -826661 -830627 -802117 -800422 -690454
5280 -690454 -502653 -644117 -876483 -988157 -1134596 -1214742 -1103921 -741954 -441546 -807403
5270 -807403 -890328 -516972 -320962 -668395 -912504 -1085753 -1220608 -472139 -274947 -511950
5260 -511950 -582204 -663881 -1084266 -384793 -448238 -959607 -676063 -718622 -625349 -384848 -728985
5249 -728985 -1229515 -1311947 -608582 -433741 -138217 -171608 -766661 -579188 -383041 -458252
5239 -458252 -791638 -1042923 -934370 -1326470 -1139510 -489149 -769976 -1036967 -1113683 -619149
5229 -619149 -617766 -651982 -205020 -418319 -324097 -159329 -192378 -229763 -125765 -161467 -110852
5218 -110852 -361842 -473313 -650337 -617317 -460878 -715978 -401691 -676403 19824 -335884
5208 -335884 -415937 -528608 -493670 -730241 -719459 -407721 -335158 -952761 -989509 -846335 -477526
5197 -477526 -589209 -668572 -780865 -764393 -534375 -235300 -370847 -716406 -688426 -278418
5187 -278418 -331793 -385592 -471334 -745528 -634843 -1022354 -843177 -479161 -476720 -482799 -757861
5176 -757861 -928828 -516293 -50307 -98846 -344426 -577074 -350071 -668573 -876980 -362166
5166 -362166 -384895 -1635216 -1446538 -1327884 -1173298 -1017659 -758904 -456703 -567667 -568588
5156 -568588 -572201 -474749 -671123 -291076 -558879 -861834 -740629 -884244 -1030459 -366303
5146 -366303 -155231 -615134 -568346 -595755 -903767 -1203465 -1066397 -538111 -273600 -192154
5136 -192154 -93122 -157229 124379 582 -1073738 -1082971 -772127 -430063 -354550 -465718
5126 -465718 -436190 -552027 -1165826 -1011633 -907975 -1034143 -827795 -1029150 -782207 -935763
5116 -935763 -910883 -456197 -363610 -378720 -262404 -555643 -1016105 -592185 -83182 12726
5106 12726 -17736 27557 -34648 32816 -295476 -345083 -1075087 -591802 -318331 -355384 -257015
5095 -257015 154983 174511 153466 -125213 14084 -7891 380729 238840 114456 430692
5085 430692 271277 -372527 -11338 182672 -116854 -70453 146018 405519 399998 44634
5075 44634 -20520 -93767 34973 433956 187859 395271 321423 423503 462374 284731 595846
5064 595846 487136 -39872 -396612 -15084 223289 -254803 -684671 -463643 -375845 -770535
5054 -770535 -441516 -508969 -425755 132191 349227 -214083 -234080 -112303 -395381 -307723
5044 -307723 -132260 -622361 -676053 -803497 -952684 -1077139 -800135 -945767 -717755 -240570
5034 -240570 -400279 -855551 -712834 -877800 -820385 -1207313 -746493 -488767 -900497 -492475
5024 -492475 -639139 -727756 -992396 57724 -367511 -604774 -933896 -1216746 -1252362 -1068761
5014 -1068761 -501533 -297459 -289571 -177952 -809839 -683831 -668590 -360471 -143149 -257115
5004 -257115 -276582 -824673 -273347 -998509 -943598 -1051711 -935458 -1011732 -490743 -641430
4994 -641430 -850130 -505202 -831901 -463670 -101393 -144580 -368613 -564888 -231500 -586288
4984 -586288 -674752 -316799 -410773 -997011 -646825 -557522 4141 -31976 -581113 -917576
4974 -917576 -611821 -800051 -955122 -390236 -320775 81135 146111 5050 -130136 -645539
4964 -645539 -617213 -1108118 -1150672 -692687 -387677 -472387 -123228 -565853 -715898 -605210
4954 -605210 -720140 -537903 -911722 -665284 -670991 -835431 -831835 -958693 -737182 -488959
4944 -488959 -709054 -616642 -828164 -536869 -413674 -414508 -628704 -555275 -739498 -1008831 -1352942
4933 -1352942 -1201056 -587225 -804662 -956382 -909139 -331954 57525 -212831 -985369 -906328
4923 -906328 -914626 -1350567 -1104662 -1116210 -655181 -361455 -877274 -1410156 -910719 -1102681
4913 -1102681 -773248 -868755 -886596 -921812 -1270171 -1141685 -1146883 -1167986 -1182963 -1183655 -1149554
4902 -1149554 -817132 -753876 -1211971 -1036190 -847183 -262865 -447062 -814139 -373367 -468548
4892 -468548 -1249581 -1311029 -1227692 -686135 -478536 -653431 -1168768 -1476198 -1266111 -984225
4882 -984225 -1064971 -937998 -690648 -860908 -734184 -537536 -532665 -778934 -735592 -426710
4872 -426710 -365874 -734197 -1069476 -784732 -482923 -642357 -1037017 -1046783 -979827 -857544
4862 -857544 -712995 -605929 -769057 -962780 -1098808 -839355 -1231439 -1547263 -900576 -943452
4852 -943452 -1204265 -1037396 -696847 -1012203 -1094172 -891665 -842557 -946197 -1146974 -1213970
4842 -1213970 -684799 -459015 -1005542 -1199823 -743916 -446995 -823390 -1061008 -1271429 -1100851
4832 -1100851 -867422 -586380 -646092 -749161 -846705 -989487 -897692 -798054 -627529 -877688
4822 -877688 -717894 -467388 -477522 -319397 -1198135 -878305 48352 -105041 -688676 -1144091
4812 -1144091 -580819 -619744 -529361 -906430 -741458 -692393 -634207 -690927 -445410 -1399684
4802 -1399684 -1213279 -1069553 -1219475 -852938 -637516 -534410 -363987 -450969 -573676 -464316
4792 -464316 -465787 -345232 -410924 -685107 -494025 -232717 -63020 -265004 -263175 -651904 -833393
4781 -833393 -613250 -710724 -845973 -753680 -713149 -724365 -677206 -373990 -696600 -625856 -793288
4770 -793288 -348918 -190301 -597275 -261051 -770801 -797366 -156008 -44591 -323195 -261847
4760 -261847 -662448 -527542 -306294 -724271 -589282 -314523 -937313 -1099493 -893044 -810556
4750 -810556 -558400 -842834 -646397 -608142 -532856 -766608 -1095081 -676520 168051 25843
4740 25843 -818985 -825308 -650454 -444416 -260292 -312211 -1448197 -434844 -671076 -1033572
4730 -1033572 -1031413 -863330 -379829 -329779 -465147 -284526 -22128 -385065 -245054 12661
4720 12661 -680064 -353185 48318 380777 -123163 -17795 678 -33480 -167232 -319460
4710 -319460 -652834 -725393 -558124 -131869 -384349 -671833 -242852 -644663 -749254 -619599
4700 -619599 -409581 122705 12150 -445804 -719508 -415136 -404915 -595135 -376153 -268210
4690 -268210 -428346 -232780 -313763 -330842 -283302 -780382 -717370 -833519 -560311 -690835
4680 -690835 -477648 -472188 -362879 -13708 -533687 -455720 -413406 -415427 233 188680 36626
4669 36626 -609961 -610179 -341276 -448754 -1275635 -700708 -222956 -52636 -175546 191619
4659 191619 548649 271112 326191 -129778 -655248 -365909 -288578 -450946 -353317 -333584
4649 -333584 -870872 -655130 -829896 -626854 -729563 -283801 -305318 -153923 -226329 14300
4639 14300 -751789 -579042 199111 -658619 -497743 -248044 -492782 -669757 -376087 -274368
4629 -274368 70223 -100352 13052 -770308 -508002 -233497 -514600 -199248 -591562 -239598
4619 -239598 -299702 -576256 -456045 -521485 -958728 -402290 -215244 -299307 -111279 -197956
4609 -197956 -323726 -791718 -457934 -860695 -394397 -314516 -237787 -295951 -445450 -386380
4599 -386380 -984734 -467181 127099 37234 -136627 -820342 -390331 -478507 -450317 -415821
4589 -415821 -662432 -498720 -124800 -191926 -278161 -264699 -100345 176968 -475265 -657493
4579 -657493 -937753 -862092 -362666 -464787 -501260 -482118 -123148 -276760 -365478 -57386
4569 -57386 -171207 -121003 -273837 -50636 174017 -119669 -518522 -499183 -314697 -659789
4559 -659789 -712194 -159805 148651 -235779 -808947 -909334 -374593 -633917 -435147 -500427
4549 -500427 -425390 -385746 -381900 -56704 -361922 101547 -212562 -302468 -147583 -63377 -247713
4538 -247713 -158772 -414299 -954054 -601030 -541561 -801833 -507556 -227691 49409 121937
4528 121937 443469 202272 -232521 -211544 -205385 -99078 66476 -110973 -163931 -206020 -673207
4517 -673207 -803320 -465222 -462035 -473534 -792161 -1211021 -1188501 -1107642 -782367 -428110 -457513
4506 -457513 -570910 -114498 -319829 -470070 -429468 -523989 -279465 -70870 -348912 -370232
4496 -370232 211149 163462 -43872 234962 -64165 -99483 -664745 -566698 -444732 -496985
4486 -496985 4594 -229722 -515489 -313910 -298779 -454213 46307 87498 -309973 -285172
4476 -285172 -387377 -139435 -222917 -33864 171669 -30260 -316214 -281305 -371575 36495
4466 36495 294133 108389 325730 116830 536074 190657 8460 -231268 -349801 354081
4456 354081 3415 271564 92622 172349 827440 529854 299253 393423 356498 1444
4446 1444 315105 558277 415458 321146 682975 897662 1149074 1031253 1169775 1559836
4436 1559836 1373745 1343763 1600311 1754000 2330059 2226487 2340387 2178809 1954098 1945171
4426 1945171 2228666 2174983 2127958 2170371 1784181 1504718 1160801 990230 419219 424694
4416 424694 802642 395491 836771 797816 346056 188740 321206 443824 959003 919938
4406 919938 509423 218144 173475 135268 164196 -136087 -98696 50073 43677 259212 230171
4395 230171 411589 -107050 -413229 -461587 -1048 -513495 -617331 -142236 135478 -17563
4385 -17563 77178 66188 149882 280430 193584 408675 361937 -377359 64325 309967 -15089
4374 -15089 -126957 270509 -35959 -209848 414574 366262 -162576 -481439 -298461 -43249
4364 -43249 -120354 492499 917319 429425 347975 659400 357173 46145 669159 1039589
4354 1039589 57177 -111620 25987 358092 439650 121314 27886 40553 367535 45317
4344 45317 -170400 224565 24425 -89671 -454662 -758667 148758 212194 -285626 -182781
4334 -182781 -91287 -590769 -111500 -252120 -547393 64664 24178 -329877 -563041 18442
4324 18442 283722 146947 177482 -156628 380204 313348 824292 701149 328745 -57678
4314 -57678 -51140 286733 350404 202787 280740 256838 -404293 -614230 -339936 -329325 -40440
4303 -40440 -44786 -52904 15461 -69073 -261008 -201225 -233825 -284217 -328841 2913 -178898 -102687
4291 -102687 567104 428099 311587 194966 -282666 55465 386466 -61976 -20937 -143983
4281 -143983 -186308 -387894 154661 -389600 -279685 -219169 179221 114604 -313237 -175265
4271 -175265 -82223 175825 35525 -152433 522276 817555 309866 -208215 320461 420424
4261 420424 -130589 -126430 199893 107536 124587 354211 95361 -8035 55102 343828 339302
4250 339302 -325163 412905 901689 1152156 659901 -100290 421489 516251 143217 -84432
4240 -84432 744208 -78683 -306715 289401 321572 185794 413504 776922 238782 367682
4230 367682 614573 394405 670498 284056 393931 455514 342833 646256 991890 1251560
4220 1251560 1049696 928457 830930 356796 878436 859041 886747 887448 615789 752306 1353752
4209 1353752 1340944 1538416 1670810 1277315 858260 1288616 1181254 1089333 1677901 1364551
4199 1364551 1039605 1199072 984353 1554997 2050647 2084299 2136947 1582238 1895774 1795507
4189 1795507 1500734 1851082 2589988 2093968 1612223 2129551 2194040 1703780 1980097 1939225
4179 1939225 2041998 2424253 2392565 2276864 2210608 2059659 2110166 2455144 2776670 2749375
4169 2749375 2869746 2281053 2333421 2643077 2934792 2656265 2933376 3170550 3099690 3471786
4159 3471786 3410789 3835274 3804030 3736033 3776803 4337149 4235209 4136325 4842490 5048386
4149 5048386 4492612 4329595 4749910 4772671 5076264 4964445 5447878 5678992 6334269 6715570
4139 6715570 6626077 6981517 6856711 6784773 7083128 7342431 7097508 7329960 7054787 7553402
4129 7553402 8007047 7857254 7792046 7848640 7926729 7781125 7160032 6433954 6066953 5976941
4119 5976941 5807944 5496949 5110847 5125417 5463205 5285345 5350798 5578102 5065213 5097407
4109 5097407 5361644 5525747 5547431 5720158 5813510 5294233 5209982 5191286 5219184 5790592
4099 5790592 6211354 5353967 5701589 5959238 5905598 5933041 5903343 5905459 6334609 6753063
4089 6753063 6608451 6672017 7325373 7588829 7501810 8178358 8782185 9082631 9725620 10411920
4079 10411920 10508101 10749117 11597919 12188900 12775216 13260273 13880787 15045254 15537728
4070 15537728 16039296 16929578 17961392 18703448 18893711 19178632 19855580 18848108 18092010
4061 18092010 17521375 16252586 15373812 14585715 12400595 11444203 10986109 9942215 9125403
4052 9125403 8457208 8105883 7377620 6850142 6142634 5575783 5447190 5684741 5628024 5580532
4042 5580532 4784373 4936749 5217438 4585757 3463650 3915491 3888514 3596117 3359082 3376250
4032 3376250 3709530 3315855 3335934 3311103 3227819 2952450 2710582 2614326 2513316 2247806
4022 2247806 2583069 2476588 2185442 2195539 2530115 2442103 2109013 1832892 1994283 2288463
4012 2288463 2297666 2133180 2429771 1641464 1717115 1774068 1864226 2108526 1708243 1219354
4002 1219354 1692804 1677741 1804494 1634931 1427960 1465219 1911188 1869816 1459516 1665204
3992 1665204 1543590 1521812 1602258 1744061 1873369 1655666 1626444 1550871 1245961 1109698
3982 1109698 916100 1430807 912140 1152785 1509796 1031922 1356162 1494356 1276798 1838849
3972 1838849 1830988 1451718 1018495 1071173 1465136 1962881 1499594 1213302 1082356 1007958
3962 1007958 1477327 1981909 1346150 1213724 566466 376298 729060 828509 1017993 1517972
3952 1517972 1311273 1124743 1026787 561038 1071094 1314297 1481746 1355754 1066154 1014838
3942 1014838 1560604 1504580 1382423 1505093 1340252 1570044 1468797 1046627 864679 614878
3932 614878 671650 1092772 862896 727315 1193805 1362518 1413962 1654812 1080130 1262519
3922 1262519 1215152 1626416 1964972 1310025 1711530 1319061 995663 1426373 1421751 1658378
3912 1658378 1341305 1890549 2061430 1208820 1341735 1238879 801433 611489 967314 737074
3902 737074 1555223 1536421 1240756 1268535 1388001 1242403 1220107 1202688 1080420 930884
3892 930884 439673 581061 656824 541576 816021 641883 442190 1081075 1127590 858708
3882 858708 641904 543324 529790 317695 468733 870062 764997 342585 1161905 900000
3872 900000 799444 554858 681667 942578 1212807 1192644 1012242 1169929 1065232 1176857
3862 1176857 524722 403127 628653 1059211 951630 1137970 989385 1196668 1250311 931133
3852 931133 1079675 1197439 673852 599582 496794 589250 687860 1005115 1270872 933139
3842 933139 684289 796814 525632 471829 120557 194967 519893 460003 459781 368393 727512
3831 727512 815750 788294 1021124 1195460 845035 1063095 950093 695181 625340 545954
3821 545954 811129 727174 685820 872686 945186 869674 868985 662732 789831 515852 529321
3810 529321 1062212 329266 750229 933651 587250 473864 906089 802928 783003 1053017
3800 1053017 1167745 1110241 1200639 1032140 763962 1034595 1147811 1299559 655559 1140383
3790 1140383 1022062 620806 1185192 588590 621772 462601 454650 1074289 1456160 1517960
3780 1517960 805606 531518 1007342 1017389 1358463 1628550 1390339 1221829 1245998 1190668
3770 1190668 1079186 773700 893973 1148836 744704 882143 1063968 1230500 1407067 1452430
3760 1452430 1405997 1740574 2138365 1623079 1082356 670618 1190251 1523943 968445 764180
3750 764180 867729 1639514 1525659 1351304 1636831 1472138 1574050 1344205 1376775 1732894
3740 1732894 1400143 1868082 1478043 1814991 1452783 1787676 2233130 1243229 1493659 1566992
3730 1566992 2030244 2177100 2224404 2496320 2459617 2140232 2410432 2090338 1984094 1725004
3720 1725004 1639804 2103105 1899524 2257598 2240080 1881891 2086217 2182632 2260491 2562231
3710 2562231 2416044 2541946 2266376 1988641 2548689 2542227 2520546 2465114 2376394 2659865
3700 2659865 2829103 2811647 2892619 2544009 2777462 2785614 2678570 2866631 2687935 2963046
3690 2963046 2512636 3190791 2943320 2905474 2665058 3017362 3220211 3077494 3051637 2743136
3680 2743136 3125598 3368907 3007865 2794366 2904348 3048197 2604499 2616534 2287840 2068637
3670 2068637 2944405 2717280 2430408 2766555 2443873 2456210 2716898 2689151 2874011 2843560
3660 2843560 2965951 2818361 2952424 2697792 3068771 3037249 3069262 2814395 2222232 2378291
3650 2378291 2676050 2829000 3185970 3027831 3261465 2827937 2826113 2925958 3046109 3256722
3640 3256722 3177466 2903436 3617814 3480187 3171797 3500473 3135363 3178001 3117119 3105165
3630 3105165 2708686 2866183 3094257 2711489 3001659 3506794 3694883 3348644 3208781 3111052
3620 3111052 2725032 3045051 3695365 3754794 3067374 2879588 2934118 3536748 3626146 3528725
3610 3528725 3989682 4028747 3481549 3040143 3490761 3307741 3284353 3440349 3900989 3735512
3600 3735512 3508918 4337180 4165838 3619249 3414192 3320750 3461645 3626123 3691776 3502729
3590 3502729 3788433 4209894 4056285 3807109 3464732 3188229 3186871 3620738 3850977 3271313
3580 3271313 3656641 3742352 3511361 3556508 3501096 3541091 3718438 3711455 3355274 3829727 4093865
3569 4093865 4097229 3746014 3399160 3991193 4362716 4270936 4506979 4290443 4461753 4320737
3559 4320737 4530325 4757665 4425004 4236836 4409436 4351613 4467031 4409127 4752784 4924174
3549 4924174 4927095 5017683 5181260 5243522 5063745 4988036 4424484 5213542 5184347 5408900 5336991
3538 5336991 5373053 5212485 4908390 5427610 5166646 5732260 5992606 6070157 6238845 6369338
3528 6369338 6094086 6274737 6542827 6406032 6420081 6616561 6064831 6202340 6449395 6489109
3518 6489109 6492173 6901071 6816097 6876896 6992413 7205295 7113768 7654975 7778673 7617777
3508 7617777 7757690 7955992 7708240 7641432 7877960 7825511 8007747 8072506 7710531 7524698
3498 7524698 8296513 7976047 7874978 7972412 8082306 8600264 8711978 8570685 8604793 8247222
3488 8247222 8164651 8324669 8575305 8532162 8420053 8506427 8044868 8151577 8973046 8820055
3478 8820055 8692072 8422030 8657281 8749753 8484488 8335631 8532206 8358234 8269235 8272557
3468 8272557 8126946 8362129 8508222 8385229 8301205 8222877 8415876 8397054 7553257 8025757
3458 8025757 8582549 8901591 8904760 8615532 8674564 8460249 8663971 8676083 9079654 8765041
3448 8765041 8970771 9419016 9724955 9820416 10377065 10253793 10265177 10650271 10287207 10452432
3438 10452432 11128532 10644404 10386839 10296121 11002923 10875401 11320328 11301459 11832818 11976348
3428 11976348 11485220 11554250 11131811 11797271 11873436 11953510 11929606 11877698 11938015 12314858
3418 12314858 12066654 11927534 11870424 12294627 12303312 12333081 12636245 12594347 12598244 13414259 13474282
3407 13474282 13237462 12957546 12512946 12952057 13342169 13587722 13285396 13735342 14716715
3398 14716715 14646767 15027280 15414303 15937431 16607776 16922641 17647500 18245838 18393865 19231680
3388 19231680 20491546 21368784 21943063 22469994 23200041 24190131 25213655 26717830 26344248
3379 26344248 24877618 23048603 20949955 18832213 17413017 16391580 15800646 15109414
3371 15109414 14537430 13726349 13062505 13219859 12730531 12385686 12151235 12330520 12912183
3362 12912183 12335905 12267354 12050331 12315687 12172081 11925614 11707917 11726917 12159524 12434513
3352 12434513 12128461 11387688 11334552 11627223 11805252 11712784 11876620 11729724 11970988 11459806
3342 11459806 10917799 11179912 10701608 11088931 11528646 11012943 11649671 11623351 11661446 11414079
3332 11414079 11408693 11763781 11372269 11419289 11801679 11799956 11624402 11265860 11972710 11736502
3322 11736502 11396756 11646218 11226488 11176895 11162031 11091468 11348379 11664678 11266013 11762699
3312 11762699 11718023 11676998 12107678 12248663 11958884 11822116 11967967 11770059 12175278 12520566
3302 12520566 12132223 12072890 12186445 11647305 11660033 11479032 11639993 12198166 12186687 11889419
3292 11889419 12240707 11845608 11460481 12020158 12438711 12480354 12323196 12253472 12247458 12190820
3282 12190820 11337033 11425751 12425731 12532972 12040811 12462195 12787550 12625093 12348622 12046804
3272 12046804 12269651 12177713 12220871 12006290 11764457 12277351 12762501 12986094 12719484 12732242
3262 12732242 12637686 12198208 12517684 12917268 12619845 12207551 12644052 12372167 12228474 12184152
3252 12184152 12595149 12573560 12534113 12818000 12926097 12986259 13450617 13383698 12854093 12708379
3242 12708379 12075904 11817792 12146194 12806198 12890069 12511111 12914327 12716520 12640541 12904827
3232 12904827 13252988 13189116 12325604 12684429 12977190 12576285 12468118 12456187 12705771 12948610
3222 12948610 12544305 12755575 12675398 12922935 13310050 12813913 12583743 13110387 12814671 12807691
3212 12807691 12990896 12981294 13054782 12642468 12350672 12790349 12817185 12964312 13580751 12618930
3202 12618930 13224215 13021548 12894092 12869189 12869295 12988144 13090246 13461500 13092792 13013250
3192 13013250 13049490 13104114 13107899 12867868 13268260 13315506 13782963 13466289 13137556 13168648
3182 13168648 12776960 12794447 12738874 13194480 13136611 13348829 12990080 12899960 13087035 13168860
3172 13168860 13263086 13566091 13124365 12645032 12854020 13292059 13348829 13764477 13381440 13795791
3162 13795791 13328857 13503090 13955643 13949967 13908203 14014149 13912220 13769853 13860405 14074122
3152 14074122 14059841 13887064 13972516 14116980 14236722 14369752 14559236 14468315 14751641 14633734
3142 14633734 14469791 14271862 14275777 14807745 15155817 14978473 15187574 15848513 16048290 15907033
3132 15907033 16392372 16380453 15830412 16365400 16512540 16431573 16641099 17039891 16954923 17095794
3122 17095794 16795683 16793841 17289190 17229640 16726643 17354298 17656555 17164646 16416393 16463165
3112 16463165 16574670 16116465 15720912 15509917 15563004 15333420 15526330 15128218 14956449 14562784
3102 14562784 14425878 14185469 13941504 13553841 13945032 13732502 13686563 13069802 12834680 12661600
3092 12661600 12608565 12566253 12647260 13206217 12885409 12335259 11969846 12313596 12395145 11452966
3082 11452966 11350565 11659366 11550142 11668401 11804399 11009356 10961480 10753362 10748388 10653065
3072 10653065 10337714 10388059 10700739 11001450 10736139 10515439 10303519 10410166 10754861 10469348
3062 10469348 10178676 9580222 9756820 9800705 9547533 9241791 8796869 9073505 9092300 9163736
3052 9163736 8880416 9234919 9605362 9478705 9781557 8857881 8424845 8450127 8228175 8183321
3042 8183321 8601565 8929045 8759446 8755573 8183766 7700383 7672950 7900422 8146823 8238112
3032 8238112 8227700 8054886 7722653 7770107 7765405 7424052 7124577 6480734 6603448 6831547
3022 6831547 7098598 6951690 7281299 7386277 7645919 7775910 6810720 6661915 6847427 7221909
3012 7221909 6915238 6807015 6526288 6483323 6564662 6439946 6283394 6432535 6349825 6812793
3002 6812793 6617299 6441230 6665325 6707308 6188162 6816747 6887749 6917722 7004223 6405627
2992 6405627 6876209 6690100 5879286 5886867 5932276 5966416 5740945 6030824 6174063 6505962
2982 6505962 6593322 6131162 6244755 5984368 5378230 5378671 5270039 5737375 5991737 5709355
2972 5709355 5433790 5367891 5768369 5781441 5677656 5804383 5809003 5565656 5174035 5266416
2962 5266416 5241210 5350187 4945997 5161464 5518996 4826552 4579074 4837245 5374140 4898366
2952 4898366 5079676 4867778 4962476 5072584 4994151 4569876 5045831 4653531 4269137 4877200
2942 4877200 4954025 4769043 4525492 4575801 4589917 4767976 4768093 4712284 5149105 4757872 4626728
2931 4626728 4685841 4544947 5095652 4539179 4723241 4601687 4505480 4702629 4882370 4523190
2921 4523190 4350497 4120771 4526982 4669894 4530320 4821130 4314730 3976554 4282111 3673196
2911 3673196 3436695 3615948 3848895 3968981 3871674 3535475 3940510 4590411 4401531 4055538
2901 4055538 3765326 4130354 3731384 3876461 3766074 3385579 3268328 3876626 3671551 3179993
2891 3179993 3273521 3476284 3133901 3157969 3522249 3783156 3537931 3642149 3907069 3805580
2881 3805580 4009592 3786818 3805824 4154420 3512251 3064325 3444406 3828765 3728598 3711363
2871 3711363 3826359 3818112 3889242 3720912 3850767 3913882 3609534 3884458 3902885 4099427
2861 4099427 4113233 3840520 3417452 3585364 3478789 3542906 3788105 4065990 3908791 4141167
2851 4141167 4120299 3964762 3722962 3747925 3903387 4007411 3907382 3970838 4595946 4695092
2841 4695092 4385405 4211276 4340169 4803230 4933417 4698363 4908052 4733515 4934089 4598564
2831 4598564 4639350 4687040 4524356 4609560 4621560 4786711 4710626 4382402 4407640 5026994 5481433
2820 5481433 5304371 5292778 4815826 4893899 5291121 5336095 5015136 5097653 5078088 5555067
2810 5555067 5966689 5671529 5490161 5438440 5967240 6282454 6819606 6827849 6486046 6950085
2800 6950085 6952646 6800105 6991522 7846096 8011975 8797097 8367140 8311868 9409916 9860215
2790 9860215 10067803 10411916 11295861 11820392 12074504 12960036 13536003 13769159 13707036 14032201
2780 14032201 14670639 15195299 15065001 14786312 14613038 13592172 12986656 12441440 11958270
2771 11958270 10583771 10390328 10152352 9255424 8699680 7935436 7137295 6411857 6394483
2762 6394483 6375915 6202547 6219769 5810268 5353864 4956501 5052141 5192587 4722819 4940842
2752 4940842 4786973 4468891 4551435 4695112 4119229 4112887 3927944 3532102 3075071 3256723
2742 3256723 3510345 3346563 3329016 2785448 2999789 2688593 2690665 3198114 3075352 2532785
2732 2532785 2529222 2378600 2630065 2778660 2728791 2830646 2748379 2756025 2512245 2315773 2287221
2721 2287221 2131524 2198422 2383807 1962523 1480551 2122915 2241090 1581044 1760824 1565212
2711 1565212 1371485 1800521 1540361 1041268 1104742 1224380 1543491 1767639 1679198 1745778
2701 1745778 1280711 991447 1621320 1619670 1446057 1100516 1465464 1504451 1561444 1268090
2691 1268090 1187474 1450010 1228651 1172370 730943 1337129 1723066 1908506 1685751 1524579
2681 1524579 1037663 889145 892026 1211104 1357023 1366112 1104761 683388 683346 857542 994116
2670 994116 890605 1246480 1025304 1081698 1066641 709182 613587 774659 719069 388626
2660 388626 402466 431986 884865 1037023 1230701 1648543 1411838 1242543 1069265 915308
2650 915308 970173 863255 1120721 922386 1039207 280697 212217 1090620 1056106 1044666
2640 1044666 766948 438861 335065 595160 183836 200193 475493 387274 121773 18786
2630 18786 -213208 335621 737193 422589 675643 585810 378134 400286 408198 519484 383828
2619 383828 346086 93883 148767 215809 407766 528911 813374 891227 123195 591678
2609 591678 632420 1069065 631542 576752 687247 177959 281034 71453 173212 129342
2599 129342 6189 188153 -341539 -188948 -81858 197805 483694 242608 624399 642183
2589 642183 664702 558615 792403 1051400 555959 479070 1239020 860989 490830 154345
2579 154345 887558 1103817 830659 789284 512987 503865 132338 -38744 -70637 -63824 144957
2568 144957 -58181 129087 410406 -288157 -463769 -149450 -102826 -207395 503649 957718
2558 957718 374272 826006 348179 -57441 147347 -132019 -170731 689007 710703 577787
2548 577787 286742 166298 614909 638472 340308 -189453 -278854 -311423 212454 499326
2538 499326 361291 549592 750333 410804 880234 818441 91369 278635 500489 303039
2528 303039 234036 423202 305719 405762 684511 242909 -169157 562105 342650 229552
2518 229552 866935 842662 791483 625488 654588 1017313 1023329 772783 476903 696378 549133
2507 549133 139102 -37367 291388 925755 989965 1133951 996984 1021537 653486 551014
2497 551014 653282 678329 1244731 1346656 1212732 943068 890873 1500874 760368 1010701
2487 1010701 1100563 1370570 1704316 1022382 409874 758413 576355 748021 913678 996834
2477 996834 813599 1219971 1445080 1209189 1332139 1045994 1804947 1686935 979757 949445
2467 949445 699940 644475 175675 -241847 705146 606568 681435 840092 842055 326675 111281
2456 111281 281628 420697 1172075 928877 913669 995038 424076 506642 611030 1114853
2446 1114853 1354170 762379 732508 927065 607290 238711 142794 840670 705485 676651
2436 676651 577383 616249 334843 609865 868399 733029 554407 465049 693606 562602
2426 562602 406310 507888 792004 590264 425202 425591 757464 386845 291325 204897 222730
2415 222730 -92725 181829 164735 23700 296410 -680786 -417579 -426620 -406975 103879
2405 103879 173732 143948 -251623 -90113 -445899 -83100 200497 -188429 -573892 -727736
2395 -727736 -366031 -324716 -40079 -646236 -735698 -683318 -535878 -410011 -598025 -901960
2385 -901960 -545446 -613090 -518966 -564826 -532552 -190771 -371919 -217085 259204 -76784
2375 -76784 -541504 -32572 -196514 -156712 -334708 -86091 -382547 -459193 -409160 125136
2365 125136 -348663 -1035010 -515253 -349375 -134575 -112872 -157906 -148514 -333180 -477525
2355 -477525 -948047 -767578 -593565 -469128 -399060 218888 -131109 -215800 -823593 -564839
2345 -564839 -448693 -520848 142178 -252300 -426044 -1110152 -990446 -707620 -699059 -829293
2335 -829293 -840916 -527959 -534148 -727440 -1014271 -675460 -471738 -810779 -483674 -168977
2325 -168977 85978 -562645 -429950 -398308 -784431 -799064 -1036204 -630585 -708206 -654988
2315 -654988 -239805 -384976 -52003 -128443 -816200 -1346536 -1179086 -838639 -649613 -466621
2305 -466621 -987848 -1034902 -1029697 -987160 -795245 -845526 -877854 -1413408 -1249607 -1530914 -924124
2294 -924124 -638877 -699417 -750793 -446943 -592476 -1139327 -1169695 -841807 -918894 -875382 -1192635
2283 -1192635 -823710 -743505 -360813 -245751 -390243 -361195 -271844 -164404 -449506 -542676
2273 -542676 -692168 -866426 -1027697 -945007 -1148570 -686693 -833611 -1262598 -792257 -453604
2263 -453604 -870770 -816204 -1355255 -1482552 -1039460 -1106638 -1090787 -450911 -412626 -860836
2253 -860836 -630113 -597959 -488991 -537607 -544931 -646448 -755470 -471865 -513505 -319565 -499831
2242 -499831 -858517 -1560639 -1638112 -1251899 -941256 -1057879 -591532 -936068 -1412419 -1611059
2232 -1611059 -1558444 -1328397 -1602382 -1039514 -670523 -918250 -1013411 -1011414 -698939 -522424
2222 -522424 -630962 -312356 -477322 -917443 -735861 -887486 -771395 -789641 -1197428 -1087878
2212 -1087878 -720349 -893444 -1169265 -1032363 -528344 -865185 -951643 -1054933 -1220137 -785025
2202 -785025 -788606 -742718 -878187 -567839 -449274 -401833 -724681 -935153 -894808 -739977 -695854
2191 -695854 -490992 -375710 -1181003 -621920 -609141 -528509 -711809 -758155 -846469 -513471
2181 -513471 -550463 -1010754 -680258 -877213 -718884 -840912 -886884 -633722 -1031797 -1177663
2171 -1177663 -1037844 -1331141 -610278 -788349 -1258541 -937182 -592750 -1049529 -1268014 -1412834
2161 -1412834 -1048438 -1151146 -1340841 -808465 -657621 -280410 -446393 -620425 -419677 -822666
2151 -822666 -647795 -479255 -664952 -1120311 -1454142 -1537958 -1559170 -1097272 -486968 -429826
2141 -429826 -271945 -565472 -886173 -1504684 -1119128 -939057 -573828 -959092 -1811457 -874856
2131 -874856 -807022 -863089 -1299633 -1020743 -530284 -839403 -807206 -429189 -733724 -593692
2121 -593692 -493825 -744946 -779394 -479546 -1115668 -1031102 -1217750 -1023743 -725918 -896404
2111 -896404 -709198 -706619 -610555 -435209 -497244 -1142481 -876173 -729974 -689144 -695483 -893723
2100 -893723 -987055 -610009 -585053 -791690 -919499 -964529 -638763 -591403 -780117 -518762
2090 -518762 -415480 -464723 -650240 -641831 -179064 268070 -464550 -814932 -269180 -544904
2080 -544904 -636120 -618269 -952864 -977760 -649467 -779688 -871246 -191041 -408566 -716252
2070 -716252 -911635 -958173 -578165 -667941 -927498 -959575 -703100 -841095 -685988 -804614
2060 -804614 -1009473 -657163 -356856 -869194 -640427 -458751 -781892 -763145 -1203172 -1463011
2050 -1463011 -1040443 -759527 -594599 -215833 -430318 -237283 -519889 -995689 -215082 -104872
2040 -104872 -163010 -49267 -495276 -451193 -762838 -642739 -578889 -129141 218854 -627875
2030 -627875 -631317 -349354 -624685 -823844 -658718 -317201 -182295 -344875 -826048 -706272
2020 -706272 -164583 -287415 38077 68419 -158430 -343135 -666810 -433155 -781765 -550330
2010 -550330 -252554 -37832 516991 413998 636890 -92726 -469592 649348 557105 433900
2000 433900 133232 -116511 344205 82144 349763 998538 1336435 1221847 914740 1278856
1990 1278856 982963 702614 675701 277702 531635 189275 194000 349251 153867 135797
1980 135797 337497 -39763 -186758 -578028 -211477 169284 194226 -14438 -319365 130697
1970 130697 -529986 -554433 -24501 60162 276040 -113131 -76908 -349113 -411115 320658
1960 320658 424116 300229 -279311 104017 348397 -219144 288007 426366 17152 235227
1950 235227 560029 548614 62605 -95101 101036 451736 299862 199147 303540 489083
1940 489083 883417 539885 534235 -23156 -468449 548638 608353 285952 -19563 340364
1930 340364 342703 488828 335641 381416 529245 799579 832943 449359 776374 797431 982102
1919 982102 361744 -10026 240444 806308 687646 799395 1233673 1147415 764624 703667
1909 703667 674461 787337 677223 1081643 1381632 884155 694617 1005635 814158 1078444
1899 1078444 1349889 1013524 1152465 1264154 928966 435351 290317 1017717 1544351 1499611
1889 1499611 1119298 1329749 1662582 1477009 1639078 2075885 2600283 2329845 2154513 1601799
1879 1601799 1960013 2312404 2661463 2872593 2558041 2624883 3225451 3336713 3153760 3215979
1869 3215979 3007418 3164631 3128160 3294041 3124330 3621272 3807957 3345753 3270538 3681483
1859 3681483 3980782 3949332 3833753 3764186 4122452 4709095 5388194 4987887 4807791 5476071
1849 5476071 5324204 4900191 5645311 5869427 5769595 5827386 5946726 5608036 5838265 6656442
1839 6656442 6642826 5804358 6265147 7095921 7362834 7501282 7603879 7680753 8230768 7891736
1829 7891736 7410183 7245336 7586645 7767829 7612456 8337585 8653372 8794578 8742775 8816960
1819 8816960 9081428 9419188 9395430 9776790 10582946 10754390 11304714 11409927 11670698 11390389
1809 11390389 11709044 12082326 12754382 13095478 12839638 13306797 13697553 14054740 14353038
1800 14353038 15023524 15755443 15731395 15915775 17201849 17836796 18508020 19349205 20203999
1791 20203999 21117106 21902357 22917884 24109888 25419835 27215777 28515862 30062283
1783 30062283 31767910 33119807 35098438 37489224 39498281 41644870 43302508 46101151
1775 46101151 48807420 51785040 54970484 58355453 61901696 66948835 72210285 78243121
1767 78243121 85378935 93601537 102355523 111074374 121432951 133254237 146102100 159294275
1759 159294275 174329844 189680756 206440277 225848982 245878299 267505191 292345913
1752 292345913 297231464 269245843 231573204 199658953 173190990 148278642 127407512
1745 127407512 111156239 98549787 88016856 79178573 72549141 67121199 62217865 57338099
1737 57338099 52838119 48804356 45222997 42002506 39366935 37336220 34665896 32615604
1729 32615604 30831271 29199050 27148346 25861846 24459147 23595834 22335263 20491410
1721 20491410 20008796 19748244 18516473 17781204 17675632 16727037 15827577 15559552 15267206
1712 15267206 14680689 14606185 13957889 13133742 12729372 12119520 11161893 11405761 11064101 10975722
1702 10975722 10274020 10165015 10024068 9579902 9375396 9226647 8993224 9402399 8837571
1693 8837571 7868576 7797439 7428532 7176859 7099291 6875573 6932110 6454540 6303853 6251663
1683 6251663 5910475 6279367 6233608 5435704 5297396 5237740 4427434 4928228 4838815 4097257
1673 4097257 4664256 4182105 4117475 4080439 4135419 3641050 3740892 3692568 3452064 3662820
1663 3662820 3520482 3302743 3257036 3359274 3235880 2575205 2882649 3003242 3449607 3697757
1653 3697757 4023436 3704500 3457579 4010183 3062992 3245956 2657983 2494089 2421175 2191305
1643 2191305 1980789 1978740 2170479 1706221 2089561 2274789 2056884 1839737 1579444 1155995
1633 1155995 1412626 1796857 1895435 1979446 1717952 2040345 1925958 1824357 1649000 1550539
1623 1550539 1337781 1300726 1168541 1399481 1667225 1462256 1479759 1629363 1477226 1462815
1613 1462815 1402284 1315248 1652862 1837246 1082496 895291 1414392 1635521 1286294 1373624
1603 1373624 1483480 1474020 1078261 974475 1020053 1812896 1292102 1183717 642351 762298
1593 762298 885173 905317 853646 569123 721673 525106 931111 628084 494909 961434
1583 961434 1013097 1078023 1244585 681298 762748 874858 1076351 859188 908513 581187
1573 581187 592385 564725 133529 450100 791736 959138 777820 316186 88387 309401
1563 309401 519122 326520 252336 730052 834444 617311 905837 612163 667881 484395
1553 484395 552155 713255 474442 342018 478580 463681 387478 627576 627213 536300 890396
1542 890396 992775 882902 639777 285439 -57831 -176833 33945 -60210 207961 934801
1532 934801 973649 717416 454709 471911 514343 671070 176248 226253 610883 603635 880236
1521 880236 309663 175149 880480 345529 739287 1260401 1280266 1244835 1309894 1472328
1511 1472328 1728780 1954072 1214713 1175468 1763932 2002881 1421818 794550 249250 -203466
1501 -203466 486283 590160 41146 329475 172014 526632 467065 755051 603588 491570
1491 491570 546741 -129096 -339875 -761442 30399 -29392 -201416 86389 -93216 -16545
1481 -16545 -90534 90648 -217809 12524 -149939 -210770 -332358 55044 -22772 -232645
1471 -232645 -594190 -192790 -373235 -528126 -509999 -60610 339785 40423 -230904 189660
1461 189660 368658 -258859 -168930 -505020 -361087 -323479 120085 486460 506159 -172947
1451 -172947 -90258 71746 229759 79465 -904187 -664100 -53521 -6200 -49477 -135618
1441 -135618 79869 443739 526377 -331889 -172495 83942 94244 -28593 189451 -25513
1431 -25513 -42843 -71578 -399454 -314198 -695768 -484685 -354903 221852 156364 372850 561801
1420 561801 570091 292632 -79225 -367946 -498610 -257729 -424373 -410334 -806695 -780456
1410 -780456 -191190 -80646 -319808 -67773 -25288 -341747 -777599 -530042 62877 -8271
1400 -8271 -81842 -289863 -223021 -271546 377651 346951 4356 -162657 72544 -54093 69844
1389 69844 105087 -568124 -183634 -211476 92819 -568491 -412851 289370 153032 -123307
1379 -123307 -161796 -531114 -526747 -818708 -514390 -423551 -353005 -635367 -427735 -530088 -201904
1368 -201904 -101306 -86223 468718 63507 39332 -213287 -269722 -592907 -123734 -356898
1358 -356898 -428802 -169544 -404440 -307820 -640203 -481396 -587019 145919 593428 -181864
1348 -181864 -282609 -130341 -281778 -935630 -821933 -369127 -57654 -37992 -108945 -78236
1338 -78236 -320171 -505820 -192772 -418982 -432999 -110468 55921 -555355 103441 -171444
1328 -171444 400946 352869 8111 -741262 -980396 -678119 -712237 -509490 -349711 -616839
1318 -616839 -657945 -243968 -345824 -283266 -485077 -724097 -553289 104364 157920 -244067
1308 -244067 -418820 -333529 -711574 -1177346 -942941 -531877 -379753 -146321 126141 51229
1298 51229 -124398 -253384 -155951 -217 179614 233185 -424431 -242007 -281223 277368
1288 277368 -224175 -483683 -310824 -334185 -268392 -163177 -303021 193899 537980 -131077
1278 -131077 -453528 -560635 -535261 -255576 -326746 -252531 -449342 -503626 -246501 -104072
1268 -104072 -65310 -472049 -303753 206575 64848 -495761 -453641 -3989 -481158 -606866
1258 -606866 -890516 -938002 -263469 -451921 -446145 -179944 -72689 -508461 -314512 153363
1248 153363 131176 1873 -923219 -941558 -614727 -617294 -265616 -726357 -632946 -32384 99859
1237 99859 -19021 170670 -226950 -1064216 -852218 -234304 -104670 408514 257834 101500
1227 101500 -381682 -769366 -521621 -767915 -587891 -108748 298091 238320 -501978 -1058438
1217 -1058438 -759496 -1001906 -1196810 -680068 -707846 -397380 -515345 -348110 -221064 19445
1207 19445 -204575 -250665 72984 107325 -231652 23592 -169281 -169525 72773 -100194 -9342
1196 -9342 229073 666251 -317168 254438 -135634 14647 23612 -282540 -366696 -476116 -496456
1185 -496456 -344596 90086 160051 28515 259701 -299337 -488765 -559094 -486269 25469
1175 25469 -489175 -558497 -458967 4551 -566841 -467832 22567 -115704 -54528 -505763 -206722
1164 -206722 -352996 -262367 -469552 -552811 -311188 -11581 -219657 -525549 -271632 366277
1154 366277 522949 184317 454910 484123 225537 -627592 -821176 -980360 -88700 -87056
1144 -87056 -332428 -241225 -123751 -405847 -231202 -485061 -656051 -352341 -244346 -383091
1134 -383091 -53529 -60659 -635006 -724358 -513754 139015 188300 -213783 72484 459557
1124 459557 -328456 -508644 -217596 -520986 -356859 -16780 -400355 -368934 -242103 128921
1114 128921 -25907 -306255 -486483 -435843 -227649 -657955 -217611 -472491 -933059 -1046006
1104 -1046006 -525978 -169547 -491844 -536614 -222844 -470977 -207584 14496 156760 -330291
1094 -330291 -606822 -345468 -772005 -444418 -138367 -106132 71389 143439 -201251 -573158
1084 -573158 -144694 -190785 -564534 -312179 -104561 -69890 -951858 -423949 -8189 -102986
1074 -102986 -129167 -199641 -421528 -171952 209210 -298241 -596975 -399759 -44983 -168179
1064 -168179 -338062 -275470 -460570 -63705 116473 99515 -20914 -232677 -585638 -462064
1054 -462064 -674311 -1105802 -759280 -218418 -230830 -453036 51180 12709 477908 380823
1044 380823 174102 -165558 -498410 -220365 -636530 -655778 -422521 -126266 -645565 -255430
1034 -255430 -260014 12369 -761195 -905842 -438337 -226048 34145 -469677 -751257 12542
1024 12542 389355 37745 483860 490981 485311 272045 59617 -110084 -438743 -227654 126132
1013 126132 93768 -162870 -265784 -18984 -236348 -269086 -89940 166191 -222436 -52794
1003 -52794 -336276 -582362 -701593 -386186 -279071 112518 -232270 -307557 60302 -43769
993 -43769 -191505 -101482 700299 248141 -168069 -398993 210310 414400 -146826 408157
983 408157 219260 128152 240134 -117459 181878 444488 203885 -118038 -358800 173183
973 173183 147191 121269 -51948 147781 -97707 -37306 167606 -7777 -68480 184161 126875
962 126875 -90046 102308 221855 331413 -60440 -292683 -40949 -1220 -124542 -223901
952 -223901 -174656 248798 356558 342889 209327 -291737 -13965 407977 183757 38407
942 38407 291400 195940 185426 135482 103441 27513 -374964 -337434 -135252 54 -450196
931 -450196 -415558 -725833 -334207 -231767 -88791 -127087 -111279 119706 509147 -203734
921 -203734 -680780 -191504 -173782 -276560 -149510 52329 -46221 -576959 -786818 -282006
911 -282006 -54156 -569594 -90631 -230948 -471377 -382430 -511377 30890 -136569 -241165
901 -241165 -448794 -224798 51842 -607607 -460295 256327 774829 56340 -315320 -240414
891 -240414 -39999 -367585 -417524 -182449 -132196 -815017 -859705 -734990 -407134 -431693 -636394
880 -636394 -603627 -493536 -301735 -336878 1603 -55129 140240 180365 -126387 -134780 -224890
869 -224890 -352212 87990 261078 403574 275671 124144 -48416 3795 -274627 133282
859 133282 -230194 94590 194877 -107481 -117560 -294862 -296300 143470 -155885 -229173 -201179
848 -201179 -324081 -483800 -365322 -129506 71231 20422 -72803 -178900 -120564 440577
838 440577 -188303 -336253 505150 451372 469462 425074 -58142 12702 61355 506219 723046
827 723046 208225 167598 -14341 510634 202285 -111171 -288503 -42053 -28359 120025
817 120025 328855 348936 138064 453935 324524 -486379 192510 245778 -118814 160796
807 160796 533428 376563 4051 93434 364935 2677 -4248 113109 8519 718637
797 718637 372452 -76512 199420 -9604 86752 -114882 -302811 -614179 -449130 -545782
787 -545782 -193629 130286 -434012 27011 -40357 227373 449779 -67812 -224436 441148
777 441148 598366 -308172 -321098 -290792 -89132 -175418 232969 -104670 -294029 -294850 393887
766 393887 143735 -3798 239544 343262 596966 48295 15327 -137027 -671695 -808918
756 -808918 -706975 -854772 -463605 -162261 -509433 -145028 -486035 -620200 -497025 82546
746 82546 610615 81917 -194792 -96841 378370 300662 363897 728937 84321 163936 172671
735 172671 403073 -394 56296 170769 339825 13395 -61437 450105 511351 -107701
725 -107701 -582831 -315339 -421775 -383634 -99683 -586134 -482456 -352212 -82137 546069
715 546069 -53671 13674 -154957 112518 506130 593936 272704 398933 439072 42581
705 42581 125655 117479 -63574 251609 571555 561893 245081 480590 695638 207612 123119
694 123119 291430 338427 341643 -133043 -15208 157313 340709 315239 114130 72175 -45896
683 -45896 -144614 376565 150761 -153784 180977 164791 352486 673082 5575 33050 371092
672 371092 246898 -235059 107803 537662 564124 169191 575336 -53689 -295833 -323795
662 -323795 -475657 266107 619693 440943 488114 282827 319854 162737 424827 770528
652 770528 521992 206542 11782 471967 436781 67977 -211137 140399 214271 827320
642 827320 987748 1130029 75336 -406998 -638959 -531430 170838 86235 -25632 491673
632 491673 542398 112913 162675 236404 -264477 -610348 -453166 -684750 -19823 -9779 -101671
621 -101671 -17439 415940 204304 -643967 -458372 -91460 539889 277917 -20236 371248
611 371248 145929 -52301 -226394 -23779 441012 -82386 -78503 35434 65625 200656
601 200656 291340 -100227 -132148 156354 -17990 -21397 353871 474210 179097 682407 898295
590 898295 598540 160055 -47306 225997 82296 284989 301670 533671 473486 631537
580 631537 1000756 596369 252558 83480 -98050 630382 542427 262482 173874 -54433
570 -54433 -85617 -397542 23913 237879 338706 353409 691289 552577 90867 227246
560 227246 427856 329567 248375 270513 -131076 -174606 40424 172939 -190894 -412690 -243419
549 -243419 46125 -148646 -167781 16258 -71168 -186060 605580 618508 643155 241484 -248581
538 -248581 300761 321809 472136 413585 964057 702770 408968 334770 45446 476388
528 476388 223303 467503 390883 244013 223244 57318 49777 -300640 -217459 119640 -241164
517 -241164 -325224 -418132 -376011 -388704 -584335 -586195 70412 263340 -41545 158024 392884
506 392884 936888 270350 527549 503162 454255 134960 -165831 17421 327710 -80554
496 -80554 456663 512032 283420 122568 408360 460634 189818 29692 -205184 -282889 -308109
485 -308109 -211090 -49460 697687 488640 366322 223082 377681 301849 198919 355690
475 355690 457047 614829 675103 -182792 54954 677810 887 -450913 212984 478335
465 478335 213993 528771 277456 6835 -255764 235208 961739 907987 709052 -32172
455 -32172 -150488 307163 399798 296749 523618 6218 -142506 -264436 -190842 283343
445 283343 -123026 -333369 49136 241811 -334252 95386 226951 -216016 -201328 26878
435 26878 552650 191566 130265 210617 10847 322790 291976 210551 420715 860392 523114
424 523114 561384 200019 191776 343081 210244 504486 299422 -6316 122279 654323
414 654323 562733 337151 1598 -156553 93450 822199 841823 32858 -2902 585425
404 585425 1061763 782620 620791 532106 45794 -151145 115008 115822 115925 519886 460466
393 460466 196388 833230 652928 689176 109615 248684 239049 -1243 332892 496917
383 496917 571903 219332 118252 141904 620952 868343 725410 -72562 184938 352693
373 352693 378487 573680 842270 567202 402524 531063 776342 496406 517225 657665
363 657665 304300 165811 680792 678286 423759 190876 -15730 264864 196670 27691
353 27691 300240 472398 785652 653909 726670 610609 575068 495345 331296 302492 525613
342 525613 617711 489945 557054 730135 546559 858281 1088204 359254 685486 918959
332 918959 545058 655685 795001 1177537 1001837 909448 686742 568891 284871 -156227
322 -156227 294481 565295 358867 561949 161572 -184184 141526 364392 313680 324433
312 324433 585702 575241 423599 -113622 -10741 246183 644818 317476 74137 39413
302 39413 657994 568131 829397 346334 358987 348632 988010 615852 401540 579419 145694
291 145694 213244 171526 165020 965985 718255 662790 864417 641701 412520 307886 406560
280 406560 459474 606315 476638 834638 266098 458147 187660 -293234 -122988 218248
270 218248 202596 -8447 207206 651944 661644 521239 363658 371103 -61512 403221 11576
259 11576 75045 239072 644622 892572 930794 672147 213655 443709 817326 684326
249 684326 499132 693983 398753 250547 586518 932495 841479 393945 517316 453108
239 453108 653334 764632 699655 817404 412257 570658 293826 972558 1195783 562958
229 562958 587940 703773 356212 555092 373545 843183 1042631 833990 387750 325876
219 325876 311148 419711 258161 201364 498985 694627 474293 355861 351997 455434 571247
208 571247 554787 996362 445708 579650 408450 430517 316265 465350 763855 433956
198 433956 224881 208613 507429 280411 169357 684760 441940 269395 330223 406191
188 406191 645249 465171 452406 716994 735519 763345 1109949 873019 472082 116244
178 116244 -161650 17021 -215501 -147312 15056 241690 530528 888136 1131762 743379
168 743379 218398 464228 279144 4363 532426 1025786 334532 32920 160793 670694
158 670694 1167262 1029401 981034 873475 583397 508878 728180 709551 367898 230959
148 230959 556773 253764 697387 767258 390419 383565 111147 320814 618143 743735
138 743735 934647 891446 1384864 1453758 835946 688644 690330 640926 712761 406429 354098
127 354098 730080 752983 455218 446229 808066 823750 573398 615229 164976 286036 803206
116 803206 729535 545379 645571 722639 655578 302757 66255 278292 646285 731646 629941
105 629941 567397 671761 541981 375848 458352 409265 334993 775017 1121100 923192 722359
94 722359 384701 -298574 -320481 265799 188346 163861 494663 462805 549301 532977 401080
83 401080 437967 584876 428623 266487 226675 259668 722959 478696 550962 647887 783712
72 783712 869508 508324 399248 865625 834909 1108232 416112 400153 636518 449521 817876
61 817876 1053546 508664 703732 607711 377590 613979 818277 628045 600469 919174
51 919174 527009 409510 305449 358626 152470 29872 -171883 403372 429018 643926
41 643926 716364 927483 818775 504399 906557 994687 777939 585781 595775 785746 513726
30 513726 633628 570445 397955 444472 471358 770547 315184 247996 241301 613651 411521
19 411521 327567 641886 452898 861731 749841 506579 488918 603414 728174 813211 835956
8 835956 662065 639105 830130 832502 718973 585017 550195 94682
0 94682
$$ Imaginary data points
##PAGE= N=2
##DATA TABLE= (X++(I..I)), XYDATA
16383 -2674907 -2744223 -2927633 -2723736 -2698284 -3021928 -2981400 -3395994 -3253896 -2702067 -2650766
16373 -2650766 -2670073 -2928326 -2823971 -2568525 -2431979 -2052435 -2350711 -2600302 -2532434 -2435066
16363 -2435066 -2335037 -2278773 -2347797 -2228664 -2286916 -2052717 -1895142 -1725553 -1878038 -1747573
16353 -1747573 -1675211 -1983460 -1475765 -1687542 -1709733 -1817490 -1551444 -1279739 -1439482 -1419246
16343 -1419246 -1290507 -1320119 -1015513 -570504 -1021857 -1311850 -1279444 -938891 -942085 -794387
16333 -794387 -624169 -322778 -467692 -867031 -952296 -662987 -1062193 -1219947 -808106 -662612
16323 -662612 -502868 -535127 -660858 -446910 -120135 -168535 -101932 8758 -204172 -251650
16313 -251650 -175102 159032 143834 -103250 189883 70668 -297529 -145971 -161681 -23172
16303 -23172 159699 48900 -79052 174492 422917 468642 173833 -180135 -164564 189318
16293 189318 181700 378017 886181 697914 746347 413453 550173 956305 699428 239185
16283 239185 807528 687165 708816 234238 140877 500352 799173 1141021 1291851 1295506
16273 1295506 1429081 1546923 1349604 1343451 1529471 1406293 1314105 1417667 1552868 1536949
16263 1536949 1268325 1639474 1563226 1619098 1454245 1321436 1295553 1382896 1522239 1659780
16253 1659780 1651035 1529638 1845905 2214288 2296914 2000598 1500407 1535325 1501226 1662808
16243 1662808 1919914 1969652 1875166 2255901 1834794 2125422 2218372 1960453 1738268 1805978
16233 1805978 1820129 1879445 2064246 1880232 2274042 2248175 1834456 1522685 2031385 2150810
16223 2150810 2422790 2417921 2455181 2826257 2190459 2392422 2119264 2226826 2693740 2700656
16213 2700656 2458687 2381238 3037441 2346541 2212281 2585094 2583284 2519172 2739519 2435215
16203 2435215 2709447 2699499 2786889 2748892 2599873 2638594 2502003 2822120 3232803 2562659
16193 2562659 2387660 2195546 2224988 2326126 2576688 2849760 2622500 2621296 2822285 3016724
16183 3016724 3070762 3122849 3151456 3418277 3626326 3213733 3860292 3637930 3258780 3032273
16173 3032273 2874685 2947218 2761253 2962386 2789940 2866923 2681425 3447597 3482602 3310834
16163 3310834 3424580 2971192 2925854 3311705 3418571 3537488 3260453 3173876 2704494 3153825
16153 3153825 3320300 3358623 3551807 3047631 3026529 3278189 3191639 2933857 3553944 3658176
16143 3658176 3549524 3459355 3528752 3636086 3351463 3478205 3806751 3621103 3607307 3217634
16133 3217634 3108248 3419217 3159439 3161919 3085892 3244962 2977270 3429725 3346425 3366475
16123 3366475 3689147 3358789 3167106 3586118 3617748 3516993 3410748 3639100 3699662 3399021
16113 3399021 3584261 3264270 3668920 3669373 3617652 3711064 3431915 3740196 3387878 3672283
16103 3672283 3701565 3492952 4142376 3589943 3441355 3446250 3454798 3853872 3501863 3146312
16093 3146312 2773436 2632059 3106946 3356522 3322226 3463533 3447281 3616493 4002529 3898052
16083 3898052 3457123 3941366 3133630 3526479 3870765 3841162 3699194 3609945 3815211 3656582
16073 3656582 3639098 3676818 4075548 3563890 4187520 4554973 3856329 3784955 4053534 3673022
16063 3673022 3196971 3138306 3987843 3992515 3789343 3958108 4038707 3734683 3662409 3818556
16053 3818556 3800341 3985364 3833412 3933126 4207143 3934105 3578602 3575602 3859025 3456873
16043 3456873 2982467 3331750 3576706 3811274 3744315 3877033 4184724 3622995 3631607 3492813
16033 3492813 3533386 3406067 3457480 3404848 3834229 3814534 3843690 3506444 3042574 3800854
16023 3800854 3463438 3101230 3144198 3549218 3878734 4053206 4085203 3764630 3977835 4265992
16013 4265992 3974669 3697611 3948669 3793615 4220563 3938482 3960290 3925012 4153286 4025403
16003 4025403 3754918 3643813 3992068 4279702 4132184 3604409 3912386 4035333 3931533
15994 3931533 3335063 3589386 3960121 3566353 3989378 3788732 3430219 3201006 3777318
15985 3777318 3649060 3833044 3228532 3485966 3826835 3570716 3266378 3261315 3640972 3357010
15975 3357010 3752894 4475573 4120743 4362440 3685907 3372499 3646710 3252084 3429743
15966 3429743 3709153 3761066 3970951 4022232 4120375 3879774 3699176 3480343 3495462 3652115
15956 3652115 3708087 3874338 3588172 3444583 3663389 3449853 3762439 3352924 3934280 3678798
15946 3678798 3786796 3877085 3382165 3390863 3693522 3485361 2830030 2858651 3337296 3551859
15936 3551859 3633665 3759518 3662554 4094289 3667001 3509540 3472788 3090961 3390588 3470266
15926 3470266 3659825 3925688 4038766 3920778 3641202 3557909 3790968 3885636 3333603 3693265
15916 3693265 3846511 3853656 3203780 2854142 3363035 3889165 4024005 3667571 3884928 3924584
15906 3924584 3761939 3673690 3480884 3846075 4262207 3918724 3551775 3841571 3558018 3871911
15896 3871911 3844236 4351967 3882321 3751785 4104960 3702155 3724773 3659847 3541170 3379612
15886 3379612 3955614 4295961 4122597 3697705 3820807 3653196 3848296 4037015 4029447 4612239
15876 4612239 4411635 4016464 3762111 3826906 3845670 4272609 4033940 4054603 3678714 3153214
15866 3153214 3301467 3448960 3984563 3907546 4428217 4355061 3627120 3781805 3711930 3942149
15856 3942149 3915698 3905495 3617317 3463112 3383514 3848253 4547481 4258290 4284837 4089761
15846 4089761 3775321 3244538 3347365 3644270 3698669 3863340 3773430 3673290 3636727 3435601
15836 3435601 3711325 4204048 3929118 3807632 3433998 3664952 3880549 3623069 3023711
15827 3023711 3476120 4080763 3562776 3321971 3489047 3852514 3866722 3827454 3979367 4240810
15817 4240810 4202922 3809343 3779974 4003066 4085939 3811798 3676505 4031203 3901419 4145567
15807 4145567 4142905 4054579 3900135 3978658 3728708 3485967 3263180 3407994 3566062 3408153
15797 3408153 3978070 4452518 4164825 3762603 4169459 3755364 3640664 3708738 3854355 3642227
15787 3642227 3904169 3841912 3603076 3979619 3713269 3673737 3269285 3779889 3601399 4093012
15777 4093012 4480985 4141934 4059207 4151360 3683789 3452637 3246007 3556003 3377254 3331829
15767 3331829 3478136 3488691 3636099 3341428 3413898 3128822 3923345 4064397 3373769 3324811
15757 3324811 3485414 4091715 4192245 3928869 3784090 3609370 3477865 3546183 3210419 2944187
15747 2944187 3154740 3290374 3562507 3538620 3848230 3657947 3490346 3619653 3837907 3965360
15737 3965360 3643803 3739974 3466851 3247720 3708816 3716966 3593054 4253487 4230697 4034370
15727 4034370 3945295 3788400 3586940 3372676 3690948 3276314 3481460 3504208 3378886 3522654
15717 3522654 3867119 4000555 4017282 4042534 3534809 3574000 3667165 3419817 3577081 3469977
15707 3469977 3307658 3392596 3417239 3303758 3553542 3774493 3809398 3723811 3378372 3473301
15697 3473301 3660758 3890245 4027348 4296337 3699789 3926071 4102761 4100484 3438300 3188872
15687 3188872 3150137 3180596 3655328 3690084 3696417 4031801 4115111 3501607 4104549 4168691 3807749
15676 3807749 3310853 3672163 3626226 3783689 4146440 4289271 3651265 3567552 3728416 4028773
15666 4028773 3420942 2887747 3607288 3452926 2988803 3814808 4311444 3812151 3542672
15657 3542672 3586266 3135520 3346584 3018630 3287798 3564030 3968984 3976523 3816395 3739934
15647 3739934 3677144 4110602 3938847 3741109 4078622 3850050 3652578 3576720 3398147 3930701
15637 3930701 3847998 3996851 4165515 4230229 3388654 3713952 3474726 4225650 4130869 3903696
15627 3903696 3967129 4340397 4180864 3100293 3737434 3908474 3803026 3957033 3483469
15618 3483469 3595102 3595102 3527101 3961242 3927378 3653860 3747212 3815462 4111766 4267314 3793968
15607 3793968 3654873 4167272 3912066 3670734 3528289 3543618 3184010 3828505 4275529 3687130
15597 3687130 3568141 3658450 3726361 3001921 3416360 4143203 3978979 3911123 3779988 3845629
15587 3845629 3517524 3720606 3783406 3934557 3619139 3362238 2910450 3276892 3185211 3503743
15577 3503743 3797545 3116846 3736231 3584796 4132896 4241965 4055634 4040749 3558018 2999582
15567 2999582 3242695 3852103 3836341 3430142 3529857 3610300 3823158 3930563 3728617 4080332
15557 4080332 3991920 3741368 3721794 4158790 3974885 3634028 3989433 4092828 4013439 3790202
15547 3790202 4469046 4747103 4374291 3816422 3753403 3768218 3367082 3381999 3632081 3307466
15537 3307466 3473835 3469444 3715851 4002850 4160016 3834878 3625063 3779404 4273395 4451294
15527 4451294 4093405 3875024 3897299 3567876 3355128 3373160 3627044 3747044 3614990 3419546
15517 3419546 4030445 4193461 4012754 4080773 3933059 3387096 3363788 3928359 4011624 3708662
15507 3708662 3556138 4170140 4700688 3872356 4080478 4056962 3608733 3856468 3365917 3520902
15497 3520902 3989672 3770499 3542008 3812710 3769524 3571417 3372760 3313071 3602771 3452097
15487 3452097 3291088 3395408 3785711 3629382 3393023 3980762 4073629 3454031 3341867 3785216
15477 3785216 3970500 4088185 3757230 3696789 3956706 3626782 4031718 4026737 3982442 3892139
15467 3892139 3225851 3970631 3764175 4193562 4349788 4358451 4354176 4593383 4863649 4121193
15457 4121193 3744620 3861350 3966836 3785347 3393258 3535475 3825892 3810411 3434434 3507827
15447 3507827 3441736 3742436 4042997 4252376 3946286 3872491 3652903 4041621 3657363 3368813
15437 3368813 3421427 3788534 3768808 3571757 3993867 3886298 3950847 3692496 3896017 4273563
15427 4273563 4395180 4621334 4336434 4444237 4051119 3812410 3726209 3564889 3988462 3941424
15417 3941424 4095691 4587599 4184834 4199355 3846867 3531526 3616873 3416294 3517632 3332335
15407 3332335 3769142 3915427 4141524 4096963 4174427 4025289 3941691 3553311 3692081 3477824
15397 3477824 3652259 3447568 3214111 3684312 4236608 3912079 3902335 3319093 2819765 3167181
15387 3167181 3993726 4292343 3685305 3456544 3345028 3222960 2994408 3218521 4049656
15378 4049656 4413500 4319417 4042039 4191687 4018153 3736820 4237714 4435516 4231420 3763585
15368 3763585 4407761 3875314 4047482 4175361 4157988 3582517 3622733 3858836 3532373 3652651
15358 3652651 3443577 3469521 3704095 3526755 4284507 3988463 3783855 4005617 3845841 4084778
15348 4084778 3759194 4346678 3989691 3941080 3737224 3925871 3955260 3498831 3487902 3715684
15338 3715684 3306291 3822727 3520094 3373581 3666972 3646008 3090886 3258378 3982703 3935400
15328 3935400 3542883 3857926 4159393 3801322 3685417 3550229 3433664 3343972 3378214 3416152
15318 3416152 3825481 3970954 4248147 4446147 3803982 3283044 3532004 3985930 3736308
15309 3736308 3737746 3895638 3770474 3788341 4126302 4568519 4342136 3723679 3760819 3922563
15299 3922563 3954413 3567550 3853587 4088650 3967894 4007252 3685312 3789759 4095022 3954350
15289 3954350 3502602 3777781 3076946 3426061 4054231 3764826 3522322 3390703 3318164 3744913
15279 3744913 4021811 3834057 4065181 4331076 4230128 4207256 4680215 4342625 3974931 3813146
15269 3813146 4080784 4034030 3958894 3938719 3673313 4093487 3956446 3953939 3819747 3649357
15259 3649357 4321062 4736275 4446108 4299588 3987960 3874769 3942234 4175655 4275828 4290628
15249 4290628 3575907 3837585 3967827 3775559 3329657 3378083 3742289 4103250 4328117 3835729
15239 3835729 4029090 3695174 3437905 4477052 4151563 4028403 4222190 3973092 4014753
15230 4014753 3930451 4089972 4012667 3338945 3714341 3619362 3319588 3608140 3635367 4110982
15220 4110982 3974035 3971463 4380544 3995700 3678726 3677759 4386455 4187220 4367625 4328834
15210 4328834 3297210 3253312 3609476 3688225 3599424 3933964 4183228 3715639 3342004 3781637
15200 3781637 3785186 4391003 3883148 3466868 3808030 3607758 3843056 3926283 3205998 3914268
15190 3914268 4532232 3911724 4316785 4415562 4401149 4439225 4006271 3883731 3863398 3912914
15180 3912914 3853180 3683483 3837353 4539830 4330825 3843753 3723825 3677161 3637546 3763628
15170 3763628 3141774 3413159 3831785 3828713 4143668 4235682 3885984 3726157 3791731 3754496
15160 3754496 3962280 3807135 3552063 3739624 4135687 3809130 4239524 4257227 3677668 3723238
15150 3723238 3767407 3799391 3727212 3982981 4017393 3606605 3901560 4092372 3597692 3691856
15140 3691856 3306022 3336152 3326971 3791682 3590088 3788754 4117798 3726255 3382900 3286063
15130 3286063 3616108 3791443 3572485 3946542 4192050 4795776 4382881 4001517 4327724
15121 4327724 3951150 3797369 4093832 4075879 3711972 3994319 3760314 3895234 4090918 3900403
15111 3900403 4085840 4575630 4559920 4230443 4392429 4422441 4125012 3384091 3378307 3671368
15101 3671368 3913075 3928927 3710769 4024984 4479258 4106106 3793797 3830234 4021143 4391887
15091 4391887 3786050 3896040 4328998 4101225 3996084 3974422 3743299 3918481 3858083 4119564
15081 4119564 3660267 3649083 3535820 3976301 3860608 4111303 4383855 3836565 3218657 3582188
15071 3582188 4523105 3783561 3963785 4082690 3449551 3467574 3787719 4108182 3415985 3900163
15061 3900163 4394411 4033387 4647545 4105322 3227273 3273267 3261310 3483113 3390192 3527829
15051 3527829 4394287 4661480 4521731 4127652 3921788 3592047 3670840 4255585 4043389 3885638
15041 3885638 4133649 4195583 3735089 3498150 3871127 3967980 4006927 3937006 4163423 4734780
15031 4734780 4617919 3986778 4172302 4226380 3915159 4195298 3967856 3918000 3989843 3795176
15021 3795176 4182107 4080452 3789336 4038232 3656914 4015654 3509536 3787236 3890814
15012 3890814 4174494 4291684 4139284 3934795 3744002 3499087 3780120 4031773 4247860
15003 4247860 4353254 3964932 4548115 4490990 3957163 4542313 4838606 4081019 4266695 3841443
14993 3841443 3673787 3605942 4060152 4284371 3801412 4233216 4746466 4862105 4524998 4403872
14983 4403872 4357228 4314161 4491667 3876981 3633536 3824666 3460640 3794670 3348737 3491297
14973 3491297 3565523 3714826 4297800 4136486 4416627 4253141 4118429 3776415 3874077 3868179
14963 3868179 4350568 4547751 4239626 4445718 3931385 3758101 4300463 3927622 4368112
14954 4368112 3612408 4334999 4153869 3824302 3879689 3439858 3487739 3792916 3421251 3573939
14944 3573939 3891721 3867948 3664852 3487443 3397462 3249037 3642644 3952082 3893983 3930620
14934 3930620 3992256 3730180 3525480 4096436 4341664 4084398 4109110 4109886 4172030 4123972 4359410
14923 4359410 4207463 4133542 3944049 3644109 4051400 4518738 3887363 4065127 4298174 3821503
14913 3821503 3722513 3954647 3668961 3957259 4708127 4762865 4582367 4630729 4033644 4288114
14903 4288114 4128354 4280101 4247729 4462267 4365566 4330868 4628912 4085259 4296907 4369899
14893 4369899 4109085 3970756 4400441 4649044 4612755 4211109 4204065 4102882 4413577 4204754
14883 4204754 4142274 4501360 4620283 4060872 3581944 4084763 4437163 4562644 4506236 4160772
14873 4160772 3773912 3865359 3734066 4589859 4365926 3417597 3861808 4111949 4243032 3962916
14863 3962916 4156124 3857770 3849674 3811203 3794893 4047344 3859444 3840588 3931236 3887071 3703255
14852 3703255 3842396 3912387 3318014 3326486 3978404 3758209 4002287 3940812 3849018 4088448
14842 4088448 3704676 3676349 4105783 4024909 3865592 3918106 4394264 4140525 3703147 4012050
14832 4012050 3900306 3771395 4366092 4155919 4440456 4162552 4006917 3987744 3291419 3744332
14822 3744332 4471643 4207711 4368733 3627010 3985484 4350171 4405415 4001063 3799917 3680241
14812 3680241 4014396 4070220 3906777 4287725 4283418 3985898 4111479 4064972 3782721 4057314
14802 4057314 3889508 3943244 3966178 3901916 3768632 4027813 4078066 4155138 3791830 4037312
14792 4037312 4217985 3809629 3891923 3786804 3582259 4027116 4242003 3828282 3875622 3723805
14782 3723805 3703411 3184042 3910346 4040629 3750224 3785339 3687504 3920496 4036803 3629880
14772 3629880 3756138 4102801 4067635 4105844 3853402 4034700 3552266 3833020 3851779 3747056
14762 3747056 3604951 3805661 3390790 3846013 3994075 3817039 3835048 4336882 3820752 4043362
14752 4043362 4165853 4019811 4232827 4357543 4204515 4328025 3900701 3755172 3980418
14743 3980418 3749530 3935417 3964707 3855219 3735942 3830235 4249118 4413098 4346672 4108721
14733 4108721 3887193 3594954 3545888 4099754 4177686 4326120 4298069 4460650 4403169 3850385
14723 3850385 3391395 3418749 3388955 3214765 3270228 3277919 3715772 4123105 4404549 3885734
14713 3885734 3812103 3899312 3835050 3601094 4218263 4474824 3850424 3895963 3964765 3708021
14703 3708021 3699882 3729173 3577205 3366867 3398195 4052375 4453181 4195070 4242985 4238506 4693474
14692 4693474 4608477 4234825 4269434 4285764 4151032 4108154 4603165 4561669 4043192 3675562
14682 3675562 4203564 4120616 4093889 3536794 3229308 3269371 3515833 4100306 4476314 4422396
14672 4422396 3990248 3798662 4291320 4341328 4362559 4003161 3940201 4096499 4259326 3914292
14662 3914292 3834262 3701667 4041068 4202936 3915259 4131372 4168445 4149742 4199281 3659770
14652 3659770 3839934 4296165 4196764 4361198 4650595 4584137 4580675 4222212 4265748 4294654
14642 4294654 4208878 4063739 4088314 4443670 4317193 3985303 3975538 4467841 4584949 4289496
14632 4289496 4607424 4237265 3907119 4021621 3836643 3860298 3626471 3686711 3941610 3965141
14622 3965141 4182736 4737427 4192972 4143032 4277398 4425313 4663902 4067932 4132627 4120292
14612 4120292 3972666 3810609 4269793 4351055 3817239 3698402 3594868 3330543 3559648 4102484
14602 4102484 4009192 3595837 3935640 4046601 4378574 4186754 3516590 3584289 3753374 4334688
14592 4334688 4075572 3964956 3365352 3305669 3815117 3601558 4019441 4344668 4196903 3945746
14582 3945746 3944848 4139292 4164282 4211398 3810638 3962488 3727820 3542302 3982395 3633828
14572 3633828 4208498 4319412 3828857 3691900 3791728 4231453 3734948 3927816 3255887 3731687
14562 3731687 3566480 3451415 4025539 3930075 3697349 3720470 4177712 4287883 4218139 3998224
14552 3998224 3920138 3533567 4068684 3983883 3892075 4353193 4269052 4390675 4342581 4216032
14542 4216032 4153258 3753814 3791497 3904219 4277026 4380048 3619419 4139427 3807838 3882847
14532 3882847 4495558 4502018 4406026 3760270 4311627 4104801 3655368 3989054 4152198 4728295
14522 4728295 4657944 4709931 4616258 4136079 4273521 4539354 4465946 3842496 3729417 4404998
14512 4404998 3824540 3355367 3498976 3767886 4361725 4231225 4047425 3658577 3609326 3991755
14502 3991755 4227690 3914745 3802513 3962657 3631476 3951929 3945952 3830078 4395087 4492188
14492 4492188 3804419 3641936 3708576 3668943 3628672 3567860 3643487 3246769 3450268 3655611
14482 3655611 3678583 3957425 4139696 3744857 3503957 3630155 3731220 4172057 4389418 4164627
14472 4164627 4139862 3339985 3468639 3993438 4382191 4483485 4187917 4198702 4554937 4521457
14462 4521457 4622877 4280271 4183107 3989477 3607118 3976664 4423461 4190505 4122389 3833673
14452 3833673 3553420 4155843 4135187 4360224 4010884 3645283 3841045 4462419 4250612 3719994
14442 3719994 4165174 4371289 3894278 4203824 4167723 4879816 4552466 4084345 4451124 4750290
14432 4750290 4120806 3918070 4211607 4668702 4888474 4485827 4251524 4296957 4457218 3829040
14422 3829040 3996727 4300122 4344660 3979218 3996201 4276820 4572362 4368440 4255126 4398034
14412 4398034 4417997 3849040 3540112 4560429 4574357 4316194 4246618 3851094 4375688 4164457
14402 4164457 3684227 4067398 4278653 4056604 4045093 4218628 4204542 4416334 4473172 4370539
14392 4370539 3813404 3971029 4376160 4023418 3886122 3794527 3949509 3888784 4261972 3994536
14382 3994536 3646925 3830936 4247050 3870701 3953926 3795457 3734740 4033367 3755479 3635270
14372 3635270 3425650 3505699 3790533 3766175 4048701 4104866 4429232 4629364 4498857 4173238
14362 4173238 4085400 4038686 4394853 4681958 4515470 4175958 3918169 4041739 4000026 3784050
14352 3784050 4209601 4214784 3906471 3980319 4121837 4362548 4820625 4868742 4393612 4722723
14342 4722723 4273235 4423072 4431508 4287542 4041395 4082823 3998575 4051175 4463268 4323765
14332 4323765 4273970 4088409 4052171 3924627 4303901 4546771 4352116 4461044 4270259 4185225
14322 4185225 3803221 3723806 4270684 4113447 3886768 3487418 4210057 4605366 4653650 4178877
14312 4178877 3883570 4292154 4105166 4353326 4087347 3854182 4158888 4281841 4433275
14303 4433275 4818523 4135848 4473474 3804668 3320609 3775905 3954987 3923235 3748323 4196279
14293 4196279 4272553 4065798 4552052 4528274 4744566 4620798 4130513 4183740 4240343 4213491
14283 4213491 3797138 3498556 4078709 4120491 4037607 4465330 4286822 3966334 3912848 4421961
14273 4421961 4639490 4059587 3934577 3761407 3904559 4071038 4305431 3820200 3697639
14264 3697639 3984412 3975164 4118455 4496337 4536051 4395652 3938919 3550707 3703479 3818240
14254 3818240 3805362 4107427 4532496 4274695 4303440 3828772 3775391 4028978 4022929 3971346
14244 3971346 3916443 4359390 4555242 4086801 4021063 4761646 4752522 4459402 4328952 4221901
14234 4221901 3941986 3823052 4161857 4507415 4509124 4013973 4167774 3990242 4234778 4143506
14224 4143506 4159231 4474633 4855309 4243730 3991291 4636739 4779507 4722966 4446405 3946788
14214 3946788 4149152 4429417 4449985 4384824 4357903 4443446 4318503 4584662 4403657 4266064
14204 4266064 4340559 3820097 3644123 3968691 4008275 4220316 4359168 4342748 4616277 4611957
14194 4611957 4987311 4430564 4068309 4499228 4373299 4551786 4799616 4534714 4510411 4127049
14184 4127049 3881083 3968179 3929804 4148038 4000059 4109644 4709980 4595703 5063875 4715869
14174 4715869 4528332 4860661 4232535 4460075 4415869 4374862 3935305 4132992 4475776 4119385
14164 4119385 4051928 3752230 3484039 3635358 3908165 3465177 3603796 3546806 3511000 3990994
14154 3990994 4139990 4221525 4367516 4186009 4451136 4357428 3810428 3996655 4473306 3790961
14144 3790961 4072040 4113534 3766876 3932302 3742111 4157824 3852869 3653329 3890958 3955362
14134 3955362 4327924 4665921 4422617 3835949 3800269 3766146 4079890 3892361 3653173 4152271
14124 4152271 4042118 3961345 4189618 3388481 3507004 4139059 3960889 4207821 4692158 4618559
14114 4618559 3632453 4229022 4459255 4248502 3959677 3618939 3665056 3663482 3736680 4120074
14104 4120074 4179753 4058621 3605997 3914488 4326892 4441849 4744490 4102189 4511931 4295843
14094 4295843 3893127 3913854 4287632 4458131 3804206 3964358 4041724 4362093 4552320 4261454
14084 4261454 4012690 4347886 3788956 3885591 3923760 4349444 4301623 4597943 4236700 3918984
14074 3918984 4942168 5101647 4382233 4199405 4218885 4219037 3953005 3744213 3691081 4096336
14064 4096336 4517603 3911472 3395552 3761492 3983590 3807295 3650654 3920236 3822370 3812462
14054 3812462 3465039 3938758 4279055 4011732 4029509 4084131 3785510 3639551 4099280 4416687
14044 4416687 4325374 4099818 4440903 4736880 4200401 4224649 4327025 4131584 4878678 4540813
14034 4540813 4459050 4206265 4050526 3604431 3595222 4066131 4124389 4105946 4645559 4338166
14024 4338166 4216681 3952734 4468949 4007619 3813569 3852643 4413492 4429856 4151341 4497587
14014 4497587 4205908 4194392 4343706 3856646 4210345 4412749 4194147 4277551 4277971 4509813
14004 4509813 4433958 4369164 4535736 4698208 4435950 4612203 4073312 4720242 4863563 4499095
13994 4499095 3870099 4322430 4449923 4341694 4734542 4567223 4140376 4213562 4654906 4674140
13984 4674140 4508878 4420403 4464702 4302788 4114409 4013513 4117781 4431960 4495699 4323042
13974 4323042 4443176 3921469 4673669 4669150 3794131 3438788 3629988 3187968 3652638 4128091
13964 4128091 4372981 4232236 4540058 4568241 4120434 4127352 4239684 3899068 3864725 3939406
13954 3939406 3820194 4440378 4515423 4100427 3735501 3684601 3581421 3938391 4349308 3870117
13944 3870117 3868375 3779357 3843705 4276293 4280321 4747880 4438366 4431722 4493621 4618969 3931316
13933 3931316 3925451 3875902 3684015 4322531 5016455 5141336 4177533 4508532 4753191 4443087
13923 4443087 4260038 3781697 3899063 3955809 3957507 3782842 4452051 4589763 4381315 4240498
13913 4240498 4374437 4441721 4160579 3883039 4058349 4076149 3743559 4157459 4437719 4318314
13903 4318314 4305121 4670822 4445430 4416740 4506029 4510496 4520556 4536774 4643137 4488136 3853716
13892 3853716 4323659 4296779 4554629 4771121 4090443 4060136 4109890 4220942 4059218 4194296
13882 4194296 4120705 4345889 4089025 3929989 4839613 5060896 4457355 4470795 4077840 4019316
13872 4019316 4714765 4464119 4029592 4144679 4496397 4673079 4290481 3979545 4572519
13863 4572519 4506254 4663473 4568812 3741458 3727173 4166191 4614387 4344514 3703056 3089897
13853 3089897 3491493 3460764 3939271 4455349 4085682 4135533 4298005 4195490 4587151 4330402
13843 4330402 3895363 4139873 4609219 4502664 4030734 4337924 4597689 4593827 4460689 4200876
13833 4200876 3492165 4117451 3992869 3855604 3879947 3883169 4598950 4539773 3928222 3527875
13823 3527875 3795587 4056103 4102773 4212768 4150321 4192140 4892665 4816627 4488257 4104744
13813 4104744 4313665 4505229 4369276 4456325 4627461 4726713 4748691 4277314 3452397 4002520
13803 4002520 4316323 4193150 4281175 4273731 4374686 4627977 4929784 4392898 4401848 4583447
13793 4583447 4625384 4370686 4750418 4589397 4476114 4270209 4167477 4515527 4734789 4836686
13783 4836686 4231796 4706423 4405805 4308937 4358523 3927785 4310543 4345190 4299375 4391168
13773 4391168 4097174 4082465 4190358 4286734 3768378 3707095 3790779 4029889 4040889 4237010
13763 4237010 4278793 4641972 4563700 4510587 4654157 4538542 4782864 4932469 4830541 4459032
13753 4459032 4225809 4037454 4164082 4252610 4303560 4470092 4436863 4189087 4740742 4602588
13743 4602588 4437620 4633704 4774463 4741556 4399746 4383376 4736834 4389847 4137662 4168245
13733 4168245 4118275 4272319 4420089 4375614 4840604 4639350 3984331 4783326 4333712 4460088
13723 4460088 4115177 4067826 4173759 4555637 4289939 4667732 5094547 5028982 4777666 4332046
13713 4332046 4837984 4290846 3954397 3352340 4053777 4066695 3959102 3818388 3654763 4271211
13703 4271211 4496985 4588340 4583039 4459218 4224534 3832676 3951591 4348354 4276971 4629659
13693 4629659 4405542 4669339 4759513 4556259 4551003 4560689 4549565 4808041 4850805 4652456 4345987
13682 4345987 4105417 4004579 4238716 4399485 4070596 4150010 4454436 4229839 4257768 4461339
13672 4461339 4012030 4190617 4344980 4747199 4457828 4156063 4194438 4135194 4167007 4241821
13662 4241821 4758183 4579870 4268623 4282954 4068938 3780337 4206870 4201812 4252590 4059476
13652 4059476 3782596 4040326 4205341 4161752 4414675 4552371 4412473 3938006 3980932 4102717
13642 4102717 4553268 4387641 4233032 4269015 4242110 4554402 4388230 4697498 4443141 4451260
13632 4451260 4324405 4702753 4327100 4292726 3938306 4066207 4108330 4683632 4688687 4206998
13622 4206998 4070898 4283287 4125449 4213480 4031274 4399209 4771095 4674263 4788456 4982563
13612 4982563 4630158 4337990 4555036 4417407 4468458 4452065 4435394 4724131 4475831 4436634
13602 4436634 4579560 3872207 4286487 4324290 3948373 4601442 4622472 4071370 4154915 4492310
13592 4492310 4855490 4470770 5066873 4957954 4855057 5021667 5128155 5033280 4904910 4684265
13582 4684265 4384912 4121743 4499420 4576116 4583338 4677888 4640436 4836674 4887759 4414752
13572 4414752 4321069 4647087 4555370 4628678 4478875 4467107 4406046 4907221 4461742 4314090
13562 4314090 4283780 4358658 4443438 4416495 4294343 4552700 4563661 4589605 4649692 4592744 4387455
13551 4387455 4106272 4222068 4340621 4131711 4169399 4142416 4071842 4354741 4324455 4375852
13541 4375852 4089880 4082276 4351859 4332568 4172833 4567115 4241240 3903621 3877652 3764830
13531 3764830 3884343 4195905 4448550 4465200 4409018 4424863 4257053 4649378 4462803 4881255
13521 4881255 4594406 4448730 4545667 4261219 4353580 4559325 4784005 4463721 4497545 4844802
13511 4844802 4948855 4771208 4374267 4438146 4451578 4306488 4046707 4487356 4450418 4135098
13501 4135098 4161926 4336176 4767489 4861820 4191720 3760354 3890192 4502480 4485350 4305850
13491 4305850 4039387 4061343 4397885 4112057 4312293 4614631 4632211 4628593 4615106 4510126
13481 4510126 4627363 4311336 5032259 4803818 3964775 4173859 4707879 4394994 3641553
13472 3641553 4167447 4155649 4057515 4115837 4746682 4623966 4538255 4375983 3846433 4278761
13462 4278761 4797949 4448603 4340545 4135612 3983278 4400091 4688708 4341964 4109550
13453 4109550 4128078 4162793 4501716 4693734 4530468 4147728 4429817 4289032 4785153 5003948
13443 5003948 4485642 4465375 4808127 5174334 4677022 4189190 4364888 3649792 3760478 4222494
13433 4222494 4108769 4350557 4938286 4964974 4473568 4452189 4504786 4751486 4577920 4970665
13423 4970665 5013606 4154082 4498577 4566126 4804669 4417493 4989808 4978096 4402168 4199645
13413 4199645 4288521 4445318 4672647 4499771 4325595 4502389 4908185 4234273 4006968 4471391
13403 4471391 4928631 5130645 4820864 4639537 4785872 4805811 4689968 4287319 3846132 4111287
13393 4111287 4645289 4573572 4484952 4354324 4598474 4374022 4792840 4647701 4752620 4528482
13383 4528482 4182829 4099858 4434861 4603595 3763535 4426419 4860234 4899749 4608135 4081612
13373 4081612 4161262 4773220 4370545 4677916 4901242 4542559 4426115 4953242 5068909 4779188
13363 4779188 4336655 4380914 5103487 5113101 4623301 4500842 3961805 4054145 4479840 4642496
13353 4642496 4785035 4734048 4139556 3957960 4577518 4559583 4424615 4642373 4506138 4650919
13343 4650919 4983325 4824792 4702830 4857324 4396090 4093626 3757344 4017901 4004325 4122376
13333 4122376 3773899 4458415 4563120 4432089 4695760 4721888 4297656 4268411 4764801 4586564
13323 4586564 4438948 4827106 4467802 4453808 4694674 4236555 4239893 4342618 4569426 4684291
13313 4684291 5127720 4742923 4470261 4336653 4317357 4070002 4378386 4394748 4051217 4332571
13303 4332571 4503458 4481838 4726302 4429624 4364659 4268537 3635601 3795924 4449223 4623003
13293 4623003 4688822 4773652 4398393 4141616 5062857 5438284 5161933 4738405 4309736 3739248
13283 3739248 4173573 4791434 4837804 5194849 4972862 4946538 4411190 4431103 4264417 4937260
13273 4937260 4357208 4811818 4746977 4634681 4462873 4251262 4335549 4127261 4767950 4461497
13263 4461497 4493355 4743294 4683603 4653833 4682231 5022406 4801204 4691771 4674242 4466713
13253 4466713 4443750 4390747 4486683 3949774 4211113 3816318 3851655 4043995 4386036 4677653
13243 4677653 4445090 4714607 4917191 4826884 4614474 4343860 4179501 4277641 4088300 4308661
13233 4308661 4755672 4385653 4304015 4239084 4551671 4595451 4555002 4528518 4460188 4197491
13223 4197491 4409029 4572269 4249171 4347946 4297775 4486747 5208251 5234729 4781587 4845412
13213 4845412 4542649 4259962 5111576 5049991 4821624 4485614 4560075 4740466 4747940 4563722
13203 4563722 4388101 4912034 4531615 4639721 4866782 5166620 4944967 4580483 4841299
13194 4841299 4520853 4860364 4628254 4795410 4569395 4202258 4688372 4919036 4516897
13185 4516897 4972176 4953298 4609297 4397941 4444352 4022232 3894441 4477965 4494206 4178578
13175 4178578 4231853 4717804 4402567 4464904 4373897 4258177 4366835 4676818 4940383 4835560
13165 4835560 4859032 5016613 4835014 5364636 4676045 4850226 4747459 4584281 4924026 4935632
13155 4935632 4393692 4363224 4284041 4101325 4535309 3732307 4069081 4313627 4387454 4442017
13145 4442017 4916747 4874677 4664694 4332015 4365688 4291239 4013263 4719094 4982634 4080765
13135 4080765 3826878 4042662 4330282 4554104 4500670 4719803 4597343 4465529 4907860 4619967
13125 4619967 5027965 4959750 4874225 4527755 4636785 4770146 5122182 5258618 4439818 4126796
13115 4126796 4096857 4384754 4502886 4880462 4555761 4365202 4537167 4571708 4395381 4936300
13105 4936300 4533787 4797367 4451663 4342709 4167787 4315853 4170681 4308746 4241540 4787547
13095 4787547 4386381 4629836 4099080 4064250 4963823 4690007 4209949 3850935 4211686 4582524
13085 4582524 5105365 5116968 4548385 4225212 4145160 3959764 4100860 3979330 3879054 4472698
13075 4472698 4536820 4254302 4487706 4537854 4387832 4227520 4554981 4206631 4003115 4620688
13065 4620688 4186474 4460684 4758965 4462893 4642887 4568175 4140414 3749020 4316070 4383615
13055 4383615 4446420 4581720 4586388 4151045 3887837 4233236 4824078 4365212 4721571 4860312
13045 4860312 4494980 4713365 5083477 4912693 4845366 4576089 4542794 4838627 4578142 4693656
13035 4693656 4515291 4736013 4545177 4930178 4500560 4043248 5109212 5236893 4771222
$$ [...]
##END NTUPLES=NMR SPECTRUM
##END=
