##TITLE=1H_CA-8917-2
 CDCl3,100 sc, 
 3.9.2021
##JCAMPDX= 6.0         $$ Bruker NMR JCAMP-DX V2.0
##DATA TYPE= NMR SPECTRUM
##DATA CLASS= NTUPLES
##ORIGIN= UXNMR, Bruker Analytische Messtechnik GmbH
##OWNER= root
$$ XWIN-NMR		Version 3.5
$$ Fri Sep  3 12:34:00 2021 Russian Standard Time (UT+4h)  she@DPX200
##.OBSERVE FREQUENCY= 200.1314
##.OBSERVE NUCLEUS= ^1H
##.ACQUISITION MODE= SIMULTANEOUS
##.ACQUISITION SCHEME= undefined
##.AVERAGES= 100
##.DIGITISER RES= 18
##SPECTROMETER/DATA SYSTEM= spect
##.PULSE SEQUENCE= zg30
##.SOLVENT NAME= D2O
##.SHIFT REFERENCE= (INTERNAL, D2O, 0, 16.9546)
##AUDIT TRAIL= $$ (NUMBER, WHEN, WHO, WHERE, WHAT)
$$ ##TITLE= Audit trail, XWIN-NMR		Version 3.5
$$ ##JCAMPDX= 5.01
$$ ##ORIGIN= Bruker BioSpin GmbH
$$ ##OWNER= she
$$ F:/spectra/data/she/nmr/H-F/1/pdata/1/auditp.txt
$$ ##AUDIT TRAIL=  $$ (NUMBER, WHEN, WHO, WHERE, WHAT)
(   1,<2021-09-03 12:32:40.04 +0400>,<she>,<DPX200>,
      <created by zg, POWCHK disabled, PULCHK disabled
       configuration hash MD5:
       00 E9 B6 7A A2 85 ED C7 34 08 36 98 17 FE 4E 26
       data hash MD5: 16K
       EE 82 6E 42 1C 7B 10 06 2E 9A 5C 2B 08 23 66 22>)
(   2,<2021-09-03 12:32:42.71 +0400>,<she>,<DPX200>,
      <Start of raw data processing
       efp BC_mod = 2 LB = 0.24 FT_mod = 6 PKNL = 1 PHC0 = -13717.05 PHC1 = 6.800974 SI = 16K 
       data hash MD5: 16K
       94 CC 5C E5 AA BD C9 77 01 A6 BC 75 E5 85 3A B8>)
(   3,<2021-09-03 12:33:03.59 +0400>,<she>,<DPX200>,
      <pk PHC0 = -27.22979 PHC1 = 35.59998 
       data hash MD5: 16K
       70 58 A8 9A FC 79 2A AE 5C 0B 9D B9 D3 F6 D8 60>)
(   4,<2021-09-03 12:33:06.62 +0400>,<she>,<DPX200>,
      <abs ABSG = 5 
       data hash MD5: 16K
       82 96 9E 0A 0B 06 AC BA 89 5D F0 02 BC E4 4B 89>)
(   5,<2021-09-03 12:33:23.93 +0400>,<she>,<DPX200>,
      <pk PHC0 = -14.2246 PHC1 = 19.6 
       data hash MD5: 16K
       73 A5 0C 24 71 F9 95 28 6A B2 F8 44 ED F0 F5 EF>)
(   6,<2021-09-03 12:33:28.15 +0400>,<she>,<DPX200>,
      <abs ABSG = 5 
       data hash MD5: 16K
       9A 4F 33 D6 6F 3E 25 6C 4C 26 D9 1D 72 EE 4D C0>)
$$ ##END=
$$ 
$$ hash MD5
$$ E3 D9 0A 0A 0A 21 19 FB B2 C5 95 37 66 0E 6A AC
##$RELAX= 
##$RELAX= 
##$RELAX= 
##$RELAX= 
##$RELAX= 
##$RELAX= 
$$ Bruker specific parameters
$$ --------------------------
##$DU= <F:/spectra>
##$EXPNO= 1
##$NAME= <H-F>
##$PROCNO= 1
##$TYPE= <nmr>
##$USER= <she>
##$AMP= (0..31)
100 100 100 100 100 100 100 100 100 100 100 100 100 100 100 100 100 100 
100 100 100 100 100 100 100 100 100 100 100 100 100 100 
##$AQSEQ= 0
##$AQ_mod= 1
##$AUNM= <au_zg>
##$AUTOPOS= <>
##$BF1= 200.13
##$BF2= 200.13
##$BF3= 200.13
##$BF4= 200.13
##$BF5= 200.13
##$BF6= 200.13
##$BF7= 200.13
##$BF8= 200.13
##$BYTORDA= 1
##$CFDGTYP= 0
##$CFRGTYP= 5
##$CHEMSTR= <none>
##$CNST= (0..31)
1 1 145 1 1 1 1 1 1 1 1 1 1 1 1 1 1 1 1 1 1 1 1 1 1 1 1 1 1 1 1 1 
##$CPDPRG= <>
##$CPDPRG1= <>
##$CPDPRG2= <>
##$CPDPRG3= <>
##$CPDPRG4= <mlev>
##$CPDPRG5= <mlev>
##$CPDPRG6= <mlev>
##$CPDPRG7= <mlev>
##$CPDPRG8= <mlev>
$$ [...]
##$SUBNAM3= <"">
##$SUBNAM4= <"">
##$SUBNAM5= <"">
##$SUBNAM6= <"">
##$SUBNAM7= <"">
##$SUBNAM8= <"">
##$SUBNAM9= <"">
##$SW= 20.0188988654967
##$SWIBOX= (0..15)
0 0 2 0 0 0 0 0 0 0 0 0 0 0 0 0 
##$SW_h= 4006.41025641026
##$TD= 16384
##$TD0= 1
##$TE= 0
##$TE2= 300
##$TE3= 300
##$TEG= 300
##$TL= (0..7)
0 120 120 120 120 120 120 120 
##$TP= (0..7)
150 150 150 150 150 150 150 150 
##$TP07= 0
##$TPNAME0= <>
##$TPNAME1= <>
##$TPNAME2= <>
##$TPNAME3= <>
##$TPNAME4= <>
##$TPNAME5= <>
##$TPNAME6= <>
##$TPNAME7= <>
##$TPOAL= (0..7)
0.5 0.5 0.5 0.5 0.5 0.5 0.5 0.5 
##$TPOFFS= (0..7)
0 0 0 0 0 0 0 0 
##$TUNHIN= 0
##$TUNHOUT= 0
##$TUNXOUT= 0
##$USERA1= <user>
##$USERA2= <user>
##$USERA3= <user>
##$USERA4= <user>
##$USERA5= <user>
##$V9= 5
##$VALIST= <valist>
##$VCLIST= <CCCCCCCCCCCCCCC>
##$VD= 0
##$VDLIST= <DDDDDDDDDDDDDDD>
##$VPLIST= <PPPPPPPPPPPPPPP>
##$VTLIST= <TTTTTTTTTTTTTTT>
##$WBST= 1024
##$WBSW= 4
##$XGAIN= (0..3)
0 0 0 0 
##$XL= 0
##$YL= 0
##$YMAX_a= 1772799
##$YMIN_a= -2790269
##$ZGOPTNS= <>
##$ZL1= 120
##$ZL2= 120
##$ZL3= 120
##$ZL4= 120
##$ABSF1= 16.9546
##$ABSF2= -3.064438
##$ABSG= 5
##$ABSL= 3
##$ALPHA= 0
##$AQORDER= 0
##$ASSFAC= 0
##$ASSFACI= 0
##$ASSFACX= 0
##$ASSWID= 0
##$AUNMP= <proc_1d>
##$AZFE= 0.1
##$AZFW= 0.1
##$BCFW= 0
##$BC_mod= 2
##$BYTORDP= 0
##$COROFFS= 0
##$CY= -3
##$DATMOD= 1
##$DC= 0
##$DFILT= <>
##$DTYPP= 0
##$F1P= 0
##$F2P= 0
##$FCOR= 1
##$FTSIZE= 16384
##$FT_mod= 6
##$GAMMA= 0
##$GB= 0
##$INTBC= 1
##$INTSCL= 1.334414e-10
##$ISEN= 128
##$LB= 0.24
##$LEV0= 0
##$LPBIN= 0
##$MAXI= 10000
##$MC2= 0
##$MEAN= 0
##$ME_mod= 0
##$MI= 1.114404
##$NCOEF= 0
##$NC_proc= -6
##$NLEV= 6
##$NOISF1= 3.799351
##$NOISF2= 2.8
##$NSP= 0
##$NTH_PI= 0
##$NZP= 0
##$OFFSET= 16.9546
##$PC= 1
##$PHC0= -13758.5
##$PHC1= 62.00096
##$PH_mod= 1
##$PKNL= yes
##$PPARMOD= 0
##$PSCAL= 0
##$PSIGN= 0
##$REVERSE= no
##$SF= 200.130010080954
##$SI= 16384
##$SIGF1= 3
##$SIGF2= 2
##$SINO= 5.538805
##$SIOLD= 16384
##$SREGLST= <1H.CDCl3>
##$SSB= 0
##$STSI= 16384
##$STSR= 0
##$SW_p= 4006.41025641027
##$SYMM= 0
##$S_DEV= 0
##$TDeff= 16384
##$TDoff= 0
##$TI= <>
##$TILT= no
##$TM1= 0
##$TM2= 0
##$TOPLEV= 0
##$USERP1= <user>
##$USERP2= <user>
##$USERP3= <user>
##$USERP4= <user>
##$USERP5= <user>
##$WDW= 1
##$XDIM= 16384
##$YMAX_p= 499474486
##$YMIN_p= -17719115
$$ End of Bruker specific parameters
$$ ---------------------------------
##NTUPLES= NMR SPECTRUM
##VAR_NAME=  FREQUENCY,     SPECTRUM/REAL,   SPECTRUM/IMAG
##SYMBOL=    X,             R,               I
##VAR_TYPE=  INDEPENDENT,   DEPENDENT,       DEPENDENT
##VAR_FORM=  AFFN,          ASDF,            ASDF
##VAR_DIM=   16384,         16384,           16384
##UNITS=     HZ,            ARBITRARY UNITS, ARBITRARY UNITS
##FACTOR=    0.244546801953871, 1,           1
##FIRST=     3393.12414493663, 0,            0
##LAST=      -613.286111473637, 0,           0
##MIN=       -613.286111473637, -17719115,   0
##MAX=       3393.12414493663, 499474486,    0
$$ Real data points
##PAGE= N=1
##DATA TABLE= (X++(R..R)), XYDATA
$$ [...]
5286A2340008K18942L78519L10081q34245j13713m35759L80728K53557j4046K72795
5276A2756867J28738L16128k98484j51604k2007M72473j13907m78338K25045r9591
5266A2735320L5897j22813L19415j59137l20255O35862l30318r63204O21384Q42741
5256A3294892K16782l45239N53854p16719L06783L371j09933n6714M71704m8578
5246A3570203m10439Q7808o490L27273M5913M99932o48884R52680m24678n64102
5236A3429216M86958l68624n41341k13941O07948J26563O782n74108n21338J062901
5226A3501016k56810J69152N9912M3634K64544k07229l26895M98676R15194j38540
5216A4522654j58737o94344r0246J40360O0179L81927m632M9282O7044J00536
$$ y = [12340008, 12558950, 12937469, 13247550, 12413305, 12299592, 11863833, 12244561, 12498118, 12484072, 12756867, 12885605, 13201733, 12903249, 12751645, 12729638, 13202111, 13088204, 12609866, 12834911, 12735320, 12771217, 12648404, 12967819, 12808682, 12488427, 13124289, 12793971, 11830767, 12452151, 13294892, 13511674, 13166435, 13720289, 13003570, 13310353, 13313724, 13203791, 13147077, 13618781, 13570203, 13159764, 13247572, 13241082, 13568355, 13614268, 14114200, 13465316, 14417996, 13993318, 13429216, 13916174, 13547550, 13006209, 12792268, 13400216, 13526779, 13533561, 12959453, 12438115, 13501016, 13244206, 13413358, 13473270, 13516904, 13781448, 13574219, 13247324, 13746000, 14661194, 14522654, 14363917, 13669573, 13579327, 13719687, 13779866, 14161793, 14157161, 14206443, 14273487, 14374023]
5206A4374023o27728L36582k73513k43948Q63230K70145l78178N43569j3575n56556
5196A4294051m90182N21809J13379K63424j56177j7647m39098L12829L82361N80874
5186A5365623J58807M04334J39739r94174K66612J44082p22035M61711K58917
5177A5483616k21973K7945q65008J53550K22995P6030K4256k75155L26873J21528
5167A5074657K60633m03035L2795P5658l4334k24004J24874N7213m46074l00970
5157A4217413l22773j62075J162489J96809l89455L98257l16803K24368k3609
5148A4984621P48M21625k04968l32406n6415O26748L2211L1113K31087o71066
5138A5063298K10322L2223Q67571r0994P48660l07757k86704k76436j84383K39046
$$ y = [14374023, 13746295, 14082877, 13809364, 13565416, 14428646, 14698791, 14320613, 14864182, 14850607, 14294051, 13803869, 14325678, 14439057, 14702481, 14546304, 14528657, 14089559, 14402388, 14784749, 15365623, 15524430, 15928764, 16068503, 15074329, 15340941, 15485023, 14762988, 15224699, 15483616, 15261643, 15289588, 14424580, 14578130, 14801125, 14877155, 14901411, 14626256, 14953129, 15074657, 15335290, 14932255, 14965050, 15040708, 15006374, 14782370, 14907244, 14964457, 14518383, 14217413, 13894640, 13732565, 14895054, 15091863, 14702408, 15100665, 14783862, 15008230, 14984621, 14985369, 15406994, 15202026, 14869620, 14813205, 15439953, 15472164, 15503277, 15734364, 15063298, 15273620, 15305843, 16173414, 16082420, 16831080, 16523323, 16236619, 15960183, 15775800, 16014846]
5128A6014846M93614J133803n18933o91959J68804l25227o8990k76034q0856l93139
5118A5455929N48628L17583l34025J09574n16097j35560P11874n42004M075M67289
5108A6087266l64747q8325M52004n3048k80213J93650k3685M04901j38856o528
5098A6182419n5280J1274q6073Q1598K0341j79275k26359J54245L03701j02401
5088A6104190R2945m34787P57282L6033k45931J64723n57332Q4095K6221j2484
5078A6014955L68937l2472o8397J15959K49483j8044n33574K89647K17588K98642
5068A6902724J48110J90807K30708m73784J03631k20880K68270J10210n61665
5059A6698131L37634N58207l13007l0086L58089m01997k10260M13496l4563n5733
$$ y = [16014846, 16508460, 17642263, 17123330, 16431371, 16600175, 16274948, 16205958, 15929924, 15849068, 15455929, 16004557, 16322140, 15988115, 16097689, 15581592, 15446032, 16157906, 15615902, 15619977, 16087266, 15722519, 15634194, 16086198, 16033150, 15752937, 15946587, 15922902, 16327803, 16188947, 16182419, 16127139, 16138413, 16052340, 16133938, 16154279, 15975004, 15748645, 15902890, 16206591, 16104190, 16197135, 15762348, 16519630, 16555663, 16309732, 16474455, 15917123, 16001218, 16027439, 16014955, 16383892, 16351420, 16283023, 16398982, 16648465, 16630421, 16096847, 16386494, 16604082, 16902724, 17050834, 17241641, 17472349, 16998565, 17102196, 16881316, 17149586, 17259796, 16698131, 17035765, 17593972, 17280965, 17250879, 17608968, 17206971, 16996711, 17410207, 17375644, 17319911]
5049A7319911k29591L01868O8707N84564l44031k16936J108630r63516J45966
5040A7775572k55539M58147k3123n60113O29517L73378j27268p34983j49187R31675
5030A8318076k61245j92632j47241J67711N88313j70091l16743p83680J54731
5021A7357199N29487P42666O07460n73637O7668k7223L78962k47384m90101L4357
5011A8379454L27713q4066K20396J021130K51942j06988K12183K87376N50731
5002B1059871l21753j46057l98954N48644O49999p42564L90885o89779O77109
4993B1027401k77456l7443O2863n02291J067116j51629p311K69010K66591J25437
4983B1842288P57695L89968o20366M51687N94209n25383Q26546P9296k27802P27034
$$ y = [17319911, 17090320, 17392188, 17460895, 18045459, 17701428, 17484492, 18593122, 17629606, 17775572, 17520033, 17978180, 17955057, 17394944, 18024461, 18397839, 18270571, 17535588, 17386401, 18318076, 18056831, 17864199, 17716958, 17884669, 18472982, 18302891, 17986148, 17202468, 17357199, 17886686, 18629352, 19236812, 18663175, 18730843, 18703620, 19082582, 18835198, 18345097, 18379454, 18707167, 18623101, 18843497, 19864627, 20116569, 20009581, 20221764, 20509140, 21059871, 20738118, 20592061, 20193107, 20741751, 21391750, 20649186, 21040071, 20350292, 21027401, 20749945, 20712502, 20775365, 20273074, 21340190, 21188561, 21181250, 21450260, 21716851, 21842288, 22599983, 22989951, 22369585, 22821272, 23415481, 22890098, 23716644, 23795940, 23568138, 24295172]
4973B4295172N08530J73435j95800M84147O5209O49858L15250l79347P4469N63054
4963B6553977P64130L04292K51764p44334p74153L96616n64753N8103m43723q16738
4953B4985181K62745M8446P7504l62635n18297L89703k03905m6082k3510O15308
4943B5224458K04132Q4591k3333K21439k45976n04266L25251j28665K25228j66381
4933B5216478K84845j23129J36762j57896l36601R99077O2967K6298J30157K75537
4923B6514495M17676L28790R344j4508J07675P32179J149416N61804l02315R7200
4913B9601756J312740P51328j51965J053360P18806L52108O8370j07861R68294
4904C4566936N77783N57864N68492J328837J386786Q58217J166738J459843P68055
$$ y = [24295172, 24803702, 24977137, 24781337, 25265484, 25330693, 25980551, 26295801, 25916454, 25990923, 26553977, 27318107, 27622399, 27874163, 27129829, 26355676, 26752292, 26187539, 26245642, 25801919, 24985181, 25247926, 25296372, 25373876, 25011241, 24492944, 24882647, 24678742, 24632660, 24609150, 25224458, 25428590, 25513181, 25489848, 25711287, 25465311, 24961045, 25286296, 25157631, 25382859, 25216478, 25501323, 25378194, 25514956, 25357060, 25020459, 26019536, 26082503, 26108801, 26238958, 26514495, 26932171, 27260961, 27270305, 27255797, 27363472, 28095651, 29245067, 29806871, 29504556, 29601756, 30914496, 31665824, 31513859, 32567219, 33286025, 33638133, 33706503, 33598642, 34566936, 35144719, 35702583, 36271075, 37599912, 38986698, 39844915, 41011653, 42471496, 43239551]
4895D3239551Q09554K92495M85441k60662q45926j601221q88007j208440j513287
4886C8509498o28199j239826p93600L51055m40843P25977l07976n7103j4058j134565
4876C4970360M70503o33194o1332j40967o15015q3357r04838m09069K81955K78427
4866C3153473J093744P0011K19041M72246M70339n12622K24455L01684k25522
4857C5266849k20813L13762m6223p71710L4708O13580R8553k99561N74571m65195
4847C5098521M63779Q04955O79609P94544L41305Q11223R15705P44956O01746
4838D1256343J033500J086246Q51531P12866O32372J575584Q68675J265659K306401
4829E1589177O11034J829752J994212J016741J166621N08265M36488Q42291K15254
$$ y = [43239551, 44049105, 44341600, 44827041, 44566379, 43720453, 42119232, 41231225, 40022785, 38509498, 37881299, 36641473, 35847873, 36198928, 35758085, 36484062, 36176086, 36118983, 36104925, 34970360, 35440863, 34807669, 34746337, 34605370, 33990355, 33906998, 33002160, 32593091, 32875046, 33153473, 34247217, 34317228, 34536269, 35008515, 35478854, 34966232, 35190687, 35492371, 35266849, 35046036, 35359798, 35313575, 34541865, 34576573, 35190153, 35288706, 34989145, 35563716, 35098521, 35562300, 36367255, 37046864, 37841408, 38182713, 38993936, 39909641, 40654597, 41256343, 42289843, 43376089, 44227620, 44940486, 45572858, 47148442, 48017117, 49282776, 51589177, 52200211, 54029963, 56024175, 57040916, 58207537, 58715802, 59152290, 59994581, 60209835]
4820F0209835j1188q93634j946746j241174k432770k508405j744920j204424j888338
4811D6338236k719878q21431q94970j425645m99205j184104j501620n24946k08027
4802C6558410q73770m39882r07238k72032r64922j176442p7673p98560o80644
4793C0367247o79082j52837o87974p74059n03210o90500q1076k04620l82827n71511
4783B5639551k5904m10694o95120k09595q010M70543n42302k55408l41593n79934
4773B3041534j40621L68033k6814l32786l02632N48983L46395l22156j78844q08754
4763B2192338k2570q770k05961j76710n90898j91800j32547P11976q79848m05934
4753B0289276l22796k39806P70816q23607L7711L42189J90417L82575n98126K80562
$$ y = [60209835, 60198647, 59305013, 57358267, 56117093, 53684323, 51175918, 49430998, 48226574, 46338236, 43618358, 42796927, 41901957, 40476312, 39977107, 38793003, 37291383, 36766437, 36558410, 35684640, 35244758, 34337520, 34065488, 33100566, 31924124, 31846451, 31047891, 30367247, 29688165, 29535328, 28847354, 28073295, 27570085, 26879585, 26798509, 26593889, 26211062, 25639551, 25613647, 25202953, 24507833, 24298238, 24290228, 24760771, 24218469, 23963061, 23621468, 23041534, 22900913, 23268946, 23242132, 22909346, 22606714, 23155697, 23502092, 23179936, 23001092, 22192338, 22169768, 22160998, 21955037, 21778327, 21187429, 20995629, 20863082, 21575058, 20695210, 20289276, 19966480, 19726674, 20497490, 19673883, 19711594, 20053783, 20244200, 20626775, 20028649, 20309211]
4743B0309211k42413K23236k76858l23368l5090m63361M2609K99019N83963m0553
4733B0076395k10536p68044J18180L76223j1942K35964l17158m67644M68501P9406
4723A9579345l38741J31218J89943m73282l02374J0946L89798J26607j32239l93364
4713A8787857K71320L67525m48019L3605M54728j39467q9059j36822M98227j76462
4703A9423433r6142m88396l40968R20425L57786j93411k26614o5183L34634J91843
4693A9817407k00479o7816m92738l38967L81960J05707k3522m77790J2925J55387
4683A8872074K42178n50056m70798N58612K4275L06480L48466p12969l6697L28077
4673A8909642P25987o59076q7893N15941k90552l15645r4164N21858j89136O9477
$$ y = [20309211, 20066798, 20290034, 20013176, 19689808, 19654718, 19191357, 19233966, 19532985, 20116948, 20076395, 19865859, 19097815, 19215995, 19592218, 19580276, 19816240, 19499082, 19031438, 19499939, 19579345, 19240604, 19371822, 19561765, 19088483, 18786109, 18797055, 19186853, 19313460, 19181221, 18787857, 19059177, 19426702, 18978683, 19012288, 19467016, 19327549, 19238490, 19101668, 19599895, 19423433, 19327291, 18838895, 18497927, 19418352, 19776138, 19582727, 19356113, 19290930, 19625564, 19817407, 19616928, 19549112, 19056374, 18717407, 19099367, 19205074, 19181552, 18703762, 18716687, 18872074, 19114252, 18564196, 18093398, 18652010, 18676285, 18982765, 19331231, 18618262, 18581565, 18909642, 19635629, 18976553, 18888660, 19404601, 19114049, 18798404, 18704240, 19226098, 19036962, 19106439]
4663A9106439o7069J31212J02186J58705j15777N31693P1279j01025k52717J58084
4653A9723010L6610n03003m31601M1202O07657L86272j51289l04692J63108J14143
4643A9681417m73074L33687J47265P0214k70639r62858L67770P30171j07210m06572
4633A9110171Q44270m28846j3238M46097k48987J9976L66447K47897o00509l00755
4623A9442523O98064J51256l87226P15141K0094J88946k44832J48777J86936P24212
4613B1643891K44592m2038j8082J93469L27903l36374m82120N25809L37660Q36389
4603B3231099l50690P89232K12147M7922N41392N18605l26198j16086m64189j133606
4593B2949628P08633o67154j99209K67803M42095j019567K55825k3924o03592
$$ y = [19106439, 19039370, 19170582, 19272768, 19431473, 19315696, 19847389, 19918668, 19817643, 19564926, 19723010, 19759620, 19256617, 18825016, 18866218, 19473875, 19860147, 19708858, 19404166, 19567274, 19681417, 19208343, 19542030, 19689295, 19759509, 19488870, 18526012, 18893782, 19623953, 19516743, 19110171, 19954441, 19525595, 19512357, 19958454, 19709467, 19729443, 20095890, 20343787, 19743278, 19442523, 20140587, 20291843, 19904617, 20619758, 20639852, 20828798, 20583966, 20732743, 20919679, 21643891, 21888483, 21846445, 21828363, 22021832, 22349735, 22013361, 21531241, 22057050, 22394710, 23231099, 22880409, 23669641, 23881788, 23929710, 24471102, 24989707, 24663509, 24547423, 24083234, 22949628, 23658261, 22991107, 22791898, 23059701, 23501796, 22482229, 22738054, 22714130, 22110538]
4584B2110538n02085j86948L59047j5715K40964l97096k86057P8099P19342J87993
4574B2308082n52800N82138l4214J57774m85241k22722K08660N38716n33614l57644
4564B1609135N47125Q6049k4231m65321M53292k27644N97620N25024m05748J16156
4554B2811457m74676q1243j29443N85573J52443n99281J51492M57518K47090j96347
4544B2924583j04777K48597R5914m76777M22132K39246n50312q8931J02662J17902
4534B2930239Q07228K54271j29490M68331M96938N20465l53822l98336n9679K14182
4524B4750327n7959P71802K34849K15844p89596J0085O6442K34182P12175M15449
4514B6563600K89482q789p66581Q02750O47596q92209M21957k71308O88874n65806
$$ y = [22110538, 21608453, 21421505, 21780552, 21764837, 22005801, 21608705, 21322648, 21400747, 22120089, 22308082, 21755282, 22337420, 22303206, 22460980, 21975739, 21753017, 21961677, 22500393, 21966779, 21609135, 22156260, 22242309, 22218078, 21752757, 22206049, 21978405, 22576025, 23101049, 22695301, 22811457, 22336781, 22255538, 22126095, 22711668, 22864111, 22264830, 22416322, 22873840, 23120930, 22924583, 22819806, 23068403, 23164317, 22687540, 23109672, 23348918, 22798606, 22709675, 22812337, 22930239, 23737467, 23991738, 23862248, 24330579, 24827517, 25347982, 24994160, 24595824, 24536145, 24750327, 24692368, 25464170, 25699019, 25914863, 25125267, 25135352, 25201794, 25435976, 26148151, 26563600, 26853082, 26844293, 26077712, 26880462, 27528058, 26635849, 27057806, 26786498, 27475372, 26909566]
4504B6909566j52943J011328J20433K17369J005265J31790m96070K87604j83623
4495B8850719m84792P30552L64651m41625n9893k82124l94643k40241r19437R78482
4485B8101649L38338l96243j656p33912k76015l4806J88014l1109o51079j28100
4475B6375081m0744K64064J37756n79772K84639j3757m9112K64863k50956j32822
4465B6259240J15660m59301P664K20169k0576j73217L0895P70143K82908j58913
4455B6874672j35378k8728n55544m79797K99477O5354r937L98752j77002k21621
4445B6030248m38005K96587M55744l0598o64643N54513K61288j275028N7649R97696
4435B6245451n45012j305m1721k04356J31551j8825N02976l58062P11669P1166
$$ y = [26909566, 26756623, 27767951, 27888384, 28105753, 29111018, 29242808, 28746738, 29034342, 28850719, 28365927, 29096479, 29461130, 29019505, 28959612, 28677488, 28282845, 28042604, 27123167, 28101649, 28439987, 28043744, 28042088, 27308176, 27032161, 26997355, 27185369, 27154260, 26503181, 26375081, 26334337, 26598401, 26736157, 26156385, 26441024, 26427267, 26378155, 26643018, 26392062, 26259240, 26374900, 25915599, 25923263, 26143432, 26122856, 25949639, 25980534, 26750677, 27033585, 26874672, 26739294, 26710566, 26155022, 25675225, 25974702, 26040056, 26030119, 26428871, 26251869, 26030248, 25592243, 25888830, 26344574, 26313976, 25649333, 26203846, 26465134, 25190106, 25247755, 26245451, 25700439, 25699134, 25657413, 25453057, 25584608, 25565783, 26068759, 25710697, 26422366, 26493532]
4425B6493532K12996m12315L16552J628m02177j51567j75239K92697l39890N91523
4415B6427740R9990l02132j57753O35396L8268q43618n24554L55196O16175N56176
4405B6900884O8092K72445K10207n00395J48266J36655r6541o2385K21170l14590
4395B6983808J29231J71940j40354j42092j114666P96737P15160j99786r4816
4386B7105162M35573N52705q436J34808n47409o30099O40642l21313n88781Q27021
4376B7599873L79959L94721m11036N60305j09503J45943k18742J27840N48448
4367B9017808j2281N15269l10205k9867k69143q6070K0847o16458K55260N4883
4357B8540043P02190m04558p1705J97906o17441K15876k90668M3539j38498L52433
$$ y = [26493532, 26706528, 26294213, 26610765, 26612393, 26210216, 26058649, 25883410, 26176107, 25836217, 26427740, 26527730, 26225598, 26067845, 26703241, 26741509, 25897891, 25373337, 25728533, 26344708, 26900884, 26968976, 27241421, 27451628, 26951233, 27099499, 27236154, 27139613, 27077228, 27298398, 26983808, 27113039, 27284979, 27144625, 27002533, 25887867, 26684604, 27399764, 27199978, 27105162, 27540735, 28093440, 28085004, 28219812, 27672403, 27042304, 27682946, 27361633, 26772852, 27599873, 27979832, 28374553, 27963517, 28523822, 28414319, 28560262, 28341520, 28469360, 29017808, 29005527, 29520796, 29210591, 29180724, 28911581, 28825511, 28846358, 28229900, 28485160, 28540043, 29242233, 28837675, 28765970, 28963876, 28346435, 28562311, 28271643, 28315182, 28176684, 28529117]
4347B8529117j88170L65451o3726k95327q3166L99423K57809j83594J35262N46741
4337B9419820L64368p80823p35036L54832M00690J53308k76943L20101N87943
4328B9808260n02106J36218N00404N8988j80183J48522j02464l9993j93497L89604
4318C0023753J46941J221287L74927j67131K564k28329K57867J67924j90862r6705
4308C1512236K13639O9999K31051n44212k03262P89868j1901j57117j06793M02270
4298C2195778k89620p58099N3061L2672j48941r663L35407P50786k22308q455
4288C1930618M95895n38830K10873J95341n66870K30953M86873J34477p8776L00926
4278C2801480K12470l33048M99281l11427J46981J56658K44731M92497J58064
$$ y = [28529117, 28340947, 28706398, 28642672, 28347345, 28264179, 28663602, 28921411, 28737817, 28873079, 29419820, 29784188, 29003365, 28268329, 28623161, 29023851, 29177159, 28900216, 29220317, 29808260, 29306154, 29442372, 29942776, 30001764, 29821581, 29970103, 29867639, 29827646, 29634149, 30023753, 30170694, 31391981, 31766908, 31599777, 31602341, 31374012, 31631879, 31799803, 31608941, 31512236, 31725875, 31795874, 32026925, 31482713, 31279451, 32069319, 32057418, 31900301, 31793508, 32195778, 31906158, 31148059, 31201120, 31233792, 31084851, 31075188, 31410595, 32161381, 31939073, 31930618, 32426513, 31887683, 32098556, 32293897, 31727027, 31957980, 32444853, 32579330, 32500554, 32801480, 33013950, 32680902, 33180183, 32868756, 33015737, 33172395, 33417126, 33909623, 34067687]
4269C4067687m47129j94124M07606J024114j85988j38314M36848j3850O66503
4260C5623353m7469l8068J6749M50412J58927m46749Q59788K41663j00337l8880
4250C6679389l13842j64824K41739K22135M50234M24706j58225N38560M93392
4241C8413264Q8632j57764j55206J46532L32563j00973j56585j97491j90860L86214
4231C8408326R08065o7265k42692l6218j02448m34570k32925O89486q2935O16281
4221C9423105q2892m17670m44623J82331k54231k03130P64086K39868l69984K34835
4211C9071695L01870j16405J49297j68925M76143L81022J56223j41688o88156
4202C9421076J30776l45954J64375O38274L51075l10963L30721Q04243l33068
$$ y = [34067687, 33620558, 33426434, 33834040, 34858154, 34672166, 34533852, 34970700, 34956850, 35623353, 35575884, 35537816, 35554565, 36004977, 36163904, 35717155, 36576943, 36818606, 36718269, 36679389, 36365547, 36200723, 36442462, 36664597, 37114831, 37539537, 37381312, 37919872, 38413264, 38501896, 38344132, 38188926, 38335458, 38668021, 38567048, 38410463, 38212972, 38022112, 38408326, 39316391, 39249126, 39006434, 38970216, 38867768, 38433198, 38200273, 38889759, 38806824, 39423105, 39340213, 38922543, 38477920, 38660251, 38406020, 38202890, 38966976, 39206844, 38836860, 39071695, 39373565, 39257160, 39406457, 39237532, 39713675, 40094697, 40250920, 40109232, 39421076, 39551852, 39205898, 39370273, 40008547, 40359622, 40048659, 40379380, 41183623, 40850555]
4193D0850555J45721K31388l13296k17941M30425Q0043o1274O94726L75965l16217
4183D1900095Q5085m7420J45719M67690j39044j43552L85967Q3492M7500m72618
4173D2312914M15891J31938j13761j1498k45528K9161L40515J90984K95027O6584
4163D3412227j33515M5021M74046j52079J72459P50452l4369R2587N70178J421
4153D5198428J068894N75316N56739L24367R8158O00066J171799N74358J098634
4144E1266759J768080J340255K292353J819458J623613K045212K971905L027008
4136F8154643K295093K254759J567858L9236j707307l551791l969996m172707
4128F0909788l177614k221027k038630l036613j122507j217675q05179q45487
$$ y = [40850555, 40996276, 41227664, 40914368, 40696427, 41126852, 41206895, 41145621, 41840347, 42216312, 41900095, 41985180, 41937760, 42083479, 42551169, 42412125, 42268573, 42654540, 42738032, 42785532, 42312914, 42728805, 42860743, 42746982, 42735484, 42489956, 42519117, 42859632, 43050616, 43345643, 43412227, 43278712, 43323733, 43797779, 43645700, 43818159, 44568611, 44534242, 44626829, 45197007, 45198428, 46267322, 46842638, 47399377, 47723744, 47821902, 48421968, 49593767, 50168125, 51266759, 53034839, 54375094, 56667447, 58486905, 60110518, 62155730, 65127635, 68154643, 70449736, 72704495, 74272353, 74311589, 72604282, 69052491, 65082495, 60909788, 57732174, 55511147, 53472517, 50435904, 49313397, 48095722, 47290543, 46445056]
4120D6445056r00535j179128l54089N233p17730J05987n18286p85396m98811k89568
4110D1312733m03152K85544p48011p02277O7612k40572p00888J03127k45563L00500
4100C9029053Q1740J18349n92142k59529J14857l35384o05186M7272J117633k46412
4090C8470251M9525l35733L9917o03852m93941j13791L34549l21968J01145L09802
4080C7435904p89358m10801N00373N41261R8987k25065n08931k02761k07938O17977
4070C6849648p17725p32682N03512L33327j16637j69753m2226k89988N0927j39317
4060C5529086l15550M66591Q5979p35658k30831K44867k47144J10924J18400J40916
4050C5167580j27330l221n61633k51023P20790J1318n77321K46863J82663l36502
$$ y = [46445056, 45544521, 44365393, 44011304, 44016537, 43298807, 43404794, 42886508, 42101112, 41602301, 41312733, 40909581, 41195125, 40447114, 39744837, 39812449, 39571877, 38870989, 38974116, 38728553, 39029053, 39110793, 39229142, 38637000, 38377471, 38492328, 38156944, 37551758, 37599030, 38716663, 38470251, 38519776, 38184043, 38223960, 37620108, 37126167, 37012376, 37346925, 37024957, 37126102, 37435904, 36646546, 36235745, 36736118, 37277379, 37376366, 37151301, 36642370, 36439609, 36231671, 36849648, 36131923, 35399241, 35902753, 36236080, 36119443, 35949690, 35907464, 35617476, 35668403, 35529086, 35213536, 35680127, 35766106, 35030448, 34799617, 35044484, 34797340, 34908264, 35026664, 35167580, 35040250, 35037029, 34475396, 34224373, 34945163, 34956481, 34379160, 34626023, 34808686, 34472184]
4040C4472184p03J40414n19115K49396K13670j46131k23813k09270O7460k00582
4030C3843510O87002P230n71238p58523J95357k18017k46403n0887L08559R6293
4020C3292883k20963L59784Q2612l94845k42819m6459q7704M38089p35214k39424
4010C2205940R4084n19221m89775l2451O42135n03818m53237L27039O7521Q4011
4000C1422228K61935q40525M39219L81249p38081l04297M30042m48572N09577
3991C1112775J37873o17420K39593K1889l19021r94775L16466L64650k11671K62948
3981C0313307K15565N99849k72021r28014J93799L89292k92006p40664m59199
3972B9019908j55415K50548J95314j86174o51369k45768J77008K92924K27729
$$ y = [34472184, 34471481, 34611895, 34092780, 34342176, 34555846, 34409715, 34185902, 33976632, 34044092, 33843510, 34530512, 34537742, 33966504, 33207981, 33403338, 33185321, 32938918, 32888031, 33196590, 33292883, 33071920, 33431704, 33514316, 33119471, 32876652, 32830193, 32742489, 33180578, 32445364, 32205940, 32300024, 31780803, 31291028, 31258577, 31900712, 31396894, 30943657, 31270696, 31338217, 31422228, 31684163, 30843638, 31282857, 31664106, 30926025, 30621728, 31051770, 30603198, 31112775, 31250648, 30633228, 30872821, 30894710, 30575689, 29580914, 29897380, 30262030, 30050359, 30313307, 30528872, 31128721, 30856700, 29928686, 30122485, 30511777, 30219771, 29479107, 29019908, 28864493, 29115041, 29310355, 29124181, 28472812, 28227044, 28404052, 28696976, 28924705]
3963B8924705m66349K49427K39611k95120l36198l30004J71275J31062L43098
3954B8631507R7927P633r0573o14503J10933j37262L22l20552J53345l76287P7502
3943B7539992J34490l7790m60390j173670P17380K01912K66442k02130O2537M10089
3933B7458862K24134l93325o3475j57448K58819K39308k58239m95988j58317K25678
3923B6880009J7210k5660L30610l96120q3008l66982L31332O59509n18684L31868
3913B7160084k2299m01681N3269m84730J38496K32770j5195k82769K23084Q18798
3903B7419827M2613n01473l19581r6560L00734j38483m47795J43987p422k67356
3893B6128491j18883O00621L2903L2764l35381r8924k55183l67634L12108K46262
$$ y = [28924705, 28458356, 28707783, 28947394, 28652274, 28316076, 27986072, 28157347, 28288409, 28631507, 28729434, 28737067, 28646494, 28031991, 28142924, 28005662, 28005984, 27685432, 27838777, 27462490, 27539992, 27674482, 27636692, 27176302, 26002632, 26720012, 26921924, 27188366, 26986236, 27048773, 27458862, 27682996, 27289671, 27226196, 27068748, 27327567, 27566875, 27308636, 26812648, 26654331, 26880009, 26897219, 26871559, 27202169, 26806049, 26723041, 26356059, 26687391, 27346900, 26828216, 27160084, 27137785, 26736104, 26789373, 26304643, 26443139, 26675909, 26660714, 26377945, 26601029, 27419827, 27462440, 26960967, 26641386, 26544826, 26845560, 26707077, 26259282, 26403269, 26395847, 26128491, 26009608, 26610229, 26643132, 26675896, 26340515, 26241591, 25986408, 25618774, 25930882, 26177144]
3883B6177144O51377m34038J63343K14923O834k36940L41582N17008p202J32028
3873B7526059O42650p5988k66265o25428j18915O54354N08954O82479l31654O65284
3863B9261530L49045k64850O44048J175176J52253o4011P19554O11786o96503
3854C1888028J92096J264893M52197o10781Q61812J040704J76534N19625M01763
3845C6186871q39334M68364k47228k85539m2027N01058M52978K06740J73504m05745
3835C6169642p03989p30781r9962K38048J51766n03115l84795j92304j94886m22500
3825C3327124r8906k72009m44116l49401j340069p59307K30060o83114m85824
3816B9124438p7851k23592l87737l05682J48260p47240r47375l78331K15018L38972
$$ y = [26177144, 26828521, 26394483, 26557826, 26772749, 26779583, 26542643, 26884225, 27401233, 27394031, 27526059, 28168709, 28092721, 27826456, 27201028, 27082113, 27736467, 28245421, 28927900, 28596246, 29261530, 29610575, 29345725, 29989773, 31164949, 31317202, 31253191, 31972745, 32584531, 31888028, 32080124, 33345017, 33797214, 33186433, 34048245, 35088949, 35265483, 35785108, 36186871, 35347537, 35815901, 35568673, 35283134, 35241107, 35742165, 36195143, 36401883, 36575387, 36169642, 35465653, 34734872, 34634910, 34872958, 35024724, 34521609, 34136814, 33944510, 33749624, 33327124, 33228218, 32956209, 32512093, 32162692, 30822623, 30063316, 30293376, 29610262, 29124438, 29046587, 28822995, 28435258, 28129576, 28277836, 27530596, 26583221, 26204890, 26419908, 26758880]
3806B6758880p65584j001321J58633k91989l98533j160124n52849m79768k75316
3797B1992029N29759o4565l79094k32042M9418l90365l03798l54692M751n99516
3787B0251885O5355o18303k70947J69582J55218q3639k25957k11259L50767k75028
3777A9307674p93489j27670M84596j37112o57885q1577n67672k77173L08906j68980
3767A7289618j42247K11272O798n4406l83120o47437J86435L42380N98587p34528
3757A6673352K8150k46503m20325J76463n06895L02505K86737m02935k92614k06707
3747A5391228n75019R29253n02877L19148M12115p14218l99439m84870M44987
3738A4820308J38399m19315n63484j3203L97020L06165o39712k32840J76972J90990
$$ y = [26758880, 25993296, 24991975, 25150608, 24858619, 24460086, 23299962, 22747113, 22267345, 21992029, 22521788, 22457223, 22078129, 21846087, 21895505, 21505140, 21201342, 20846650, 20851401, 20251885, 20317240, 19698937, 19427990, 19597572, 19752790, 19669151, 19443194, 19231935, 19582702, 19307674, 18514185, 18386515, 18871111, 18733999, 18076114, 17994537, 17426865, 17149692, 17458598, 17289618, 17147371, 17358643, 17365441, 17311035, 16927915, 16280478, 16466913, 16809293, 17407880, 16673352, 16701502, 16454999, 16034674, 16211137, 15704242, 16006747, 16293484, 15890549, 15597935, 15391228, 14816209, 15745462, 15242585, 15561733, 15973848, 15259630, 14860191, 14375321, 14820308, 14958707, 14539392, 13975908, 13962705, 14359725, 14665890, 14026178, 13793338, 13970310, 14161300]
3728A4161300n89636j15065m72544K5808J12254K90209J71343n95360j17146N47357
3718A3418520L23611l54716p27170P95279K41089n20102O7379k8775P4634k92115
3708A2997634j05509o91198K66926q45087K732L15106K46973m21078J77026J7769
3698A1961294j56756J60843R8742J26922m0877p96510m13780M66372K44714L48316
3688A1999280J76918J09885l50469j2421j75475k69268k69360M10944L21495l75205
3678A1566324M32162o75480Q6376M86449m80381Q9638l39362k44524K41623K77933
3668A1440758J0220j66816L0119n57423j3162L43155N51218j48245n6101q8935
3658A1344788j36611k2309p7511M45224k68659j12604r4570l53429K08432P80672
$$ y = [14161300, 13571664, 13456599, 12984055, 13009863, 13122117, 13412326, 13583669, 12988309, 12871163, 13418520, 13742131, 13387415, 12660245, 13455524, 13696613, 13176511, 13243890, 13215115, 13289749, 12997634, 12892125, 12200927, 12467853, 11622766, 11625498, 11940604, 12187577, 11766499, 11943525, 11961294, 11804538, 11965381, 12064123, 12191045, 12150168, 11353658, 10939878, 11406250, 11650964, 11999280, 12176198, 12286083, 11935614, 11923193, 11747718, 11478450, 11209090, 11620034, 11941529, 11566324, 11998486, 11323006, 11409382, 11895831, 11415450, 11505088, 11165726, 10921202, 11162825, 11440758, 11450978, 11284162, 11314281, 10756858, 10743696, 11086851, 11638069, 11489824, 11433723, 11344788, 11208177, 11185868, 11108357, 11553581, 11284922, 11172318, 11077748, 10724319, 10932751, 11713423]
3648A1713423L9854o48037K06457j029938K39647P75017m77394O64572L53862
3639A1837463k72070l82383P0091q5002L54303l01653N04556k14720P4128o75546
3629A0909167J05046K80911L74330J46689j85341J26442k9584J61382J66170N6342
3619A2111554K81018p02432l2248R06477K79538k30450K9943l21326o06725N28824
3609A2244173K04177J1404N64175J79297J7634K63422J59965K32402j68010J28389
3599A3837028k26915M07439J96751Q17943J65103l26633l6585L10648O47649n86545
3589A5205883P40984R19897l97437J45749k12962m97343J95134R33225K64536
3580A7297666K43308N17405L10064k2997L71563J3379O29294L22787l06687K5594
$$ y = [11713423, 11753277, 11105240, 11311697, 10281759, 10521406, 11296423, 10819029, 11483601, 11837463, 11565393, 11183010, 11253101, 11168099, 11522402, 11220749, 11725305, 11510585, 11584713, 10909167, 11014213, 11295124, 11669454, 11816143, 11630802, 11757244, 11727660, 11889042, 12055212, 12111554, 12392572, 11690140, 11657892, 12564369, 12843907, 12613457, 12643400, 12322074, 11715349, 12244173, 12448350, 12459754, 13023929, 13203226, 13220860, 13484282, 13644247, 13876649, 13708639, 13837028, 13610113, 14017552, 14214303, 15032246, 15197349, 14870716, 14834131, 15144779, 15792428, 15205883, 15946867, 16866764, 16469327, 16615076, 16402114, 15904771, 16099905, 17033130, 17297666, 17540974, 18058379, 18368443, 18345446, 18717009, 18730388, 19359682, 19682469, 19375782, 19401376]
3570A9401376J33095O83388N68270n394R30256N26601L25901P4228p034Q42494
3560B3473181N93298J98562L99117J008081P61332O60355Q15741J178257J521625
3551C0609549O39068Q18259O58248J581837J797133R82018J578047J548041J823194
3542D2035394K432965K817855K180764K083004K210713J490460J748050J826121
3534E8825326J467873P94101j18771j937349j938135j598199k636376l008945
3526D9849525k951646k894361k797003k918976k488147j593709j496802k051956
3518C0656925j640985j202248j630764j627170n75157q14861p07222q49010m18
3509B1609090m72210j049657q52981j511713k59693m28744l04605r70934j73882
$$ y = [19401376, 19534471, 20217859, 20786129, 20780735, 21710991, 22237592, 22563493, 22637721, 22630687, 23473181, 24066479, 24265041, 24664158, 25672239, 26433571, 27093926, 27909667, 29087924, 30609549, 31248617, 32066876, 32725124, 34306961, 36104094, 37086112, 38664159, 40212200, 42035394, 44468359, 47286214, 49466978, 51549982, 53760695, 55251155, 56999205, 58825326, 60293199, 61087300, 60968529, 59031180, 57093045, 55494846, 52858470, 49849525, 46897879, 44003518, 41206515, 38287539, 35799392, 34205683, 32708881, 30656925, 29015940, 27813692, 26182928, 24555758, 23980601, 23165740, 22458518, 21609508, 21609090, 21136880, 20087223, 19234242, 17722529, 17462836, 17034092, 16729487, 15758553, 15584671]
3500A5584671K12061m56928j022974m1937k09605J02545o59785k08318k82401
3491A3017329k85859p27754m01880J78213j59078q83335k45307N21902L67735
3482A1381966n24426r85253n56191K36775M09149r11916M54442k15235o72683
3473H616628o4094n79675J67798L29776m29256QL5682o70400k92534j97195M83468
3462G400206m51420j49394p6836N2421n4451Q8076n90559j91830K00469j47873
3452F078809O189j13786l6323L8556J77297k32650J69546n28593P31001l56743
3442E933303n77678K18550L66050k67474j41692k46960Q048j96813j24592P2934
3432E043676m54382q748l3107L32448J83438j91658n96133o1434J302243l79802
$$ y = [15584671, 15796732, 15339804, 14316830, 14274893, 14065288, 14167833, 13508048, 13299730, 13017329, 12731470, 12003716, 11601836, 11780049, 11620971, 10737636, 10492329, 11014231, 11381966, 10857540, 9872287, 9316096, 9552871, 9962020, 9050104, 9504546, 9289311, 8616628, 8552534, 7972859, 8140657, 8470433, 8041177, 8041185, 8076867, 7406467, 7113933, 6916738, 7400206, 6948786, 6799392, 6722556, 6774977, 6720526, 6808602, 6218043, 6026213, 6226682, 6078809, 6084998, 5971212, 5934889, 5973445, 6150742, 5918092, 6087638, 5559045, 6290046, 5933303, 5355625, 5574175, 5940225, 5672751, 5531059, 5284099, 5292147, 5095334, 4970742, 5043676, 4589294, 4580546, 4547439, 4879887, 5063325, 4871667, 4275534, 4214100, 5516343, 5136541]
3422E136541q07744L7212L04435N08407M70606k90687r09244P8322K68870j72442
3412D624276J98300m54972K72423j24933j39704J49425k83044N29481k48763m33663
3402D088826M11327M43370p01109k53725J99615J92381k87278q9054J71209k54435
3392C921127M8327o3373o63379J86510N20816l06665M53216k66284j26387o06432
3382C097476K0228Q70411k02699j76495j8454m56532M79488K62259p8940q61111
3372B935631r70454K96547P7119M50988M96111J89888k11208k93204J05960j9715
3362C057663K68787n06806r83965L02248K63187R2169k73974P26904M89428n07194
3352B928447J85048j83523l23484l7707n15439K01319P82508k71135o541p149
$$ y = [5136541, 4328797, 4366009, 4670444, 5178851, 5649457, 5358770, 4449526, 4527848, 4796718, 4624276, 4822576, 4367604, 4640027, 4515094, 4375390, 4524815, 4241771, 4771252, 4522489, 4088826, 4500153, 4943523, 4242414, 3988689, 4188304, 4380685, 4093407, 4004353, 4175562, 3921127, 3969454, 3906081, 3242702, 3429212, 3950028, 3643363, 4096579, 3830295, 3703908, 3097476, 3117704, 3988115, 3785416, 3608921, 3590467, 3133935, 3613423, 3875682, 3796742, 2935631, 1965177, 2261724, 2338843, 2789831, 3285942, 3475830, 3264622, 2971418, 3077378, 3057663, 3326450, 2819644, 1835679, 2137927, 2401114, 2493283, 2219309, 2946213, 3435641, 2928447, 3113495, 2929972, 2606488, 2568781, 2053342, 2254661, 3037169, 2766034, 2759493, 2752344]
3342B752344m41092l5779J17329L1457k72144L67666J98484m16891q3158J5070
3332B233286K34168l05707L97621m9483K38984j53297m84327l04269L74877Q97362
3322C079215q21649L36921o59598N45578N63693o41744M62352O9000M17211J15107
3312C466086p97271j82252K77739k42611j63961L59990K38236n3658k17089l0062
3302B655147L18980n57593j24711L18248p35871M79806o6155L76302M29848L41152
3292C435153o7181K30258l2741n2848j03030m6110M24811n16272k07174Q40233
3282C905099K96229q96281K84586N0159K04357K04375k68888l355j13012J47513
3272C810782q1421L06110L98411j46991j40547L5245l73383k72838L58825L51072
$$ y = [2752344, 2311252, 2275473, 2392802, 2424259, 2152115, 2519781, 2718265, 2301374, 2218216, 2233286, 2467454, 2161747, 2559368, 2509885, 2748869, 2595572, 2111245, 1806976, 2181853, 3079215, 2257566, 2594487, 1934889, 2480467, 3044160, 2402416, 2864768, 2933768, 3350979, 3466086, 2668815, 2486563, 2764302, 2521691, 2357730, 2717720, 2955956, 2902298, 2685209, 2655147, 2974127, 2416534, 2291823, 2610071, 1874200, 2354006, 2287851, 2664153, 3094001, 3435153, 3367972, 3598230, 3565489, 3512641, 3409611, 3363501, 3788312, 3272040, 3064866, 3905099, 4201328, 3305047, 3589633, 3639792, 3844149, 4048524, 3779636, 3776281, 3663269, 3810782, 3729361, 4035471, 4433882, 4286891, 4146344, 4181589, 3808206, 3535368, 3894193, 4245265]
3262D245265N05269o4240j35859M98544p9566k00479k81201o3380J54555j23569
3252D455339M27180n43167l68326R39916K25623J8107M54293k84027K60188M27333
3242F012459J09742l48441O5326j32925p9644J028640J37022m94681J46124j39992
3232F303630N00634M78358k48681P1387k53229n8024R55815k30331j154613J98516
3222F563462L3043l95039l57693k40676k79772k57562K2581M23674L84198K97674
3212F193890j96760k32556L01859l05496K93480l64398O02067Q720m9327j88545
3202F062934J40337N42969l28454j88335n91286q605l60636L6955l9112q8400
3192E178367l75861j71008m47721K22151N55156J41397L6342k38346l53019l9009
$$ y = [4245265, 4750534, 4686294, 4550435, 5048979, 4969413, 4768934, 4487733, 4424353, 4578908, 4455339, 4882519, 4339352, 3971026, 4910942, 5136565, 5154672, 5608965, 5324938, 5585126, 6012459, 6122201, 5773760, 5839086, 5706161, 5626517, 6655157, 6792179, 6297498, 6443622, 6303630, 6804264, 7282622, 7033941, 7105328, 6852099, 6794075, 7749890, 7519559, 6364946, 6563462, 6596505, 6201466, 5843773, 5603097, 5323325, 5065763, 5088344, 5512018, 5896216, 6193890, 5997130, 5764574, 6066433, 5760937, 6054417, 5690019, 6292086, 6300806, 6251479, 6062934, 6203271, 6746240, 6417786, 6229451, 5638165, 5629560, 5268924, 5305879, 5266767, 5178367, 4802506, 4631498, 4183777, 4405928, 4961084, 5102481, 5138823, 4900477, 4547458, 4508449]
3182D508449m01691J0757l09840J54438r7851k80109k53271M6348L0965m96260
3172B911935J4364j53k81353m69009N11694m89014J03739o59241l1829L77882
3162A989015j54409k87567k99071J13813j27466l5194j12871J84612K6368Q8017
3152A385247L61539L0446p2625j016848k51932M68448J29039m39584L4602O3368
3142F91700j64328l01838k72499L86000n58398N31555l51719K03587p7479j50578
3132f3997K68747j20500L20637j91809p3038K92795j00960J81950K37867K16177
3122I67869j11652l30713k68216L71322L72719q16741j29078j94590J33172p21223
3112g27131j58161k77049P69830L37407J49653j29459p3029M64078n7368l46193
$$ y = [4508449, 4106758, 4117515, 3807675, 3962113, 3864262, 3584153, 3330882, 3377230, 3408195, 2911935, 2926299, 2926146, 2644793, 2175784, 2687478, 2198464, 2302203, 1642962, 1611133, 1989015, 1834606, 1547039, 1247968, 1361781, 1234315, 1199121, 1086250, 1270862, 1297230, 1385247, 1746786, 1777232, 1704607, 687759, 435827, 904275, 1033314, 593730, 628332, 691700, 527372, 225534, -46965, 339035, -219363, 312192, -39527, 164060, 86581, -63997, 204750, 84250, 404887, 213078, 140040, 432835, 331875, 513825, 751692, 967869, 856217, 525504, 257288, 628610, 1001329, 184588, 55510, -139080, -5908, -727131, -885292, -1162341, -392511, -55104, 94549, -34910, -107939, 356139, 298771, -47422]
3102d7422m05106K4304J17999M84195K68466l49924j79503l58289m93425J82719
3092g55986k06905L17981M21174n69578k41640O61612R8616m04035l1271N01219
3082b08813n61724m29549K0845K50625J30768O81541J57050l08230p83020k43378
3072a293885K84817L28605J57472Q6745K4733l74015j75144l179L64775j29832
3062g28908n33507O57100J07504n15932k45932o6659N11250J80255j95572m24171
3052a254572K3196k91139J25381K05958l59814L08494O53178l37727m72236M9086
3042a350195j10242R24939k02243o48279m1366K32646K35877k09765O91080K20304
3032b57244n23004K61732k30180J47399l43421l82477K5236J22227M60781K56170
$$ y = [-47422, -452528, -428224, -310225, 173970, 442436, 92512, -86991, -445280, -938705, -755986, -962891, -644910, -223736, -793314, -1034954, -373342, -274726, -678761, -710032, -208813, -770537, -1200086, -1179241, -928616, -797848, -116307, 40743, -267487, -1050507, -1293885, -1009068, -680463, -522991, -436246, -411513, -785528, -960672, -963851, -599076, -728908, -1262415, -605315, -497811, -1013743, -1259675, -1326334, -815084, -634829, -830401, -1254572, -1231376, -1522515, -1397134, -1191176, -1550990, -1242496, -589318, -927045, -1399281, -1350195, -1460437, -535498, -737741, -1386020, -1427386, -1194740, -958863, -1168628, -477548, -257244, -780248, -518516, -748696, -601297, -944718, -1327195, -1301959, -1179732, -718951, -462781]
3022d62781n74533j90787j69292j86628o486M81971N55442o87561K31671j05147
3012a114131j55344L63640j30254k6309K04073j3055R1812P44227r63138k65584
3002a264063L90784o29200O65256k1796K33347m51482r50472P47911n1286K34279
2992a096722K00695k44134J62220K84804J04707L28177k27442p72786O8112J46993
2982a045376J28245p12929L7090K26661M07258K66968l67289j26018J18654m23217
2972a489953J98398J94511J32075Q8455K06601j73799m73017m10152M58008l51108
2962a619981j10316L00342O05684l90064n42449M10161J03192R054m79215M95307
2952a218285L49745l05541K38603k2839k76295J39409L82502j41488k81516j58077
$$ y = [-462781, -1037314, -1228101, -1397393, -1584021, -1590507, -1108536, -553094, -1240655, -1008984, -1114131, -1269475, -905835, -1036089, -1062398, -858325, -871380, -779568, -35341, -998479, -1264063, -873279, -1502479, -837223, -859019, -625672, -1077154, -2027626, -1279715, -1331001, -1096722, -896027, -1140161, -977941, -693137, -588430, -260253, -487695, -1260481, -1192369, -1045376, -917131, -1630060, -1592970, -1366309, -959051, -692083, -1059372, -1185390, -1066736, -1489953, -1291555, -1097044, -964969, -876514, -669913, -843712, -1316729, -1726881, -1268873, -1619981, -1730297, -1429955, -824271, -1214335, -1756784, -1346623, -1243431, -1234377, -1713592, -1218285, -868540, -1174081, -935478, -958317, -1234612, -1095203, -712701, -854189, -1135705, -1293782]
2942a293782N65565m56461j20468K68479m10846L59955k56203M4804N80394n94651
2932a313214J24977l6305M5141M6563J2493K42765l7432n5054m50754l30062r0856
2921a841738M74798l74542o39563O15066M41458K65348o48541K53980K16823r6158
2911a333069m05759J25835K82451P22711k59437l43745m5531j257770J15456M70237
2901a928621N09894J64296q6207n91759M32859k22884L28934J83113l19699o30061
2891b160135N47423r0971K15552K75636K16411m88834Q5269K41505P17842r25582
2881a365884k90101M02747J27166l69556l46925J78496K65883l41605j11929O83295
2871a168413l83579m90500L44880J37916j91052J0006k18744M9557R873J7308
$$ y = [-1293782, -728217, -1184678, -1305146, -1036667, -1447513, -1087558, -1343761, -1298957, -718563, -1313214, -1188237, -1224542, -1179401, -1132838, -1120345, -877580, -915012, -970066, -1420820, -1750882, -1841738, -1366940, -1741482, -2381045, -1765979, -1324521, -1059173, -1707714, -1453734, -1236911, -1333069, -1738828, -1612993, -1330542, -607831, -867268, -1211013, -1256544, -2514314, -2398858, -1928621, -1418727, -1254431, -1340638, -1932397, -1499538, -1722422, -1393488, -1210375, -1530074, -2160135, -1612712, -1703683, -1488131, -1212495, -996084, -1484918, -1399649, -1158144, -440302, -1365884, -1655985, -1253238, -1126072, -1495628, -1842553, -1664057, -1398174, -1739779, -1851708, -1168413, -1551992, -2042492, -1697612, -1559696, -1750748, -1740742, -1959486, -1909929, -1900056, -1882748]
2861a882748K71294R6294j4850l93563K53114P56820p52211n78706P28913K12738
2851a302905J72238j24450J07436J48802m25735n46928N19062K18497L99863m35895
2841a270015o4444j41970l70551l6621M46554K28818l55551O95148n08941M20825
2831i56748k26140j47009j80006n3598n2922K08766o46557M37583J26698Q1562
2821a408371L19596j61933J8223j68102k66304N03655l75660J99172K2642J85070
2811a132012N5541j58859l1800M01384J44583m42859K96143k04491j82825j24419
2801a379614k53516R10636K59622P2232n47797j92922M5816m33570P195O84022
2791h27896K35837p38719L20501L97568k89563k31606P14258j25485m7376k50454
$$ y = [-1882748, -1611454, -1515160, -1530010, -1923573, -1670459, -913639, -1665850, -2244556, -1515643, -1302905, -1130667, -1255117, -1147681, -998879, -1424614, -1971542, -1452480, -1233983, -834120, -1270015, -1334459, -1476429, -1846980, -1883601, -1437047, -1208229, -1563780, -868632, -1377573, -956748, -1182888, -1329897, -1509903, -1563501, -1616423, -1407657, -2054214, -1616631, -1489933, -1408371, -1088775, -1250708, -1232485, -1400587, -1666891, -1163236, -1538896, -1339724, -1317082, -1132012, -1076471, -1235330, -1267130, -865746, -721163, -1164022, -867879, -1072370, -1255195, -1379614, -1633130, -722494, -462872, -390640, -938437, -1131359, -1085543, -1519113, -1511918, -827896, -592059, -1330778, -1010277, -612709, -902272, -1133878, -419620, -545105, -592481, -842935]
2781h42935J23988N43142p13057L28087L3635n42974k67759N93646L63557J40080
2771b40590N22378l52554k879N62517o4319n23267k84359O51454K6539J00865
2761C95785l49424k766J06527K93795n583K23061J34557N04406L46423J95148
2751A841929L27019n59589O33232l92906J4411M33212o06744n44492j24188l61373
2741F60511K06670l79676o63630N5918M00032J65395K18351j91415m21436j482
2731D9238k43413j38176O67456q9449n2706L29714o62234j23630O63780J86426
2721E87006M79780q86196n53898j61333J39853m0209M46344o6311K76263M64831
2711F86130K01485o08188j23942m0116L76434N21962l72243n07985m3376M19028
$$ y = [-842935, -718947, -175805, -888862, -560775, -527140, -1070114, -1337873, -744227, -380670, -240590, 281788, -70766, -73645, 488872, 424553, -98714, -383073, 268381, 294920, 395785, 46361, 43595, 150122, 443917, 438334, 661395, 795952, 1300358, 1646781, 1841929, 2168948, 1609359, 2242591, 1849685, 1864096, 2297308, 1690564, 1146072, 1021884, 660511, 867181, 487505, -176125, -120207, 279825, 445220, 663571, 472156, 50720, 49238, -194175, -332351, 335105, 245656, 192950, 522664, -139570, -263200, 400580, 587006, 1066786, 180590, -373308, -534641, -394788, -434997, 11347, -54964, 221299, 686130, 887615, 279427, 155485, 115369, 491803, 1013765, 641522, 133537, 90161, 509189]
2701E09189j7949K862N9322M85436j53399l61841p15854J96136Q24639j94801
2691F33740p86136K05662P73310K18141K81579M22269n1162q39676J68035L22129
2681A347891L03368K59197n30549l84458K21949k25771q6729L73594L88872k51428
2671A415936k61360P1933M35373j43113R2472L85998K50177M94584r01798j20435
2661A719767j3055m55571J61957L92966J97418k61336l36537K57846M99963J0208
2651B173626K43208L20770K56054l58166K39706N38473n58515k533J05039M87339
2641C445001o0343J88023K25152j92310O08190J32276l41103o06073J21505J057698
2631D578016k43927K23567L2137L97768J50022l31902M51133O27951K27371N80324
$$ y = [509189, 491240, 494102, 553424, 1038860, 885461, 523620, -192234, 3902, 828541, 633740, -152396, 53266, 826576, 1044717, 1326296, 1748565, 1697403, 857727, 1025762, 1347891, 1651259, 1910456, 1379907, 995449, 1217398, 991627, 904898, 1278492, 1667364, 1415936, 1154576, 1226509, 1661882, 1518769, 1611241, 1997239, 2247416, 2742000, 1840202, 1719767, 1706712, 1251141, 1413098, 1806064, 2003482, 1742146, 1405609, 1663455, 2163418, 2173626, 2416834, 2737604, 2993658, 2635492, 2875198, 3413671, 2855156, 2852623, 2957662, 3445001, 3384658, 3572681, 3797833, 3605523, 4213713, 4345989, 4004886, 3398813, 3520318, 4578016, 4334089, 4557656, 4589793, 4987561, 5137583, 4805681, 5256814, 5884765, 6112136, 6692460]
2621F692460o0288j41235K40113l26024l07749N67165L12326k12616n89775L57110
2611F531487J65211Q8627J01270k53555K06619R7129L40518K90701L33435L82903
2601H284345O24341J12441n08067Q12837K53850J09440N7461j67069N7876Q03397
2591A0440852l1391O85962K85330M59338P68972O05757N00371J59039Q67546L48602
2581A5090378J80235M15500N38446L86402N83532K02349M97260J9510P65475Q43273
2571A9522360R57779N47622K1162K26990M54507L67976Q84226O88351R7232L89476
2561B4157681P19919K09517R57428N66590J913145J12410Q32526L24873O10935
2552C0405024J105170J000094Q26509Q75756J283272R61798K224505N15114K035151
$$ y = [6692460, 6632172, 6490937, 6731050, 6405026, 6097277, 6664442, 6976768, 6764152, 6174377, 6531487, 6696698, 6785325, 6886595, 6633040, 6839659, 6936788, 7277306, 7568007, 7901442, 8284345, 8908686, 9021127, 8513060, 9325897, 9579747, 9689187, 9746648, 9579579, 9637455, 10440852, 10409461, 11095423, 11380753, 11840091, 12609063, 13214820, 13715191, 13874230, 14741776, 15090378, 15270613, 15686113, 16224559, 16610961, 17194493, 17396842, 17894102, 17913612, 18679087, 19522360, 20480139, 21027761, 21048923, 21275913, 21730420, 22098396, 22982622, 23670973, 23768205, 24157681, 24877600, 25087117, 26044545, 26611135, 28524280, 28636690, 29469216, 29794089, 30405024, 31510194, 32510288, 33336797, 34212553, 35495825, 36457623, 38682128, 39197242, 41232393]
2543D1232393J688384J251769J893590J682942K758166K640791K719153L046272
2535E8913460K927451L084655L420390L433675L321127N005969M202536N313688
2527H9622951O522596P265731P423863Q785172R058755J0218934J1426267J3535102
2519A63859371J5977102J7645881J9992335K3731448K6531752K9740793L2855369
2512C30334051L5142973L8134795L8468408L5051733K2342526l22519k5161318
2505D73990649m0155832m7503689m7021245m2156881l6239471l0045109k4291574
2498B06576848j9929051j6806161j3816519j2128983j1185021r378196r088594
2491A14244323q536647q170470p599475o190099n839708n426651m127170l577773
$$ y = [41232393, 42920777, 44172546, 46066136, 47749078, 50507244, 53148035, 55867188, 58913460, 61840911, 64925566, 68345956, 71779631, 75100758, 80106727, 84309263, 89622951, 96145547, 103411278, 110835141, 119620313, 128679068, 138898002, 150324269, 163859371, 179836473, 197482354, 217474689, 241206137, 267737889, 297478682, 330334051, 365477024, 403611819, 442080227, 477131960, 499474486, 499151967, 473990649, 433834817, 386331128, 339309883, 297153002, 260913531, 230868422, 206576848, 186647797, 169841636, 156025117, 143896134, 132711113, 123332917, 114244323, 105707676, 97537206, 89937731, 83747632, 77907924, 72481273, 68354103, 64776330]
2483F4776330l485642l890784l339299k222191k216769k133022k255900j921929
2475D3310794k240718j901706j361956j330284j569452k115705o84222r02909
2467C1203842j450049j112702o61721j711765j555412n30858r95155r08821m16336
2458B1861023q44706j76604j220402n85282l22536m80063j273089n15090n22693
2449A5920558m12883N42825o47303n88228n39960j82439o75250k46172q00997
2440A2370151O0506o82195k75591k69639J22751n85014p41119q63209J98974R2893
2430I428508p01394K6849j081618k59546l30712j09282j06715J25802L68316m96509
2420F863699n57683m83004M8981M24865q01912p65493M61602l62214J19692K26698
$$ y = [64776330, 61290688, 57399904, 54060605, 51838414, 49621645, 47488623, 45232723, 43310794, 41070076, 39168370, 37806414, 36476130, 34906678, 32790973, 32106751, 31203842, 29753793, 28641091, 27979370, 26267605, 24712193, 24181335, 23186180, 22277359, 21861023, 21016317, 20839713, 19619311, 19034029, 18711493, 18231430, 16958341, 16443251, 15920558, 15507675, 16050500, 15403197, 14814969, 14275009, 14092570, 13417320, 13171148, 12370151, 12430657, 11748462, 11472871, 11203232, 11325983, 10740969, 9999850, 9136641, 9335615, 9428508, 8727114, 8753963, 7672345, 7412799, 7082087, 6972805, 6866090, 6991892, 7360208, 6863699, 6306016, 5823012, 5871993, 6296858, 5494946, 4729453, 5191055, 4828841, 4948533, 5175231]
2410E175231l44849m25583l65358j95576J19135l44495n90985Q53979K2084k50257
2400C653326j97098l66556j19634n27665p0721L80982M71835K23285j82965k18641
2390C046148P14828j11100p02098l64062l03011m75828k03170l27817N28273R83663
2380B785826k17872p81541K80967m07167K44874k90122j03055m62082Q15795N8304
2370A923927k83102l72928p60059K18497L76949l56822P1818J35154j94089K29733
2360I89078k91223R8331n2596J00881K05426k10565p96815J18021K39377L11340
2350G11255p00464K06929R4845k68752L29050J25052m47152J40958N64227N64951
2340A320899o11324m69523j96383j23319l63394Q65643P8311p92508k29073O56395
$$ y = [5175231, 4830382, 4404799, 4039441, 3843865, 3963000, 3618505, 3027520, 3881499, 3903583, 3653326, 3456228, 3089672, 2970038, 2442373, 2371652, 2752634, 3224469, 3447754, 3264789, 3046148, 3760976, 3649876, 2947778, 2583716, 2280705, 1804877, 1601707, 1273890, 1802163, 2785826, 2567954, 1786413, 2067380, 1660213, 1905087, 1614965, 1511910, 1049828, 1865623, 1923927, 1640825, 1267897, 507838, 726335, 1103284, 746462, 818280, 953434, 759345, 989078, 697855, 796186, 743590, 844471, 1049897, 839332, 42517, 160538, 399915, 711255, 10791, 217720, 312565, 43813, 372863, 497915, 50763, 191721, 755948, 1320899, 709575, 240052, 43669, -79650, -443044, 422599, 500910, -291598, -520671, 135724]
2330A35724k24997j36620J9900l50892L5241M3311j8299O1358k40236R5714K52136
2319c27660K51340L56165K8101m5080j43628l8561o65358q02704N68978N59633
2309b58774k17865q438O3964J75515L79302n51526M72279l6589K6812k02947L0036
2298a28231j10624O6650Q0703m17512J6518k40736L79633K4971J2647J02721p9406
2287b92666L57850n93693j04474M20070k83194O46676k36378K58048o72316J70209
2277c29868L46947K63032j06054L13564k4733L76451L52674q03129P7220O00618
2267A066722M79235L84346o9639j84729J85432K1858o40389L50965l76080r01682
2257C16039q243M34430k27295R0470N423n27701j5216l22909J88611m56336j72087
$$ y = [135724, -89273, -225893, -205993, -556885, -521644, -478333, -496632, -435274, -675510, -579796, -327660, -76320, 279845, 307946, 262866, 119238, 80677, -584681, -1387385, -818407, -258774, -476639, -485077, -421113, -245598, 133704, -417822, 54457, 17868, 44680, -158267, -128231, -238855, -172205, -91502, -509014, -492496, -733232, -353599, -328628, -315981, -213260, -292666, 65184, -528509, -632983, -212913, -496107, 150569, -85809, 172239, -500077, -329868, 17079, 280111, 174057, 487621, 462888, 839339, 1192013, 388884, 466104, 1066722, 1545957, 1930303, 1860664, 1675935, 1861367, 1883225, 1242836, 1593801, 1217721, 316039, 307796, 742226, 514931, 605401, 610824, 83123, 67907, -255002, -66391, -522727, -694814]
2246f94814M86767o56865m46182Q24992J74002N37850j05167o25258o06589M61349
2236f49915l13910m77988N96751J01973o1902k05284K02949k29651k18982k05457
2226a461416K34171j53357K28564J24814o73608K70953P4855l86849j04485M7309
2216a799049N69022J03442o51437J32842M02355k0723L02692m76436O4496J95059
2206a177737L63639o6938l12482l95094M78276M40394l68563k12151j09994j41845
2196a502495k29303J73443m7014N17185K28943p17758M89450L30132m94929j4361
2186a266707J71077p359j23414p59639k40154R62000L34577o4205k91421K28490
2176a056755j45617p6997M39112l01457k40450k7523o22477N56033N81492N39337
$$ y = [-694814, -208047, -864912, -1311094, -486102, -312100, 225750, 120583, -504675, -1111264, -649915, -963825, -1441813, -845062, -743089, -804991, -1010275, -807326, -1036977, -1255959, -1461416, -1227245, -1380602, -1152038, -1027224, -1700832, -1429879, -1355024, -1741873, -1846358, -1799049, -1230027, -1126585, -1778022, -1645180, -1242825, -1263548, -960856, -1437292, -1372796, -1177737, -814098, -881036, -1193518, -1588612, -1110336, -669942, -1038505, -1250656, -1360650, -1502495, -1731798, -1558355, -1605369, -1088184, -859241, -1576999, -1087549, -757417, -1252346, -1266707, -1095630, -1102989, -1226403, -1986042, -2226196, -1264196, -929619, -993824, -1285245, -1056755, -1202372, -1279369, -840257, -1141714, -1382164, -1409687, -2032164, -1476131, -894639, -355302]
2166c55302p06342n25256O11806N3173j26585o19038J42133L14536j80571N13227
2156h78219o24317J64856N41264K37038k17952k59247K83723K56781o6168k88335
2146h50576j16883j07422L89803L58460O0937K5100J99292m71018j126630O02941
2136a035996j09846J70613l75108Q8356j76233J35275L1986k9275K03245J8874
2126a078109j76425l70034J82615O8736N94076J39574l45061l19286O50143L19114
2116c34657k72206r30402N83878j14952O48386k35918j74732l57507r9910l38273
2106a626293N58082K33435j51492l14272L09035J09187j68703M07331l57005J3499
2096i87196R9314l92847M95518L66718n22952K0228r3270N06443Q3482n73849
$$ y = [-355302, -1061644, -1586900, -975094, -921921, -1048506, -1667544, -1525411, -1210875, -1391446, -878219, -1502536, -1337680, -796416, -559378, -777330, -1036577, -752854, -496073, -562241, -850576, -967459, -1074881, -685078, -326618, -265681, -240581, -41289, -512307, -1638937, -1035996, -1145842, -975229, -1350337, -1261981, -1438214, -1302939, -1270953, -1300228, -1096983, -1078109, -1254534, -1624568, -1441953, -1373217, -779141, -639567, -984628, -1303914, -653771, -334657, -606863, -1537265, -953387, -1068339, -419953, -655871, -830603, -1188110, -1288020, -1626293, -1068211, -834776, -986268, -1300540, -991505, -882318, -1051021, -643690, -1000695, -987196, -887882, -1280729, -785211, -418493, -941445, -921217, -1014487, -508044, -424562, -998411]
2086i98411l64259K45715j69737k61298M6101K82365j9286l9798k15670k16843
2076a711121J08037q160K83649R1719J25267m1086P5466m09516k60284R90802
2066g55227K5144n31602k75105L97121M46583j68964m15759l23125M76045M00671
2056g24218j40669k29327l00999Q5683o56043M89218N95406P59071k38599j2108
2046c72585j29689m29017o58243j102709N43857J542038K18300l86035k98099
2037a072182j73458J7993l00036K05536k38589J06883J36231L64924L14699l0905
2027f68904n87270L3738K35729M77804n41363m889N17419p43641J099907k81916
2017d63386p91634J28936K68365l14695K77101Q4141K2117m1825p066J47337l28647
$$ y = [-998411, -1362670, -1116955, -1286692, -1547990, -1501889, -1219524, -1238810, -1278608, -1494278, -1711121, -1603084, -1611244, -1327595, -1235876, -1110609, -1151695, -1076229, -1485745, -1746029, -755227, -730083, -1261685, -1536790, -1139669, -693086, -862050, -1277809, -1600934, -1124889, -724218, -864887, -1094214, -1395213, -1309530, -1965573, -1476355, -880949, -121878, -360477, -372585, -502274, -931291, -1589534, -2692243, -2148386, -606348, -388048, -774083, -1072182, -1245640, -1227647, -1527683, -1322147, -1560736, -1453853, -1317622, -952698, -637999, -668904, -1256174, -1222436, -986707, -508903, -1050266, -1055155, -537736, -1281377, -181470, -463386, -1255020, -1126084, -857719, -1172414, -895313, -811172, -789055, -830880, -837946, -690609, -1019256]
2006a019256R5479Q21287k68045m86291O105n10106M5089J17572J98227R642k7201
1995a017498M34612j44794k69267r2705J48074O0250j97023L31152j59485M67493
1985d39191j5433q55710j8596O68539L1897K03184m95628k46461L18954L83992
1975d64453q57445N60797J00092j18599k42682k97291n9920K3788K75722N32939
1965e47052M9096m09886L0918M62197k73012p65914K1535J85312P21032l98773
1955i24547J36773N37341m5775o68337L8357N36747N6586n7143p4798k69896n47978
1944a282670q17q6508n11974N40297O3402L11456N49461J3657k98737K9056m8172
1933g21549k28508p1647O21961K00581q5932K34335l81990R7487Q73507r44350
$$ y = [-1019256, -923777, -102490, -370535, -856826, -850721, -1360827, -1315738, -1198166, -999939, -990297, -1017498, -582886, -727680, -996947, -1089652, -941578, -881328, -1078351, -747199, -906684, -439191, -454624, -1310334, -1328930, -660391, -628494, -425310, -920938, -1167399, -848445, -464453, -1321898, -761101, -661009, -779608, -1022290, -1319581, -1379501, -1355713, -1079991, -547052, -497956, -907842, -876924, -414727, -687739, -1453653, -1432118, -1246806, -525774, -924547, -787774, -250433, -296208, -964545, -926188, -389441, -332855, -389998, -464796, -734692, -1282670, -1283487, -1369995, -1881969, -1341672, -1278270, -966814, -417353, -403696, -702433, -673377, -721549, -950057, -1021704, -399743, -199162, -285094, -50759, -432749, -335262, 538245, -406105]
1923d06105k04445j36664o6106M99957r8579m35605L26700N67205o93852K16354
1913d31140l3927k4791p2577l63998J05274l49507J7276k42764N34293J85359
1903f76502j4066K03679o63506O56005n1733o0629l95546o27558j89745M64324
1893a355277M06942J62669O09447l10291o89037J05119J67149L46839l23976M69095
1883d11321J21575m45976k18849m2833L47514K97789n67627J75520M2515q5476
1873g87169P10305O9425j45945Q8304q6692J9310O8047k30054n82624j21495N33069
1862d65519Q79116p2914r719o72143j34383R30938j84881K33816k33784o53909
1852c83382j99032j5675N32462j17581o94719R40777k23588O3519M3262k46741
$$ y = [-406105, -610550, -747214, -813320, -313363, -411942, -847547, -520847, 46358, -647494, -431140, -465067, -489858, -562435, -926433, -821159, -1170666, -1153390, -1396154, -861861, -676502, -690568, -486889, -1150395, -494390, -546123, -606752, -1002298, -1629856, -1819601, -1355277, -948335, -785666, -176219, -486510, -1175547, -1070428, -903279, -556440, -880416, -411321, -289746, -735722, -954571, -997404, -649890, -352101, -919728, -744208, -701693, -787169, -76864, -7439, -153384, -65080, -151772, -132462, -64415, -294469, -877093, -998588, -465519, 413597, 340683, 330964, -341179, -475562, 455376, 270495, 504311, 270527, -383382, -582414, -598089, -65627, -183208, -877927, 62850, -160738, -97219, -53957, -300698]
1842c00698k37009J99474l04802N42864L30360p04815j2820J58783k05947j82677
1832g17287j14147m52560P19081O52759j09905m05366J85827O18246j83180r33532
1822g40064k59310P38353j47399m45040L11689L71024k79192k01903M15652N44291
1812C08101k39602l52389P3983n8023k30599K25256k01110K69631R2767K71611
1802A59626o21854k86689J56533l33811L27007j40749K33767K67611K56607k86085
1792b68037n98211K68685j318k38817N96023l77569N92637j99574p06569j3076
1782i45826m7481k16958N13820P86087j32562k92800r36064R89644P4737j6702
1772b24105l45902R9331Q42482l26100p25121J014831N53913p68391n67857J64785
$$ y = [-300698, -537707, -338233, -643035, -100171, 230189, -474626, -487446, -328663, -534610, -717287, -831434, -1283994, -564913, 87846, -22059, -427425, -241598, 376648, 193468, -740064, -999374, -261021, -408420, -853460, -541771, -170747, -449939, -651842, -236190, 308101, 68499, -283890, -209907, -267930, -498529, -273273, -474383, -204752, -111985, 159626, -462228, -748917, -592384, -926195, -599188, -739937, -506170, -238559, 18048, -268037, -866248, -597563, -598881, -837698, -241675, -619244, -26607, -226181, -932750, -945826, -993307, -1210265, -696445, 89642, -42920, -335720, -1271784, -282140, -207403, -224105, -570007, -470676, 371806, 45706, -679415, 335416, 889329, 120938, -446919, -282134]
1762b82134O24238l92320J55162J9222K73257m06369L35278p40120m54216K80722
1752e87280j7005K31073L41290m38223L77723N92089p12792L0181k99123L65434
1742a16633N51337p3686p01719m21390O5026m9118K76004n52365m7990M34800
1732f35734M67332o7270k36948j42039R3878r0765J49816J08414K31346J48796
1722B6826m24092M03282L74762j37093p146J44306o22047p0910L39087m42232
1712d15257N79578L83323l00570l94918j29439J41111N28189K56783q13599L51922
1702A87123M43957j35298J24889m84567p92471l21135M69900k53379k74878Q01740
1692b34119M31422j89428j91529Q452m4982O05648l72692j34467L08089l27518
$$ y = [-282134, 342104, -50216, 104946, 124168, 397425, -8944, 326334, -413786, -868002, -587280, -604285, -373212, -31922, -470145, -92422, 499667, -213125, -182944, -482067, -116633, 434704, 361018, -340701, -762091, -697065, -746183, -470179, -1022544, -1070534, -635734, -168402, -235672, -472620, -614659, -520781, -611546, -461730, -353316, -121970, 26826, -397266, 6016, 380778, 243685, 236539, 380845, -241202, -312112, 26975, -415257, 164321, 547644, 247074, -147844, -277283, -136172, 392017, 648800, -164799, 187123, 631080, 495782, 620671, 136104, -656367, -977502, -507602, -760981, -1035859, -234119, 197303, 7875, -183654, -175202, -220184, 385464, 12772, -121695, 186394, -141124]
1682a41124l27889K37060m21860N28266N4507N0052K01462l20050N31227J48325
1672E39976L91821p59859O06820k95345l11386K68865J80585l46759K77143q30843
1662b78982j73191M70193j28226L31188j77847L13689n10046j06841K62373J25142
1652A27452J82437j8689o35432K08759O52957l20736p22059J09472L81460l42286
1642c76665o4879M35152M08562k54179n68747K31563K12585Q3052K23545k86832
1632D3157l33484l31911J97055M02786L91955J95243p7384P9912m54948K90359
1622D02740L01487j06667o87468L63041K11374j23083o20643L95856J83157O0933
1612C80727O91999l55340p04491K59689J90192l3956n76409k68497L37040m9366
$$ y = [-141124, -469013, -231953, -653813, -125547, -71040, -20988, 180474, -139576, 391651, 539976, 931797, 171938, 778758, 483413, 172027, 440892, 621477, 274718, 551861, -278982, -452173, 18020, -110206, 220982, 43135, 356824, -153222, -260063, 2310, 127452, 309889, 291200, -344232, -135473, 517484, 196748, -525311, -415839, -34379, -376665, -441544, -6392, 402170, 147991, -420756, -189193, 23392, 106444, 329989, 43157, -290327, -622238, -425183, -22397, 369558, 564801, 487417, 567329, 112381, 402740, 704227, 597560, -89908, 273133, 484507, 361424, -259219, 136637, 319794, 380727, 1072726, 717386, 12895, 272584, 462776, 428820, -147589, -416086, -79046, -128412]
1602a28412K60481L39265q5711k07305o6327j66792m41878L82250L55145L66401
1592F07117m83373O6324J71760j67771o29810O16444M52059p81810q6889L38733
1582A02784m3841j44447J87374L67529O1512L20486n9272p99001P54256p151j00333
1571F39896k64580r8254m13661R4484N2523K00964P67117l11218j75425M53189
1561I45035r72335K03742J35007n17975O25433K26390m77721m0044l5840K1228
1551A12920j56055j53467L18408j15252p5571l69412L19073L75410J04960N02945
1541H63959Q6317o39042K92756K10266l29525m7658n93575L1432K8986m21309
1531e17393j17716Q00864j54181L94275m48612K14146P4020k35219K25097l56614
$$ y = [-128412, 132069, 471334, 385623, 178318, 111991, -54801, -496679, -114429, 240716, 607117, 123744, 190068, 361828, 194057, -435753, 180691, 632750, -149060, -235949, 102784, 58943, -85504, 101870, 469399, 530911, 851397, 792125, -6876, 747380, 740229, 639896, 375316, 277062, -136599, -42115, 10408, 211372, 978489, 667271, 491846, 945035, -27300, 176442, 311449, -206526, 418907, 645297, 167576, 127532, 91692, 112920, -43135, -196602, 121806, 6554, -69017, -438429, -119356, 256054, 361014, 863959, 950276, 311234, 603990, 814256, 484731, 437073, -156502, -125070, -96084, -517393, -635109, 165755, 11574, 405849, -42763, 171383, 245403, 10184, 235281, -121333]
1521a21333n3596j67256M51386J88272K57469r3998L85071n2712l07549M30773
1511I16527k06241j95470l502K21966k79597M12423m09168O1735J65947p60381
1501g5761k56533L83251N3645K32257j26800J49172p2400j9962J41795K98833
1491G07497k41525l095k96726o3222K00871l14000j04813K96345J119343r0758
1481A209917m46639k23905K23128R3220N5749j24720K35135q90432J64167k91186
1471D434J0548O33147L8883M33700m53718l45379j17481J63093J47993n47148
1461c1928q807Q26678n9623j99053k04146M29487k08680J77678m86927J30358
1451C65037K28950n84207J01721m33954P89795K03846L10949k42090P273L94819
$$ y = [-121333, -174929, -342185, 109201, 297473, 554942, 460944, 846015, 793303, 485754, 916527, 710286, 514816, 511314, 733280, 453683, 866106, 456938, 518673, 684620, -75761, -332294, 50957, 104602, 336859, 210059, 359231, 286831, 266869, 408664, 707497, 465972, 462877, 166151, 102929, 303800, -10200, -115013, 181332, 1300675, 1209917, 763278, 539373, 762501, 855721, 911470, 786750, 1021885, 131453, 295620, 4434, 14982, 648129, 687012, 1120712, 666994, 321615, 204134, 367227, 515220, -31928, -40735, 785943, 726320, 527267, 323121, 752608, 543928, 721606, 234679, 365037, 593987, 9780, 111501, -322453, 467342, 671188, 982137, 740047, 747320, 1142139]
1441A142139j17600r10946J23827M71069K29240q38224P0742k73315J05407l12288
1431c09949N14905N62532j56343o02792l4294O24924O30031Q7435q5430j065978
1421A65041K3193M59118o92146K84984M35807L59660l38728p1472k20570K99301
1411G04188m0025q05962L88952P84779k16831M17265K94229n6414j36472r00892
1401D32817N91532K583j132100J38607K660M70834j90691m8772L98063j0661l45996
1390C08876L46057M1287Q7664k98855j17243K73228J21157l94512K28910P1374
1380F67943l52657M61515L05145q53782L98577l06558m81492k88279N22057K01188
1370B73657P45700K30651R7844o81968k65303P99372j15361o5495o00688P47235
$$ y = [1142139, 1024539, 113593, 237420, 708489, 937729, 99505, 170247, -103068, 2339, -309949, 204956, 767488, 611145, 8353, -25941, 598983, 1229014, 1316449, 1231019, 165041, 188234, 647352, -44794, 240190, 675997, 1035657, 696929, 625457, 404887, 704188, 664163, -141799, 247153, 1031932, 815101, 1232366, 1526595, 1470181, 1333709, 432817, 1024349, 1026932, -105168, 33439, 36099, 506933, 316242, 267470, 665533, 654872, 308876, 654933, 696220, 783884, 485029, 367786, 641014, 762171, 367659, 596569, 667943, 315286, 776801, 1081946, 228164, 626741, 320183, -161309, -449588, 72469, 273657, 1019357, 1250008, 1347852, 665884, 400581, 1199953, 1084592, 1019097, 418409, 1165644]
1360A165644l79630k67529m9208M1092L2538J82482J47581l10157J43124M43346
1350A149283K3245P37974m51677k33591k26413p19713L81134M00603P294l20292
1340G47847l46496o57328q5637K54735N45251J54194l76534L24401L92528K84868
1330A237829J32646k28278K39781l08030r0495l543p41955K88641l54970M31950
1320F03576J52742j27950L55167m58670N1459k01645q3220P24025j17656k13959
1310F83869N35853l3395j32170j49247K9469j31200N6846n9328O25385j08390
1300A317692m65184L97085j97311n08277k69954J109283J10932o16857N6256P14042
1290A647707r1827K6037j41349k80129j57004k34483J007142M8998o49867k42791
$$ y = [1165644, 786014, 518485, 469277, 510369, 542907, 725389, 872970, 562813, 705937, 1149283, 1172528, 1910502, 1458825, 1225234, 998821, 279108, 660242, 1060845, 1068139, 747847, 401351, -255977, -341614, -86879, 458372, 612566, 236032, 560433, 952961, 1237829, 1370475, 1142197, 1381978, 1073948, 983453, 979910, 237955, 526596, 171626, 603576, 756318, 628368, 983535, 524865, 576324, 374679, 291459, 1015484, 897828, 683869, 1219722, 1186327, 1054157, 904910, 934379, 803179, 860025, 800697, 1426082, 1317692, 852508, 1249593, 1052282, 544005, 274051, 1383334, 1494266, 877409, 933665, 1647707, 1555880, 1581917, 1440568, 1160439, 1003435, 768952, 1776094, 1825092, 1175225, 932434]
1280I32434n87566p3196j41166K21850K24386L26262l42730j27798J029789j0087
1270A452178l89768k93764L67373k78773O34388o70497n32179j52O50935K63928
1260A203669j160052M53390R54073j05672K40858P6796J46593l47822n64199J00537
1250I98171n99350J96825J22558J88345m9282J18169M3609k99168K50386k83595
1240F86668j66502L61151M28623k48854j60544j04231k06452R492P2048J22077
1230G93476J3351J25388J36807l34906L85048J6442n97611j85116N60601l9614
1220H73866j60425J03182K38696K74625k66060L92474l8654n8055n52945N3201
1210H59905l31114L89798P22389o6498M05983l07390m57334n3645K77169R478
$$ y = [932434, 344868, 271672, 130506, 352356, 576742, 903004, 560274, 432476, 1462265, 1452178, 1062410, 768646, 1136019, 857246, 1491634, 821137, 288958, 288806, 939741, 1203669, 43617, 497007, 1451080, 1345408, 1586266, 1663062, 1809655, 1461833, 897634, 998171, 398821, 595646, 718204, 906549, 857267, 975436, 1019045, 719877, 970263, 686668, 520166, 881317, 1309940, 1061086, 900542, 796311, 589859, 599351, 671399, 793476, 806827, 932215, 1069022, 734116, 1119164, 1135606, 537995, 352879, 913480, 873866, 713441, 816623, 1055319, 1329944, 1063884, 1456358, 1417704, 1359649, 806704, 859905, 528791, 918589, 1640978, 1574480, 1980463, 1673073, 1215739, 1162094, 1439263, 1448741]
1200A448741j66319o46814J53394J56638J56443m68121k57365L83211l49935l62365
1190D7508J43623j53533K26583J21720J4467J92277l0136M93801n25831L40057
1180H70536M56836l23345j55826k5229r8238K59396l21340k5655n6697K67015
1170H47453K04178j43337K38141j9257m83712L61275j25519O86461l80464m81670
1160G03549J81952K40854k08237m53146m37715N33853J70142n0259M6393L50537
1150A077923N20000P4916k41329q70026l72194J6154O14349J06953m29024M19418
1140I17140k90130p2715l05890O79138N76177K00550k45151n90223o8164n44748
1130B55984K12487L09089J32424Q5452M7373p57623M09914L96929n86746j1455
$$ y = [1448741, 1282422, 635608, 789002, 945640, 1102083, 633962, 376597, 759808, 409873, 47508, 191131, 37598, 264181, 385901, 400368, 592645, 562509, 1056310, 530479, 870536, 1327372, 1004027, 848201, 822972, 724734, 984130, 662790, 637135, 580438, 847453, 1051631, 908294, 1146435, 1127178, 643466, 1004741, 879222, 1565683, 1185219, 703549, 885501, 1126355, 918118, 464972, 27257, 561110, 731252, 680993, 727386, 1077923, 1597923, 1672839, 1431510, 561484, 189290, 205444, 819793, 926746, 497722, 917140, 627010, 554295, 248405, 927543, 1503720, 1704270, 1459119, 868896, 800732, 255984, 468471, 777560, 909984, 995436, 1042809, 285186, 695100, 1092029, 505283, 493828]
1120D93828N52470m41551N08690m50997j59373L59431l48267P59602n2190q74215
1110C47428n9596L84362j22847n40748M68525r8191m66146j47347R31953n7463
1100F39930j0642l54974Q21171L63673n20157J68735j43909J92619j22557m14426
1090F19463Q3580q2062N87937J7893m58902j26774M5968j55455l3092j19722j55449
1079B23385j81179M41697O23381L14925m17432n6344k931Q14n09205R86146L28284
1068A751541n90662j70359L35383N40151j173519M3648J07233k68247L82820k02473
1058G55516l3765R51453N43745q15697n26014L75612J8615K65070l39074m5131
1048A150330k34995o99650l96222N96197N25906j01398k14104l2435k02293k60281
$$ y = [493828, 1046298, 604747, 1113437, 662440, 503067, 862498, 514231, 1273833, 1221643, 347428, 287832, 672194, 549347, 8599, 477124, 378933, -87213, -234560, 697393, 639930, 629288, 274314, 1095485, 1459158, 939001, 1107736, 963827, 1156446, 1033889, 619463, 703043, 620981, 1208918, 1226811, 767909, 641135, 687103, 531648, 498556, 378834, 223385, 42206, 483903, 1107284, 1422209, 1004777, 948433, 945502, 946316, 437111, 1423257, 1751541, 1160879, 990520, 1325903, 1866054, 692535, 736183, 843416, 575169, 957989, 755516, 721751, 1673204, 2216949, 1401252, 875238, 1250850, 1269465, 1534535, 1195461, 1150330, 915335, 215685, -180537, 415660, 941566, 840168, 626064, 593629, 391336, 131055]
1038A31055r6734K41634J38490J33759o2583M29922j35781J17518j81663j48850
1028E66767L61222K0517K7905j66420K87325M15670l65837k23487M78412l67757
1018A034317K75549L01003o26936l64492k25775L61968l03806L07395k87479k27422
1008B44322K47439M46872l73006o985J72096k40715o80593R7588P42813k68295
998C81536J013430M72031j025538M08820n82932k15590O93162J2081J79353K41903
988A578256m90604k96627M48925j64779n75533R3995O3645N53378K72516k72588
978A210584p5867n99573o7533N52547L23638l29584k01505M28036K17512q52093
968F06162P6546j93744N10912K63540j16750k12836r9005K07497J93529N26409
$$ y = [131055, 34321, 275955, 414445, 548204, 485621, 915543, 779762, 897280, 715617, 566767, 927989, 948506, 976411, 809991, 1097316, 1512986, 1147149, 923662, 1402074, 1034317, 1309866, 1610869, 983933, 619441, 393666, 755634, 451828, 759223, 471744, 244322, 491761, 938633, 565627, 558642, 730738, 490023, -190570, -92982, 649831, 381536, 1394966, 1866997, 841459, 1250279, 667347, 451757, 1144919, 1157000, 1336353, 1578256, 1087652, 791025, 1239950, 1075171, 499638, 593633, 657278, 1210656, 1483172, 1210584, 1134717, 535144, 467611, 1020158, 1343796, 1014212, 812707, 1240743, 1458255, 606162, 682708, 488964, 999876, 1263416, 1146666, 933830, 834825, 1042322, 1235851, 1762260]
958A762260n75115j60720p27316L65314j12910k98008L49249M04142m27933K91008
948H69971n2582k66250L82J38079L11525J25949l64619K15147Q23617m22127n00929
937H78163n80210l67031k22399J214761K96431n2576r17653M34336r8215q6758
927D98849M57331R6459K4139q7m17983M05124q21637P77907L28238q21797O35146
916A161689j66817m85036r2041J08095l17779K7187M7699R71246J81578o99971
906G35850p4540K02941N8387j17832l4717l27946O8064K4514K68660K10942n55798
895D58525M42347R036N55158o64468n35261M01570q1674Q244k78043n17308M66060
884B64186P47921j70631K48537l38518j30831P7275j25900K236l26836k17408
$$ y = [1762260, 1187145, 1026425, 299109, 664423, 551513, 253505, 602754, 1006896, 578963, 869971, 817389, 551139, 551521, 689600, 1001125, 1127074, 762455, 977602, 1801219, 1379092, 878163, 297953, -69078, -291477, 923284, 1219715, 1167139, 249486, 683822, 585607, 498849, 956180, 1052639, 1076778, 1076691, 658708, 1063832, 242195, 1020102, 1348340, 526543, 1161689, 994872, 509836, 417795, 525890, 208111, 235298, 282997, 1254243, 1435821, 735850, 661310, 864251, 922638, 804806, 770089, 442143, 510207, 534721, 803381, 1014323, 458525, 900872, 909908, 1465066, 800598, 265337, 666907, 585233, 593477, 315434, -201874, 264186, 1012107, 841476, 1090013, 751495, 620664, 697939, 572039, 574275, 247439, 30031]
874C0031M033q7451J43144l0296j7816K43134j96647L14780M18245K4115j58813
863F86459m20600j60474M26399k317k01778P32149J09385m05814l80455j20841
853B62113M48823j063l02943j64871o58169N76418K17875M37723j60708k95446
843C59752m99837K25279N85950k12809l12817L61143m60527N5306J223K58406
833C61069Q421k88104Q15386m88527j71056k88280j46385N4783K96817l82414
823b28290n18147J20534M32393M29970M41034P00754p03707o66636L77850j68891
813B16864L89648p8634j67478J1684K82889j38798o37459o0093O10731L6956n1006
802D15304l5888N435k83173J92808J39878j58775p88574N19360J48371J96450
$$ y = [30031, 34064, -53387, 89757, 59461, 41645, 284779, 88132, 402912, 821157, 845272, 686459, 265859, 105385, 531784, 529467, 327689, 1059838, 1169223, 763409, 382954, 262113, 710936, 709873, 406930, 242059, -416110, 160308, 378183, 815906, 655198, 359752, -140085, 85194, 671144, 458335, 145518, 506661, 46134, 101440, 102663, 361069, 369490, 81386, 896772, 408245, 237189, -51091, -197476, -142693, 154124, -228290, -746437, -625903, -193510, 236460, 677494, 1378248, 674541, 7905, 385755, 216864, 606512, 527878, 360400, 372084, 654973, 516175, -121284, -181377, 429354, 466310, 415304, 379416, 384851, 101678, 294486, 434364, 275589, -512985, 6375, 154746, 351196]
792C51196k26582K2996q716K62856J89530n3543J53127j95515n8312J05832O0092
781F02961m52693l30303N70606p0964l48017J2773q4586N68495N74925l90576
771F52621L83484n0966l44912J36413J32915n07200j26347L91322j57586p34821
761b25077K16686J81029j50617M84552j20556K04013K15280L5630L9813j7861
751H62892k64833j22281m25458j62188M27660J95469K69708n19815k21763O4092
741A03483k32037P1959k82688K00759L69447r6549l66817N67444j67591o0383
731A07027k82391L62622L8318l76736N9423J03133n62119M29495m69284P42179
721A51667J61129m93941Q0976O80542p9562o50866o199K65329j185647o8101O88939
$$ y = [351196, 124614, 147610, 138894, 401750, 591280, 537737, 690864, 495349, 437037, 542869, 602961, 150268, -180035, 390571, 319607, -28410, -15637, -100223, 468272, 1043197, 652621, 1036105, 985139, 640227, 776640, 909555, 402355, 276008, 667330, 509744, -225077, -8391, 172638, 22021, 506573, 386017, 590030, 805310, 840940, 880753, 862892, 598059, 475778, 50320, -111868, 315792, 511261, 780969, 261154, 39391, 103483, -128554, -56595, -339283, -138524, 230923, 134374, -232443, 335001, 167410, 107027, -175364, 187258, 225576, -151160, -91737, 11396, -550723, -121228, -590512, 151667, 312796, -181145, -100169, 580373, 500811, -150055, -156254, 109075, -1076572, -1144673, -455734]
710d55734J24491K66973j28108k06607J45347j45243j00903j85875k43537O45946
700b83250K22872L13829J68943l28490K31691j68777p33366N78585J02498M7655
690A52190m33017p74589N69097P15344K035K38173j122j95225j63832k596N04926
679F11384j92928o84251J56473l39638R6434M51417j21239L0808N643M62074j22479
668C53698l41239o41442l7113Q49557l36677l24005J30520K37596k93870O74985
658B72010J3283k46576R7808r0988m80299j87125N09514K01670p47338K92964
648c65077J04328k36293N00319l60886K01430K89597l41903k75142J17552j77020
638e43095P7575M94689j21973k41960j4763q9066M69529J816r34924k17087L16670
$$ y = [-455734, -331243, -64270, -192378, -398985, -253638, -398881, -499784, -685659, -929196, -283250, -60378, 253451, 422394, 93904, 325595, 156818, -576548, 2037, 104535, 152190, -280827, -1055416, -486319, 229025, 231060, 469233, 468111, 272886, 109054, 106458, 611384, 418456, -265795, -109322, -448960, -352526, 98891, -22348, 8460, 14103, 476177, 353698, 12459, -628983, -666096, 183461, -153216, -477221, -346701, -109105, -402975, 272010, 285293, 38717, 136525, 45537, -434762, -621887, -112373, 89297, -658041, -365077, -260749, -497042, 3277, -357609, -156179, 133418, -208485, -483627, -366075, -543095, -465520, 29169, -92804, -334764, -349527, -438593, 30936, 32752, -902172, -1119259, -802589]
627h02589J086377j69939n87235O12221M6379l01085M58805l1394j39424k33979
617f1863K76526m25378L42711n00131J17037M03797o50323L15942k21347M17661
607A4632p82544m0866m3794l3744O04200o83406L20889K7003N02156K63465p58115
596f10124M3240k18004k21267N49884O32899L31147j17311l50264p37620n0450
586g47870J99633K20520p53682k90931M49483j14667J31328L88725j75796j14613
576h07870O44111p12910N00171j5212l18453l05647k47995o583J78836K59652
566h31900N9467j21308J41096j57682k67400q6854n5123K61891m15565M24682
556a048696j50584j32045P18257K91382l98795l83097P0412M13010r8382k23052
$$ y = [-802589, 283788, 113849, -473386, 138835, 185214, -115871, 342934, 311540, 172116, -61863, 214663, -210715, 131996, -368135, -251098, 152699, -497624, -181682, -403029, 14632, -767912, -808778, -852572, -886316, -282116, -965522, -644633, -617630, -115474, 147991, -610124, -566884, -784888, -1006155, -456271, 176628, 507775, 390464, 40200, -697420, -747870, -548237, -327717, -1081399, -1372330, -922847, -1037514, -906186, -517461, -693257, -807870, -163759, -876669, -376498, -391710, -710163, -1015810, -1263805, -1270388, -1091552, -831900, -772433, -893741, -752645, -910327, -1177727, -1264581, -1319704, -1057813, -1473378, -1048696, -1199280, -1331325, -613068, -321686, -720481, -1103578, -1033166, -620156, -718538, -941590]
546i41590L60925n9400O8867m49743m57302K57281J40264K1410R48781K55727
536A45220n32647l02659n59436n43971L60287M03716N59360n60611l10695J18914
526a222522L33581K21815k82907J3496j41163K11998K68792p88583M40738J57768
516g86987o9541J91746l20717J13914J74706m40312o7457Q01398j52071l73340
506i28661J1781J5176r6149k98045n65067M50984N39961l3714l32029o0422j3359
495a309544K35631k31118J34490K39052m15681N5325k40129M0418N09528j59356
485a141384p2377n20137L08180M80542l76204L32607o42758k41817m8331L19337
475a602342K46473j81524l30566k33676J90651N99521L26006o09957M05586l00018
$$ y = [-941590, -580665, -640065, -571198, -1020941, -1478243, -1220962, -1080698, -1059288, -110507, 145220, -387427, -690086, -1249522, -1793493, -1433206, -1029490, -470130, -1030741, -1341436, -1222522, -888941, -667126, -950033, -936537, -1077700, -865702, -596910, -1385493, -944755, -786987, -856528, -664782, -985499, -871585, -696879, -1137191, -1204648, -403250, -555321, -928661, -916880, -901704, -997853, -1295898, -1860965, -1409981, -870020, -903734, -1235763, -1296185, -1309544, -1073913, -1305031, -1170541, -931489, -1347170, -1291845, -1531974, -1491556, -982028, -1141384, -1213761, -1733898, -1425718, -945176, -1321380, -988773, -1631531, -1873348, -1921679, -1602342, -1355869, -1537393, -1867959, -2101635, -1910984, -1311463, -985457, -1595414, -1189828, -1489846]
465a489846l18126L1526O98318R1060l03480K93962n81742j37163j03540p2459
455a891490K67631r93776O45234O0944l25995L74389K04880j09214o2760L59840
445a470317K66878m18158L11186j34488l73853J19859J98800M66733l47679l21424
435a702463o31010M39410N16108J23483p22316k92857J27743J27405J77177l51319
425b188639n0019Q57324J09617o79040j21924k26212J01203R7186K52966J42663
415a704875k2936K567j24734n57415k5231Q37826q3960p52100m59674L03999N35166
404b051367R9557J80945P7498J69265p00927l84554L53443p6038N65866l96395
394b162707M71015j93099r7547K15739n99057Q5429r2373N82079O1141j11003
$$ y = [-1489846, -1807972, -1776446, -1078128, -987068, -1290548, -996586, -1578328, -1715491, -1819031, -1891490, -1623859, -2617635, -1972401, -1911457, -2237452, -1863063, -1658183, -1767397, -1830157, -1470317, -1203439, -1621597, -1310411, -1444899, -1818752, -1698893, -1500093, -1033360, -1381039, -1702463, -2333473, -1894063, -1377955, -1254472, -1976788, -2269645, -2141902, -2014497, -1837320, -2188639, -2238658, -1381334, -1271717, -1950757, -2072681, -2298893, -2197690, -2100504, -1847538, -1704875, -1727811, -1725244, -1849978, -2407393, -2432624, -1594798, -1678758, -2430858, -2890532, -2586533, -2051367, -1951810, -1770865, -1693367, -1524102, -2225029, -2609583, -2256140, -2332178, -1766312, -2162707, -1691692, -1884791, -1982338, -1766599, -2365656, -2280227, -2372600, -1790521, -1729380, -1840383]
384a840383J8484n9783k86940Q0360l2890k49364l5839M9238L7187J3461K25496
373b080973p60229j83631L04117L36626L47497J99881n11736K84292L75402k45339
363a934093l15514k63346K8920K85224j64753k00947K30945N445K8311j35482
353b435290k26111m32472P91027m76018P9841N89644k64776n41994m27376n284
343c348809M33103O09214n06636N00N91108k89982L38654J55441L33463J21718
333a562226q15080j37049K24984m28909n61801O55703L97734p867k82178J43504
323b373185K28361M79043k22133j93045j37672r9289k0438K69879Q1841j49451
313b136089m52086l7893j79624k23097K54024J68878n11148O47706L38497o98836
$$ y = [-1840383, -1821899, -1881682, -2168622, -2088262, -2121152, -2370516, -2406355, -2357117, -2319930, -2306469, -2080973, -2841202, -3024833, -2720716, -2384090, -2036593, -1836712, -2348448, -2064156, -1688754, -1934093, -2249607, -2512953, -2484033, -2198809, -2363562, -2564509, -2333564, -2328119, -2299808, -2435290, -2661401, -3093873, -2302846, -2778864, -2699023, -2109379, -2374155, -2916149, -3343525, -3348809, -2915706, -2306492, -2813128, -2812628, -2221520, -2511502, -2172848, -2017407, -1683944, -1562226, -2377306, -2514355, -2289371, -2718280, -3280081, -2624378, -2226644, -2234511, -2516689, -2373185, -2144824, -1665781, -1887914, -2080959, -2218631, -2317920, -2338358, -2068479, -1986638, -2136089, -2588175, -2626068, -2805692, -3028789, -2774765, -2605887, -3117035, -2469329, -2130832, -2829668]
303b829668M98115J28669l64046K06113M3539l83027j02661o9706K14786m35440
293c093326K10714L1530k50808L26044k03187N45150k43924o43827J12472k42752
283c451914N48682q7535K16139L15531l12597P4548n26374J76173N80799j13411
273b579959m4568j63746K5304n29837J20874O9215o22416J41816J125056N743
263b452518m91176L38394j72648k59391K63299K35071J62902l94882l55279k42741
253c368969J87791j63109J8143k64910J87829M2772L8705o1956k23520K1427K62193
242c323604p9059j27035M66533J91616K34273k03471L40304L01156o00155l12212
232c111654J22831m49239L62155M74272O04604l76532l29335j12527Q4392l67395
$$ y = [-2829668, -2331553, -2202884, -2566930, -2360817, -2317278, -2700305, -2802966, -2872672, -2657886, -3093326, -2882612, -2851082, -3101890, -2775846, -2979033, -2433883, -2677807, -3321634, -3209162, -3451914, -2903232, -2990767, -2774628, -2459097, -2771694, -2697146, -3223520, -3047347, -2466548, -2579959, -2624527, -2788273, -2762969, -3292806, -3171932, -3102717, -3725133, -3583317, -2458261, -2452518, -2943694, -2605300, -2777948, -3037339, -2774040, -2538969, -2376067, -2770949, -3126228, -3368969, -3181178, -3344287, -3326144, -3591054, -3403225, -3360453, -3321748, -3383704, -3607224, -3585797, -3323604, -3402663, -3529698, -3063165, -2871549, -2637276, -2840747, -2500443, -2199287, -2799442, -3111654, -2988823, -3438062, -3075907, -2601635, -1997031, -2373563, -2702898, -2815425, -2731033, -3098428]
222c098428n54822M74200L63615n5564J77575q0035n61432j43908J93388l5425
212c320836p4665P79898Q8538j120565K86336K0341N4257K60376r0069K75473
202b840916l72504K55929l9596j10035K16116m95709M33851k01470p48256L41514
192c561076O68284j10408n78360L46904O01424r4632r17457k64820M33050N47348
182b929743j64206l75924P1773j18609p39735K70432K03432N1039J2231l7314
172c756624J67121k2630K45916j40803j12291n75139M63322L82775l39656j29230
162c817239m85813M79141N19904J77315l63812l07106l8853K49540J29182J45942
152c311799l02910j15566M15562J33811J6333q77792J50156K06739K62168l32941
$$ y = [-3098428, -3653250, -3179050, -2815435, -2870999, -2693424, -2773459, -3334891, -3478799, -3285411, -3320836, -3395501, -2615603, -2527065, -3647630, -3361294, -3340953, -3286696, -3026320, -3116389, -2840916, -3213420, -2957491, -2997087, -3107122, -2891006, -3386715, -2952864, -3154334, -3902590, -3561076, -2892792, -3003200, -3581560, -3234656, -2633232, -2727864, -3645321, -3910141, -3477091, -2929743, -3093949, -3469873, -3398100, -3516709, -4256444, -3986012, -3782580, -3731541, -3719310, -3756624, -3589503, -3612133, -3366217, -3507020, -3619311, -4194450, -3731128, -3348353, -3688009, -3817239, -4303052, -3823911, -3304007, -3126692, -3490504, -3797610, -3836463, -3586923, -3457741, -3311799, -3614709, -3730275, -3314713, -3180902, -3164569, -4042361, -3892205, -3685466, -3423298, -3756239]
142c756239k93883Q07582m7319J7885j14789k71220L48874m48611k16326j9744
132c993790J21847j01481K50675M82818j65464o2007k14088J1636j47181N9169
122c757866L42796l89896j17574R7043J05103J09430K98777r84046J55186Q51576
112c289471J21944o65569k65008O58957n12850R0530l54508P74986j59838L11534
102c289293k88401k96588j54913J5719R2709J19217L6987R8281l83299j05459
92d155040N05901p3329O6800j79075M72104m52213j91957J9878M83307l44835
82c848459j10997M36804j2379m44813M9671J93984j49502l18331j79580J85432
72d198170Q7809j75626k55347L26467o7622j80879K11143L2413L5665J06871J37302
$$ y = [-3756239, -4050122, -3242540, -3289859, -3271974, -3386763, -3657983, -3309109, -3757720, -3974046, -3993790, -3871943, -3973424, -3722749, -3239931, -3405395, -3467402, -3681490, -3669854, -3817035, -3757866, -3415070, -3804966, -3922540, -3825497, -3720394, -3610964, -3312187, -4296233, -4141047, -3289471, -3167527, -3833096, -4098104, -3439147, -3951997, -3861467, -4215975, -3440989, -3600827, -3289293, -3577694, -3874282, -4029195, -4013476, -3920767, -3801550, -3764563, -3666282, -4049581, -4155040, -3649139, -3722468, -3655668, -3834743, -3362639, -3814852, -4006809, -3986931, -3503624, -3848459, -3959456, -3522652, -3535031, -3979844, -3930173, -3736189, -3885691, -4204022, -4383602, -4198170, -4110361, -4285987, -4541334, -4214867, -4282489, -4463368, -4252225, -4219812, -4184147, -4077276, -3939974]
61c939974k81990k86490j15140N16866K10949q034M8217J84718k25622k37420
51d133920j72148M6731k5306O1237k27680L29675R1944J28650Q8479l43676j87653
40d343667K5539L01879l92740k76170l4646K18296m1456m8163m009N75135K6984
29c993018n52794O8787J49323N54776j92967n5281o0748n6130j00519n61848k29398
18e029817L06079M11100l42708p3518k6194O49503j59237p390k67849J52301R7398
7d290332N05703n52780j43456N2048L76963J39565o54757
0d567046
$$ y = [-3939974, -4221964, -4508454, -4623594, -4106728, -3895779, -3903813, -3855596, -3670878, -3896500, -4133920, -4306068, -4259337, -4284643, -4223406, -4451086, -4121411, -4029467, -3900817, -3812338, -4156014, -4343667, -4318128, -4016249, -4408989, -4685159, -4719805, -4501509, -4542965, -4591128, -4595137, -4020002, -3993018, -4545812, -4477025, -4327702, -3772926, -3965893, -4021174, -4081922, -4138052, -4238571, -4800419, -5029817, -4723738, -4312638, -4655346, -4728864, -4755058, -4105555, -4264792, -4272182, -4540031, -4387730, -4290332, -3784629, -4337409, -4480865, -4428817, -4051854, -3912289, -4567046]
$$ Imaginary data points
##PAGE= N=2
##DATA TABLE= (X++(I..I)), XYDATA
16383d884724P2457K39361J57200Q5776N65775k1073l19624j7502K31612K57939
16373c632803n448L12841j93796K96159L15765L18820j32582q7221Q03448N5515
16363a949302r9801J93322j20681k26256M05771K469P1218J55273K90186j23336
16353a401137J86324L63735K3316N46720K5374r7440M61124k19251K25066L26789
16343D40620j59983P6774Q4200K04512K66159L7532J50082L39067m6931J76268
16333A568300Q6476k00922M03177J27710k2335M127J09263N96262K64593k46122
16323B690529j24484L86862L32521N58115n8384k1444j61060k63203Q0294K6822
16313C446568Q42400L94346k94080J90045N92643l38361M79324l71520O273J64237
$$ y = [-4884724, -4812267, -4572906, -4415706, -4329930, -3764155, -3785228, -4104852, -4122354, -3890742, -3632803, -3638251, -3325410, -3519206, -3223047, -2907282, -2588462, -2721044, -2808265, -2004817, -1949302, -2049103, -1855781, -1976462, -2202718, -1796947, -1794478, -1723260, -1567987, -1277801, -1401137, -1214813, -851078, -827762, -281042, -255668, -353108, 108016, -111235, 113831, 440620, 280637, 357411, 441611, 646123, 912282, 949814, 1099896, 1438963, 1392032, 1568300, 1654776, 1453854, 1857031, 1984741, 1962406, 1966533, 2075796, 2672058, 2936651, 2690529, 2566045, 2952907, 3285428, 3843543, 3785159, 3763715, 3602655, 3339452, 3419746, 3446568, 4288968, 4683314, 4389234, 4579279, 5171922, 4833561, 5312885, 4941365, 4947638, 5111875]
16303E111875k6565j07644k27187J88692J28121J03528L88433Q3010L26463k17692
16293E751034q6543L61708M12843J33160k22876J0743j0381P49759K59437l33573
16283G025311q446M21740k37282K20446J05685K10716K37036J6823l71586Q5934
16273G706377O19584m17173k12498L91515p7367J73843n5771n9714L78523L44320
16263H791639J30075n3966L65111k21825J76023m38640M62969O52806l73383K7530
16253I518339K29966k06399L91420M09005j02237l05551J91253q2825j293Q18613
16243A0860291l8860J47872l17990J07241K10856J50674O23430L45384k91495
16234A1797403j42965k05149j08007M46624J90277m69969k66852K86990K59418
$$ y = [5111875, 5085310, 4977666, 4750479, 4939171, 5067292, 5170820, 5559253, 5642263, 5968726, 5751034, 5664491, 6026199, 6439042, 6572202, 6349326, 6360069, 6349688, 7099447, 7358884, 7025311, 7016865, 7438605, 7201323, 7421769, 7527454, 7738170, 7975206, 7992029, 7620443, 7706377, 8325961, 7908788, 7696290, 8087805, 8010438, 8184281, 8128510, 8068796, 8447319, 8791639, 8921714, 8867748, 9232859, 9011034, 9187057, 8748417, 9211386, 9864192, 9490809, 9518339, 9748305, 9541906, 9933326, 10342331, 10240094, 9934543, 10125796, 10042971, 10041678, 10860291, 10821431, 10969303, 10651313, 10758554, 10969410, 11120084, 11743514, 12088898, 11797403, 11654438, 11449289, 11341282, 11787906, 11978183, 11508214, 11241362, 11528352, 11787770]
16225A1787770J75131k31727l73102J63753J36802J2599j57253m6283O92724J148103
16215A3308517p72555L30049K09648l67600l4802K72733K36027j18061l13682
16206A2750274M0046K65182J02294j24233K69481r3805L01343l02768L45J62429
16196A3370588j23662P43539J3924m89114j66134K70039j68513p30917O48340
16187A3368090M72447j84902N20181N2960m56855j92220L89076O75500l32887
16178A4311390m61036P35519l32576J41573P4687P002O8804l77252r1962P28196
16168A4804345O991K31878m21483L97681j05294n71560J15693O0313j27233R1321
16158A4482652K52315J14837J71970L93539n3631o57411k84389N62495L98329
$$ y = [11787770, 11962901, 11731174, 11358072, 11521825, 11658627, 11671226, 11513973, 11467690, 12160414, 13308517, 12535962, 12866011, 13075659, 12708059, 12673257, 12945990, 13182017, 13063956, 12750274, 12790320, 13055502, 13157796, 13033563, 13303044, 13209239, 13510582, 13207814, 13208159, 13370588, 13246926, 13990465, 14004389, 13515275, 13349141, 13619180, 13450667, 12719750, 13368090, 13840537, 13655635, 14175816, 14228776, 13771921, 13579701, 13968777, 14644277, 14311390, 13850354, 14585873, 14253297, 14394870, 14469557, 14476559, 14545363, 14168111, 14076149, 14804345, 14811336, 15043214, 14621731, 15019412, 14914118, 14342558, 14458251, 14518564, 14391331, 14482652, 14734967, 14849804, 15021774, 15415313, 15361682, 14704271, 14419882, 14982377, 15380706]
16149A5380706k84429J12642m78814Q66077L75988n70391r559K15946N80143n51202
16139A5637107k48405j56211O29691j29753L43922K49600m89878l52589O5557
16130A5549041J57861k01552L70136L13341J1314l68955k58256l23957P05005
16121A5953978L97685l45154n6380O94993n05115K7724J53580K23162m52751j31485
16111A5960237J2263l27925J12121n6444J5747n20312n28218M44022J111833j46187
16101A6077137j90449L47716j23573L72529m31350o38923P20153J028567m15907
16092A6745900k08785O6768n68n0803j14528K67959p96016k21466M42220J04041
16082A6234722J55743j5234J00345J50711O1662J96089J02167k66132o24467J09077
$$ y = [15380706, 15096277, 15208919, 14730105, 15596182, 15972170, 15401779, 15392220, 15608166, 16188309, 15637107, 15388702, 15232491, 15862182, 15732429, 16076351, 16325951, 15836073, 15483484, 15549041, 15706902, 15505350, 15875486, 16188827, 16200141, 15831186, 15572930, 15248973, 15953978, 16351663, 16006509, 15950129, 16645122, 16140007, 16167731, 16321311, 16544473, 16091722, 15960237, 15972500, 15644575, 15756696, 15700252, 15715999, 15195687, 14667469, 15111491, 16223324, 16077137, 15886688, 16234404, 16110831, 16483360, 16052010, 15413087, 16133240, 17161807, 16745900, 16537115, 16603883, 16603315, 16552512, 16437984, 16705943, 15909927, 15688461, 16130681, 16234722, 16390465, 16375231, 16475576, 16626287, 16687949, 16884038, 16986205, 16720073, 16095606, 16204683]
16072A6204683j07125P01975K80633Q5434m2464Q5840l23135J29520J13533n017
16062A7123877k59994J33497m00065m53698R06348Q2902l38731k59382K19879
$$ y = [16204683, 16097558, 16799533, 17080166, 17165600, 17123136, 17208976, 16885841, 17015361, 17128894, 17123877, 16863883, 16997380, 16597315, 16143617, 17049965, 17132867, 16794136, 16534754, 16754633]
$$ [...]
##END NTUPLES=NMR SPECTRUM
##END=
