##TITLE=1H_CA-8916-1
 CDCl3, 8 sc, 
 31.8.2021
##JCAMPDX= 6.0         $$ Bruker NMR JCAMP-DX V2.0
##DATA TYPE= NMR SPECTRUM
##DATA CLASS= NTUPLES
##ORIGIN= UXNMR, Bruker Analytische Messtechnik GmbH
##OWNER= root
$$ XWIN-NMR		Version 3.5
$$ Wed Sep  1 08:44:22 2021 Russian Standard Time (UT+4h)  she@DPX200
##.OBSERVE FREQUENCY= 200.131506
##.OBSERVE NUCLEUS= ^1H
##.ACQUISITION MODE= SIMULTANEOUS
##.ACQUISITION SCHEME= undefined
##.AVERAGES= 8
##.DIGITISER RES= 18
##SPECTROMETER/DATA SYSTEM= spect
##.PULSE SEQUENCE= zg30
##.SOLVENT NAME= CDCl3
##.SHIFT REFERENCE= (INTERNAL, CDCl3, 0, 17.5264)
##AUDIT TRAIL= $$ (NUMBER, WHEN, WHO, WHERE, WHAT)
$$ ##TITLE= Audit trail, XWIN-NMR		Version 3.5
$$ ##JCAMPDX= 5.01
$$ ##ORIGIN= Bruker BioSpin GmbH
$$ ##OWNER= she
$$ F:/spectra/data/she/nmr/H-F/1/pdata/1/auditp.txt
$$ ##AUDIT TRAIL=  $$ (NUMBER, WHEN, WHO, WHERE, WHAT)
(   1,<2021-09-01 08:42:31.17 +0400>,<she>,<DPX200>,
      <created by zg, POWCHK disabled, PULCHK disabled
       configuration hash MD5:
       00 E9 B6 7A A2 85 ED C7 34 08 36 98 17 FE 4E 26
       data hash MD5: 16K
       01 DC 24 FB 5A 40 17 B4 6F 0F F2 D5 6B 26 35 4F>)
(   2,<2021-09-01 08:42:35.75 +0400>,<she>,<DPX200>,
      <Start of raw data processing
       efp BC_mod = 2 LB = 0.24 FT_mod = 6 PKNL = 1 PHC0 = -13362.03 PHC1 = 14.80098 SI = 16K 
       data hash MD5: 16K
       F2 15 C5 F2 26 31 D6 7A 00 85 15 CF DF 0F 35 D6>)
(   3,<2021-09-01 08:43:06.81 +0400>,<she>,<DPX200>,
      <pk PHC0 = 3.583619 PHC1 = -7 
       data hash MD5: 16K
       1B 09 84 31 6D C8 C6 67 59 2C A9 01 F5 49 0F 4E>)
(   4,<2021-09-01 08:43:10.73 +0400>,<she>,<DPX200>,
      <abs ABSG = 5 
       data hash MD5: 16K
       1E C2 37 18 FD AD 50 B8 24 FE 41 C0 04 0A D2 EF>)
$$ ##END=
$$ 
$$ hash MD5
$$ 84 35 AD 7D A7 D4 5F B0 B1 5F BA AB 31 AB 39 1C
##$RELAX= 
##$RELAX= 
##$RELAX= 
##$RELAX= 
##$RELAX= 
##$RELAX= 
$$ Bruker specific parameters
$$ --------------------------
##$DU= <F:/spectra>
##$EXPNO= 1
##$NAME= <H-F>
##$PROCNO= 1
##$TYPE= <nmr>
##$USER= <she>
##$AMP= (0..31)
100 100 100 100 100 100 100 100 100 100 100 100 100 100 100 100 100 100 
100 100 100 100 100 100 100 100 100 100 100 100 100 100 
##$AQSEQ= 0
##$AQ_mod= 1
##$AUNM= <au_zg>
##$AUTOPOS= <>
##$BF1= 200.13
##$BF2= 200.13
##$BF3= 200.13
##$BF4= 200.13
##$BF5= 200.13
##$BF6= 200.13
##$BF7= 200.13
##$BF8= 200.13
##$BYTORDA= 1
##$CFDGTYP= 0
##$CFRGTYP= 5
##$CHEMSTR= <none>
##$CNST= (0..31)
1 1 145 1 1 1 1 1 1 1 1 1 1 1 1 1 1 1 1 1 1 1 1 1 1 1 1 1 1 1 1 1 
##$CPDPRG= <>
##$CPDPRG1= <>
##$CPDPRG2= <>
##$CPDPRG3= <>
##$CPDPRG4= <mlev>
##$CPDPRG5= <mlev>
##$CPDPRG6= <mlev>
##$CPDPRG7= <mlev>
##$CPDPRG8= <mlev>
##$CPDPRGB= <>
##$CPDPRGT= <>
##$D= (0..31)
0 1.2 0 0 0 0 0 0 0 0.06 0 0.03 0 0 0 0 0.0002 0 0 0 0 0 0 0 0 0 0 0 0 
0 0 0 
##$DATE= 1630471350
##$DBL= (0..7)
120 120 120 120 120 120 120 120 
##$DBP= (0..7)
150 150 150 150 150 150 150 150 
##$DBP07= 0
##$DBPNAM0= <>
##$DBPNAM1= <>
##$DBPNAM2= <>
##$DBPNAM3= <>
##$DBPNAM4= <>
$$ [...]
##$SUBNAM3= <"">
##$SUBNAM4= <"">
##$SUBNAM5= <"">
##$SUBNAM6= <"">
##$SUBNAM7= <"">
##$SUBNAM8= <"">
##$SUBNAM9= <"">
##$SW= 20.0188882624521
##$SWIBOX= (0..15)
0 0 2 0 0 0 0 0 0 0 0 0 0 0 0 0 
##$SW_h= 4006.41025641026
##$TD= 16384
##$TD0= 1
##$TE= 0
##$TE2= 300
##$TE3= 300
##$TEG= 300
##$TL= (0..7)
0 120 120 120 120 120 120 120 
##$TP= (0..7)
150 150 150 150 150 150 150 150 
##$TP07= 0
##$TPNAME0= <>
##$TPNAME1= <>
##$TPNAME2= <>
##$TPNAME3= <>
##$TPNAME4= <>
##$TPNAME5= <>
##$TPNAME6= <>
##$TPNAME7= <>
##$TPOAL= (0..7)
0.5 0.5 0.5 0.5 0.5 0.5 0.5 0.5 
##$TPOFFS= (0..7)
0 0 0 0 0 0 0 0 
##$TUNHIN= 0
##$TUNHOUT= 0
##$TUNXOUT= 0
##$USERA1= <user>
##$USERA2= <user>
##$USERA3= <user>
##$USERA4= <user>
##$USERA5= <user>
##$V9= 5
##$VALIST= <valist>
##$VCLIST= <CCCCCCCCCCCCCCC>
##$VD= 0
##$VDLIST= <DDDDDDDDDDDDDDD>
##$VPLIST= <PPPPPPPPPPPPPPP>
##$VTLIST= <TTTTTTTTTTTTTTT>
##$WBST= 1024
##$WBSW= 4
##$XGAIN= (0..3)
0 0 0 0 
##$XL= 0
##$YL= 0
##$YMAX_a= 249496
##$YMIN_a= -378468
##$ZGOPTNS= <>
##$ZL1= 120
##$ZL2= 120
##$ZL3= 120
##$ZL4= 120
##$ABSF1= 17.53499
##$ABSF2= -2.484049
##$ABSG= 5
##$ABSL= 3
##$ALPHA= 0
##$AQORDER= 0
##$ASSFAC= 0
##$ASSFACI= 0
##$ASSFACX= 0
##$ASSWID= 0
##$AUNMP= <proc_1d>
##$AZFE= 0.1
##$AZFW= 0.1
##$BCFW= 0
##$BC_mod= 2
##$BYTORDP= 0
##$COROFFS= 0
##$CY= -3
##$DATMOD= 1
##$DC= 0
##$DFILT= <>
##$DTYPP= 0
##$F1P= 0
##$F2P= 0
##$FCOR= 1
##$FTSIZE= 16384
##$FT_mod= 6
##$GAMMA= 0
##$GB= 0
##$INTBC= 1
##$INTSCL= 1.334414e-10
##$ISEN= 128
##$LB= 0.24
##$LEV0= 0
##$LPBIN= 0
##$MAXI= 10000
##$MC2= 0
##$MEAN= 0
##$ME_mod= 0
##$MI= 1.114404
##$NCOEF= 0
##$NC_proc= -6
##$NLEV= 6
##$NOISF1= 3.799351
##$NOISF2= 2.8
##$NSP= 0
##$NTH_PI= 0
##$NZP= 0
##$OFFSET= 17.52643
##$PC= 1
##$PHC0= -13358.45
##$PHC1= 7.80098
##$PH_mod= 1
##$PKNL= yes
##$PPARMOD= 0
##$PSCAL= 0
##$PSIGN= 0
##$REVERSE= no
##$SF= 200.13000163992
##$SI= 16384
##$SIGF1= 3
##$SIGF2= 2
##$SINO= 5.538805
##$SIOLD= 16384
##$SREGLST= <1H.CDCl3>
##$SSB= 0
##$STSI= 16384
##$STSR= 0
##$SW_p= 4006.41025641026
##$SYMM= 0
##$S_DEV= 0
##$TDeff= 16384
##$TDoff= 0
##$TI= <>
##$TILT= no
##$TM1= 0
##$TM2= 0
##$TOPLEV= 0
##$USERP1= <user>
##$USERP2= <user>
##$USERP3= <user>
##$USERP4= <user>
##$USERP5= <user>
##$WDW= 1
##$XDIM= 16384
##$YMAX_p= 433614866
##$YMIN_p= -268197
$$ End of Bruker specific parameters
$$ ---------------------------------
##NTUPLES= NMR SPECTRUM
##VAR_NAME=  FREQUENCY,     SPECTRUM/REAL,   SPECTRUM/IMAG
##SYMBOL=    X,             R,               I
##VAR_TYPE=  INDEPENDENT,   DEPENDENT,       DEPENDENT
##VAR_FORM=  AFFN,          ASDF,            ASDF
##VAR_DIM=   16384,         16384,           16384
##UNITS=     HZ,            ARBITRARY UNITS, ARBITRARY UNITS
##FACTOR=    0.24454680195387, 1,            1
##FIRST=     3507.56449065982, 0,            0
##LAST=      -498.845765750439, 0,           0
##MIN=       -498.845765750439, -268197,     0
##MAX=       3507.56449065982, 433614866,    0
$$ Real data points
##PAGE= N=1
##DATA TABLE= (X++(R..R)), XYDATA
$$ [...]
7525A52897R1933m836q279J7727j18779L4782k7246Q5070j1772k2773n3617l6663
$$ 152897 244830 239994 231715 249442 130663 165445 138199 223269 211497 188724 135107 98444
7513I8444O36J9666L0388R6422q7340K7910J11863k02060J4431K4769K7955J225
$$ 98444 99080 118746 149134 245556 158216 186126 297989 95929 110360 135129 163084 164309
7501A64309p1455l1897l9589Q0633m5082J5503J03206o1638j3390Q835K0707k239
$$ 164309 92854 60957 21368 102001 56919 72422 175628 113990 100600 109435 130142 127903
7489A27903P1906r0933o3734k7262Q4553R2589j6287o0310N6951m6103j45496
$$ 127903 199809 108876 45142 17880 102433 195022 178735 118425 175376 129273 -16223
7478a6223J98316j35388Q362K9904k2275M5868L5072j75209l3397J42M3565K5672
$$ -16223 182093 46705 55067 84971 62696 108564 143636 -31573 -64970 -64828 -21263 4409
7466D409M1523P6214M7574j42096O7423j01847K2936L3866n0228j46712J00920
$$ 4409 45932 122146 169720 27624 95047 -6800 16136 50002 -226 -146938 -46018
7455d6018J48741p8925j07170L1548M7890Q0981m7788n2826J9101k5328L7861
$$ -46018 102723 23798 -83372 -51824 -3934 77047 29259 -23567 -4466 -29794 8067
7444H067N3330Q5961j01567m0671J8938N7599N8893j33801n7723J32768P3908
$$ 8067 61397 147358 45791 5120 24058 81657 140550 6749 -50974 81794 155702
7433A55702O5097m1463r8229M56m6724n7917O6446M4700P9922k4419R259j01526
$$ 155702 220799 179336 81107 81563 34839 -23078 43368 88068 167990 143571 152830 51304
7421E1304r5975L7399N8627r823M3413j05315M2526j5211n5185N2637N5322q6324
$$ 51304 -44671 -7272 51355 41532 84945 -20370 22156 6945 -48240 4397 59719 -26605
7409b6605N7054J26274J8200o4774j52967n4292J28988l1486m2424L1374M260
$$ -26605 30449 156723 174923 110149 -42818 -97110 31878 392 -42032 -10658 -6398
7398f398J31721n17o9764L4893j20141J07698K9589j42565k6666j7475l7475o0432
$$ -6398 125323 124806 55042 89935 -30206 77492 107081 -35484 -62150 -79625 -117100 -177532
7386a77532M4897J9713J42622l1441p6306J4907p4575J01348n913k4576O5858
$$ -177532 -132635 -112922 29700 -1741 -78047 -63140 -137715 -36367 -42280 -66856 -998
7375i98Q7276P2288m8146n8600n4848K5551M135r9186r313O9800r51J6372n1993
$$ -998 86278 158566 110420 51820 -3028 22523 26658 -72528 -81841 -12041 -12992 3380 -48613
7362d8613j2346J04867L3663j05755m8165M6161N086R454r424m2451N8781J000
$$ -48613 -60959 43908 77571 -28184 -76349 -30188 -25102 -15648 -25072 -67523 -8742 -7742
7350g742M9435J4793m1942L4493n1270o813L5552P7620n9359n1907m7253O6932
$$ -7742 41693 56486 14544 49037 -2233 -9046 26506 104126 44767 -7140 -54393 12539
7338A2539J6886N2980L2666j42461L1275M3522K5196j232l8409p521M109O0211
$$ 12539 29425 82405 115071 -27390 3885 47407 72603 71371 32962 25441 29550 89761
7326H9761L749L01Q0614m8761n4077l9425m3999O2836L8820j3896j23821M8172
$$ 89761 93510 93811 174425 125664 71587 32162 -11837 50999 89819 75923 -47898 274
7314B74q572q6601J42067K1903o9063j356j06634J44627R6825n7872n7107R9688
$$ 274 -8298 -94899 47168 69071 8 -1348 -107982 36645 133470 75598 18491 118179
7302A18179k4775j36397m08J4609J0345j02910J2817J5505O9823j0281p7545Q5238
$$ 118179 93404 -42993 -43401 -28792 -18447 -121357 -108540 -93035 -23212 -33493 -111038 -25800
7290b5800O9782j7763J4707J4269M863N3777p5093n1605J33507n0290p9097J1714
$$ -25800 43982 26219 40926 55195 60058 113835 38742 -12863 120644 70354 -8743 2971
7278B971K0780K7785M774J04184L9549r8667j28143P4176q76j37577P6307O370
$$ 2971 23751 51536 56310 160494 200043 101376 -26767 47409 46533 -91044 -14737 -8367
7266h367L1536m557P3349L2723j8692Q325N9785j25283n3755O7827J264J28761
$$ -8367 23169 18612 91961 124684 105992 114317 174102 48819 -4936 62891 64155 192916
7254A92916L1079j24830Q7448j41025q494Q2979N1511p7232j09856P0632l3832
$$ 192916 223995 99165 186613 45588 37094 120073 171584 94352 -15504 55128 21296
7243B1296o964O490q8261L7791K5888R9520o6274m8438J41966l7327r379m133
$$ 21296 14332 20822 -67439 -29648 -3760 95760 29486 -18952 123014 85687 76308 72175
7231G2175m4235n0216j9460R643J0662O8941J35703N8072q0060l924o4897M4685
$$ 72175 27940 -22276 -41736 -32093 -21431 47510 183213 241285 161225 157301 92404 137089
7219A37089j8833j19156J06451l8220j29063N5328M2611j8277J07L6408o261q1562
$$ 137089 118256 -900 105551 67331 -61732 -6404 36207 17930 18037 54445 48184 -33378
7207c3378J17021l4557k277N6631j62749M0920P1762K7955m1799K14N2706Q7426
$$ -33378 83643 49086 46809 103440 -59309 -18389 53373 81328 39529 39743 92449 179875
7195A79875J19964k26051L5788p8547k7511J3516M7814N3442r1542K0077l6432
$$ 179875 299839 73788 109576 31029 3518 17034 64848 118290 26748 46825 10393
7184A0393M6566n678O4370J9680r1800K4544j5965j1731J28705j0143j59669j5949
$$ 10393 56959 51281 115651 135331 43531 68075 52110 40379 169084 158941 -728 -16677
7172a6677J11935J1090q5404J0098r020m4909J32271j17742Q84n4834P1981J66814
$$ -16677 95258 106348 20944 31042 22022 -22887 109384 -8358 -7474 -62308 9673 176487
7160A76487q7672N1008o0800P9513n7856J8200O4156n8786n1063p1307P440J02521
$$ 176487 88815 139823 79023 158536 100680 118880 183036 124250 73187 1880 9320 111841
7148A11841k08028P6279L9761L9834l1452J03460N8673j02788r8586J34300L2884
$$ 111841 -96187 -19908 19853 59687 28235 131695 190368 87580 -11006 123294 156178
7137A56178q4651P4943j09853n6057Q4996r0059j0944K4666k6482l6220l800N2180
$$ 156178 71527 146470 36617 -19440 65556 -24503 -35447 -10781 -37263 -73483 -77283 -25103
7125b5103M4550J65612n5220l0607k4635O9659j0843j66728M9052K9253q007N1877
$$ -25103 19447 185059 129839 99232 74597 144256 133413 -33315 15737 44990 36983 88860
7113H8860o2378R7526N0237j10550l9127j3533m069N7259N2279j22233j13655
$$ 88860 26482 124008 174245 63695 24568 11035 6966 64225 116504 -5729 -119384
7102a19384J7868J60815K9650j02843N8990N3896k6618k1868r685p3529J9664
$$ -119384 -101516 59299 88949 -13894 45096 98992 72374 50506 40821 -32708 -13044
7091a3044j8584N721J02508J12162r3884j19943N9364P1516q4854K7118R4725
$$ -13044 -31628 -25907 76601 188763 94879 -25064 34300 105816 20962 48080 142805
7080A42805j7478n0931N2807n2960K9820p0518k240J3009L8924J56178j20641
$$ 142805 125327 74396 127203 74243 104063 33545 31305 44314 83238 239416 118775
7069A18775m3349O6187n6293J3965k7712m7410J07328j879q2947q5377j743R6217
$$ 118775 75426 141613 85320 99285 71573 24163 131491 129612 46665 -38712 -40455 55762
7057E5762j5657k5918O2649Q0756j481p6081l1440P704O2410q704q5785O5795
$$ 55762 40105 14187 76836 157592 156111 80030 48590 56294 118704 110000 24215 90010
7045I0010M5510n3496j8640N6391o2946K1096j16457J87404k8689j21343L3956
$$ 90010 135520 82024 63384 119775 56829 77925 -38532 148872 120183 -1160 32796
7034C2796J67766j70797j11999R7627k534n3392J41685N9124o1827k9571L2234
$$ 32796 200562 29765 -82234 15393 12859 -40533 101152 160276 98449 68878 101112
7023A01112o4459N9535J31646j88674q1223o9561J20542P848J00123j10495J42022
$$ 101112 36653 96188 227834 39160 -42063 -111624 8918 16766 116889 6394 148416
7012A48416m9896l1385M0845m0657L5194Q2441l5882n8545l2724l2582L3971R8093
$$ 148416 98520 67135 107980 67323 102517 184958 149076 90531 57807 25225 59196 157289
7000A57289R6479j60104p8469o6235K1156R8581J2350M5481j4598n9481J53362
$$ 157289 253768 93664 15195 -51040 -29884 68697 81047 126528 111930 52449 205811
6989B05811j08022j13535P2299K2969N0329q927m8228m7637K4850P0556R3786
$$ 205811 97789 -15746 56553 79522 129851 120924 72696 25059 49909 120465 214251
6978B14251j26669l5711l6220Q7939J4166P3542r7667J6425j9787N1679j887L3789
$$ 214251 87582 51871 15651 103590 117756 191298 93631 110056 90269 141948 140061 173850
6966A73850n2699N9222m3119q10J21586j05172N0610l8910k3092J7135k822j05079
$$ 173850 121151 180373 137254 136444 258030 152858 203468 164558 141466 158601 155779 50700
6954E0700r6787L2300N2153j16945K6237J14507N3398P21K1513N8047k106q0277
$$ 50700 -46087 -13787 38366 -78579 -52342 62165 115563 116284 137797 195844 193738 113461
6942A13461o85L1418J3415L4888l193j39325l1558L9258J11691N1264K999j5894
$$ 113461 112776 144194 157609 192497 189304 49979 18421 57679 169370 220634 223633 207739
6930B07739j14138J06725O4273j06667l1326O0334K8525j41659O5516l6542J63684
$$ 207739 93601 200326 264599 157932 126606 186940 215465 73806 139322 102780 266464
6919B66464j1243k37884J3075J88916R6426l6624j8664o7770M2753p5967l0864
$$ 266464 255221 17337 30412 219328 315754 279130 260466 192696 235449 159482 128618
6908A28618K8075q0964k6866O5393J12858l4748q3796O8477n7419l8142J32096
$$ 128618 156693 75729 48863 114256 227114 192366 108570 177047 119628 81486 213582
6897B13582J00681L0828o1590p128m380l4284p6732k4440K5786P1928l2836o4250
$$ 213582 314263 345091 283501 276373 271993 237709 160977 136537 162323 234251 201415 137165
6885A37165J863o5884K1725j0692J36557M3172J0064O5161J0783n190p0041P8868
$$ 137165 139028 73144 94869 84177 220734 263906 273970 339131 349914 344724 274683 353551
6873C53551J00693L2965m4713r7748k9441j0604L9244l121r8514J5425r601n7718
$$ 353551 454244 487209 442496 344748 315307 304703 343947 340826 242312 257737 248136 190418
6861A90418l9875J52410j0531j12653P913Q9791p3529J7915J57805r1375p8600
$$ 190418 150543 302953 292422 179769 187682 277473 203944 221859 379664 288289 209689
6850B09689R3898p4393k1380n631K4336m7999r2202P2604K7992Q7479Q6342O8692
$$ 209689 303587 229194 207814 202183 226519 178520 86318 158922 186914 274393 360735 429427
6838D29427n8211L5500r5164j08528Q5181N2055r1523L7614J25893j14376J8222
$$ 429427 371216 406716 311552 203024 288205 340260 248737 286351 412244 297868 316090
6827C16090j4115j01006M3672o5077k7536k335O9854P5934r514j43584P6611Q1948
$$ 316090 301975 200969 244641 179564 152028 149693 219547 295481 285967 142383 218994 300942
6815C00942j0349j4167q244j3891l1641P8144R461l2026Q269j202M9506O0800
$$ 300942 290593 276426 268182 254291 222650 300794 310255 278229 286498 285296 334802 395602
6803C95602r1884r0722J21523J12533p8630r0209m2801l1905M428M3162M4771
$$ 395602 303718 212996 334519 447052 368422 278213 235412 203507 207935 251097 295868
6792B95868R926M3156M8674j01837r29L8627r6142N9993O2006o9833L9116j10748
$$ 295868 305794 348950 397624 295787 294858 333485 237343 297336 359342 289509 328625 217877
6780B17877N779M8103p5582m755K7103M8259n253q1660M3247N1364L8119Q5914
$$ 217877 223656 271759 196177 191422 218525 266784 261531 179871 223118 274482 312601 398515
6768C98515m6842N4804p5848N0398o0080j8642J13225n8067m6863m022J11589
$$ 398515 351673 406477 330629 381027 320947 302305 415530 357463 310600 306578 418167
6757D18167n0737o4755k5581R6000J9019r0287M7880j4715N0326J4424j07299
$$ 418167 367430 302675 277094 373094 392113 301826 349706 334991 385317 399741 292442
6746B92442L3684K2747K8404J0837N9667n1241J15633R152p2987L1083j27573
$$ 292442 326126 348873 377277 388114 447781 396540 512173 521325 448338 479421 351848
6735C51848K5557R6396q369R4945r9119j37355R1824m6855J4472L8487q6260l3241
$$ 351848 377405 473801 465432 560377 461258 323903 415727 368872 383344 421831 335571 302330
6723C02330N933l0354m5745P0867J14022N2875N8312n5590l2223O2847k3743m6069
$$ 302330 308263 277909 232164 303031 417053 469928 528240 472650 440427 503274 479531 433462
6711D33462m6799M7773J05210M186k004j2015r869n0388m1226m7144J2111j8210
$$ 433462 386663 434436 539646 543832 541828 529813 519944 469556 428330 381186 393297 375087
6699C75087N0153J1479j5151k3032N883J03720L6628p0646J0421Q6240n9857m9066
$$ 375087 425240 436719 421568 398536 404419 508139 544767 474121 484542 570782 510925 461859
6687D61859N8475m7475q2644Q9535M95j42425j2128j8386J33440J19339j12271
$$ 461859 520334 472859 390215 479750 480245 337820 325692 307306 440746 560085 447814
6676D47814K5404m3174Q3428J03970l5825l6022L635l9267q2729J25343L351k0815
$$ 447814 473218 430044 513472 617442 581617 545595 549230 509963 427234 552577 555928 535113
6664E35113j258r1258q108R3963L5107K5445j6484k856o8955M7430p7859R8230
$$ 535113 533855 442597 434489 528452 563559 589004 572520 569664 500709 548139 470280 568510
6652E68510O9786r0824k3368P1171P1244j32947M2606J8699j32454J14888r683
$$ 568510 638296 547472 524104 595275 666519 533572 576178 594877 462423 577311 567628
6641E67628J5187L6261J03652K6099q6686N6732r2463j41695N6249J15211k3525
$$ 567628 582815 619076 722728 748827 662141 718873 626410 484715 540964 656175 632650
6630F32650o9538L3547k5671O4025N9065j31657J05668J11276r607l6815p3050
$$ 632650 563112 596659 570988 635013 694078 562421 668089 779365 769758 732943 659893
6619F59893o4349L126R3558l072o783J09566l6757J08327N6601J3206j585J78008
$$ 659893 595544 598670 692228 689156 682373 791939 755182 863509 920110 933316 931731 1109739
6607A109739j71058l9005L628N1332q9063Q6034Q9935o7369K5427P743m0247m2602
$$ 1109739 938681 899676 903304 954636 865573 951607 1041542 974173 999600 1007343 967096 924494
6595I24494L9958J20366L1012o5073r7115Q2664N4818O4388j5749Q4428M2706
$$ 924494 964452 1084818 1115830 1050757 953642 1036306 1091124 1155512 1139763 1224191 1266897
6584A266897p9574Q262J00817J80498J8246K3813r2262N0052n59m2312P8743K661
$$ 1266897 1187323 1195585 1296402 1476900 1495146 1518959 1426697 1476749 1476190 1433878 1512621 1515282
6572A515282k676P3185m818J90789J02340k3467n9439L0302O3863K28766P1412
$$ 1515282 1512606 1585791 1580973 1771762 1874102 1850635 1791196 1821498 1885361 2114127 2185539
6561B185539r4603R1111J3838Q1921J14147K2408P0154J41150q768K9028J36616
$$ 2185539 2090936 2182047 2195885 2277806 2391953 2414361 2484515 2625665 2616897 2645925 2782541
6550B782541K9945J66810J41049R0069L2068J41131R0074P1339J11180J43088
$$ 2782541 2812486 2979296 3120345 3210414 3242482 3383613 3473687 3545026 3656206 3799294
6540C799294J27791R4974L32062J61056K71807K99794J68105K70042L42416K42234
$$ 3799294 3927085 4022059 4354121 4515177 4786984 5086778 5254883 5524925 5867341 6109575
6530F109575L58203M92361M65328O18835P34109R00128R11972J035413J239795
$$ 6109575 6467778 6960139 7425467 8044302 8778411 9678539 10590511 11625924 12865719
6521A2865719J392406J762398K426476L014259L641726M253170M770929M650465
$$ 12865719 14258125 16020523 18446999 21461258 25102984 29356154 34127083 38777548
6513C8777548L506813Q33889k258969m834238o056247n647677m426223l204719
$$ 38777548 42284361 43118250 40859281 36025043 29968796 24321119 19894896 16690177
6505A6690177k335749j855969j247530j124751r88536p77572n96831n30491m78183
$$ 16690177 14354428 12498459 11250929 10126178 9137642 8360070 7763239 7232748 6754565
6496F754565m20412m14617l37786k50949l95874l64031k09753k00739j86950l8956
$$ 6754565 6334153 5919536 5581750 5330801 4934927 4570896 4361143 4160404 3973454 3934498
6486C934498j18116o9114j47571j64440j60358j22406j22653p6201m3358r7089
$$ 3934498 3816382 3747268 3599697 3435257 3274899 3152493 3029840 2953639 2910281 2813192
6476B813192J1106j01599n5287k6284P28J9577k19910j27223R3786j0096q9901
$$ 2813192 2824298 2722699 2667412 2641128 2641856 2661433 2441523 2314300 2408086 2397990 2308089
6465B308089n7310K3917p3368N45m7065k0336M2626q043l8281j00489L5795P9683
$$ 2308089 2250779 2274696 2201328 2201873 2154808 2134472 2177098 2169055 2130774 2030285 2066080 2145763
6453B145763j01431J12189j44535P0095M2496j47212k6594J83119k2607o8528
$$ 2145763 2044332 2156521 2011986 2082081 2124577 1977365 1950771 2133890 2111283 2042755
6443B042755j20129P6482L1426L1459j07982J90072j75462j08394J23856J33395
$$ 2042755 1922626 1999108 2030534 2061993 1954011 2144083 1968621 1860227 1984083 2117478
6433B117478R7262p7532p2565k1203M8653j05063L4056P6933O73M7593P4876n2416
$$ 2117478 2214740 2137208 2064643 2043440 2092093 1987030 2021086 2098019 2098692 2146285 2221161 2168745
6421B168745O2030L815J7184L5828J06774l4066J2626J8209J1313J46440J43365
$$ 2168745 2230775 2234590 2251774 2287602 2394376 2360310 2372936 2391145 2402458 2548898 2692263
6410B692263L4844J06920K003p1391N3891J97653J55649J34508N3182p608j0417
$$ 2692263 2727107 2834027 2836030 2764639 2818530 3016183 3171832 3306340 3359522 3351914 3341497
6399C341497N7170J66833Q9030J04303J08531K85662J76694O9475K64231K51474
$$ 3341497 3398667 3565500 3654530 3758833 3867364 4153026 4329720 4399195 4663426 4914900
6389D914900K43085L85773L29732M43797M79776M98483P48306Q71303J084627
$$ 4914900 5157985 5543758 5873490 6317287 6797063 7295546 8043852 8915155 9999782
6380I999782J412558J704260K297600K738360L291694M364292M805701K209199
$$ 9999782 11412340 13116600 15414200 18152560 21444254 25808546 30614247 32823446
6372C2823446l056784n303122n714899m059333k572207j888784j279143p95770
$$ 32823446 29766662 24463540 18748641 14689308 12117101 10228317 8949174 8153404
6364H153404q34497p55859m64701m03024k13803m00723k17414k32272l51271j87206
$$ 8153404 7318907 6563048 6098347 5695323 5481520 5080797 4863383 4631111 4279840 4092634
6354D092634k37777k08879p6532r0584j00707m4759o3626r5397K5054j60103m7368
$$ 4092634 3854857 3645978 3569446 3478862 3378155 3333396 3269770 3174373 3199427 3039324 2991956
6343B991956j45683j5035r3929R433N1482j60335q9022J3375j57029P527L7826
$$ 2991956 2846273 2831238 2737309 2746742 2798224 2637889 2548867 2562242 2405213 2412740 2450566
6332B450566Q4988j23166j46518N3912j02814k07150J54021j8960j9911Q1854
$$ 2450566 2535554 2412388 2265870 2319782 2216968 2009818 2163839 2144879 2124968 2206822
6322B206822l3290K3883q6220j04102N3491J36908j77277n157M2507p8743M2983
$$ 2206822 2173532 2197415 2111195 2007093 2060584 2197492 2020215 2015058 2057565 1978822 2021805
6311B021805j7274o9639r480M1350m871o7415L0378K5127j331J7531j38338q3924
$$ 2021805 2004531 1934892 1925412 1966762 1961891 1894476 1924854 1949981 1948650 1966181 1827843 1743919
6299A743919Q238J29508Q3015L1644r4843r7583N2685p4487j2840O3934J7826
$$ 1743919 1752157 1881665 1964680 1996324 1901481 1803898 1856583 1782096 1769256 1833190 1851016
6288A851016K9409N4575l9719R548L3872M2848j18477q373j78525J41869K00777
$$ 1851016 1880425 1935000 1895281 1904829 1938701 1981549 1863072 1854699 1676174 1818043 2018820
6277B018820j18906m5191L8864o4795L5202O8977l6370l4769K1665L9817K5815
$$ 2018820 1899914 1854723 1893587 1828792 1863994 1932971 1896601 1861832 1883497 1923314 1949129
6266A949129O6159K0263M259k2661K3009p2904l9177J28748R4766j70566R745
$$ 1949129 2015288 2035551 2039810 2017149 2040158 1967254 1928077 2056825 2151591 1981025 1990770
6255A990770m9086J11164L8273n8226q7142j5345P4848k2072j0742j2546L0061
$$ 1990770 1941684 2052848 2091121 2032895 1945753 1930408 2005256 1983184 1972442 1959896 1989957
6244A989957L5126l1198J24387p3912o4596r409O333J921j0979R4193j29913N9325
$$ 1989957 2025083 1993885 2118272 2044360 1979764 1970355 1976688 1978609 1967630 2061823 1931910 1991235
6232A991235J35652L1333R208J1500j6808j04766K8358J9648J10858K9465j01374
$$ 1991235 2126887 2158220 2167428 2178928 2162120 2057354 2085712 2105360 2216218 2245683 2144309
6221B144309J1898Q6540q0024K8991K5991L602M3368j54141J4734Q4850J29026
$$ 2144309 2156207 2242747 2162723 2191714 2217705 2221307 2264675 2110534 2125268 2210118 2339144
6210B339144n0542J17326p5517J14537J8123J4190r3173L0360k710N1652K490
$$ 2339144 2288602 2405928 2330411 2444948 2463071 2477261 2384088 2414448 2411738 2463390 2465880
6199B465880k4366R469l189J6342l0371l809P2039J2093J1234m4927o5130J50244
$$ 2465880 2441514 2450983 2447794 2464136 2433765 2429956 2501995 2514088 2525322 2480395 2415265 2565509
6187B565509M8472l7600L1797Q198j09501J42676J32727N9445j26697P1327R3568
$$ 2565509 2613981 2576381 2608178 2616376 2506875 2649551 2782278 2841723 2715026 2786353 2879921
6176B879921m5259p5063J65632L2379K6950j17141L6113L8512j35084K0191J8744
$$ 2879921 2834662 2759599 2925231 2957610 2984560 2867419 2903532 2942044 2806960 2827151 2845895
6165B845895R6959O0222j253J00412J08719q2249J8067K8145n3019J08536J27823
$$ 2845895 2942854 3003076 3001823 3102235 3210954 3128705 3146772 3174917 3121898 3230434 3358257
6154C358257J18384L5957O6497J53683l7442K6884O7200R3689M0082K3628J10703
$$ 3358257 3476641 3512598 3579095 3732778 3695336 3722220 3789420 3883109 3923191 3946819 4057522
6143D057522K3089K12266J93874K03986O8784K11701L78047L88454J59989K20134
$$ 4057522 4080611 4292877 4486751 4690737 4759521 4971222 5349269 5737723 5897712 6117846
6133F117846J83527j90065q5888k06817k23212j07663l39717k59934k18852j75912
$$ 6117846 6301373 6111308 6025420 5818603 5595391 5487728 5148011 4888077 4669225 4493313
6123D493313j59982k44316J0367j4777q7933j60227j8718J8506o1898m3171r3550
$$ 4493313 4333331 4089015 4099382 4084605 3996672 3836445 3817727 3836233 3774335 3731164 3637614
6112C637614P3641J6628j23688l8695J606R2104q5267O1783O212m1134q085J6564
$$ 3637614 3711255 3727883 3604195 3565500 3567106 3659210 3573943 3635726 3641938 3600804 3592719 3609283
6100C609283R796p2773j52328O070J45342M322J8493M5120O3190J803k7066q253
$$ 3609283 3619079 3546306 3393978 3400048 3545390 3549712 3568205 3613325 3676515 3678318 3651252 3642999
6088C642999M728N1998J6917j13577R2549K3898o0703J6018L4356j1188L402N0768
$$ 3642999 3647727 3699725 3716642 3603065 3695614 3719512 3658809 3674827 3709183 3697995 3701397 3752165
6076C752165L4815m9310p0140N8510k6848m4372N3472N4742L7080O5600J2094
$$ 3752165 3786980 3737670 3667530 3726040 3699192 3654820 3708292 3763034 3800114 3865714 3877808
6065C877808o3553J8228l8104o3885k4192Q2980j5569L8947K7623Q8378l01O008
$$ 3877808 3814255 3832483 3794379 3730494 3706302 3789282 3773713 3812660 3840283 3928661 3928360 3934368
6053C934368K2149j20610O8402N7659O8242M8162j6089O216N7946m7401j13656
$$ 3934368 3956517 3835907 3904309 3961968 4030210 4078372 4062283 4068499 4126445 4079044 3965388
6042C965388O4026J36176o2364k407j13183O1957J32865l2170J34746j74989J0741
$$ 3965388 4029414 4165590 4103226 4100819 3987636 4049593 4182458 4150288 4285034 4110045 4120786
6031D120786j3772r9004J77209r0208K6135J34082m316J7993K4389j3617L2760
$$ 4120786 4107014 4008010 4185219 4095011 4121146 4255228 4250912 4268905 4293294 4279677 4312437
6020D312437p5487K8943l3983L1819Q2460j22814J08480J30075p4804m1325K2517
$$ 4312437 4236950 4265893 4231910 4263729 4346189 4223375 4331855 4461930 4387126 4345801 4368318
6009D368318Q0173Q7295n4504o5796R8164r8309J9712k7468J41045o2989o6076
$$ 4368318 4448491 4535786 4481282 4415486 4513650 4415341 4435053 4407585 4548630 4485641 4419565
5998D419565o0381l4419J10077j8363O0586J2620N651M4566L23m8426P6256Q625
$$ 4419565 4359184 4324765 4434842 4416479 4477065 4489685 4495336 4539902 4540225 4491799 4568055 4576680
5986D576680k9177J34343r5236m3285m1044P9814M1652M6922q2126O819L9978
$$ 4576680 4547503 4681846 4586610 4543325 4502281 4582095 4623747 4670669 4588543 4595362 4635340
5975D635340n7494O8577n667o6738m9289J09675P6802P3090O9810p1490q9619
$$ 4635340 4577846 4646423 4640756 4574018 4524729 4634404 4711206 4784296 4854106 4782616 4692997
5964D692997R581K6672n644l2474j00198k3061J84759M7025R507j617j9141m8295
$$ 4692997 4702578 4729250 4723606 4691132 4590934 4567873 4752632 4799657 4809164 4807547 4788406 4740111
5952D740111J00479L046M3207n4423r5822l1123J07398K8352L6106J6650N7968
$$ 4740111 4840590 4843636 4886843 4832420 4736598 4705475 4812873 4841225 4877331 4893981 4951949
5941D951949j06072M7793m152J2564n0773r228O0109L4706r3985k0232K6856j011
$$ 4951949 4845877 4893670 4889518 4902082 4851309 4842081 4902190 4936896 4842911 4822679 4849535 4848524
5929D848524J9005M1599M6843o5112J5678M8310j814m2948j12720M9584R1485
$$ 4848524 4867529 4909128 4955971 4890859 4906537 4954847 4953033 4910085 4797365 4846949 4938434
5918D938434L0809j6438m6507j30845P3667M0866q3052R0832J20585p341k6156
$$ 4938434 4969243 4952805 4906298 4775453 4849120 4889986 4806934 4897766 5018351 5011010 4984854
5907D984854n0887r3623P4634l2190P1508o3113N6811N7235j13910j2639P599
$$ 4984854 4933967 4840344 4914978 4882788 4954296 4891183 4947994 5005229 4891319 4878680 4886279
5896D886279J1957m0322L3184o3174K972m4518q345J63511Q3698p183n0791r7350
$$ 4886279 4898236 4857914 4891098 4827924 4830896 4786378 4778033 4941544 5025242 5018059 4967268 4869918
5884D869918q2650Q2766J63157p5397l2351k0700N581L2967j6115K1786j4951
$$ 4869918 4787268 4870034 5033191 4957794 4925443 4904743 4910324 4943291 4927176 4948962 4934011
5873D934011j16969Q0242O5758m5519j3285n6442J12178o369Q81L465L1716n4619
$$ 4934011 4817042 4897284 4963042 4917523 4904238 4847796 4959974 4953605 4954486 4957951 4989667 4935048
5861D935048L8531J406l5498o7370P3061l0746M5497n9910k5207J06067l2286
$$ 4935048 4973579 4974985 4939487 4872117 4945178 4914432 4959929 4900019 4874812 4980879 4948593
5850D948593l0182M5710N8112n5186m9864O843m3721M7038P5639J0862j1328p8529
$$ 4948593 4918411 4964121 5022233 4967047 4917183 4924026 4880305 4927343 5002982 5013844 5002516 4923987
5838D923987n1190P1366K5066l3239q0781J32118N4557m8713p832O7703r6210
$$ 4923987 4872797 4944163 4969229 4935990 4855209 4987327 5041884 4993171 4985339 5053042 4956832
5827D956832p4549J59276P6710n0426k5092l9920O6730j07127q9142M8223P318
$$ 4956832 4882283 5041559 5118269 5067843 5042751 5002831 5069561 4962434 4873292 4921515 4928833
5816D928833p9564J46018n7997m3260K2171j4079k0793M2026k6526k5486j0949
$$ 4928833 4849269 4995287 4937290 4894030 4916201 4902122 4881329 4923355 4896829 4871343 4860394
5805D860394k7889o8565N5258J3615k4238L7338M3883J697k282q7685r7769M4624
$$ 4860394 4832505 4763940 4819198 4832813 4808575 4845913 4889796 4891493 4889211 4801526 4703757 4748381
5793D748381k7884J50563n7005N5009p3095O6006j3608p4672L7228o084l1846
$$ 4748381 4720497 4871060 4814055 4869064 4795969 4861975 4848367 4773695 4810923 4804839 4772993
5782D772993l5818J7578M5219o4579K56407N5474p603l3735j04327l6461L2504
$$ 4772993 4737175 4754753 4799972 4735393 4991800 5047274 5039671 5005936 4901609 4865148 4897652
5771D897652j1717K267L3907q8045J38847m7355j80140J13349R08k469k0758O3102
$$ 4897652 4885935 4888202 4922109 4834064 4972911 4925556 4745416 4858765 4859673 4857204 4836446 4899548
5759D899548j04105j17681J24045j7968k6946R9990o3951k7426K3113k8251l9254
$$ 4899548 4795443 4677762 4801807 4783839 4756893 4856883 4792932 4765506 4788619 4760368 4721114
5748D721114O5229M3986l488N6097n286J2139j6316l4207J0761L3369o5605M5241
$$ 4721114 4786343 4830329 4826841 4882938 4877652 4889791 4873475 4839268 4850029 4883398 4817793 4863034
5736D863034J03656m0262k2125L1621R7127o7842J02596p1127j22103L3472J12349
$$ 4863034 4966690 4926428 4904303 4935924 5033051 4965209 5067805 4996678 4874575 4908047 5020396
5725E020396L303Q1577J25958j52164L2292L384J88901j22947j1297M2227J8358
$$ 5020396 5023699 5105276 5231234 5079070 5111362 5114746 5303647 5180700 5169403 5211630 5229988
5714E229988K0379O8948R8888j57963l7235N2778M7158J00086J44132K4633P3804
$$ 5229988 5250367 5319315 5418203 5260240 5223005 5275783 5322941 5423027 5567159 5591792 5665596
5703E665596J26942N05P6588Q6184L6872J8121m0641J84944J92431K31598P8789
$$ 5665596 5792538 5793043 5869631 5955815 5992687 6010808 5970167 6155111 6347542 6579140 6657929
5692F657929K60345L64719L79516L96721M85502O23606R20866J003333J431365
$$ 6657929 6918274 7282993 7662509 8059230 8544732 9168338 10089204 11092537 12523902
5683A2523902J188457J105597R20779l98924j724366k168484j605238j086028
$$ 12523902 13712359 14817956 15738735 15339811 13615445 11446961 9841723 8755695
5675H755695o63898n54105m31028l76489k49581k58813j94963k30247k4576j06436
$$ 8755695 8091797 7537692 7106664 6730175 6480594 6221781 6026818 5796571 5771995 5665559
5665E665559j90776J837o0028q0577n1510j86353j08165m5650J2606n5338L6014
$$ 5665559 5474783 5476620 5416592 5336015 5284505 5098152 4989987 4944337 4956943 4901605 4937619
5654D937619J23318j02662k09261j09953Q3487J07409j25137L0292K397q3234
$$ 4937619 5060937 4958275 4749014 4639061 4722548 4829957 4704820 4735112 4737509 4654275
5644D654275K0738n3321m5199N2332m457k8831j1j12612k9575J6109N5007o5487
$$ 4654275 4675013 4621692 4576493 4628825 4624368 4595537 4595526 4482914 4453339 4469448 4524455 4458968
5632D458968n9394J06550p797L5426j43853r4871l8688O4486M3816p661m3700
$$ 4458968 4399574 4506124 4498327 4533753 4389900 4295029 4256341 4320827 4364643 4356982 4313282
5621D313282M3014O9251k0483j42258Q9303J1802q0740o3653J45825o0574j06353
$$ 4313282 4356296 4425547 4405064 4262806 4352109 4363911 4283171 4219518 4365343 4304769 4198416
5610D198416J23469r6927j23187M2408J31710j6146Q5778n3114j26457J641K5282
$$ 4198416 4321885 4224958 4101771 4144179 4275889 4259743 4345521 4292407 4165950 4167591 4192873
5599D192873J19449L3260j78154Q9629N6359r5155n2181r114m1856o8546R4449
$$ 4192873 4312322 4345582 4167428 4257057 4313416 4218261 4166080 4156966 4115110 4046564 4141013
5588D141013j34253q458Q7850j11233k609J39062q084j12627L5233M5720M2780
$$ 4141013 4006760 3998302 4086152 3974919 3972310 4111372 4103288 3990661 4025894 4071614 4114394
5577D114394o6887M93Q7555M2905l1207o5864l4223K9413J74187p6892r4443M2634
$$ 4114394 4047507 4048000 4135555 4178460 4147253 4081389 4047166 4076579 4250766 4173874 4079431 4122065
5565D122065r978k7301N6668L7486J9956k8189q3587N0633O864j3101j0912R3476
$$ 4122065 4112087 4084786 4141454 4178940 4198896 4170707 4087120 4137753 4144617 4131516 4120604 4214080
5553D214080n8285k104L173L2282k8152J18036m2028q1436L262N6025r7565k4022
$$ 4214080 4155795 4153691 4156864 4189146 4160994 4279030 4237002 4155566 4158828 4214853 4117288 4093266
5541D093266P4358M6062J52851p5418p5402P7288p4144M4522J6564K3232K2011
$$ 4093266 4167624 4213686 4366537 4291119 4215717 4293005 4218861 4263383 4279947 4303179 4325190
5530D325190l7975l0274J01354k8691n2857J85078o8665l5591k5063Q1691P0797
$$ 4325190 4287215 4256941 4358295 4329604 4276747 4461825 4393160 4357569 4332506 4414197 4484994
5519D484994M9883o9816O4046p0J8328P3438L3463L1165j26527j53700O0850J37587
$$ 4484994 4534877 4465061 4529107 4529037 4547365 4620803 4654266 4685431 4558904 4405204 4466054 4603641
5507D603641M9271J4490L0053J22562o9121l438J19681P073o1531J08922j6769
$$ 4603641 4652912 4667402 4697455 4820017 4750896 4747458 4867139 4874212 4812681 4921603 4904834
5496D904834P801j21652J57968J24251R5404j06171n2136J09260M561J3989Q2904
$$ 4904834 4912635 4790983 4948951 5073202 5168606 5062435 5010299 5119559 5124120 5138109 5221013
5485E221013k4655q6023J07139J48396J3149o9864O3424P0310J31007k8843O8420
$$ 5221013 5196358 5110335 5217474 5365870 5379019 5309155 5372579 5442889 5573896 5545053 5613473
5474E613473k8055P010J18154K08350Q9268O3322J0047M0922P7744j7527R1140
$$ 5613473 5585418 5592428 5710582 5918932 6008200 6071522 6081569 6122491 6200235 6182708 6273848
5463F273848N9574K4044J56078N2162J44199R0286J58865Q5932K04093O4124J00594
$$ 6273848 6333422 6357466 6513544 6565706 6709905 6800191 6959056 7044988 7249081 7313205 7413799
5452G413799J90882J97440K35951J43649K25468J55205M21183J34054L04311L40486
$$ 7413799 7604681 7802121 8038072 8181721 8407189 8562394 8983577 9117631 9421942 9762428
5442I762428J44372L70682M93103M74696M50141N19962P57245P57032R50380J063842
$$ 9762428 9906800 10277482 10770585 11245281 11695422 12215384 12972629 13729661 14680041 15743883
5432A5743883J339790J550055J805901J990906J732733J717585J120718K32116
$$ 15743883 17083673 18633728 20439629 22430535 24163268 25880853 27001571 27233687
5424B7233687n36638j068424j207857p04421m61807k9557L14635N08904R44481
$$ 27233687 26697049 25628625 24420768 23716347 23254540 23224983 23539618 24048522 24993003
5415B4993003R75014J465967J831814K280787K784078K843239K743721J909072
$$ 24993003 25968017 27433984 29265798 31546585 34330663 37173902 39917623 41826695
5407D1826695L92397j279506k086632k149763j974756j781529k099810k219494
$$ 41826695 42219092 40939586 38852954 36703191 34728435 32946906 30847096 28627602
5399B8627602j688517r53829o28475j39578L68622N56824R08942R81515J119866
$$ 28627602 26939085 25985256 25356781 25217203 25585825 26142649 27051591 28033106 29152972
5390B9152972J472928J466957J090740p5777j666263k779456l383439l118991
$$ 29152972 30625900 32092857 33183597 33107820 31441557 28662101 25278662 22159671
5382B2159671k472924k008985j661369j212920j117630p99500q49103o47086n38125
$$ 22159671 19686747 17677762 16016393 14803473 13685843 12886343 12037240 11390154 10852029
5373A0852029n24756n11363l58611m04440k65972l53298l06155k45048j38033
$$ 10852029 10327273 9815910 9457299 9052859 8786887 8433589 8127434 7882386 7744353
5364G744353j33019k04740k20230j06507o1581k15112j77524j13498M371K2378
$$ 7744353 7611334 7406594 7186364 7079857 7018276 6803164 6625640 6512142 6516513 6538891
5354F538891q3364j21298j18725j34816K9035j45566k5647j58433m0894j37888
$$ 6538891 6455527 6334229 6215504 6080688 6109723 5964157 5938510 5780077 5739183 5601295
5344E601295j5156l5454n4210q4411n4675p2286j03516N009j632Q410m8405j23072
$$ 5601295 5586139 5550685 5496475 5412064 5357389 5285103 5181587 5186596 5184964 5193374 5144969 5021897
5332E021897J8216j20619n1142L8782J6984p8924N271O1233o2004L4608j8443
$$ 5021897 5040113 4919494 4868352 4907134 4924118 4845194 4850465 4911698 4849694 4884302 4865859
5321D865859J7068l3166P4612o3674j9016K2491k3217l3461P6841q9887m0724
$$ 4865859 4882927 4849761 4924373 4860699 4841683 4864174 4840957 4807496 4884337 4794450 4753726
5310D753726j01449p743L7822K5456J4202l6852Q6843n6540q385R2275K1905k3819
$$ 4753726 4652277 4644534 4682356 4707812 4722014 4685162 4772005 4715465 4707080 4799355 4821260 4797441
5298D797441L5995m0809Q7422J25780P6790r7682Q0817L0833j158K9308k3974
$$ 4797441 4833436 4792627 4880049 5005829 5082619 4984937 5065754 5096587 5095429 5124737 5100763
5287E100763J1090N0127O2165P9916L3213O1930j9594R9540m2342J46897k7316
$$ 5100763 5111853 5161980 5224145 5304061 5337274 5399204 5379610 5479150 5436808 5583705 5556389
5276E556389K21268J34720p4875K2780L8385P6410J40148N4178P9052J32747J47039
$$ 5556389 5777657 5912377 5837502 5860282 5898667 5975077 6115225 6169403 6248455 6381202 6528241
5265F528241O9212N9054P6350P9045J54321J36280K20378J46184J35877J55600
$$ 6528241 6597453 6656507 6732857 6811902 6966223 7102503 7322881 7469065 7604942 7760542
5255G760542J18535J69720K24238K43279L22676K83849K49551L25916J41625J66477
$$ 7760542 7879077 8048797 8273035 8516314 8838990 9122839 9372390 9698306 9839931 10006408
5245A0006408M87053M02448M61118M98053M88971M31119O81373P93989Q04791
$$ 10006408 10493461 10895909 11357027 11855080 12344051 12775170 13456543 14250532 15055323
5236A5055323Q33269J016786J156522J274843J669101J842232K006720K560828
$$ 15055323 15888592 16905378 18061900 19336743 21005844 22848076 24854796 27415624
5228B7415624K887915L252836L596845L592324L042992K339879J108286q58156
$$ 27415624 30303539 33556375 37153220 40745544 43788536 46128415 47236701 46378545
5220D6378545k428831l445798l466235k599727j911884j253757r12654p03503
$$ 46378545 43949714 40503916 37037681 34437954 32526070 31272313 30359659 29656156
5212B9656156r3805N04786P32749J491055J789792J938746J976959J556162J135251
$$ 29656156 29562351 30067137 30799886 32290941 34080733 36019479 37996438 39552600 40687851
5203D0687851R32313L83028n13198j736013k998129l611115l310777k597366j697489
$$ 40687851 41620164 42003192 41489994 39753981 36755852 33144737 29833960 27236594 25539105
5194B5539105j162971o78341n86669l04534k92064l4502M20554O20177Q25568
$$ 25539105 24376134 23697793 23111124 22806590 22514526 22480024 22900578 23520755 24346323
5185B4346323O89888M34486j84807j202304j926835k210780k205458j769846j481179
$$ 24346323 25036211 25470697 25285890 24083586 22156751 19945971 17740513 15970667 14489488
5176A4489488j159673q70790q11519p29967n47643n28093m76745l73411k85346
$$ 14489488 13329815 12459025 11647506 10917539 10369896 9841803 9365058 8991647 8706301
5167H706301k31589k83244l15692j60146k40542k44421p0305j94876k31447q9074
$$ 8706301 8474712 8191468 7875776 7715630 7475088 7230667 7160362 6965486 6734039 6644965
5157F644965j28375K8863k03158j23450q626q9904m2345j45363K0848l9591j11612
$$ 6644965 6516590 6545453 6342295 6218845 6210219 6120315 6077970 5932607 5953455 5913864 5802252
5146E802252J25493l3897p3078l3007Q5143R3891M5902J79423J23364K34615J81652
$$ 5802252 5927745 5893848 5820770 5787763 5872906 5966797 6012699 6192122 6315486 6550101 6731753
5135F731753J02448J46496q0350o9250n6446j80222j08670j44240k97675r0951
$$ 6731753 6834201 6980697 6900347 6831097 6774651 6594429 6485759 6341519 6043844 5952893
5125E952893L5807q088o1510R5028K67366K07518J60215K09700M04677M09512
$$ 5952893 5988700 5980612 5919102 6014130 6281496 6489014 6649229 6858929 7263606 7673118
5115G673118L57966K57179J30086K12595j21234l95572m16245l97138k53083k50552
$$ 7673118 8031084 8288263 8418349 8630944 8509710 8114138 7697893 7300755 7047672 6797120
5105F797120k67537k40024j68779r8983k50975j82762j16821J25956M5602L8863
$$ 6797120 6529583 6289559 6120780 6021797 5770822 5588060 5471239 5597195 5642797 5681660
5095E681660R9868J62097K15725J69895L96041L22486J6819j84176m52417m29175
$$ 5681660 5781528 5943625 6159350 6329245 6725286 7047772 7064591 6880415 6427998 5998823
5085E998823l43210m95469l91369j82940j45463j32263j28405k90710j19552j0784
$$ 5998823 5655613 5160144 4768775 4585835 4440372 4308109 4179704 3888994 3769442 3758658
5075C758658k0727q8705j152l091j47023K2635j7417Q064K0996R0888R2307k1578
$$ 3758658 3737931 3649226 3648074 3644983 3497960 3520595 3503178 3511242 3532238 3623126 3715433 3693855
5063C693855r6188p3299J36989o4029j04463l5110r1657j8015M7448O6765j4888
$$ 3693855 3597667 3524368 3661357 3597328 3492865 3457755 3366098 3348083 3395531 3462296 3447408
5052C447408r8502q9633n20J12822P3722q3055N7165m7362J1960L9756p1134P8132
$$ 3447408 3348906 3259273 3258753 3371575 3445297 3362242 3419407 3372045 3384005 3423761 3352627 3430759
5040C430759J07661J91448l6856J72039K41320L3577O9305M0826k7167j63686
$$ 3430759 3538420 3729868 3693012 3865051 4106371 4139948 4209253 4250079 4222912 4059226
5030D059226n4607o0861n6722q0712J7928M9649k0661o2157J36364L2518R9288
$$ 4059226 4004619 3943758 3887036 3806324 3824252 3873901 3853240 3791083 3927447 3959965 4059253
5019D059253M8865Q2396N2484N4891J05091O9398J85332L8369k680Q0490J58875
$$ 4059253 4108118 4190514 4242998 4297889 4402980 4472378 4657710 4696079 4693399 4773889 4932764
5008D932764J07947K28578R9284N8046N3604l6364j42972j19098l2946N2184p1664
$$ 4932764 5040711 5269289 5368573 5426619 5480223 5443859 5300887 5181789 5148843 5201027 5129363
4997E129363L2819N2807K8760R7876M6484J07855J32483J3714P7083j63054N0882
$$ 5129363 5162182 5214989 5243749 5341625 5388109 5495964 5628447 5642161 5719244 5556190 5607072
4986E607072L8014r048R6167m1070J08458J57409J70740K25172L54943L13947
$$ 5607072 5645086 5636038 5732205 5691135 5799593 5957002 6127742 6352914 6707857 7021804
4976G021804L57215M01972L98372L48757J72178j4787j43350k36474l66585l20226
$$ 7021804 7379019 7780991 8179363 8528120 8700298 8685511 8542161 8305687 7939102 7618876
4966G618876k86182j27856j72481K2029Q0806R8766R4304J26855J70097K74458
$$ 7618876 7332694 7204838 7032357 7054386 7135192 7233958 7328262 7455117 7625214 7899672
4956G899672K68287J87270L39849L50712J97854J29261J98620R9918K38674P5480
$$ 7899672 8167959 8355229 8695078 9045790 9243644 9372905 9571525 9671443 9910117 9985597
4946I985597m87216m94983l90322l72655j63942r1211j37073n3161J1238J5731
$$ 9985597 9498381 9003398 8613076 8240421 8076479 7985268 7848195 7795034 7806272 7822003
4936G822003J0257l1626R086k15479J3575l063j0512N0707J11733r9235j40962
$$ 7822003 7832260 7800634 7809720 7594241 7607816 7604753 7594241 7644948 7756681 7657446 7516484
4925G516484j31631l61971k26601k63748k16233j48933k05308r4349j37855j08242
$$ 7516484 7384853 7022882 6796281 6532533 6316300 6167367 5962059 5867710 5729855 5621613
4915E621613j50309k38090r2305k12359j40626k17157k72795q4939j45932p5926
$$ 5621613 5471304 5233214 5140909 4928550 4787924 4570767 4297972 4213033 4067101 3991175
4905C991175j00146k47677j47269r4039q350j36922m4133N4690n8851j02832j56492
$$ 3991175 3891029 3643352 3496083 3402044 3393694 3256772 3212639 3267329 3208478 3105646 2949154
4894B949154M4779o5661j60985M2295o1310l0385n2028o1580p5251k2344p2122
$$ 2949154 2993933 2928272 2767287 2809582 2748272 2717887 2665859 2604279 2529028 2506684 2434562
4883B434562j6346Q3119m9089o7581j11290n0063J42903P0137j27094k340k9962
$$ 2434562 2418216 2501335 2452246 2384665 2273375 2223312 2366215 2436352 2309258 2306918 2276956
4872B276956K2971j0858j16117J40785K5807p0175L039r327K0004L7269j794L1470
$$ 2276956 2299927 2289069 2172952 2313737 2339544 2269369 2272408 2263081 2283085 2320354 2318560 2350030
4860B350030L5014q6888r793J8611K8890o644n3032J10120L1959P824N5580j0179
$$ 2350030 2385044 2298156 2288363 2306974 2335864 2329220 2276188 2386308 2418267 2426091 2481671 2471492
4848B471492J60125r0570q0775M0202R76K4355J40794R5162J20572L3347J07668
$$ 2471492 2631617 2541047 2460272 2500474 2501450 2525805 2666599 2761761 2882333 2915680 3023348
4837C023348J80960J69884J12222K54417K04173J00884J54346J35778j7672j30661
$$ 3023348 3204308 3374192 3486414 3740831 3945004 4045888 4200234 4336012 4318340 4187679
4827D187679r9907k04992k17682l01203n6111q2819l27011K8768J2752k19846
$$ 4187679 4087772 3882780 3665098 3363895 3307784 3224965 2897954 2926722 2939474 2719628
4817B719628l0298N054K1288j26646q0850J5428j13604m6315m9906m7047k1292
$$ 2719628 2689330 2694384 2715672 2589026 2508176 2523604 2410000 2363685 2313779 2266732 2245440
4806B245440M7209j28768N5622J9935l7946q7141k0969n809P17J35769K222J1393
$$ 2245440 2292649 2163881 2219503 2239438 2201492 2114351 2093382 2087573 2088290 2224059 2226281 2237674
4794B237674k4832O1959j2217n1493Q0599J35865K8332n5272Q586N150k4043N0371
$$ 2237674 2212842 2274801 2262584 2211091 2291690 2427555 2455887 2400615 2409201 2414351 2390308 2440679
4782B440679N7519L8032O8760K892P688P3356Q8549J61467J94578J29397J53226
$$ 2440679 2498198 2536230 2604990 2607882 2615570 2688926 2777475 2938942 3133520 3262917 3416143
4771C416143Q6937J26817J12943J26524j1416n9983J8056J80487o3279L525q7084
$$ 3416143 3503080 3629897 3742840 3869364 3857948 3797965 3816021 3996508 3933229 3936754 3849670
4760C849670p2088L4338J2669K7492n713J46523J07213K10412O8099K11938K1857
$$ 3849670 3777582 3811920 3824589 3852081 3846368 3992891 4100104 4310516 4378615 4590553 4612410
4749D612410P3199O1725P1927j2487q8334k16096n5661j34260p0200k83423j94248
$$ 4612410 4685609 4747334 4819261 4806774 4718440 4502344 4446683 4312423 4242223 3958800 3764552
4738C764552J9303L4652j60070j03049l0227J932Q7340K3970j33775J6580n3331
$$ 3764552 3783855 3818507 3658437 3555388 3525161 3527093 3614433 3638403 3504628 3521208 3467877
4727C467877L5273k0631K2242o8170p2417j58156j21639j2828j84893M8536j2842
$$ 3467877 3503150 3482519 3504761 3436591 3364174 3206018 3084379 3071551 2886658 2935194 2922352
4716B922352j31358m8401l4118m3834J43258O320l1560K292N0991J80549J39785
$$ 2922352 2790994 2742593 2708475 2664641 2807899 2814219 2782659 2784951 2835942 3016491 3156276
4705C156276K51562K88947K69880J08630q0658k11504l40893l32742j78122j85880
$$ 3156276 3407838 3696785 3966665 4075295 3994637 3783133 3442240 3109498 2931376 2745496
4695B745496m3693n3913k65033j7067q5508j6671p1693o8644L477J32576m1399
$$ 2745496 2701803 2647890 2382857 2365790 2280282 2263611 2191918 2123274 2126751 2259327 2217928
4684B217928p6613n8152M3475L285p2575K3730R4224r2857J3855K8870K120k0774
$$ 2217928 2141315 2083163 2126638 2129923 2057348 2081078 2175302 2082445 2096300 2125170 2127290 2106516
4672B106516M2366P6422n8698k00094q288J5988l8486J24153Q1387l0036l8594
$$ 2106516 2148882 2225304 2166606 1966512 1958224 1974212 1935726 2059879 2141266 2111230 2072636
4661B072636N4199L9924k4586P8373m5645m8785J52706n9892R224r549O2820K22103
$$ 2072636 2126835 2166759 2142173 2220546 2174901 2126116 2278822 2218930 2228154 2218605 2281425 2503528
4649B503528j0477o1454J21945K06520M21624K68893K60928J53560r7971p3552
$$ 2503528 2493051 2431597 2553542 2760062 3181686 3450579 3711507 3865067 3767096 3693544
4639C693544l41848l87167k53289o3113j89899l9450j65445j2234L7265j20424
$$ 3693544 3351696 2964529 2711240 2648127 2458228 2418778 2253333 2241099 2278364 2157940
4629B157940p9674j7090J4290N1575p9356q7800l5258m741N7413M6787j38681
$$ 2157940 2078266 2061176 2075466 2127041 2047685 1959885 1924627 1919886 1977299 2024086 1885405
4618A885405J50234L5616J1327p2971Q2708O245J13243L2613j12793M7090R7201
$$ 1885405 2035639 2071255 2082582 2009611 2092319 2098564 2211807 2244420 2131627 2178717 2275918
4607B275918q1623j64482J22101J8090O0354j27005K126J71160J43706P611Q9157
$$ 2275918 2194295 2029813 2151914 2170004 2230358 2103353 2105479 2276639 2420345 2427956 2517113
4596B517113j20868J25660R1517j17428j21819J4675J1741m1639N634K3351M308
$$ 2517113 2396245 2521905 2613422 2495994 2374175 2388850 2400591 2358952 2364586 2387937 2392245
4585B392245j3338k7415j8845J00825J30540p470O50n4054j6988n8197J8589J28175
$$ 2392245 2378907 2351492 2332647 2433472 2564012 2556542 2557192 2503138 2486150 2427953 2446542 2574717
4573B574717L1458k2904J40645Q367J772J15811Q06j0128k3458j16885N0387R2415
$$ 2574717 2606175 2583271 2723916 2732283 2734055 2849866 2850672 2840544 2817086 2700201 2750588 2843003
4561B843003N3420J43863J70592N3425P7331P5987k4335J04858j8366P4876J58195
$$ 2843003 2896423 3040286 3210878 3264303 3341634 3417621 3393286 3498144 3479778 3554654 3712849
4550C712849J1590N5609J80012J33594l0851J17075J53553K4851j57706r7183
$$ 3712849 3724439 3780048 3960060 4093654 4062803 4179878 4333431 4358282 4200576 4103393
4540D103393l0825O6136K1346J45036Q137L9198J10554O4308N0877k9634J07819
$$ 4103393 4072568 4138704 4160050 4305086 4313223 4352421 4462975 4527283 4578160 4548526 4656345
4529D656345K6927J24501J51179J8267K62956J65379K63191Q6905J93721J65817
$$ 4656345 4683272 4807773 4958952 4977219 5240175 5405554 5668745 5755650 5949371 6115188
4519F115188P0280K12239J54517k5573N2722p3189r2620J77585K20451R666J44586
$$ 6115188 6185468 6397707 6552224 6526651 6579373 6506184 6413564 6591149 6811600 6821266 6965852
4508F965852K28939q5211J41633J15246O6575K22537K61213K71510K61575J62264
$$ 6965852 7194791 7109580 7251213 7366459 7433034 7655571 7916784 8188294 8449869 8612133
4498H612133K99626K96998K83857L62955L31636L37384L88852J74191K56965K76950
$$ 8612133 8911759 9208757 9492614 9855569 10187205 10524589 10913441 11087632 11344597 11621547
4488A1621547L65286L01785J58990K51997M98482L40883L68325M57241J60231
$$ 11621547 11986833 12288618 12447608 12699605 13198087 13538970 13907295 14364536 14524767
4479A4524767J98393J28753J80471L95147M33631N40654P64998O43412N82294
$$ 14524767 14723160 14851913 15032384 15427531 15861162 16401816 17166814 17810226 18392520
4470A8392520O03373N67153M86514O36390Q18085P69570Q13534R76792R03890
$$ 18392520 18995893 19563046 20049560 20685950 21504035 22273605 23087139 24063931 24967821
4461B4967821R61300J056144Q59628J053433Q52586R48439R56107J092623R96746
$$ 24967821 25929121 26985265 27844893 28898326 29750912 30699351 31655458 32748081 33744827
4452C3744827J137611J226631J539769J596935J936900J975732K315525K233200
$$ 33744827 34882438 36109069 37648838 39245773 41182673 43158405 45473930 47707130
4444D7707130K390523K441514K837075L038970L585030M019327M586205N373666
$$ 47707130 50097653 52539167 55376242 58415212 62000242 66019569 70605774 75979440
4436G5979440O459952P433103Q827177J0018441J2027797J4391944J7815167K1817968
$$ 75979440 82439392 89872495 98699672 108718113 120745910 135137854 152953021 174770989
4428A74770989K7864934L3991845M2166624M8439365N1140991M2025431J3214687
$$ 174770989 202635923 236627768 278794392 327233757 378374748 420400179 433614866
4421D33614866k1182913n3011792o5249781n9318255m3532242k9916476k1264687
$$ 433614866 412431953 359420161 294170380 234852125 191319883 161403407 140138720
4414A40138720j5876255j2575687j0285874q544232p266071n553011m638140l767497
$$ 140138720 124262465 111686778 101400904 92856672 85590601 80037590 75399450 71631953
4406G1631953l461719l143512k912925k515627k152443j733035j394835j057504
$$ 71631953 68170234 65026722 62113797 59598170 57445727 55712692 54317857 53260353
4398E3260353q21085l64104k13413j24539k34355k54268j440l2922J94072J13727
$$ 53260353 52439268 52075164 51861751 51737212 51502857 51248589 51247149 51214227 51408299 51522026
4388E1522026L97133M89056J053416J402780J517848J400499J840787K076248
$$ 51522026 51919159 52408215 53461631 54864411 56382259 57782758 59623545 61699793
4380F1699793K218328K361043K876784L407297M171652M634079N712089O798369
$$ 61699793 63918121 66279164 69155948 72563245 76734897 81368976 87081065 93879434
4372I3879434Q316124R581470J1731137J4873034J8204812K2427954K8690152
$$ 93879434 102195558 111777028 123508165 138381199 156586011 179013965 207704117
4365B07704117L4608813M2211667M6575790M4929272K6456998q87908k3591789
$$ 207704117 242312930 284524597 331100387 376029659 402486657 401598749 378006960
4358C78006960m5205373n7007061n5002133m1442535k8671363k0906109j5740220
$$ 378006960 332801587 275794526 220792393 179349858 150678495 129772386 114032166
4351A14032166j2705363j0589452q451349p126292n681864m834694m252471l726882
$$ 114032166 101326803 90737351 82286002 75159710 69477846 64643152 60390681 56663799
4343E6663799l546803l136479k991259k517495k306027k003414j686272j518063
$$ 56663799 53116996 49980517 46989258 44471763 42165736 40162322 38476050 36957987
4335C6957987j021052r01807p10196p34043p95252q92843o72129p35593r31605
$$ 36957987 35936935 35035128 34324932 33590889 32795637 31902794 31230665 30495072 29563467
4326B9563467q19066r91048q82795q31193q31500o29720n16607n64098m79924
$$ 29563467 28744401 27753353 26870558 26039365 25207865 24578145 24061538 23497440 23017516
4317B3017516n34346k77231l36437m30600k47630j81827k31117J471l8342N6229
$$ 23017516 22483170 22205939 21869502 21438902 21191272 21009445 20778328 20779799 20741457 20797686
4307B0797686K94683J98835K51775L33917L87639O03798Q52408P58769Q54813
$$ 20797686 21092369 21291204 21542979 21876896 22264535 22868333 23720741 24479510 25334323
4298B5334323P96920O25213K13826m62497r67400j420354j536495j412104j169347
$$ 25334323 26131243 26756456 26970282 26507785 25540385 24120031 22583536 21171432 20002085
4289B0002085j034020p53108o46575n00559n73542k86235k58409k62590j06676
$$ 20002085 18968065 18214957 17568382 17067823 16494281 16208046 15949637 15687047 15580371
4280A5580371M2262K6826P1394K01898K57933M15294N24931O15233P84663Q78274
$$ 15580371 15622633 15649459 15720853 15922751 16180684 16595978 17120909 17736142 18520805 19399079
4270A9399079Q91142J015012O45605L79412j83549p48781j107994j430575j507896
$$ 19399079 20290221 21305233 21950838 22330250 22146701 21397920 20289926 18859351 17351455
4261A7351455j368612j139976r54947r07205n73251n24669m48379m65036n49364
$$ 17351455 15982843 14842867 13887920 12980715 12407464 11882795 11434416 10969380 10420016
4252A0420016l08825j22599k97749j78278j19759j52457n8619J25322J77739O4714
$$ 10420016 10111191 9988592 9690843 9512565 9392806 9240349 9181730 9307052 9484791 9549505
4242I549505J43100O8617N1560J21215O878J5759j49521k84366m12348n44521
$$ 9549505 9692605 9761222 9812782 9933997 9940875 9956634 9807113 9522747 9110399 8565878
4232H565878n38770m84890m33527m14655l78401k61491j49315k06768k16120j66418
$$ 8565878 8027108 7542218 7108691 6694036 6315635 6054144 5904829 5698061 5481941 5315523
4222E315523j02704k00856j13029j13091k17420j22403k17202j26598q8804k5748
$$ 5315523 5212819 5011963 4898934 4785843 4568423 4446020 4228818 4102220 4013416 3987668
4212C987668j6525l1003M213o7393k24743O9198q7591k04976m4234o7808n8177
$$ 3987668 3971143 3940140 3944353 3876960 3652217 3721415 3633824 3428848 3384614 3316806 3258629
4201C258629j78733j36288M6700m8831j25158J43969m3876j05797j63198M1484
$$ 3258629 3079896 2943608 2990308 2941477 2816319 2960288 2916412 2810615 2647417 2688901
4191B688901L499p1889j72352k5598R5628j40684R447J9944N5451Q3598j09519
$$ 2688901 2692400 2620511 2448159 2422561 2518189 2377505 2386952 2406896 2462347 2545945 2436426
4180B436426K4949l1775L280p1990O3926N8536O5769m2625k2080P8145j97946
$$ 2436426 2461375 2429600 2432880 2360890 2424816 2483352 2549121 2506496 2484416 2562561 2364615
4169B364615n5817o170M895m885r0983m1162m7957J384Q9289R9326N6633j13699
$$ 2364615 2308798 2302628 2307523 2302638 2211655 2170493 2122536 2123920 2213209 2312535 2369168 2255469
4157B255469j08835Q2753R5320m163m6559k2261M2086R6171P9827J04691J41924
$$ 2255469 2146634 2229387 2324707 2320544 2273985 2251724 2293810 2389981 2469808 2574499 2716423
4146B716423J645R9672M04840K76946K13086M28512K72582J11340j74203l03900
$$ 2716423 2718068 2817740 3222580 3499526 3712612 4141124 4413706 4525046 4350843 4046943
4136D046943m46896l63398m19852k35943j94324j65436j29082j81342q6077n7859
$$ 4046943 3600047 3236649 2816797 2580854 2386530 2221094 2092012 1910670 1824593 1766734
4126A766734p950k9841K776N9412l0894j63044m9445N0183K2239q281m8312L5955
$$ 1766734 1758784 1728943 1731719 1791131 1760237 1597193 1547748 1597931 1620170 1611889 1563577 1599532
4114A599532Q6140j7884p5906q0702K4401k6888j10752q3797O601J47953P1285
$$ 1599532 1685672 1667788 1591882 1511180 1535581 1508693 1397941 1314144 1320745 1468698 1539983
4103A539983n8528J00648P2741r0663P7505L0829J194J4286M8080J2374p9807
$$ 1539983 1481455 1582103 1654844 1564181 1641686 1672515 1673709 1687995 1736075 1748449 1668642
4092A668642p6735J37213J68746r3800L4975r31M0030L8094K56981l5077J24316
$$ 1668642 1591907 1729120 1897866 1804066 1839041 1838110 1878140 1916234 2173215 2138138 2262454
4081B262454J40964K74949K44939L27578J65472O1525k0310k8077j82607l96543
$$ 2262454 2403418 2678367 2923306 3250884 3416356 3477881 3457571 3429494 3246887 2850344
4071B850344l29948l21631P1862p0253l0694l7720K3428m8500l8999N0713O235
$$ 2850344 2520396 2198765 2270627 2200374 2169680 2131960 2155388 2106888 2067889 2118602 2124837
4060B124837m1136J54997J14241n3072J04893M6092Q485j14466j59803j35805
$$ 2124837 2083701 2238698 2352939 2299867 2404760 2450852 2459337 2344871 2185068 2049263
4050B049263L3809k2495k6996N2874p2462j70610o8978M4905J0840l7734m3776
$$ 2049263 2083072 2060577 2033581 2086455 2013993 1843383 1774405 1819310 1830150 1792416 1748640
4039A748640J15156J40332J8927p8922m396J19142O3218O3609P1762N9268J01196
$$ 1748640 1863796 2004128 2023055 1944133 1939737 2058879 2122097 2185706 2257468 2316736 2417932
4028B417932J32828J42488J0477j4410m3774K08005J12781K4560M7345M3143J03559
$$ 2417932 2550760 2693248 2703725 2689315 2645541 2853546 2966327 2990887 3038232 3081375 3184934
4017C184934J51887m0904N2802O5319M0518L9105O5773k08755k3686J3681J16030
$$ 3184934 3336821 3295917 3348719 3414038 3454556 3493661 3559434 3350679 3326993 3340674 3456704
4006C456704J32055P9791L9258o5283J06003J7227P5721K8097n9429o1644J03910
$$ 3456704 3588759 3668550 3707808 3642525 3748528 3765755 3841476 3869573 3810144 3748500 3852410
3995C852410r4088j51329o9846j22926M0679J2648m6163J2741J70189j35782m1494
$$ 3852410 3758322 3606993 3537147 3414221 3454900 3467548 3421385 3434126 3604315 3468533 3427039
3984C427039J23699M734M7766L3400p2761Q3985J22839m5181N9584P8197j03047
$$ 3427039 3550738 3555472 3603238 3636638 3563877 3647862 3770701 3725520 3785104 3863301 3760254
3973C760254K5862J39724J17742K133Q0159K6156N60j5047k22815l8665p9207
$$ 3760254 3786116 3925840 4043582 4045715 4125874 4152030 4152590 4137543 3914728 3876063 3796856
3962C796856L4096J47531o1752l8908L2959J27350r9194N8398J64844L0103n4369
$$ 3796856 3830952 3978483 3916731 3877823 3910782 4038132 3938938 3997336 4162180 4192283 4137914
3951D137914J29896K58929J3365j2645J50240J00517Q2617J60321q2J81630J21870
$$ 4137914 4267810 4526739 4540104 4527459 4677699 4778216 4860833 5021154 5021072 5202702 5324572
3940E324572J69036P3084M7247J1436R5243J60555n347J46831K11380L09550K77984
$$ 5324572 5493608 5566692 5613939 5625375 5720618 5881173 5875826 6022657 6234037 6543587 6821571
3929F821571J48952K27898J84763K49682K66345R2217J10207K16455K19158M24787
$$ 6821571 6970523 7198421 7383184 7632866 7899211 7991428 8101635 8318090 8537248 8962035
3919H962035L29966K15673K52621J92765K11299M45051K49343M81191L95886L14771
$$ 8962035 9292001 9507674 9760295 9953060 10164359 10609410 10858753 11339944 11735830 12050601
3909A2050601M42115L95755N02290P72928O20728P97380Q00924Q86249P22079
$$ 12050601 12492716 12888471 13390761 14163689 14784417 15581797 16382721 17268970 17991049
3900A7991049J050289J185731J212047J511958J769433K008830K276004K449022
$$ 17991049 19041338 20227069 21439116 22951074 24720507 26729337 29005341 31454363
3892C1454363K850968L254134L884427M660271N919568P262589R076162J0895116
$$ 31454363 34305331 37559465 41443892 46104163 52023731 59286320 68362482 79257598
3884G9257598J3168437J5358837J5781209J1247262Q05994j1418003j9316355
$$ 79257598 92426035 107784872 123566081 134813343 135619337 124201334 104884979
3877A04884979j9750981j6148674j1447775q215541n925613m543761l901549l124873
$$ 104884979 85133998 68985324 57537549 49322008 43396395 38852634 34951085 31826212
3869C1826212k472924k049780j502457j489556j240216j323745j105246j001395
$$ 31826212 29353288 27303508 25801051 24311495 23071279 21747534 20642288 19640893
3861A9640893r03440o57596o78555n96251n01320l66587j85581j82140j30685
$$ 19640893 18737453 18079857 17401302 16805051 16303731 15937144 15751563 15569423 15438738
3852A5438738k78325k59448j99218p7167j31258p4593n3024N2272r4576L3540
$$ 15438738 15160413 14900965 14701747 14624580 14493322 14418729 14365705 14417977 14323401 14356941
3842A4356941R8878J11555K97464K03013K02007L00339J58509K89150L16759K32991
$$ 14356941 14455819 14567374 14864838 15067851 15269858 15570197 15728706 16017856 16334615 16567606
3832A6567606L46469L47729L22990M59461M28127M35972M70502O12404O17457
$$ 16567606 16914075 17261804 17584794 18044255 18472382 18908354 19378856 19991260 20608717
3823B0608717O13570O43893P43436R81111J052649J277263J334138J378868J453212
$$ 20608717 21222287 21866180 22609616 23590727 24643376 25920639 27254777 28633645 30086857
3814C0086857J556787J849473K155900K349323K731803L230085L532678L942074
$$ 30086857 31643644 33493117 35649017 37998340 40730143 43960228 47492906 51434980
3806E1434980M350983N267674O184456P283649Q420706J0284392J1790143J3470595
$$ 51434980 55785963 61053637 67238093 74521742 82942448 93226840 105016983 118487578
3798A18487578J5136713J6079800J5161185J1018924J425950j1835592k1057541
$$ 118487578 133624291 149704091 164865276 175884200 177310150 165474558 144417017
3791A44417017k2986461j9388888j4845051j1305686q734633o879954n652739
$$ 144417017 121430556 102041668 87196617 75890931 67156298 60276344 54623605
3784E4623605m598390m008271l192826k583582j897223j673708j673418j246641
$$ 54623605 50025215 46016944 42824118 40240536 38343313 36669605 34996187 33749546
3776C3749546q80472p49637m47888o7523J67714M35423P20163R96091P55494K68662
$$ 33749546 32869074 32119437 31671549 31604026 31771740 32207163 32927326 33923417 34678911 34947573
3766C4947573q13236j987943k764292k962520k453295k249038j863377j429523
$$ 34947573 34134337 32146394 29382102 26419582 23966287 21717249 19853872 18424349
3758A8424349j230969j085118q24362p75779o39487n66176m04591n09353n68938
$$ 18424349 17193380 16108262 15283900 14508121 13868634 13302458 12897867 12388514 11819576
3749A1819576m55137k87986m70662m48598k49056k58955k38066j93872j98577
$$ 11819576 11364439 11076453 10605791 10157193 9908137 9649182 9411116 9217244 9018667
3740I018667j04330k46878j75885k45416k31444j46066k08167l1567l2774l2065
$$ 9018667 8914337 8667459 8491574 8246158 8014714 7868648 7660481 7628914 7596140 7564075
3730G564075j51614o9309j61465j2428m2929K582l4701J13516J89194L1219Q5717
$$ 7564075 7412461 7343152 7181687 7169259 7126330 7128912 7094211 7207727 7396921 7428140 7513857
3719G513857K65911K75058L42560N03692M44814N46445N29208M14648Q5210k07601
$$ 7513857 7779768 8054826 8397386 8901078 9345892 9892337 10421545 10836193 10921403 10713802
3709A0713802m81786q69612r35784p47782n38928m88964n43213m89463k75349
$$ 10713802 10232016 9362404 8426620 7678838 7139910 6650946 6107733 5618270 5342921
3700E342921l63106l44826j72474j38236p2853k89001j29359j11299O8417j99470
$$ 5342921 4979815 4634989 4462515 4324279 4251426 3962425 3833066 3721767 3790184 3590714
3690C590714Q2965l4433j30039j06976N8693n5464j55049J1325l9668j91630o9207
$$ 3590714 3673679 3639246 3509207 3402231 3460924 3405460 3250411 3261736 3222068 3030438 2961231
3679B961231J23779j02312p3967p4123j73454k3613M7470j20360K4527M3997N0305
$$ 2961231 3085010 2982698 2908731 2834608 2661154 2637541 2685011 2564651 2589178 2633175 2683480
3668B683480J8259k7429j68074r1801j4692N2646j34289j6753n4411n735O1198
$$ 2683480 2701739 2674310 2506236 2414435 2399743 2452389 2318100 2301347 2246936 2241201 2302399
3657B302399k5734j01774o3501j15342N827k6429M4203M1307L6532r1225n7613
$$ 2302399 2276665 2174891 2111390 1996048 2001875 1975446 2019649 2060956 2097488 2006263 1948650
3646A948650k6941k1803p6245m1803l1500k1003k5744O4615J9924l1454j1611
$$ 1948650 1921709 1899906 1823661 1781858 1750358 1729355 1703611 1768226 1788150 1756696 1745085
3635A745085o2621q4337L155L0868l9395l0979o6538K0791O2152J61258L0825
$$ 1745085 1682464 1598127 1601282 1632150 1592755 1561776 1495238 1516029 1578181 1739439 1770264
3624A770264J35145j1597Q4897R9535R6517Q6744p400K5943o0587j14245j27839
$$ 1770264 1905409 1893812 1978709 2078244 2174761 2261505 2254105 2280048 2219461 2105216 1977377
3613A977377q2846L1287o5978J07347Q8399J07294o266L0254K45654j012j4964
$$ 1977377 1894531 1925818 1859840 1967187 2055586 2162880 2156614 2186868 2432522 2431510 2416546
3602B416546o739n7049j12571K5204j09837j4181P8821j29923N4545M9354m6881
$$ 2416546 2409807 2352758 2240187 2265391 2155554 2141373 2220194 2090271 2144816 2194170 2147289
3591B147289m3461n4248N9222m2488q4661O9212J24005k35P723N982O5958P3456
$$ 2147289 2103828 2049580 2108802 2066314 1981653 2050865 2174870 2174635 2182358 2188340 2254298 2327754
3579B327754P6669L9540J05445j3910K9598M3157L0115Q8329K04048Q1329K75974
$$ 2327754 2404423 2443963 2549408 2535498 2565096 2608253 2638368 2726697 2930745 3012074 3288048
3568C288048P4577J97259K38973Q1262J88886K41327K09367L30619N23885M40479
$$ 3288048 3362625 3559884 3798857 3880119 4069005 4310332 4519699 4850318 5374203 5814682
3558E814682L85538M77886P05187P64595Q19919R67033J206766J393447J385784
$$ 5814682 6200220 6678106 7383293 8147888 8967807 9934840 11141606 12535053 13920837
3549A3920837J446539J778213J352151P83903j54824j294278j911409k093149
$$ 13920837 15367376 17145589 18497740 19281643 19126819 17832541 15921132 13827983
3541A3827983j909470j427565j112673j125963p97909n43124m56779l39569l78360
$$ 13827983 11918513 10490948 9378275 8252312 7454403 6911279 6454500 6114931 5736571
3532E736571m20925k65360k66689l76427l98774k37215l01535l15092j32331l54167
$$ 5736571 5315646 5050286 4783597 4407170 4008396 3771181 3469646 3154554 3022223 2668056
3522B668056j49275j31909n4197j23786m6891k6084j15481r3928j27307j02834
$$ 2668056 2518781 2386872 2332675 2208889 2161998 2135914 2020433 1926505 1799198 1696364
3512A696364J1830o2640J933R6982m2791j63807j18517N4795n658n9432j00402
$$ 1696364 1708194 1645554 1647487 1744469 1701678 1537871 1419354 1474149 1468491 1409059 1308657
3501A308657r3479P4996p1179O4340p3624k8629L8234j08328j18922O4302j50166
$$ 1308657 1215178 1290174 1218995 1283335 1209711 1181082 1219316 1110988 992066 1056368 906202
3490I06202N2577k984o3164N9890R3220p3761o0180Q9064q2858l6754Q4760r5263
$$ 906202 958779 955795 892631 952521 1045741 971980 911800 1000864 918006 881252 966012 870749
3478H70749j34634r6682p6614Q0743L7512p6190N3151K9382j01426L0716L4827
$$ 870749 736115 639433 562819 643562 681074 604884 658035 687417 585991 616707 651534
3467F51534J00366m4940N0608o1951m4023k2834k6238l6414o6356J8912L2272
$$ 651534 751900 706960 757568 695617 651594 628760 602522 566108 499752 518664 550936
3456E50936k4195M0068j61533j3494k202K6985m3390o6667k7288L5058o2468k6059
$$ 550936 526741 566809 405276 391782 389580 416565 373175 306508 279220 314278 251810 225751
3444B25751Q1315M4494m6815q9319J8715k3485R3902N7099K6256M2806n2806L742
$$ 225751 307066 351560 304745 215426 234141 210656 304558 361657 387913 430719 377913 381655
3432C81655r0789o7551n4242N5303J4655j21617O4307K8946N3678N4612M8060
$$ 381655 290866 223315 169073 224376 239031 117414 181721 210667 264345 318957 367017
3421C67017J7168n7889k7178n1626p0006L6042L3283K8944p8800M4657J0530j09774
$$ 367017 384185 326296 299118 247492 177486 213528 246811 275755 196955 241612 252142 142368
3409A42368J20853p308L7685O2405j53034j5991O6254n5044q2445Q0996o992j19867
$$ 142368 263221 255913 293598 356003 202969 186978 253232 198188 115743 196739 189747 69880
3397F9880J4641O2334l9115k9810Q9896J59347q0993r4555J33649r9583J28791
$$ 69880 84521 146855 107740 77930 167826 327173 246180 151625 285274 185691 314482
3386C14482J0476o4379m9190q8964J13509J9528L6707L6618L8175j11518n4458
$$ 314482 324958 260579 211389 122425 235934 255462 292169 328787 366962 255444 200986
3375B00986K0905n8453N5855L4410Q0990j94011l6561p2175j628J27047J10193
$$ 200986 221891 163438 219293 253703 334693 140682 104121 31946 30318 157365 267558
3364B67558j7299n1115m2480p6185K9107j7696L8711m6480J59255m6563q9796
$$ 267558 250259 199144 156664 80479 109586 91890 130601 84121 243376 196813 107017
3353A07017O4019J66152l1775J5330m3364J4706o3500k4740Q1164k1933J1872
$$ 107017 171036 337188 305413 320743 277379 292085 228585 203845 285009 263076 274948
3342B74948l4185K0563O1361r0440j03036J679L4501J41693o1864q9164l3609
$$ 274948 240763 261326 322687 232247 129211 130890 165391 307084 245220 156056 122447
3331A22447p292r3612K38473P9301m6183J2796o731J42960k4015q7582L7536j0789
$$ 122447 115155 21543 260016 339317 293134 305930 299199 442159 418144 330562 368098 357309
3319C57309n1278M01J64428j30561j22611j05869j1817M3819n6884J10574K7652
$$ 357309 306031 306432 470860 340299 217688 111819 100002 143821 86937 197511 225163
3308B25163j944P8059K0052o7905j01485j23047r087J45169R0276q9247L1830
$$ 225163 223219 301278 321330 253425 151940 28893 19806 164975 255251 166004 197834
3297A97834Q9668J32321j97518P1042K1903j39569R4715J2043J15740L3365j01651
$$ 197834 287502 419823 222305 293347 315250 175681 270396 282439 398179 431544 329893
3286C29893R2146o8690j20630l5025l9679k8983N9603q8761m6382J22912J11996
$$ 329893 422039 353349 232719 197694 158015 129032 188635 99874 53492 176404 288400
3275B88400n5935n4849J16210K3178l7929M450m8403j1901M408q754o653M094
$$ 288400 232465 177616 293826 317004 279075 283525 235122 223221 227629 218875 212222 216316
3263B16316j34139j13867R8995J8293O5745k2675M5276j2755j7009K7066q5274
$$ 216316 82177 -31690 67305 85598 151343 128668 173944 161189 144180 171246 85972
3252H5972J28587j0388l2384l8285K0488N3069j54935O6058J07081J2531n2647
$$ 85972 214559 204171 171787 133502 153990 207059 52124 118182 225263 237794 185147
3241A85147j14029O0457Q2373o8187k3803m6847m2257Q5005j04397J17240Q4507
$$ 185147 71118 131575 213948 145761 121958 75111 32854 117859 13462 130702 215209
3230B15209j16103n6746R4516j8149J5135n1317l5563R3472Q6839q2277n7659
$$ 215209 99106 42360 136876 118727 133862 82545 46982 140454 227293 145016 87357
3219H7357O6793L7632j7963R0840j35195j37177J89228k0673k3071l9381R295
$$ 87357 154150 191782 173819 264659 129464 -7713 181515 160842 137771 98390 107685
3208A07685j750l9321M7953J25585n5572j08467K0277O5928j29209K26742N583
$$ 107685 105935 66614 114567 240152 184580 76113 96390 162318 33109 259851 265434
3197B65434n6299k5414m4208L6969j20291m7264O8875Q153k5799K1854Q1278p3969
$$ 265434 209135 183721 139513 176482 56191 8927 77802 85955 60156 82010 163288 89319
3185H9319o979Q5049n8085N4920n8616J35676p9847p3722P6249l056N2201j8495
$$ 89319 82340 167389 109304 164224 105608 241284 161437 87715 163964 160908 213109 194614
3173A94614j03331J55470Q3898p1974O9079p9528M9018L2518k6638l7397M7559
$$ 194614 91283 246753 330651 258677 327756 248228 297246 329764 303126 265729 313288
3162C13288l9029J8139l121M6140q9627M7018O4173j8202K1814R0394M3392n3641
$$ 313288 274259 292398 289277 335417 245790 292808 356981 338779 360593 450987 494379 440738
3150D40738o7631O5714k0675J4406j2494m5654M9435k5775n3873l1428k7507P4950
$$ 440738 373107 438821 418146 432552 420058 374404 423839 398064 344191 312763 285256 360206
3138C60206O3869N9205Q658q7242r653J1555k4288O827M2108J0090J04811L5771
$$ 360206 424075 483280 491938 404696 395043 406598 382310 389137 431245 441335 546146 581917
3126E81917K1533M5235l4948l8218J0298M7673n3775l3230O0177M1377o1051O7744
$$ 581917 603450 648685 613737 575519 585817 633490 579715 546485 606662 648039 586988 654732
3114F54732J07605l7043r0758o4780M820p5045K3070K2975Q7778L7186J5174j31069
$$ 654732 762337 725294 634536 569756 574576 499531 522601 545576 633354 670540 685714 554645
3102E54645J00894J43417L9535P7442m1342j14146J6702J00015P6425r7579J06340
$$ 554645 655539 798956 838491 915933 874591 760445 777147 877162 953587 856008 962348
3091I62348l6556o6418K949P0592R5527J82204O2515j17460N5932J33221J947
$$ 962348 925792 859374 862323 932915 1028442 1210646 1273161 1155701 1211633 1344854 1346801
3080A346801n776J50017J17246n748J58820K17495J5195l9672K65667J74012Q4698
$$ 1346801 1341025 1491042 1608288 1602540 1761360 1978855 1994050 1954378 2220045 2394057 2478755
3069B478755J05325J08285K0583j32967j95037k01993j12904r2016j77532j75250
$$ 2478755 2584080 2692365 2712948 2579981 2384944 2182951 2070047 1978031 1800499 1625249
3059A625249m0424o4314p4146j10525O4477j06894j21209k3749M8791j04582N0379
$$ 1625249 1584825 1520511 1446365 1335840 1400317 1293423 1172214 1148465 1197256 1092674 1143053
3048A143053P4117m8740m0539q170o1346P8427J11342m4364P2054J43248O4541
$$ 1143053 1217170 1168430 1127891 1119721 1058375 1136802 1248144 1203780 1275834 1419082 1483623
3037A483623L6774N7923N0525K62080J23358j02719k95236o1852j26696q7750
$$ 1483623 1520397 1578320 1628845 1890925 2014283 1911564 1616328 1554476 1427780 1340030
3027A340030j43563O022r522l3029r8786j1813P6175r9270o9015K5401P9612n23
$$ 1340030 1196467 1202489 1192967 1159938 1061152 1049339 1125514 1026244 957229 982630 1062242 1061719
3015A061719K39192R3435M4245K6187K2725K19850K31219J18712L93911K55351
$$ 1061719 1300911 1394346 1438591 1464778 1487503 1707353 1938572 2057284 2451195 2706546
3005B706546L02780l4294k64044m84996l33712l36422k9753n9297o7323L2276
$$ 2706546 3009326 2975032 2710988 2225992 1892280 1555858 1526105 1466808 1399485 1431761
2995A431761j59121j00080K4426k8660n2043k844k5133J19534J11269J3906q7893
$$ 1431761 1272640 1172560 1196986 1168326 1116283 1113439 1088306 1207840 1319109 1333015 1245122
2984A245122M8192q7155J26618Q5688K1110J47459J86115Q3360J58270j55115
$$ 1245122 1293314 1206159 1332777 1418465 1439575 1587034 1773149 1856509 2014779 1859664
2974A859664k14541j64092j14859L3294q1642p3156k1091M0970Q254o0641J02712
$$ 1859664 1645123 1481031 1366172 1399466 1317824 1244668 1223577 1264547 1272801 1212160 1314872
2963A314872j31473k436Q1116K4957L0533o7570L5438K0369j0013J8522N6637
$$ 1314872 1183399 1180963 1262079 1287036 1317569 1249999 1285437 1305806 1295793 1314315 1370952
2952A370952k742j1808M4230O7596k7968M5316J06458J755R2261J02884M8324
$$ 1370952 1368210 1356402 1400632 1468228 1440260 1485576 1592034 1593789 1686050 1788934 1837258
2941A837258J49587j62957q6301K31573J38859j09767j7437R9277J11513M4468
$$ 1837258 1986845 1823888 1737587 1969160 2108019 1998252 1980815 2080092 2191605 2236073
2931B236073Q6073Q1224J45969J21301k9222q096K5323J51150K23736R0846J58849
$$ 2236073 2322146 2403370 2549339 2670640 2641418 2633322 2658645 2809795 3033531 3124377 3283226
2920C283226P3326J5250Q9359K01577K14841K22421J57258J54014J20458K77677
$$ 3283226 3356552 3371802 3461161 3662738 3877579 4100000 4257258 4411272 4531730 4809407
2910D809407L23798K21326M18455K63640L30611L97791M92194M01839N23805P23328
$$ 4809407 5133205 5354531 5772986 6036626 6367237 6765028 7257222 7659061 8182866 8906194
2900H906194O69048Q09421Q17485P74675R64191J143890R47427R15309Q23909
$$ 8906194 9575242 10384663 11202148 11976823 12941014 14084904 15032331 15947640 16771549
2891A6771549O96593N98019J52042l24695l57742o44158p67141o80514n16254
$$ 16771549 17468142 18066161 18218203 17893508 17535766 16891608 16124467 15443953 14927699
2882A4927699m02934m30347j25177r4796l7000M9678K73660M08012L54829M55859
$$ 14927699 14524765 14094418 13969241 13874445 13837445 13887123 14160783 14568795 14923624 15379483
2872A5379483Q49009Q28440J026006J108481J458983J541106J665480J747933
$$ 15379483 16228492 17056932 18082938 19191419 20650402 22191508 23856988 25604921
2864B5604921J616352J734392J327175P37437K42151o83472j367553j746247k050084
$$ 25604921 27221273 28955665 30282840 31020277 31262428 30578956 29211403 27465156 25415072
2855B5415072j961744j870158j663217j509674j185928r03965r79917p90759n82722
$$ 25415072 23453328 21583170 19919953 18410279 17224351 16320386 15340469 14549710 13966988
2846A3966988l80641l32181k47658k44403N0520J23247M5808K97007L62292M05133
$$ 13966988 13586347 13254166 13006508 12762105 12812625 12935872 12981680 13278687 13640979 14046112
2836A4046112N18888N78569M51236M47857J54243j05982k99375m05749r08729
$$ 14046112 14565000 15143569 15594805 16042662 16196905 16090923 15791548 15385799 14477070
2827A4477070j000215r38646j006082j038324q57477o45964p72107p46009o15586
$$ 14477070 13476855 12538209 11532127 10493803 9636326 8990362 8218255 7472246 6856660
2818F856660m91828l47940l46567l61544l58989k77783j24109j78853l70108k49162
$$ 6856660 6364832 6016892 5670325 5308781 4949792 4672009 4547900 4369047 3998939 3749777
2808C749777q5888j57887k19485k45609j19591j4926k65238j32846M1007n7027
$$ 3749777 3663889 3506002 3286517 3040908 2921317 2906391 2641153 2508307 2549314 2492287
2798B492287j01559j02249j76121J381N2757n1997m1047p1876j03763o8723J9668
$$ 2492287 2390728 2288479 2112358 2113739 2166496 2114499 2073452 2001576 1897813 1829090 1848758
2787A848758j00115j20587M6275P1274J9054k7248j91040J00m8527j52710J07250
$$ 1848758 1748643 1628056 1674331 1745605 1764659 1737411 1546371 1546471 1497944 1345234 1452484
2776A452484k9838j38526N0974p0527K5628O0911l1776o836m6540n5326j09660
$$ 1452484 1422646 1284120 1335094 1264567 1290195 1351106 1319330 1312494 1265954 1210628 1100968
2765A100968l1016q037j08972J57928N8548q534m1761q5177Q33j9949k7405P6784
$$ 1100968 1069952 1061915 952943 1110871 1169419 1160885 1119124 1033947 1034780 1014831 987426 1064210
2753A064210K1989j70393O2173j9165N359M7165L643q2839m6859r0636l4659n9818
$$ 1064210 1086199 915806 977979 958814 964173 1011338 1014981 932142 885283 794647 759988 700170
2741G00170p814O3906K0029N1304N9871j17169j4648l6069P2258q5496j34038
$$ 700170 692356 756262 776291 827595 887466 770297 755649 719580 791838 706342 572304
2730E72304L5878k5499O9199k9658p6339K264J29367l9328j01762p9859M2978
$$ 572304 608182 582683 651882 622224 545885 548149 677516 638188 536426 456567 499545
2719D99545N3272k7371K8886j08988r2781L3312J18860Q96j49124J26012k0330
$$ 499545 552817 525446 554332 445344 352563 385875 504735 505631 356507 482519 462189
2708D62189p3803o997M4679j21333L7546Q697l4915l3844L9249M7685j7541j16587
$$ 462189 388386 381389 426068 304735 342281 350978 316063 282219 321468 369153 351612 235025
2696B35025l7324q2340Q0849j2583Q0745N5696r8084l6778k1741N4785j5296j01945
$$ 235025 197701 115361 196210 183627 264372 320068 221984 185206 163465 218250 202954 101009
2684A01009l8452R6957N7737j12247k7047J68520m9746M8344j2960j15871N7050
$$ 101009 62557 159514 217251 105004 77957 246477 196731 245075 232115 116244 173294
2673A73294N6927j24076o0536P3489K5056M005n4627n839K2783L188M7872l2717
$$ 173294 230221 106145 45609 119098 144154 148159 93532 87693 110476 113664 161536 128819
2661A28819n7260m5254O2843K0237N426p4578p520N2056Q5789k00926K6793O5065
$$ 128819 71559 26305 89148 109385 114811 40233 32713 84769 170558 -30368 -3575 61490
2649F1490O6795m6166r152J29018j57095N9141r3530l7634M6115m9169J21048
$$ 61490 128285 82119 72967 201985 44890 104031 10501 -27133 18982 -30187 90861
2638I0861K1009n281L0385j20458l068J92041l6706L7069q5497L9135n288o1509
$$ 90861 111870 106589 136974 16516 13448 205489 168783 205852 120355 159490 154202 92693
2626I2693m1404q615J06726o0922l1029L8704J11265l8008j09080L2204k5289
$$ 92693 51289 42674 149400 88478 57449 96153 207418 169410 60330 92534 67245
2615F7245l7442o0312J18264N1100j0063m3681j17105O2043J1063M4163o1500
$$ 67245 29803 -30509 87755 138855 128792 85111 -31994 30049 41112 85275 23775
2604B3775l2262L5193q1014O299L5987O1105P6580Q4053j3776j334P6194q0571
$$ 23775 -8487 26706 -54308 -48009 -12022 49083 125663 209716 195940 194606 270800 190229
2592A90229o8395P2269k9614r8965N0815N4373m9291m2398m5352l1935n6506K7091
$$ 190229 121834 194103 164489 65524 116339 170712 121421 79023 33671 1736 -54770 -27679
2580b7679L1561k5967P5267O5192j2709l6744K013j6869Q573J0535j0419o8182
$$ -27679 3882 -22085 53182 118374 105665 68921 70934 54065 62638 73173 62754 -5428
2568e428j5761J662K686L1504L5403L4988j01431l5000J3758l2514N1653q5159
$$ -5428 -21189 -19527 -16841 14663 50066 85054 -16377 -51377 -37619 -70133 -18480 -103639
2556a03639O6090j11569J8265J26370m1900K7282j4969n1911P6172N5734q3892
$$ -103639 -37549 -149118 -130853 -4483 -46383 -19101 -34070 -85981 -9809 45925 -37967
2545c7967r2348Q7053l1837k4143j3213N2280k0418L9477k9687J28108q716k0248
$$ -37967 -130315 -43262 -75099 -99242 -112455 -60175 -80593 -41116 -70803 57305 48589 28341
2533B8341k3482M8796O0515q2478O552j8247J3073n3474l791n6303l3950M2737
$$ 28341 4859 53655 114170 31692 38244 19997 33070 -20404 -24195 -80498 -114448 -71711
2521g1711J53180j07212r6000M6006l6151K8282M1394N5987k0247M4594M0380
$$ -71711 81469 -25743 -121743 -75737 -111888 -83606 -42212 13775 -6472 38122 78502
2510G8502K3106J1491j7440j4056j04430M4911j6352o217J3079l799j3797n6900
$$ 78502 101608 113099 95659 81603 -22827 22084 5732 -485 12594 8795 -5002 -61902
2498f1902p277R320k7509m083k5024P0501K0238L3279N4946O8459j53831M9057
$$ -61902 -69179 -59859 -87368 -91451 -116475 -45974 -25736 7543 62489 130948 -22883 26174
2486B6174K9797j46615m1047L3724M7071M1608Q481Q589J0652P7450r3116k9036
$$ 26174 55971 -90644 -131691 -97967 -50896 -9288 -807 7782 18434 95884 2768 -26268
2474b6268N7867m20J6972q4571O690p211j6837n1239P4248M1018J2910k2815j4750
$$ -26268 31599 31179 48151 -36420 -29730 -36941 -53778 -105017 -30769 10249 23159 344 -14406
2461a4406n1937N8092M8665m3989j06484J1123J2860n4632Q9897P9102N2866m8942
$$ -14406 -66343 -8251 40414 -3575 -110059 -98936 -86076 -140708 -50811 28291 81157 32215
2449C2215J3230q4883J9680M9535K8785j49401M2114M0182r6082R4363n5329L474
$$ 32215 45445 -39438 -19758 29777 58562 -90839 -48725 -8543 -104625 -10262 -65591 -62117
2437f2117J236l9564P2687K711j9731j10796K7189O6895L5310m4890N3095k8130
$$ -62117 -60881 -100445 -27758 -25047 -44778 -155574 -128385 -61490 -26180 -71070 -17975 -46105
2425d6105j01426J0124K9562R7884o496l2449k1259N2824m0759k7973M1027J00421
$$ -46105 -147531 -137407 -107845 -9961 -16457 -48906 -70165 -17341 -58100 -86073 -45046 55375
2413E5375l1795j06644O6764M1350j23683o2024P5434O4399m1137n6669P0312
$$ 55375 23580 -83064 -16300 25050 -98633 -160657 -85223 -20824 -61961 -118630 -48318
2402d8318r155M3561J02863j29577m3324N9254m9137j24162o5831M4372P912Q7447
$$ -48318 -57473 -13912 88951 -40626 -83950 -24696 -73833 -197995 -263826 -219454 -211542 -124095
2390a24095N8798l6975K0858P7054q0701j3802m453M6959p1612l4954R7439j106
$$ -124095 -65297 -102272 -81414 -4360 -85061 -98863 -103316 -56357 -127969 -162923 -65484 -66590
2378f6590N4404j01471R13m3510K8825J7723O2941R746l6085M5320m542m8696
$$ -66590 -12186 -113657 -112744 -156254 -127429 -109706 -46765 -37019 -73104 -27784 -32326 -81022
2366h1022Q0014l8195R792N6727p2637n4758J9718J1588l5086m1993J6411p9905
$$ -81022 -1008 -39203 -29411 27316 -45321 -100079 -80361 -68773 -103859 -145852 -129441 -209346
2354b09346N4995Q1940J5570j0604N5151k1221K1576N2288P0840l070j12518r9045
$$ -209346 -154351 -72411 -56841 -67445 -12294 -33515 -11939 40349 111189 108119 -4399 -103444
2342a03444j4053K9709l6506o4832J23730L6389o0697O6657J156L7776j7070q7697
$$ -103444 -117497 -87788 -124294 -189126 -65396 -29007 -89704 -23047 -21891 15885 -1185 -88882
2330h8882o9107M9787J5304Q5627J7504j2136o0186q1367o883J10480l1972J893
$$ -88882 -157989 -108202 -92898 -7271 10233 -1903 -62089 -143456 -150339 -39859 -71831 -69938
2318f9938n3525L2569M9412M1640l7903j04828J32919J63648m6847k6421k4392
$$ -69938 -123463 -90894 -41482 158 -37745 -142573 -9654 153994 107147 80726 56334
2307E6334q6942m4743M5894O1289O927k978l308K1466j7421j07790n2953R3917
$$ 56334 -30608 -75351 -29457 31832 38759 35781 32473 53939 36518 -71272 -124225 -30308
2295c0308K1694p7554o7j7345J50219j866q0966k9885L8887J30276q5875o3203
$$ -30308 -8614 -86168 -86235 -103580 46639 44773 -36193 -66078 -27191 103085 17210 -45993
2283d5993M1215N7248J10616J9675n904L400j23021m5998K6812j01723j1100O2812
$$ -45993 -4778 52470 163086 182761 176857 180257 57236 11238 38050 -63673 -74773 -11961
2271a1961k3320N5275J3394J0075p8082J41931m6884j6929k8233p5510N8804j01131
$$ -11961 -35281 19994 33388 43463 -34619 107312 60428 43499 15266 -60244 -1440 -102571
2259a02571j6342k7323l0302L2959J37349R2348j04623P400J0518K018j25364
$$ -102571 -118913 -146236 -176538 -143579 -6230 86118 -18505 -11105 -587 1431 -123933
2248a23933o5012R9345L5249K0036j57446J33736l579l0679J12671j34342M0588
$$ -123933 -188945 -89600 -54351 -34315 -191761 -58025 -61604 -92283 20388 -113954 -73366
2237g3366L0225O1637j12386R5628J1866o0325N2222N8574j8451j7236m4723K0498
$$ -73366 -43141 18496 -93890 1738 13604 -46721 5501 64075 45624 28388 -16335 4163
2225D163P5702n8248K8445n1606p629J4589J20191j567q9698j44770L7503j4443
$$ 4163 79865 21617 50062 -1544 -9173 5416 125607 124040 34342 -110428 -72925 -87368
2213h7368M4158J38033k4654O5190m5133n98L1404n5633m7660q7783J01838J37083
$$ -87368 -43210 94823 70169 135359 90226 89628 121032 65399 17739 -70044 31794 168877
2201A68877j61612j20848J71168J275K3880j8808J9222L2548J4570r2627R604
$$ 168877 7265 -113583 57585 58860 82740 63932 83154 115702 130272 37645 47249
2190D7249N7519P0547m307L464k7540m0944K0304l8261j4394K208m675j05370
$$ 47249 104768 175315 171008 174472 146932 105988 126292 88031 73637 75845 71170 -34200
2178c4200O5768N7096N6183J6180o8322M4808p1801K6821M8275j21157r724K12068
$$ -34200 31568 88664 144847 161027 92705 137513 65712 92533 140808 19651 9927 221995
2166B21995p1439j5951O2226o1688J3418L6227j824p8969J1590j9109L9258o5666
$$ 221995 150556 134605 196831 135143 148561 184788 182964 103995 115585 96476 135734 70068
2154G0068R989M696J07578m7773J5017r3150K7862j5756R7082L2846O631N4899
$$ 70068 80057 84753 192331 144558 159575 66425 94287 78531 175613 208459 215090 269989
2142B69989P2262N572o4485m74L9669M9215o1610N5374L8586Q6692J9569o5301
$$ 269989 342251 347823 283338 282864 322533 371748 310138 365512 404098 490790 510359 445058
2130D45058j3194O0702n5474P5221J3650R4828j06988m586M0771k8316L0093J3020
$$ 445058 431864 492566 437092 512313 525963 620791 513803 509217 549988 521672 551765 564785
2118E64785Q695Q8228o1754p0480j11648L5231J38327O2846q562j29751Q330O7823
$$ 564785 573480 661708 599954 529474 417826 453057 591384 654230 645668 515917 524247 592070
2106E92070J64423J02260q399o0264K3786O3926k1J40031J09371j18922j89525
$$ 592070 756493 858753 850354 790090 813876 877802 877781 1017812 1127183 1008261 818736
2095H18736N0842J08600M0267Q2911O3778Q3491J15184j8344J3988L8836J06485
$$ 818736 869578 978178 1018445 1101356 1165134 1248625 1363809 1345465 1359453 1398289 1504774
2084A504774P3030l9211J10553O4081L9430O8177J04930J31233J19501P5061L2600
$$ 1504774 1577804 1538593 1649146 1713227 1752657 1820834 1925764 2056997 2176498 2251559 2284159
2073B284159P1511N0606P3204R7341N7058J47156J36316J37970J79507K65197
$$ 2284159 2355670 2406276 2479480 2576821 2633879 2781035 2917351 3055321 3234828 3500025
2063C500025J73499K10394L36857J88671L14199K96931M50093M04802M45408P34692
$$ 3500025 3673524 3883918 4220775 4409446 4723645 5020576 5470669 5875471 6320879 7055571
2053G055571N94443M50124N48064R34337Q90809J133498J440826K235670K576894
$$ 7055571 7650014 8100138 8648202 9582539 10473348 11606846 13047672 15283342 17860236
2044A7860236L411266L864889N046207O651234N092528k306048o471882p181762
$$ 17860236 21271502 25136391 30182598 36833832 41926360 39620312 33148430 25966668
2036B5966668o060880l911164k776229j733340j368831j003882r45507o28797
$$ 25966668 19905788 15994624 13218395 11485055 10116224 9112342 8166835 7538038
2028G538038p40358k97577m55477l65930n17160m37428n20161l74097k99112l47678
$$ 7538038 6797680 6500103 6044626 5678696 5161536 4724108 4203947 3829850 3530738 3183060
2018C183060j43945j46717j95928j01987n9489j35773q0575p6630k23663l8882
$$ 3183060 3039115 2892398 2696470 2594483 2534994 2399221 2318646 2242016 2018353 1979471
2008A979471j16977J4537r1484j24675n7192l6289k16425r0475r5169L4750J4313
$$ 1979471 1862494 1877031 1785547 1660872 1603680 1567391 1350966 1260491 1165322 1200072 1214385
1997A214385J19183l7602j38184l1529o5347M431m9900k6668j33013m359M5676
$$ 1214385 1333568 1295966 1157782 1126253 1060906 1065337 1015437 988769 855756 851397 897073
1986H97073P2632p6735j58833M4984m6389M735o4921j7629Q4933o5725p8951P3014
$$ 897073 969705 892970 734137 779121 732732 737467 672546 654917 739850 674125 595174 668188
1974F68188m2120o7493j3674r4203K444K8184j375K8261n8767N9323o2391M0056
$$ 668188 626068 558575 544901 450698 453142 481326 479951 508212 449445 508768 446377 486433
1962D86433J6579R077m0996o9625o4767l0138j1674n3104Q5706j50439l4371J6826
$$ 486433 503012 512089 471093 401468 336701 306563 294889 241785 327491 177052 142681 159507
1950A59507Q5313K7588K7910R9894k7857j38081p708j0353o7832R3759N2705n0607
$$ 159507 244820 272408 300318 400212 372355 234274 226566 216213 148381 242140 294845 244238
1938B44238m8900M7391q4258k5505Q6535p607r7972J9858o4128L290J84976J1484
$$ 244238 195338 242729 158471 132966 219501 211894 113922 133780 69652 72942 257918 269402
1926B69402j13909j8356l2312j5147J0194j3396J07486q6037J7289k793R0565
$$ 269402 155493 137137 104825 89678 99872 86476 193962 107925 125214 122421 212986
1915B12986J9222j7840p3844l4822j04906K7219k250K8238k1869m5826m5042M823
$$ 212986 232208 214368 140524 105702 796 28015 25765 54003 32134 -13692 -58734 -53911
1903e3911L3715K9795J27437n687M6106r8128m0797M4045N2586j35215K3951N0153
$$ -53911 -20196 9599 137036 131349 177455 79327 38530 82575 135161 -54 23897 74050
1891G4050j2897p073n0700K13489j03451j36143J27940P9828o2784l9840p0670
$$ 74050 61153 54080 3380 216869 113418 -22725 105215 185043 122259 82419 11749
1880A1749J62249p9007j796K1823J8101r8815p1466j5023P2244K3158J2787o5045
$$ 11749 173998 94991 93195 115018 133119 34304 -37162 -52185 20059 43217 56004 -9041
1868i041Q8182J6580j72302Q0588K6238o6966O1073J58533L5351m5992p5408o9688
$$ -9041 79141 95721 -76581 4007 30245 -36721 24352 182885 218236 172244 96836 27148
1856B7148m2968p1392k490J41045m0152r3907j0909J21154j4884O3983n1643J1034
$$ 27148 -15820 -87212 -89702 51343 11191 -82716 -93625 27529 12645 76628 24985 36019
1844C6019p753l5254o269j9398J4771O7299k8980j4357M8867P4816o5552J846
$$ 36019 28266 -6988 -13257 -32655 -17884 49415 20435 6078 54945 129761 64209 66055
1832F6055o9861r5048J39145o7584J1294N1960q3300L3369n7416m2331K9565k78
$$ 66055 -3806 -98854 40291 -27293 -15999 35961 -47339 -13970 -71386 -113717 -84152 -84430
1820h4430P4761P2990q2387q1784L5211J14708k2091j17007l8788J10451K2859
$$ -84430 -9669 63321 -19066 -100850 -65639 49069 26978 -90029 -128817 -18366 4493
1809D493j27317P2600J14416J8834j60562j9409J18204q9479K7572o596K09615
$$ 4493 -122824 -50224 64192 83026 -77536 -96945 21259 -68220 -40648 -47244 162371
1798A62371m6777L4593n6364L890J00429j50242M5146J8222k9732p7239J4432
$$ 162371 115594 150187 93823 97713 198142 47900 93046 111268 81536 4297 18729
1787A8729N0849o8521m7118J4467l1662k7611K9178J04938J8337j11410j6870
$$ 18729 69578 1057 -46061 -31594 -63256 -90867 -61689 43249 61586 -49824 -66694
1776f6694O8129k2192p6307r926J00197r514p6699O3090n6149M6236P1151J8254
$$ -66694 1435 -20757 -97064 -106990 -6793 -16307 -93006 -29916 -86065 -39829 31322 49576
1764D9576j7171l923l6073p7602Q837k1385J3579Q263K26N3793k14K1596m7194
$$ 49576 32405 28482 -7591 -85193 -76356 -97741 -84162 -75899 -75673 -21880 -22094 -498 -47692
1751d7692r7785J82971l9801O556k4125q2020k0718P493K4536R241j00026n689
$$ -47692 -145477 37494 -2307 4249 -19876 -101896 -122614 -115121 -90585 -81344 -181370 -187059
1739a87059l3020R4563N7126m9415J0464K308o2597P4559L8179q0420j8031J41324
$$ -187059 -220079 -125516 -68390 -117805 -107341 -105033 -167630 -93071 -54892 -135312 -153343 -12019
1727a2019l768m0217R3417q3236P7162o9967j0014O4539n3941R4534j02242j01652
$$ -12019 -15787 -56004 37413 -45823 31339 -38628 -48642 15897 -38044 56490 -45752 -147404
1715a47404K9422r5444j436Q9414J22256m9189o5786J8138k1364M6669j6270k9963
$$ -147404 -117982 -213426 -214862 -125448 -3192 -52381 -118167 -100029 -121393 -74724 -90994 -120957
1703a20957J08459j1703L2417l404r9704Q2896R2873j1132N4070j02961j43886
$$ -120957 -12498 -24201 8216 4812 -94892 -11996 80877 69745 123815 20854 -123032
1692a23032m3342P7779k8882m5136l6775N8835L8400l7067J24924r5069J4680
$$ -123032 -166374 -88595 -117477 -162613 -199388 -140553 -102153 -139220 -14296 -109365 -94685
1681i4685R064k799L4441L879N3804j7864P8867O029q7185j97280N2044J66131
$$ -94685 -85621 -88420 -53979 -50100 3704 -14160 64707 70736 -16449 -213729 -161685 4446
1669D446n3139l142P7947k6858j4785o1024n4251J23529Q3421K854Q26K2938l3402
$$ 4446 -48693 -51835 26112 -746 -15531 -76555 -130806 -7277 76144 78998 79824 102762 69360
1656F9360j32658k9774Q050k5898P8770K2529j4045k7900O4044j1860O138o137
$$ 69360 -63298 -93072 -85022 -110920 -32150 -9621 -23666 -51566 12478 618 6756 619
1644F19l5700L160m9001n7905q291O0299N1857M539j9853k7410J19134o6971q3708
$$ 619 -35081 -31921 -80922 -138827 -147118 -86819 -34962 -30423 -50276 -77686 41448 -25523 -109231
1631a09231N0185m0200R6953k8342O2422J31479j27018p0037M0447O5986p6402
$$ -109231 -59046 -99246 -2293 -30635 31787 163266 36248 -33789 6658 72644 -3758
1620c758q06q2786p3463J9772J85259r9585j03030P1465R0370p6183n3342J42896
$$ -3758 -4564 -87350 -160813 -141041 44218 -55367 -158397 -86932 3438 -72745 -126087 16809
1608A6809K8474o5749K9951O0076k0857j8117o6390k2337m6204J26332q795j8822
$$ 16809 45283 -20466 9485 69561 48704 30587 -35803 -58140 -104344 21988 13193 -5629
1596e629n0761M3364K4686l9563L8437o2296k4000l557N4262Q6075o4266k2366
$$ -5629 -56390 -13026 11660 -27903 10534 -51762 -75762 -79319 -25057 61018 -3248 -25614
1584b5614q3147P5022l5036n5870J86852M0835j11000o4155P5229Q4588o9616
$$ -25614 -108761 -33739 -68775 -124645 62207 103042 -7958 -72113 3116 87704 18088
1573A8088j38696J0591P8912M2259o4762R350O1169n2899K8175m414O7513l8327
$$ 18088 -120608 -110017 -31105 11154 -53608 -44258 16911 -35988 -7813 -12227 55286 16959
1561A6959j7541M2496m3802j11412q1370P0230N0154L0291O0651k7056M4565K2949
$$ 16959 -582 41914 -1888 -113300 -194670 -124440 -74286 -43995 16656 -10400 34165 57114
1549E7114j17667j195k9220O453Q5437M3391m7506p0479r1265J15402L7063l5055
$$ 57114 -60553 -61748 -90968 -84515 922 44313 -3193 -73672 -164937 -49535 -12472 -47527
1537d7527J2060m8238O5353M8654j05839Q4459q2609k251J30548j14231k6459
$$ -47527 -35467 -83705 -18352 30302 -75537 8922 -73687 -75938 54610 -59621 -86080
1526h6080l748l0941o5402N4650P0425P3975p1812k6817J20356j56851l9728n1942
$$ -86080 -89828 -120769 -186171 -131521 -61096 12879 -58933 -85750 34606 -122245 -161973 -213915
1514b13915J53627q8211L1911J17876r2365N9867q9882J8232N311O6112m7084
$$ -213915 -60288 -148499 -116588 1288 -91077 -31210 -121092 -102860 -97549 -31437 -78521
1503g8521Q2405l5440q211k2877P6317L6147l983l1330M494L33k7566m7958l2381
$$ -78521 3884 -31556 -39767 -62644 13673 49820 45837 14507 19001 19334 -8232 -56190 -88571
1490h8571L8447K4495o9847m6599L6957l8803R5489O5927K3379L3385j1014j42343
$$ -88571 -50124 -25629 -95476 -142075 -105118 -143921 -48432 17495 40874 74259 63245 -79098
1478g9098j16272K4060Q9824Q9472k6353K9136j19707j139M3569j0105n251J08062
$$ -79098 -195370 -171310 -81486 7986 -18367 10769 -108938 -110077 -66508 -76613 -81864 26198
1466B6198o2965L1919R232j29632n8415P5697O8246q7315Q7261j13270J0604R9319
$$ 26198 -36767 -4848 4384 -125248 -183663 -107966 -39720 -127035 -39774 -153044 -142440 -43121
1454d3121J1701k1191l0626l4734k0800m7499R239l1281N1921M6299O2069L1175
$$ -43121 -31420 -52611 -83237 -117971 -138771 -186270 -177031 -208312 -156391 -110092 -48023 -16848
1442a6848l9641l666M4260j1060j16705J07586J32651j49376j53087K4714O0700
$$ -16848 -56489 -60155 -15895 -26955 -143660 -36074 96577 -52799 -205886 -181172 -120472
1431a20472o328N9956m7598K7422M4407n927K4889N8918m8212J0728o4385N6353
$$ -120472 -126800 -66844 -114442 -87020 -42613 -48540 -23651 35267 -12945 -2217 -66602 -10249
1419a0249j49330J05267l435K6374j8591K9330K3281m8628L5770o9184k0633q5283
$$ -10249 -159579 -54312 -57747 -31373 -49964 -20634 2647 -45981 -10211 -79395 -100028 -185311
1407a85311R7904k2505q07j4089J3310K8480Q2583o1706K0636m0813P2175J5184
$$ -185311 -87407 -109912 -110719 -124808 -111498 -83018 -435 -62141 -41505 -82318 -10143 5041
1395E041l158j12057k2242J34882j10996J23767Q9218q1944o0745M6335J8359
$$ 5041 1883 -110174 -132416 2466 -108530 15237 104455 22511 -38234 8101 26460
1384B6460q6643J6744n1701J0576M7530r5589n3648Q9427N0190o5598n9435k9286
$$ 26460 -60183 -43439 -95140 -84564 -37034 -132623 -186271 -96844 -46654 -112252 -171687 -200973
1372b00973O3536J30815k6995J4611J16542p7816n6758o1216L6290l734j00242
$$ -200973 -137437 -6622 -33617 -19006 97536 19720 -37038 -98254 -61964 -65698 -165940
1361a65940M9664J52997n7379M5479L8461K7348l90j96016j01386J52955L2905
$$ -165940 -116276 36721 -20658 24821 63282 90630 90240 -105776 -207162 -54207 -21302
1350b1302J5670J05141j16402L9685R4241l2894j37665J2760j3147N8259M072
$$ -21302 -5632 99509 -16893 22792 117033 84139 -53526 -40766 -53913 4346 8418
1339H418j39068m9978N5255j9644J01153l219r0960Q4467N2824m0393l2371J5804
$$ 8418 -130650 -180628 -125373 -145017 -43864 -47083 -138043 -53576 -752 -41145 -73516 -57712
1327e7712j3062l6128m0770L5268K7166q5422P8745J9179J2960J36737n8929l9378
$$ -57712 -70774 -106902 -147672 -112404 -85238 -170660 -91915 -72736 -59776 76961 18032 -21346
$$ [...]
##END NTUPLES=NMR SPECTRUM
##END=
