##TITLE=1H_CA-8915-1
 CDCl3, 8 sc, 
 6.08.2021
##JCAMPDX= 6.0         $$ Bruker NMR JCAMP-DX V2.0
##DATA TYPE= NMR SPECTRUM
##DATA CLASS= NTUPLES
##ORIGIN= UXNMR, Bruker Analytische Messtechnik GmbH
##OWNER= root
$$ XWIN-NMR		Version 3.5
$$ Fri Aug  6 12:27:52 2021 Russian Standard Time (UT+4h)  she@DPX200
##.OBSERVE FREQUENCY= 200.131506
##.OBSERVE NUCLEUS= ^1H
##.ACQUISITION MODE= SIMULTANEOUS
##.ACQUISITION SCHEME= undefined
##.AVERAGES= 8
##.DIGITISER RES= 18
##SPECTROMETER/DATA SYSTEM= spect
##.PULSE SEQUENCE= zg30
##.SOLVENT NAME= CDCl3
##.SHIFT REFERENCE= (INTERNAL, CDCl3, 0, 17.4788)
##AUDIT TRAIL= $$ (NUMBER, WHEN, WHO, WHERE, WHAT)
$$ ##TITLE= Audit trail, XWIN-NMR		Version 3.5
$$ ##JCAMPDX= 5.01
$$ ##ORIGIN= Bruker BioSpin GmbH
$$ ##OWNER= she
$$ F:/spectra/data/she/nmr/H-F/1/pdata/1/auditp.txt
$$ ##AUDIT TRAIL=  $$ (NUMBER, WHEN, WHO, WHERE, WHAT)
(   1,<2021-08-06 12:26:31.32 +0400>,<she>,<DPX200>,
      <created by zg, POWCHK disabled, PULCHK disabled
       configuration hash MD5:
       00 E9 B6 7A A2 85 ED C7 34 08 36 98 17 FE 4E 26
       data hash MD5: 16K
       34 06 B6 6D EA FE E4 42 4E 6B C0 4A 8D DC 7A 39>)
(   2,<2021-08-06 12:26:34.20 +0400>,<she>,<DPX200>,
      <Start of raw data processing
       efp BC_mod = 2 LB = 0.24 FT_mod = 6 PKNL = 1 PHC0 = -13363.92 PHC1 = 23.60099 SI = 16K 
       data hash MD5: 16K
       A3 49 32 61 BF 60 BD DF AE 39 3A AB D3 F8 A0 68>)
(   3,<2021-08-06 12:26:54.35 +0400>,<she>,<DPX200>,
      <pk PHC0 = 7.056333 PHC1 = -9.599999 
       data hash MD5: 16K
       6F B2 98 A7 EE FA 0D 91 2D D6 B0 05 B5 29 4F D0>)
(   4,<2021-08-06 12:26:57.93 +0400>,<she>,<DPX200>,
      <abs ABSG = 5 
       data hash MD5: 16K
       6A CB E8 B4 15 AE D5 91 08 64 2A 10 59 BF D5 C4>)
$$ ##END=
$$ 
$$ hash MD5
$$ F4 C0 EA 7C A3 D3 24 3C FB 03 CC 3F 06 10 44 CC
##$RELAX= 
##$RELAX= 
##$RELAX= 
##$RELAX= 
##$RELAX= 
##$RELAX= 
$$ Bruker specific parameters
$$ --------------------------
##$DU= <F:/spectra>
##$EXPNO= 1
##$NAME= <H-F>
##$PROCNO= 1
##$TYPE= <nmr>
##$USER= <she>
##$AMP= (0..31)
100 100 100 100 100 100 100 100 100 100 100 100 100 100 100 100 100 100 
100 100 100 100 100 100 100 100 100 100 100 100 100 100 
##$AQSEQ= 0
##$AQ_mod= 1
##$AUNM= <au_zg>
##$AUTOPOS= <>
##$BF1= 200.13
##$BF2= 200.13
##$BF3= 200.13
##$BF4= 200.13
##$BF5= 200.13
##$BF6= 200.13
##$BF7= 200.13
##$BF8= 200.13
##$BYTORDA= 1
##$CFDGTYP= 0
##$CFRGTYP= 5
##$CHEMSTR= <none>
##$CNST= (0..31)
1 1 145 1 1 1 1 1 1 1 1 1 1 1 1 1 1 1 1 1 1 1 1 1 1 1 1 1 1 1 1 1 
##$CPDPRG= <>
##$CPDPRG1= <>
##$CPDPRG2= <>
##$CPDPRG3= <>
##$CPDPRG4= <mlev>
##$CPDPRG5= <mlev>
##$CPDPRG6= <mlev>
##$CPDPRG7= <mlev>
##$CPDPRG8= <mlev>
##$CPDPRGB= <>
##$CPDPRGT= <>
##$D= (0..31)
0 1.2 0 0 0 0 0 0 0 0.06 0 0.03 0 0 0 0 0.0002 0 0 0 0 0 0 0 0 0 0 0 0 
0 0 0 
##$DATE= 1628238390
##$DBL= (0..7)
120 120 120 120 120 120 120 120 
##$DBP= (0..7)
150 150 150 150 150 150 150 150 
##$DBP07= 0
##$DBPNAM0= <>
##$DBPNAM1= <>
##$DBPNAM2= <>
##$DBPNAM3= <>
##$DBPNAM4= <>
$$ [...]
##$SUBNAM3= <"">
##$SUBNAM4= <"">
##$SUBNAM5= <"">
##$SUBNAM6= <"">
##$SUBNAM7= <"">
##$SUBNAM8= <"">
##$SUBNAM9= <"">
##$SW= 20.0188882624521
##$SWIBOX= (0..15)
0 0 2 0 0 0 0 0 0 0 0 0 0 0 0 0 
##$SW_h= 4006.41025641026
##$TD= 16384
##$TD0= 1
##$TE= 0
##$TE2= 300
##$TE3= 300
##$TEG= 300
##$TL= (0..7)
0 120 120 120 120 120 120 120 
##$TP= (0..7)
150 150 150 150 150 150 150 150 
##$TP07= 0
##$TPNAME0= <>
##$TPNAME1= <>
##$TPNAME2= <>
##$TPNAME3= <>
##$TPNAME4= <>
##$TPNAME5= <>
##$TPNAME6= <>
##$TPNAME7= <>
##$TPOAL= (0..7)
0.5 0.5 0.5 0.5 0.5 0.5 0.5 0.5 
##$TPOFFS= (0..7)
0 0 0 0 0 0 0 0 
##$TUNHIN= 0
##$TUNHOUT= 0
##$TUNXOUT= 0
##$USERA1= <user>
##$USERA2= <user>
##$USERA3= <user>
##$USERA4= <user>
##$USERA5= <user>
##$V9= 5
##$VALIST= <valist>
##$VCLIST= <CCCCCCCCCCCCCCC>
##$VD= 0
##$VDLIST= <DDDDDDDDDDDDDDD>
##$VPLIST= <PPPPPPPPPPPPPPP>
##$VTLIST= <TTTTTTTTTTTTTTT>
##$WBST= 1024
##$WBSW= 4
##$XGAIN= (0..3)
0 0 0 0 
##$XL= 0
##$YL= 0
##$YMAX_a= 159679
##$YMIN_a= -290850
##$ZGOPTNS= <>
##$ZL1= 120
##$ZL2= 120
##$ZL3= 120
##$ZL4= 120
##$ABSF1= 17.52277
##$ABSF2= -2.496269
##$ABSG= 5
##$ABSL= 3
##$ALPHA= 0
##$AQORDER= 0
##$ASSFAC= 0
##$ASSFACI= 0
##$ASSFACX= 0
##$ASSWID= 0
##$AUNMP= <proc_1d>
##$AZFE= 0.1
##$AZFW= 0.1
##$BCFW= 0
##$BC_mod= 2
##$BYTORDP= 0
##$COROFFS= 0
##$CY= -3
##$DATMOD= 1
##$DC= 0
##$DFILT= <>
##$DTYPP= 0
##$F1P= 0
##$F2P= 0
##$FCOR= 1
##$FTSIZE= 16384
##$FT_mod= 6
##$GAMMA= 0
##$GB= 0
##$INTBC= 1
##$INTSCL= 1.334414e-10
##$ISEN= 128
##$LB= 0.24
##$LEV0= 0
##$LPBIN= 0
##$MAXI= 10000
##$MC2= 0
##$MEAN= 0
##$ME_mod= 0
##$MI= 1.114404
##$NCOEF= 0
##$NC_proc= -9
##$NLEV= 6
##$NOISF1= 3.799351
##$NOISF2= 2.8
##$NSP= 0
##$NTH_PI= 0
##$NZP= 0
##$OFFSET= 17.47878
##$PC= 1
##$PHC0= -13356.86
##$PHC1= 14.00099
##$PH_mod= 1
##$PKNL= yes
##$PPARMOD= 0
##$PSCAL= 0
##$PSIGN= 0
##$REVERSE= no
##$SF= 200.130011176497
##$SI= 16384
##$SIGF1= 3
##$SIGF2= 2
##$SINO= 5.538805
##$SIOLD= 16384
##$SREGLST= <1H.CDCl3>
##$SSB= 0
##$STSI= 16384
##$STSR= 0
##$SW_p= 4006.41025641026
##$SYMM= 0
##$S_DEV= 0
##$TDeff= 16384
##$TDoff= 0
##$TI= <>
##$TILT= no
##$TM1= 0
##$TM2= 0
##$TOPLEV= 0
##$USERP1= <user>
##$USERP2= <user>
##$USERP3= <user>
##$USERP4= <user>
##$USERP5= <user>
##$WDW= 1
##$XDIM= 16384
##$YMAX_p= 480480960
##$YMIN_p= -2641677
$$ End of Bruker specific parameters
$$ ---------------------------------
##NTUPLES= NMR SPECTRUM
##VAR_NAME=  FREQUENCY,     SPECTRUM/REAL,   SPECTRUM/IMAG
##SYMBOL=    X,             R,               I
##VAR_TYPE=  INDEPENDENT,   DEPENDENT,       DEPENDENT
##VAR_FORM=  AFFN,          ASDF,            ASDF
##VAR_DIM=   16384,         16384,           16384
##UNITS=     HZ,            ARBITRARY UNITS, ARBITRARY UNITS
##FACTOR=    0.24454680195387, 1,            1
##FIRST=     3498.02858614057, 0,            0
##LAST=      -508.381670269688, 0,           0
##MIN=       -508.381670269688, -2641677,    0
##MAX=       3498.02858614057, 480480960,    0
$$ Real data points
##PAGE= N=1
##DATA TABLE= (X++(R..R)), XYDATA
$$ [...]
6775B814867K36255p52062m9248p27356K95406K85826l85021p70941J58666K68672
6765A375064j05946J196554M56012p0284J3509K17856L54742Q79003K77893Q5103
6755D679506j098816L45050n24717j8479o47916j95136L76525l87403k76933q22793
6745A428888R42961j94362r27247M92698k90797n5644K44339n1689l61509M06122
6735A633760N2183j109156l8898J78486M06246L1021J22860M89426J32779m3274
6725A855433P1233q79927M27758K1712j42990l51213k38416O2168O42122M30809
6715A898689n12875j41667J059199O02949m68906M35753j45236l27943r11629
6706A488334n89981R58298P75129j043681J099006k07842j549042J69093N00797
$$ y = [2814867, 3051122, 2299060, 2249812, 1522456, 1817862, 2103688, 1718667, 947726, 1106392, 1375064, 1269118, 2465672, 2921684, 2851400, 2864909, 3082765, 3437507, 4316510, 4594403, 4679506, 3580690, 3925740, 3401023, 3382544, 2734628, 2539492, 2916017, 2528614, 2251681, 1428888, 2371849, 2177487, 1250240, 1742938, 1452141, 1396497, 1640836, 1589147, 1227638, 1633760, 1685943, 576787, 537889, 716375, 1122621, 1153642, 1276502, 1765928, 1898707, 1855433, 1926666, 1046739, 1474497, 1496209, 1353219, 1002006, 763590, 825758, 1467880, 1898689, 1385814, 1244147, 2303346, 2906295, 2437389, 2873142, 2727906, 2399963, 1488334, 898353, 1856651, 2631780, 1588099, 2687105, 2479263, 930221, 1099314, 1600111]
6697A600111L75457O93698q34645j123629Q95462J407119r585m25310L69819o1507
6687B886990m94168j58317Q65314p61381j3590N04992J151292n68553r01641p41496
6677A769442k81610J091765l24558j15682J08804Q13204L09036n72772o76002
6668B121627j3912O99345J162748j283330m23837K35080j13779N16891n10754
6659B390079j069686P08526k62186K15630N99379K37510R8993m18925k3734n5028
6649B420558L49911L3965m60042j236012N7067J141725M25143l46470l06793J011319
6639C090371r38719K58336k5989M6693N5370M17733k48432L98966K09937J41118
6629C405384j118833p96848P93663J38376N63627R5471o07382j329l23o7090J40112
$$ y = [1600111, 1975568, 2669266, 1834621, 710992, 1606454, 3013573, 3003988, 2578678, 2948497, 2886990, 2392822, 2234505, 3099819, 2338438, 2324848, 2829840, 3981132, 3412579, 2510938, 1769442, 1487832, 2579597, 2255039, 2139357, 2248161, 3061365, 3370401, 2797629, 2121627, 2107715, 2807060, 3969808, 2686478, 2262641, 2497721, 2383942, 2900833, 2390079, 1320393, 2028919, 1766733, 1982363, 2581742, 2819252, 2918245, 2499320, 2475586, 2420558, 2770469, 2804434, 2344392, 1108380, 1165447, 2307172, 2732315, 2385845, 2079052, 3090371, 2151652, 2409988, 2383999, 2430692, 2486062, 2903795, 2655363, 3054329, 3264266, 3405384, 2286551, 1489703, 2283366, 2421742, 2985369, 3080840, 2473458, 2472129, 2471806, 2404716, 2544828]
6618B544828r69116P2934n39650L51447K82592k75043J57841K80640m41337N98551
6608B063687L90839L8094N89943L86986o41957k50168M87993P4190p63054K56599
6598B633152N88103J98628j65385q9902j67189R22470j98972p40783N36182M13100
6588C929404l76338K83755L14005J22424J16060J67304O35620J3263M5318m02515
6578D848300n56402L01988j30001n60252j29794M54548L70296N82190r08200k50763
6568D021910J067249J05022m85694p63191k0857N92892L13128P30590k0496J75156
6558E715709p7203n53312N08916L96846M03546l1573M27026M79589k94232J549691
6548H525003J829291K00298O61944R95454L68859J649280J003777J610519K033814
$$ y = [2544828, 1575712, 1648646, 1108996, 1460443, 1743035, 1467992, 1625833, 1906473, 1465136, 2063687, 2454526, 2492620, 3082563, 3469549, 2827592, 2577424, 3065417, 3139607, 2376553, 2633152, 3221255, 3419883, 3254498, 3164596, 2997407, 3919877, 3720905, 2980122, 3516304, 3929404, 3553066, 3836821, 4150826, 4273250, 4389310, 4556614, 5192234, 5205497, 5250815, 4848300, 4291898, 4593886, 4463885, 3903633, 3773839, 4228387, 4598683, 5180873, 4272673, 4021910, 5089159, 5194181, 4708487, 3945296, 3924439, 4517331, 4830459, 5561049, 5540553, 5715709, 5638506, 5085194, 5594110, 5990956, 6394502, 6362929, 6789955, 7269544, 6975312, 8525003, 10354294, 10554592, 11216536, 12211990, 12580849, 14230129, 15233906, 16844425, 18878239]
6539A8878239K491894K186079K882481K742577L547249K463816k75211k13259
6531C4703865k062054l069238k990106k853736l348508k328143j813278j201212
6523A5037590j235334j31559j588479j409701J07287j52265r2755n96428L5137
6514I973493j180357q7244q52105j12957O51176p41987Q07048l32192l72854M9131
6504G801152m46319p76224M7929J154574n8554n38637N39984M92239m55513p66339
6494F994292j43451q1354O87095l44779k1018L50301Q56938K85433j123244j17907
6484G342306l08813P1647L28629M41133N41068J2810K55663j06556J253239l85517
6474I445609j102221J120128j70082J055360N66979k47754J37755Q55030L18582
$$ y = [18878239, 21370133, 23556212, 26438693, 29181270, 32728519, 35192335, 34917124, 34703865, 32641811, 29572573, 26582467, 23728731, 20380223, 18052080, 16238802, 15037590, 13802256, 13670697, 12082218, 10672517, 10779804, 10627539, 10534784, 9938356, 9973493, 8793136, 8705892, 7853787, 7740830, 8392006, 7650019, 8457067, 8124875, 7752021, 7801152, 7354833, 6578609, 6626538, 7781112, 7722558, 7183921, 7723905, 8216144, 7760631, 6994292, 6850841, 6769487, 7456582, 7111803, 7090785, 7441086, 8298024, 8583457, 7460213, 7342306, 7033493, 7105140, 7433769, 7874902, 8415970, 8428780, 8684443, 8577887, 9831126, 9445609, 8343388, 9463516, 9293434, 10348794, 10915773, 10668019, 10805774, 11660804, 11979386]
6465A1979386j91207J082317J015088k41405J61794K33916L29420J56012j67979
6456A4357342N00905l47753J607372O35410o8377J192572M59724L02287Q8090
6447A8727572O67666J328252k76432K46158P51353J442311Q62793Q06192j98059
6438B4357806o43421K78153R70457O29826J209290J54122N01119R33213K017267
6429C0407832J445249J036844J339907J684344K045762J348717J274301K263658
6421D2846614K979332K196369L669941L247771K539051L591039L528993N308901
6413F9908011M867396M763781O452212O934304P423963J1200178J3128652J5721533
6405A40400030J8982423K0104862K2614690K6566943L2898164L8707341M6975336
$$ y = [11979386, 11788179, 12870496, 13885584, 13644179, 13805973, 14039889, 14369309, 14525321, 14357342, 14858247, 14510494, 16117866, 16753276, 16684899, 17877471, 18337195, 18639482, 18727572, 19395238, 20723490, 20447058, 20693216, 21444569, 22886880, 23749673, 24555865, 24357806, 23714385, 23992538, 24962995, 25592821, 26802111, 26956233, 27457352, 28390565, 30407832, 31853081, 32889925, 34229832, 35914176, 37959938, 39308655, 40582956, 42846614, 45825946, 48022315, 51692256, 54940027, 57479078, 61070117, 64599110, 69908011, 74775407, 79539188, 85991400, 92925704, 100349667, 111549845, 124678497, 140400030, 159382453, 179487315, 202102005, 228668948, 261567112, 300274453, 347249789]
6398C47249789N3303951M8341947L1585273m169243m4212807n9944668n3973628
6391C18180614m8450332m2483170l1389863k3336495j8759387j6171271j2785716
6384A24804380j1571539r731897q131449p467172o967387n471389n370144l924593
6376F6168810m404129m136123k903720k049919l268536j628236j598102j089035
6368D5091010j163434k503467r11924j389859k099546j291169k232748l52507
6360C3146356r64990j583750r04970j443328j494952m48785j281838k026599p24325
6351B2272819M8194j014894q63102j049981N85766m06643j138570k08900J025745
6342A9250434o1596r3007k45980L00961o0131j69905L96188L34542o53945r35616
$$ y = [347249789, 400553740, 448895687, 480480960, 476311717, 432098910, 372154242, 318180614, 269730282, 227247112, 195857249, 172520754, 153761367, 137590096, 124804380, 113232841, 103500944, 95369495, 87902323, 80934936, 75463547, 70093403, 66168810, 61764681, 57628558, 54724838, 52674919, 49406383, 47778147, 46180045, 45091010, 43927576, 41424109, 40512185, 39122326, 37022780, 35731611, 33498863, 33146356, 32181366, 30597616, 29692646, 28249318, 26754366, 26305581, 25023743, 22997144, 22272819, 22321013, 21306119, 20443017, 19393036, 19978802, 19572159, 18433589, 18224689, 19250434, 19188838, 19095831, 18849851, 19150812, 19090681, 18920776, 19316964, 19651506, 18997561, 18061945]
6332A8061945j441356N12397L19214r53207Q91217k41151q56862m5968P24443
6323A6970672m07069m53923m86115J523607N20808K89850l78182O21352j56058
6314A8044942J335787J303036J352350J70766L93219n05929M81784j224729m50131
6305B0901095l95188N2302R98930p23622n91187J79527O43561q24204M10934P95197
6295B1447345L60530P77771O61809L30008J162988J171038K370188J956596J197968
6286C1436241J260935J466325J000630Q06989n01216j22582q27917j746724j573475
6277C1199206p84690P06738n50487j362143M36009M72654q38692M58431J842231
6268C1579257J082147j99408J032566J616120L159495O08625J703073L233317
$$ y = [18061945, 16620589, 17132986, 17452200, 16498993, 17390210, 17149059, 16292197, 16246229, 16970672, 16563603, 16109680, 15623565, 17147172, 17667980, 17957830, 17579648, 18201000, 18044942, 19380729, 20683765, 22036115, 22206881, 22600100, 22094171, 22575955, 21351226, 20901095, 20505907, 20558209, 21557139, 20833517, 20242330, 20421857, 21065418, 20241214, 20652148, 21447345, 21807875, 22585646, 23247455, 23577463, 24740451, 25911489, 28281677, 30238273, 31436241, 32697176, 34163501, 35164131, 35971120, 35469904, 35347322, 34519405, 32772681, 31199206, 30414516, 31121254, 30570767, 29208624, 29644633, 30117287, 29278595, 29737026, 31579257, 32661404, 32461996, 33494562, 35110682, 38270177, 38878802, 40581875, 43815192]
6260D3815192J915391O60300J695290J009191L0159j228160j724635j167158j041585
6251D3963985j460226j073550j093555p65298j08192m34192j26835k78043N72736
6242C9196830O88267l34809j01637Q20907K516161J944652J237844K351562P42208
6233D9061985R38176O68640J912457P32110r2753k058444k606622k561863k157540
6224D3836146j405623j442568k619399j173248r95475l73731j7474m415n33279
6215C5270934O6203J59634J407257J003691M36030K93103J346694J38712O63811
6206D0786069J151221k17005L1558j566292p00691k238154k016624p15009j902205
6197C2612868k149577q86500k559447m43506m19975r63357O2853j133507l12967
$$ y = [43815192, 45730583, 46390883, 48086173, 49095364, 49125523, 47897363, 46172728, 45005570, 43963985, 42503759, 41430209, 40336654, 39571356, 39463164, 39028972, 38902137, 38624094, 39196830, 39885097, 39550288, 39448651, 40269558, 42785719, 44730371, 45968215, 48319777, 49061985, 50000161, 50668801, 52581258, 53313368, 53220615, 51162171, 48555549, 45993686, 43836146, 42430523, 40987955, 38368556, 37195308, 36199833, 35826102, 35808628, 35804213, 35270934, 35337137, 35496771, 36904028, 37907719, 38343749, 38636852, 39983546, 40122258, 40786069, 41937290, 41720285, 41751843, 40185551, 39484860, 37246706, 35230082, 34515073, 32612868, 30463291, 29576791, 27017344, 26573838, 26153863, 25190506, 25253359, 24119852, 23806885]
6188B3806885j29407m48262P82753O718O41368n72699M9565P11819j91564K42916
6178B4900092p06465o01986j401805j071397r24737l72669j494096q63954o98847
6169A6764136k01730O6529n65415m7899k21935L64684j247952o72335O6947P33297
6159A5038327R60209k82557q88474j31618o65817K43049Q9774N88852k47679j136035
6149A3568031r52202o91880M3287J29982J803o33828m80564M36526p4285n6194
6139A1290676l24111m4158l86908n64285p11471J248352J059134k61124M04935
6130A1711040q7145K2013J61026M602l16388j29257J20506k55600j123442P89853
6120A0897208m53592j55957o7859P47268k32859m73384l77321o95173J472284
$$ y = [23806885, 23677478, 23229216, 24011969, 24018687, 24660055, 24087356, 24136921, 24848740, 24657176, 24900092, 24193627, 23591641, 22189836, 21118439, 20193702, 19821033, 18326937, 17462983, 16764136, 16562406, 16628935, 16063520, 16015621, 15793686, 16158370, 14910418, 14238083, 14305030, 15038327, 15998536, 15715979, 14827505, 14695887, 14030070, 14273119, 14362893, 14951745, 14704066, 13568031, 12615829, 11923949, 11967236, 12097218, 12099021, 11465193, 10984629, 11421155, 11346870, 11290676, 10966565, 10922407, 10535499, 9971214, 9259743, 10508095, 11567229, 11306105, 11711040, 11623895, 11645908, 11806934, 11811536, 11495148, 11365891, 11486397, 11230797, 10107355, 10897208, 10443616, 10287659, 10219800, 10967068, 10734209, 10260825, 9883504, 9188331, 10660615]
6111A0660615k01749K52420m1900M55291M13508l94426r9704J9532m33495L42473
6101A0972565j9299j401453L61555j264435q88431j41404K53518r28531J56063
6092G100148n5202k34184O62155J4393K30688N91915Q6403l28597L25631P50925
6082I144275N91850o17664L42389R5176p45505O16534k3695j003045n35008K63971
6072H129278M54619L2548k17587q65067r3995k5295R72661N85248r00714p50052
6062G321644R06404K12524j00877J325989m76795o66021O31171k37695m54428
6053H461916j12768q11119R29820o02534j49324k86514j83951K9116m48251K80197
6043G106588J03130o57178J15767j60107k59673O84627l1052J190575j957N88163
$$ y = [10660615, 10458866, 10711286, 10669386, 11124677, 11538185, 11143759, 11044055, 11063587, 10630092, 10972565, 10953266, 9551813, 9913368, 8648933, 7760502, 7619098, 7872616, 6944085, 7100148, 7044946, 6810762, 7472917, 7487310, 7717998, 8309913, 8396316, 8067719, 8393350, 9144275, 9736125, 9118461, 9460850, 9556026, 8810521, 9427055, 9403360, 8400315, 7865307, 8129278, 8583897, 8616445, 8398858, 7533791, 7439796, 7414501, 8387162, 8972410, 8071696, 7321644, 8228048, 8440572, 8339695, 9665684, 9188889, 8522868, 9154039, 8916344, 8461916, 8349148, 7538029, 8467849, 7865315, 7715991, 7429477, 7245526, 7274642, 6826391, 7106588, 7209718, 6552540, 6668307, 6508200, 6248527, 6933154, 6902102, 8092677, 8090720, 8678883]
6033H678883Q8899j23850J83099L16234n00182j421327K71867p72225P37030j391605
6023F066823p29666Q26719j90115l31941q6506j176966m79082P10676n22723N40886
6013D628105j251232n20498K14382Q58204k87426j45744k77760k3277M97438j67805
6003C524387n78843n06222L1748l33879L27609J94243k03396J50595L20019m04858
5993B521403l80894R3385l2509j59161J71977K2602j94692P36463R2412L30809
5983C201795K74829n81951m02810O6783J28357p66783m86514J407671r3157q40262
5973A907958m4476m42029j70841L14043M51443L52273l5430j4527o47784O87625
5963B358255L18759j100930M2630k87715P09806k26973l16954R93782n83418j46661
$$ y = [8678883, 8767782, 8643932, 8827031, 9143265, 8643083, 7221756, 7493623, 6721398, 7458428, 6066823, 5337157, 6163876, 5973761, 5641820, 5555314, 4378348, 3899266, 4609942, 4087219, 4628105, 3376873, 2856375, 3070757, 3928961, 3641535, 3495791, 3218031, 3194754, 3692192, 3524387, 2945544, 2439322, 2471070, 2137191, 2464800, 2659043, 2455647, 2606242, 2926261, 2521403, 2140509, 2233894, 2201385, 2042224, 2214201, 2236803, 2042111, 2778574, 2870986, 3201795, 3476624, 2894673, 2491863, 2558646, 2687003, 1920220, 1433706, 2841377, 2748220, 1907958, 1863482, 1421453, 1250612, 1564655, 2016098, 2368371, 2332941, 2318414, 1670630, 2358255, 2677014, 1576084, 1618714, 1330999, 2040805, 1813832, 1496878, 2490660, 1907242, 1760581]
5953A760581j55983j37087j27723J246286l74966n6455l73789J1043K86212L12150
5943B390269P66872k43041O39131n32597K33025N92178l22370Q5293O32285N84559
5933D825604m96405L34226j99883r31883q16219N97942P58853j48058r7691Q3232
5923C909718p71306N92102n65071k29995j0789q1725m63898L78640J51231k20949
5913B687958L27325m69667L20156J30685J41771j383899J046034r3748N42460
5904C249075j64705M23341j76565L95080R25371n9518k88913J92651l50607M96494
5894D641704M56800k97105O12572O1407J58699L07715m55402M37912j28492l43620
5884E452190L04502K39616L54346q33551K2729R90776j69084M11260K93980O94974
$$ y = [1760581, 1604598, 1467511, 1339788, 2586074, 2211108, 2154653, 1780864, 1791907, 2078119, 2390269, 3157141, 2914100, 3553231, 3020634, 3253659, 3845837, 3523467, 3608760, 4241045, 4825604, 4329199, 4663425, 4463542, 3531659, 2715440, 3313382, 4072235, 3924177, 3826486, 3909718, 3138412, 3730514, 3165443, 2935448, 2924659, 2842934, 2379036, 2757676, 2908907, 2687958, 3015283, 2545616, 2865772, 2996457, 3138228, 1754329, 2800363, 2706615, 3249075, 3084370, 3507711, 3331146, 3726226, 4651597, 4592079, 4303166, 4495817, 4145210, 4641704, 5098504, 4801399, 5413971, 5475378, 5634077, 5941792, 5486390, 5924302, 5795810, 5452190, 5756692, 5996308, 6350654, 5517103, 5539832, 6530608, 6361524, 6772784, 7066764, 7761738]
5874G761738M48434O7308P55945P35266N23352O50628l1922M63057n03127P31695
5864A1602374J107758O88504J22290J396675J270205P22794J710899J156136J965839
5855B1743474J896523K343901L569337L227912L382926M604001O115901M998068
5847E1882043N677296O864185M778711J576303k611177p789003o796363p041521
5839D6540474o232847n109079l589597l191643l436585j719954k030673j728719
5831A9501377j701268j681406j061507p577j988971j86486m04762j180205l91989
5822A0897206M12906n91295j256171r25734n59643o45205o12899M80619J68093
5813G367877j223962q81889j02142K34866Q35199L92433L14537k82617j326224
$$ y = [7761738, 8210172, 8277480, 9033425, 9768691, 10292043, 10942671, 10910749, 11373806, 10870679, 11602374, 12710132, 13398636, 13520926, 14917601, 16187806, 16910600, 18621499, 19777635, 21743474, 23639997, 25983898, 29553235, 32781147, 36164073, 40768074, 46883975, 51882043, 57559339, 64423524, 69202235, 70778538, 68167361, 60378358, 53581995, 46540474, 40307627, 35198548, 31608951, 28417308, 24980723, 23260769, 21230096, 19501377, 17800109, 16118703, 15057196, 15049619, 13060648, 12874162, 12469400, 11289195, 10897206, 11310112, 10718817, 9462646, 8536912, 7977269, 7332064, 6719165, 7199784, 7367877, 6143915, 5262026, 5159884, 5394750, 6229949, 6622382, 6936919, 6654302, 5328078]
5804E328078M12622l65721M33966L04595J83823p28479j255466p8494J52836k69177
5794D118583Q19725j044014l28885J29142o53188j27924K3496j471791q5496J069721
5784B449369k66735q01320P02963p1208n97478O76873J222820j672192L63448
5775B006540L6165R87140k70671J66881M81864j150178p59863K93348J088849
5766B880075J17044k61972m5689n30858L11556m39102M84541L08257j44791J131953
5756C811014j037961Q3509J050677r0961l08260J724476M98446r314l44990j98544
5746E178092M26386P60665K48100P88178l62749J69962P5752o94280j088165j84327
5736E317614j305189M02722J12334o21229m75856n401j11232j054181n83039O12325
$$ y = [5328078, 5740700, 5374979, 5808945, 6113540, 6297363, 5568884, 4313418, 4234924, 4387760, 4118583, 4938308, 3894294, 3565409, 3694551, 3041363, 2913439, 2936935, 1465144, 1379648, 2449369, 2182634, 1381314, 2084277, 2013069, 1415591, 2092464, 3315284, 1643092, 2006540, 2042705, 3029845, 2759174, 2926055, 3407919, 2257741, 1497878, 1791226, 2880075, 2997119, 2735147, 2689458, 2158600, 2470156, 2031054, 2515595, 2823852, 2679061, 3811014, 2773053, 2856562, 3907239, 3816278, 3508018, 5232494, 5730940, 5721626, 5376636, 5178092, 5604478, 6365143, 6613243, 7401421, 7038672, 7208634, 7284386, 6590106, 5501941, 5317614, 4012425, 4415147, 4527481, 3906252, 3430396, 3424995, 3313763, 2259582, 1676543, 2288868]
5726B288868J085976l50502j2797k10568K83173j93874q73880L15535j030823
5717A301108J259929P28601o20932k17256m8488j629669k7219r6698J7280J091284
5707A757940n60742n7727O13386j28066j38597R56634J2246j26373n8111j119793
5697A150797k93754j47506j99924P7374K57870O49144m45521k10699J335255p8060
5687B094976o11942L96058J077286j489973M84532o17386m25249M99326o41561
5678G66067j54235k2839j02273O32938o65428q67549K00005J77046Q36486M1210
5668H41428M93649o0567j16598K41972l60722j89997j17204o72105P59994N82211
5658A402061q13890n94373J009223k99278k075j114119Q64376L65017j72996L27352
$$ y = [2288868, 3374844, 3024342, 3011545, 2800977, 3084150, 2890276, 2016396, 2331931, 1301108, 2561037, 3289638, 2668706, 2451450, 2402962, 773293, 746074, 649376, 666656, 1757940, 1197198, 1139471, 1752857, 1624791, 1486194, 2442828, 2455074, 2328701, 2270590, 1150797, 857043, 709537, 509613, 586987, 844857, 1494001, 1048480, 837781, 2173036, 2094976, 1483034, 1879092, 2956378, 1466405, 1950937, 1333551, 908302, 1407628, 766067, 611832, 588993, 486720, 1119658, 454230, -413319, -213314, -36268, 800218, 841428, 1335077, 1274510, 1157912, 1399884, 1039162, 849165, 731961, 59856, 819850, 1402061, 588171, -6202, 1003021, 703743, 701668, -412451, 451925, 816942, 643946, 971298]
5648I71298q62503O0359k161j143476n02058J486771J033312n89866m95775J45592
5638A01493l72047L99083l3877m43589k11081J96400l22213j00491Q32543k63423
5628b17202n74068o99992O02954R26744P0864q91972J43127Q55755m55413N61618
5618C22415l31856P68207o7024k56198j024206k62692J418777L3531j87554l93437
5608A9963N24438l15631R18592j136947o97756J32610R65663j214834O65266m34468
5598e73104m11685P58887l40877Q29123P76189k32094m08165P05961J36748n39557
5588G01426n71621M34919K87924J68403j071305l33331J925804p8581j57718P9069
5578A384989N6672o13462Q34698o39450j06862M6547J49761L98149r01556l08346
$$ y = [971298, 108795, 169154, 166993, -976483, -1478541, 8230, 1041542, 451676, -44099, 101493, -270554, 128529, 94652, -348937, -560018, -363618, -685831, -786322, 46221, -217202, -791270, -1491262, -888308, 38436, 109300, -782672, -639545, 216210, -239203, 322415, -9441, 758766, 691742, 435544, -588662, -851354, 567423, 600954, 413400, 19963, 544401, 228770, 1147362, 10415, -687341, -554731, 410932, -803902, -138636, -573104, -984789, -225902, -566779, 262344, 1038533, 806439, 398274, 1104235, 1240983, 701426, 129805, 564724, 852648, 1021051, -50254, -383585, 1542219, 1463638, 1305920, 1384989, 1441661, 828199, 1662897, 1023447, 916585, 963132, 1112893, 1511042, 609486, 301140]
5568C01140K52629O81333L3286Q58031k88171o32449R08192j96789j10649k94514
5558A512039m90883j85552q19118J449338j0808K99272p73931L39023N9256k16301
5548A162335L48124M2577Q3639K76551L11845Q83481l32891N78537r11215n00043
5538A942940q6011O23875Q27268m69755K91590j94289m45150j97027r1072O69606
5528B871975M05301o55536j05003J39410R33457N7634n79573L48056R89302N93434
5518D998457o8676K24863L32426n60443p46538O47440O79054L82747l48516l07676
5508E233138P8440j387746k11998J323982n19445m98981L23243Q6056Q68103r49793
5498D344999r41920J81116Q44119Q69456O46434o22505l2007P46016J06809m52879
$$ y = [301140, 553769, 1235102, 1268388, 2126419, 1838248, 1205799, 2113991, 1917202, 1806553, 1512039, 1021156, 835604, 16486, 1465824, 1455016, 1754288, 980357, 1319380, 1378636, 1162335, 1510459, 1553036, 1636675, 1913226, 2225071, 3108552, 2775661, 3354198, 2442983, 1942940, 1856929, 2480804, 3308072, 2838317, 3129907, 2935618, 2490468, 2293441, 2202369, 2871975, 3277276, 2621740, 2516737, 2656147, 3589604, 3647238, 3067665, 3415721, 4405023, 4998457, 4929781, 5154644, 5487070, 4926627, 4180089, 4827529, 5506583, 5889330, 5540814, 5233138, 5311578, 3923832, 3711834, 5035816, 4516371, 4017390, 4340633, 4426689, 5294792, 4344999, 3403079, 3584195, 4428314, 5297770, 5944204, 5321699, 5289692, 6035708, 6142517, 5689638]
5488E689638r23123N94685M20363r5474m99734Q0993N10116M65786l18123o71905
5478E253222O12042J83771j455502L69502J626551K3627L46481p82545n5192J142575
5468G264532q48575l34541K02166L363K91568j007393L84756L63149n66230L0695
5458E783490q1908J568008O08746l50648j27903K73806l3160k11091l1636q6645
5448G311059o8459P12054N12289K77400O11839L55311J75061J135432j23991M76794
5438A1374789J243402L64855j46664N7791J170259K4468n37669o3919J159224
5429A4646536L66899O95441P76471M62820J121035J257157P61669l16889Q1083
5420A9852222m12125j917759r83107q94659j150994n76773j73483J42371N86844
$$ y = [5689638, 4766515, 5361200, 5781563, 5686089, 5186355, 5267348, 5777464, 6243250, 5925127, 5253222, 5865264, 6049035, 4593533, 4963035, 6589586, 6613213, 6959694, 6177149, 6121957, 7264532, 6415957, 6081416, 6283582, 6286945, 6578513, 5571120, 5955876, 6319025, 5752795, 5783490, 5701582, 7269590, 7878336, 7527688, 7399785, 7673591, 7640431, 7429340, 7397704, 7311059, 7242600, 7954654, 8466943, 8744343, 9356182, 9711493, 9886554, 11021986, 10897995, 11374789, 12618191, 12983046, 12836382, 12894173, 14064432, 14088900, 13551231, 13487312, 14646536, 15013435, 15708876, 16485347, 16948167, 18069202, 19326359, 20088028, 19771139, 19852222, 19440097, 17522338, 16539231, 15644572, 14493578, 13916805, 13743322, 13885693, 14472537]
5411A4472537P2151o19543J004401R8367J02029J329858O59560J139955L25650
5402A8584965P55121J319379P80984j386311o78117p78293j549586p29237r02717
5393A5416188j370397j027099q13879k70834n52743p12587l98278q29351m51137
5384H989883L91111m65942J63052l3739o51872L85600q46182M43831L40688K64381
5374H980811k38223j465974m15716L09481J042772p45787p84858l07637L07913
5365F682782P48644k47544j071462L26772K21134o1198n51632K26636O8484m4573
5355F298043R72790q68623o89955j90919P72788M25485j562970l89347M52187
5346E219479M16285m0742L79453J0181p60205l02069O21324K5827n03699j82954
$$ y = [14472537, 14544688, 13925145, 14929546, 15027913, 15129942, 16459800, 17119360, 18259315, 18584965, 19340086, 20659465, 21440449, 20054138, 19376021, 18597728, 17048142, 16318905, 15416188, 14045791, 13018692, 12204813, 11933979, 11381236, 10668649, 10270371, 9441020, 8989883, 9380994, 8915052, 9078104, 9044365, 8392493, 8778093, 7931911, 8375742, 8716430, 8980811, 8742588, 7276614, 6860898, 7170379, 8213151, 7467364, 6682506, 6374869, 6682782, 7431426, 7183882, 6112420, 6439192, 6660326, 6599128, 6047496, 6274132, 6342616, 6298043, 7270833, 6402210, 5712255, 5521336, 6294124, 6719609, 5156639, 4767292, 5219479, 5635764, 5595022, 5974475, 5984656, 5224451, 4922382, 5543706, 5569533, 5065834, 4882880]
5336D882880j57398K40015m51537j63670J385703l5800o62707q01346j5255J089531
5326E310416m55071M33181l4636j28051j252636J50618R1082j140619J91053J511835
5316D677172p86397M46428n13455n85405J029413o20102k40107J104866M07689
5307D920102j329676p808O50824j58701p7574M74418L89153n13633J065415o15896
5297D796624m94490L69508m12970m02573l12086Q43360O36377q82956J041437
5288E182231P9083j88987k46860k97744N20435j95761o7424J31028O57318L82618
5278E955937q65502l15254N72774k28224l24387K81902J54220l12365P1374R42755
5268E933230L71618r05508J392824N16596n07578K16758k54360n41559M375k8433
$$ y = [4882880, 4725482, 4965497, 4513960, 4350290, 5735993, 5700193, 5037486, 4236140, 4220885, 5310416, 4855345, 5288526, 5253890, 5125839, 3873203, 4023821, 4114903, 2974284, 3165337, 4677172, 3890775, 4337203, 3823748, 3238343, 4267756, 3647654, 3407547, 4512413, 4920102, 3590426, 3582618, 4233442, 4074741, 3997167, 4471585, 4860738, 4347105, 5412520, 4796624, 4302134, 4671642, 4258672, 3856099, 3544013, 4387373, 5023750, 4140794, 5182231, 5261314, 5072327, 4825467, 4527723, 5048158, 4852397, 4784973, 4916001, 5573319, 5955937, 5090435, 4775181, 5347955, 5119731, 4795344, 5077246, 5231466, 4919101, 4990475, 5933230, 6304848, 5399340, 6792164, 7308760, 6801182, 7017940, 6763580, 6222021, 6226396, 6197963]
5258F197963Q07808r56494L39202R55367j61691P09411k73819P80174n05279l21007
5248G571635O97338k60666R34760J467875J39825N63793O25491K65480J082924
5239A3088455j24299J577912j49921J036598Q27707N82776P06147O75664o67795
5230A7553244m15433j73543p07941M22274m98072p87258J37402L79409m07967
5221A5502115m41708j69522p792K50629J80859M75206R15083M1453q38497M12879
5211A6320705j40524k58228n41310p44846L03935m2361J32639O31011J8849J76125
5201A5855995j628263l2937J43139j13602Q7102j91302J214646L24133N38592
5192A6197503j61971K2352L76716Q93915n33172m63515k29443M50692k04584N37133
$$ y = [6197963, 7005771, 6049277, 6388479, 7343846, 7182155, 7891566, 7617747, 8397921, 7892642, 7571635, 8268973, 8008307, 8943067, 10410942, 10550767, 11114560, 11740051, 12005531, 13088455, 12964156, 14542068, 14392147, 15428745, 16256452, 16839228, 17545375, 18221039, 17553244, 17137811, 16964268, 16256327, 16678601, 16180529, 15393271, 15530673, 15910082, 15502115, 15060407, 14890885, 14883093, 15133722, 15314581, 15789787, 16704870, 16746323, 15907826, 16320705, 16180181, 15921953, 15380643, 14635797, 14939732, 14897371, 15030010, 15661021, 15679870, 15855995, 14227732, 14194795, 14337934, 14224332, 14311434, 14120132, 15334778, 15658911, 16197503, 16035532, 16057884, 16434600, 17328515, 16795343, 16331828, 16102385, 16553077, 16348493, 16885626]
5182A6885626P90012N22400n3204P55333j25585M13946J59892l17535k18765K68523
5172A9080643Q35844Q28346P37593J71986Q01220Q01552J122761O47838k87689
5163B4740094O75838P59463J486992N06114N30419N3912J020651J003585M50506
5154C1227574Q47061J407501M98806K077935J381472N4407J784904J488692J488132
5145D2256484P22050j26547R70466K367121K398710K119007J484459J666368J631184
5136E5489302J770831N80584O33003J926025O32889R05734J212580R45564K718077
5127F6814589J871318J852155K747281K986464K366797K767094K368660L547443
5119H7321801L657543L440872L929295N211303N195918O413597N691048O667374
$$ y = [16885626, 17675638, 18198038, 18144834, 18900167, 18774582, 19188528, 19348420, 19030885, 18812120, 19080643, 19916487, 20744833, 21482426, 21654412, 22455632, 23257184, 24379945, 25027783, 24740094, 25415932, 26175395, 27662387, 28168501, 28698920, 28752832, 29773483, 30777068, 31227574, 32074635, 33482136, 33980942, 36058877, 37440349, 37494756, 39279660, 40768352, 42256484, 42978534, 42851987, 43822453, 46189574, 48588284, 50707291, 52191750, 53858118, 55489302, 57260133, 57840717, 58473720, 60399745, 61032634, 61938368, 63150948, 64096512, 66814589, 68685907, 70538062, 73285343, 76271807, 78638604, 81405698, 83774358, 87321801, 90979344, 94420216, 98349511, 103560814, 108756732, 115170329, 120861377, 127528751]
5111A27528751O345936P420433Q053526Q996436Q478683Q562909R387682J1163924
5103A95938280J0624313R924457J1167749J0467248J1127355R932279Q368442
5096B67550123O770654N432667L883775J687708M40688k93186m297937o925846
5088B74248646p274021q634645j0724693j1026411j0556507r904065j0365665
5081B05762639j0442548r753447r940595r498030p086453q099346p506075o854421
5073A36581724o280157o637758o395216n412452m734058m660021m074018l806582
5065I4581462m772261l447471l025591l257103l010564k722450k024366k338120
5057F9983536l018114j835712k234768k267870k000581j953571j280314k200061
$$ y = [127528751, 133874687, 141295120, 149348646, 158345082, 166823765, 175386674, 184774356, 195938280, 206562593, 216487050, 227654799, 238122047, 249249402, 259181681, 267550123, 274320777, 279753444, 283637219, 285324927, 285765615, 285472429, 281174492, 274248646, 266974625, 258339980, 247615287, 236588876, 226032369, 216128304, 205762639, 195320091, 185566644, 175626049, 166128019, 159041566, 150942220, 143436145, 136581724, 130301567, 123663809, 117268593, 111856141, 107122083, 102462062, 98388044, 94581462, 89809201, 86361730, 83336139, 80079036, 77068472, 74346022, 72321656, 69983536, 66965422, 65129710, 62894942, 60627072, 58626491, 56672920, 55392606, 53192545]
5049E3192545j641756j162154k332930j386360j560902j89872q34936p32341K55501
5040D3606795j251950j808566j768438o10083K39086j96050n42560k1340j319807
5031C6327087r46484k88395o8326p36598q47811m00709k34295M55519m10053r66158
5021C1883777n3267M27129k71730p65789n22179P46711n75506j65502O73067j217092
5011C0159619Q58581j10515r49115o27590m03273j098726r5046K75149J52638
5002B8161722L93301q533q45299r8655J99769r85343N9361j173526K19539j37601
4992B5784735L03292M24604k17081o79924M0748K16869j3937r2536K07333K434
4982B5976537K29101P21736n84507j359581O42771Q06493M62941R57651m35474
$$ y = [53192545, 51550789, 50388635, 48055705, 46669345, 45108443, 44918571, 44083635, 43351294, 43606795, 42354845, 40546279, 38777841, 38167758, 38406844, 38210794, 37668234, 37646894, 36327087, 35380603, 35092208, 35023882, 34287284, 33439473, 33038764, 32804469, 33259988, 32849935, 31883777, 31830510, 32257639, 31985909, 31220120, 30697941, 31444652, 30869146, 30703644, 31376711, 30159619, 31018200, 30907685, 29958570, 29330980, 28927707, 27828981, 27733935, 28009084, 28161722, 28555023, 28546490, 27701191, 27602536, 27802305, 26816962, 26876323, 25702797, 25922336, 25784735, 26088027, 26512631, 26295550, 25615626, 25656374, 25873243, 25859306, 25766770, 25974103, 25976537, 26205638, 26927374, 26342867, 24983286, 25626057, 26432550, 26895491, 27853142, 27417668]
4973B7417668o179j74013J95685J000822P73710n45239L17522L89027R64860k39181
4963C0094682J169828M19488Q2354j60149J549001L69944M09307J41463j1521
4954C4064397j04613k96608P62573k30327n2378r67258K61652R72567N14681p70069
4944C4154617J568035N00020P07445K47945P4451n2587K05399o5771l25771Q67804
4934C7881587J557416N45655k19115J001085J377115K66146p43862L85741J080762
4925D3132530Q41617M34569L89289K99403L60355N55934L83668J786748J05493
4916D8289606P96858K084837K027894J781527J843021J398203J323088K670859
4908F2215893K819174K637789K870219M441796L342552L219393L111033K801700
$$ y = [27417668, 27411489, 27237476, 27433161, 28433983, 29207693, 28662454, 28979976, 29369003, 30333863, 30094682, 31264510, 31683998, 31766352, 31606203, 33155204, 33525148, 33934455, 34075918, 34064397, 33959784, 33663176, 34425749, 34195422, 34143044, 33175786, 33437438, 34410005, 34924686, 34154617, 35722652, 36222672, 36930117, 37178062, 37252513, 37199926, 37405325, 37339554, 37013783, 37881587, 39439003, 39984658, 39765543, 40766628, 42143743, 42409889, 41666027, 42051768, 43132530, 43974147, 44408716, 44798005, 45097408, 45457763, 46013697, 46397365, 48184113, 48289606, 49086464, 51171301, 53199195, 54980722, 56823743, 58221946, 59545034, 62215893, 65035067, 67672856, 70543075, 74984871, 78327423, 81546816, 84657849, 87459549]
4900H7459549K940305J062391K063306J995369O24646q39075n82516L58495m30307
4891I4652163k52228l76663J061030J569745J556113K023498K229718N78232O15071
4882A03656679J624052Q94814L57136n92607j361144j621402l017095k364114
4874I7576319k403836k202653k152743l055014l38444k16897k628290j927375
4866H2651067k157007j500176j389899k766214k095008k081529r17151j429220
4858F8314863j062091j627612j214276j029227o60752j239607l66359j380517
4850E9734422j485283l9262r18462q7227q80840p31501R90547j36602j084327
4841E5361465M49832q70618q32332j31897p3149M71915j74332l6490M81861q05287
$$ y = [87459549, 90399854, 91462245, 93525551, 95520920, 96145566, 95306491, 94723975, 95082470, 94652163, 94399935, 94023272, 95084302, 96654047, 98210160, 100233658, 102463376, 103041608, 103656679, 105280731, 106175545, 106532681, 105940074, 104578930, 102957528, 99940433, 97576319, 95172483, 92969830, 90817087, 87762073, 87423629, 87206732, 84578442, 82651067, 80494060, 78993884, 77603985, 74837771, 72742763, 70661234, 69744083, 68314863, 67252772, 65625160, 64410884, 63381657, 62720905, 61481298, 61114939, 59734422, 58249139, 58209877, 57291415, 57204188, 56323348, 55591847, 56582394, 56445792, 55361465, 55811297, 54940679, 54108347, 53976450, 53903301, 54375216, 54200884, 54164394, 54646255, 53840968]
4831E3840968N1102m58678p55651m8409l75655K87159J081408N82663o86330K30274
4821E3748851L39495q08196O00858K43767r5947m16451p2933J47794j492286j065796
4811E1129156K81809k95833l47084J065264N33222q98210j61612K33001r00323
4802E0639390j564919j857602K74501M7562j113215j151291p50196P46080j654710
4793D3615600j53472O18977j8971L81960m68194q63176o21359J161570O3000r12381
4783D2803554q05351j05003P33622k55970J169787K77600k12146J360191J805611
4774D6771895j5791L60342N59056J469009O80489J186624M67218j233874j429704
4765D8815264J30634M6750j064157o46499n32841n90423J93157j08532N13396
$$ y = [53840968, 53892070, 53433392, 52677741, 52629332, 52253677, 52540836, 53622244, 54204907, 53518577, 53748851, 54088346, 53280150, 53881008, 54124775, 54028828, 53612377, 53539444, 53687238, 52194952, 51129156, 51410965, 51115132, 50768048, 51833312, 52366534, 51468324, 51306712, 51539713, 50639390, 49074471, 47216869, 47491370, 47538932, 46425717, 45274426, 44524230, 45270310, 43615600, 43462128, 44081105, 44062134, 44444094, 43975900, 43112724, 42491365, 43652935, 43715935, 42803554, 41998203, 41893200, 42626822, 42370852, 43540639, 43818239, 43606093, 44966284, 46771895, 46756104, 47116446, 47675502, 49144511, 49825000, 51011624, 51478842, 50244968, 48815264, 48945898, 48992648, 47928491, 47281992, 46749151, 46158728, 46351885, 46243353, 46756749]
4756D6756749M188q28844L93395M45628J749454j11573j24111r01290J206522
4747D8590118J184340N08017J086696m0729K28722J67955J280390M38151M49320
4738E3892980P49236P53854K038606J361569R67939L91557J179982O50408P90996
4729F2777127O09003O68238o15589o69591J04422l80249j129342k36347m95317
4720F0632355j396708l46342R60982P5580K27640r1537P48010N20016R79234K41806
4710F2551036L1617k88943Q09401P82234l91801J777239J219639J265269J412616
4701F9168307J760659K477840J739703J366816J375088Q97626q0592L40744k32087
4692G8814104J137063n87131j602026k0662r75678k13562L57002L87561q35163
$$ y = [46756749, 46760937, 45932093, 46325488, 46771116, 48520570, 48408997, 48284886, 47383596, 48590118, 49774458, 50282475, 51369171, 51328442, 51557164, 51725119, 53005509, 53443660, 53892980, 54642216, 55396070, 57434676, 58796245, 59764184, 60155741, 61335723, 61986131, 62777127, 63386130, 64054368, 63438779, 62769188, 62873610, 62493361, 61364019, 61127672, 60632355, 59235647, 58889305, 59850287, 59925867, 60153507, 60061970, 60809980, 61329996, 62309230, 62551036, 62582653, 62293710, 63103111, 63885345, 63493544, 65270783, 66490422, 67755691, 69168307, 70928966, 73406806, 75146509, 76513325, 77888413, 78786039, 78705447, 79046191, 78814104, 79951167, 79364036, 77762010, 77741348, 76765670, 76552108, 76909110, 77296671, 76461508]
4683G6461508J370449R42116L39539N87383O39547J663834J775324J432253J088530
4674H6300483K272272L508803M013807M260273M211709M962411N187936N795373
4666A20513067P069373N562980N838512M883943L133180K483235Q20945j078927
4658A49226308k913522m514480o130092n491627n342206o071890o136181m993371
4650A07632939m224831m774971n387254l930891l011713k778523k185131k183812
4642G9155813j534192j790265k491230j211657k046039j708904r79029j103747
4634F6290750j828014j414344r79361r74995j073315j645907p13415P8387q53341
4625E6886445j492623k052697j49971j63019j91912k5845j171280j095777j040646
$$ y = [76461508, 77831957, 78774073, 79113612, 79700995, 80340542, 82004376, 83779700, 85211953, 86300483, 88572755, 92081558, 96095365, 100355638, 104567347, 109529758, 114717694, 120513067, 127582440, 133145420, 138983932, 143867875, 147001055, 149484290, 150305235, 149226308, 146312786, 141798306, 135668214, 130176587, 124834381, 118762491, 112626310, 107632939, 103408108, 98633137, 93245883, 89314992, 86303279, 83524756, 81339625, 79155813, 77621621, 75831356, 73340126, 72128469, 70082430, 68373526, 67394497, 66290750, 64462736, 63048392, 62069031, 61094036, 60020721, 58374814, 57661399, 57739786, 56886445, 55393822, 53341125, 53191154, 53028135, 52836223, 52810378, 51639098, 50543321, 49502675]
4616D9502675N04299j922938l35393O91262p86914j363478j049109Q77565J39303
4607D6257272Q28341M71381o99124j082295J039879k8778o78807o35884j081946
4598D4390039J15164J96047j347781N10094j337L32334o79745j10835R28368r09906
4588D3422442m41156q2940J51557p82867m18576l23607n78143O96546M26218j095494
4578D0973980j42543R14659j32431o37695O6660O04697k24076n00362K81941P77561
4568D1982391L24997n75278K44731K67165m12725P41835j122352O9554J024917
4559D2545235J76497m42634r28296J064231O60017Q4976L18629q60782l85512
4550D2232361O62972k30763o71489o92722N65362n67296K42620J27849q4451q96769
$$ y = [49502675, 50006974, 48084036, 47748643, 48439905, 47652991, 46289513, 45240404, 46117969, 46257272, 47085613, 47556994, 46857870, 45775575, 46815454, 46786676, 46107869, 45471985, 44390039, 44505203, 44701250, 43353469, 43863563, 43862226, 44194560, 43514815, 43403980, 44332348, 43422442, 42981286, 42898346, 43049903, 42267036, 41848460, 41524853, 40946710, 41643256, 42069474, 40973980, 40831437, 41746096, 41613665, 40975970, 41042630, 41647327, 41423251, 40922889, 41204830, 41982391, 42307388, 41732110, 41976841, 42244006, 41831281, 42573116, 41450764, 41520318, 42545235, 42721732, 42279098, 41350802, 42415033, 43075050, 43160026, 43478655, 42617873, 42232361, 42895333, 42664570, 41993081, 41300359, 41865721, 41298425, 41541045, 41668894, 41584443, 40687674]
4540D0687674n35q4865J85236n90720j52046j73017P64135M5660j19057R7278
4530D0659743q29287q18918n87126k37218L4578J89287m59439r2590k04945K28466
4520C7882551q8798l60548o91875J185116j32817p43705j7863m5890K6528O87906
4510C7700605m2513m00411J183637M25040L59625m23495O67369L77476J467820
4501D1315153m35958O6835O80923O63914L50480K35614m52271K79946P71891R22278
4491D4398805k12277J89511Q28249l12964J109681J681402J39865P66016L25534
4482D8913822J95034J590982R26879N92690Q40222L72925K40275J786680K84152
4473E5743661P37790P23306J545480R15377P73046J169725R29491O23994O11036
$$ y = [40687674, 40687139, 40602274, 40787510, 40196790, 40044744, 39871727, 40635862, 40681522, 40562465, 40659743, 39830456, 39011538, 38424412, 38187194, 38221772, 38411059, 37951620, 37859030, 37654085, 37882551, 37793753, 37433205, 36741330, 37926446, 37793629, 37049924, 37032061, 36986171, 37012699, 37700605, 37658092, 37257681, 38441318, 38866358, 39225983, 38802488, 39469857, 39847333, 41315153, 40879195, 40946030, 41626953, 42290867, 42641347, 42876961, 42424690, 42704636, 43476527, 44398805, 44186528, 44376039, 45204288, 44891324, 46001005, 47682407, 47822272, 48588288, 48913822, 49108856, 50699838, 51626717, 52219407, 53059629, 53432554, 53672829, 55459509, 55743661, 56481451, 57204757, 58750237, 59665614, 60438660, 61608385, 62537876, 63161870, 63772906]
4464F3772906J779880J056779J119375N66212m2259O50585O27835Q52286Q08294
4455G1191893Q93968J892101Q72060P06662J182393Q93496J668925k4956J133979
4446H0410521K061173J153087P16790K85762M64074J125539J123258P79284Q12429
4437H8931917J106462L92370O28051J91814J432392Q42575J094233K30594J575429
4428I6425837J297018K557633O21203L60870J366167J431352J691093K439906
4420A08191079J797999K759417K906750J777435L066253K475962K365330K410675
4412A27750900K111991K689004J778255K143431K849187K761181K269573K272198
4404A46625720K522275J394891L164531K879048K865724K832481L521052L565288
$$ y = [63772906, 65552786, 66609565, 67728940, 68295152, 68252893, 68903478, 69531313, 70383599, 71191893, 72085861, 73977962, 74850022, 75556684, 76739077, 77632573, 79301498, 79276542, 80410521, 82471694, 83624781, 84341571, 84627333, 85091407, 86216946, 87340204, 88119488, 88931917, 90038379, 90430749, 91058800, 91250614, 92683006, 93525581, 94619814, 94850408, 96425837, 97722855, 100280488, 100901691, 101262561, 102628728, 104060080, 105751173, 108191079, 109989078, 112748495, 115655245, 117432680, 120498933, 122974895, 125340225, 127750900, 129862891, 132551895, 134330150, 136473581, 139322768, 142083949, 144353522, 146625720, 149147995, 150542886, 153707417, 156586465, 159452189, 162284670, 165805722, 169371010]
4396A69371010L255306M214630M442647K542980N623722M162576L698255M931253
4388B02242379L375944L055681K136006L039695K529009K218205K762862K218630
4380B23578411K826043L274693L265473M061175M170889L533496L264816M291819
4372B52266815M359663M678184L968974M096107L483825M191591L758447L192854
4364B83996460K969908K692203L609532L397865L752100K297933L166923J888129
4356C07771053K226883K757782L312047J827628J854485K235799J986923J303816
4348C25276416K516340K975384J381584J266795K280796J899718P99290K203908
4340C40600231R44233K059451J010461R26525P05470j03487R83855J44138r68848
$$ y = [169371010, 172626316, 176840946, 181283593, 183826573, 189450295, 193612871, 197311126, 202242379, 205618323, 208674004, 210810010, 213849705, 216378714, 218596919, 221359781, 223578411, 226404454, 229679147, 232944620, 237005795, 241176684, 244710180, 247974996, 252266815, 256626478, 261304662, 265273636, 269369743, 272853568, 277045159, 280803606, 283996460, 286966368, 289658571, 293268103, 296665968, 300418068, 302716001, 305882924, 307771053, 309997936, 312755718, 316067765, 317895393, 319749878, 321985677, 323972600, 325276416, 327792756, 330768140, 332149724, 333416519, 335697315, 337597033, 338396323, 340600231, 341544464, 343603915, 344614376, 345540901, 346246371, 346142884, 347126739, 347270877, 346302029]
4331C46302029J32205j6646r16879k23926j333823j568694j426116k43986k373244
4322C38330920k093354k721890l454648j836817j557164l296186l634261l425788
4314C16310812j814736l419389l325688k914196l956540k651918l780495m294259
4306B90153591l108542k968243k246372l529666n345419l507729l106476l056558
4298B63284586m021207m403232k860997m292492m288028l264491l625766m920158
4290B31608215l293035l308004l755857k340482l659391l823574l198854k023770
4282B06205248k446857k880087l281178k087130k368261l021219k601458j847805
4274A85671253l004114l281580l136545k693850j419539k532010l013342l846653
$$ y = [346302029, 346434234, 346417588, 345500709, 345276783, 343942960, 342374266, 340948150, 340704164, 338330920, 336237566, 333515676, 330061028, 328224211, 326667047, 323370861, 319736600, 316310812, 314496076, 311076687, 307750999, 304836803, 300880263, 298228345, 294447850, 290153591, 287045049, 284076806, 281830434, 278300768, 272955349, 269447620, 266341144, 263284586, 259263379, 254860147, 251999150, 247706658, 243418630, 240154139, 236528373, 231608215, 228315180, 225007176, 221251319, 218910837, 215251446, 211427872, 208229018, 206205248, 203758391, 200878304, 197597126, 195509996, 193141735, 190120516, 187519058, 185671253, 182667139, 179385559, 176249014, 173555164, 172135625, 169603615, 166590273, 162743620]
4266A62743620k438521k698171k493509j102401k138476n39751j525073j044241
4258A48763477j573624n00357j80433j344876o33520k128949j667296j668895
4250A39065527k466999j122723j775277k511236k177953j581893j973401j002348
4242A24453697j546311j560824j806200r76063p51401q62446l87337j23533r17921
4233A15521661k85205k04999j610700j209991q7780J89396k04976j4535o57301
4224A11435570k28409j569280K99601q8642p33985Q2225j191962j544722q25978
4215A05634418j262557o71506j8580j233200j563411j056871q59991O36579M08651
4206A00013532K29220K13270j26889K13943L49191N26749m91623L65417N05823
$$ y = [162743620, 160305099, 157606928, 155113419, 154011018, 151872542, 151332791, 149807718, 148763477, 147189853, 146689496, 146509063, 145164187, 144530667, 142401718, 140734422, 139065527, 136598528, 135475805, 133700528, 131189292, 129011339, 127429446, 125456045, 124453697, 122907386, 121346562, 119540362, 118564299, 117812898, 116950452, 116563115, 116439582, 115521661, 115236456, 115031457, 113420757, 112210766, 112122986, 112312382, 112107406, 112092871, 111435570, 111207161, 109637881, 109937482, 109848840, 109114855, 109197080, 108005118, 106460396, 105634418, 104371861, 103700355, 103681775, 102448575, 100885164, 99828293, 98968302, 99604881, 100013532, 100242752, 100456022, 100329133, 100543076, 100892267, 101419016, 100927393, 101292810, 101798633]
4197A01798633J032707l3490N86568N80166J50692o05452L52275N08641K00662
4188A04571402K84981Q14194O57391J91496m37722J353635Q27023P89722J790796
4179A10842918N10546O15702J003033J962223J728990J613684R56218J943906
4171A21177220K297983L840860K482884L433404K878042L190013L677298L536476
4163A46514180L111563M951125N549220N401004N230227N248443O958120O468134
4155A89432016Q399379R978193R163796R453283J0701287J1605910J2339399J3654834
4147B74728097J4810107J4525196J5971272J7865171J7741641J7359836J7255915
4140C90257235J8201168J7442867J4661269J2484894R873654M876053J467302
$$ y = [101798633, 102831340, 102797850, 103384418, 103964584, 104115276, 103509824, 103862099, 104370740, 104571402, 104856383, 105670577, 106327968, 106519464, 106081742, 107435377, 108262400, 109052122, 110842918, 111353464, 111969166, 112972199, 114934422, 116663412, 118277096, 119233314, 121177220, 123475203, 127316063, 129798947, 133232351, 136110393, 139300406, 142977704, 146514180, 149625743, 154576868, 160126088, 165527092, 170757319, 176005762, 182963882, 189432016, 197831395, 207809588, 216973384, 226426667, 237127954, 248733864, 261073263, 274728097, 289538204, 304063400, 320034672, 337899843, 355641484, 373001320, 390257235, 408458403, 425901270, 440562539, 453047433, 462921087, 467797140, 469264442]
4133D69264442j047997p036570r724256j2896961j5784826j7188500j7451563
4126C88133769j7116302j7866761j8540918j6471966j5243256j4594447j4030644
4119B74269475j3764488j2312037j0775043j0452099r895094r586929q998327
4112A98485458p122674o302543n705318o753629n336751m573500m962655m128975
4104A53599413m396762l274028l405936l626251k459851l398218l040100k532014
4096A27466253k317668j616914j736460j903315r99003m64153j655789m66600
4088A16306351m82639q7312n6884L7382R22065N54553J537138K862252J680342
4079A23273248N63574K108114L097163K907577K600085K605420L240846L744297
$$ y = [469264442, 468216445, 461179875, 451455619, 438558658, 422773832, 405585332, 388133769, 371017467, 353150706, 334609788, 318137822, 302894566, 288300119, 274269475, 260504987, 248192950, 237417907, 226965808, 217070714, 207483785, 198485458, 191362784, 185060241, 179354923, 172601294, 167264543, 162691043, 157728388, 153599413, 149202651, 145928623, 142522687, 138896436, 136436585, 133038367, 129998267, 127466253, 125148585, 123531671, 121795211, 119891896, 118892893, 118428740, 116772951, 116306351, 115823712, 115736400, 115679516, 115716898, 116638963, 117193516, 118730654, 121592906, 123273248, 123836822, 125944936, 129042099, 131949676, 134549761, 137155181, 140396027, 144140324]
4071A44140324L779779L978552L252437M002131L648199J616751K87480j54306
4063A64551347k519508k911531l727724l571728l942393l667077l925561k816293
4055A37469532l154073j340501j906816k485404j887808j335338j956399j923614
4047A21479579j435155l263278k285235j788365j567494p08333j267293m10966
4039A08753460p96455j366100k89274q58466R5843q13225j374870j803194j077976
4030A00469743l116o44828j090902l66048j415641Q09910J210337L14949Q51626
4021A00136030M04468J387627K287392J809238K270605L095915L249082K998654
4013A17639011K086280J891530J624100P18457L3687j045351j603861k157673
$$ y = [144140324, 147920103, 151898655, 155151092, 159153223, 162801422, 164418173, 164705653, 164551347, 162031839, 159120308, 155392584, 151820856, 147878463, 144211386, 140285825, 137469532, 134315459, 132974958, 131068142, 128582738, 126694930, 125359592, 123403193, 121479579, 120044424, 116781146, 114495911, 112707546, 111140052, 110431719, 109164426, 108753460, 107957005, 106590905, 106301631, 105443165, 105539008, 104725783, 103350913, 101547719, 100469743, 100466627, 99821799, 98730897, 98364849, 96949208, 97759118, 98969455, 99284404, 100136030, 100540498, 101928125, 104215517, 106024755, 108295360, 111391275, 114640357, 117639011, 119725291, 121616821, 123240921, 123959378, 123993065, 122947714, 121343853, 119186180]
4005A19186180j386275k098876k623425k811778k255837j577918j717263l545855
3997A01168953l014112j045846l55175j097563o01150l91698j48258o05562k24037
3988I3685552l20385r7582j7774J836328J076761J52453J419156K067298J969756
3979A01771563J570099K797513K921877L592285K497701L970139N426655L751730
3971A28299562N029832N556693M365262M320239M375929K986227J904331o46684
3963A56191391j136737j378354m301244k720275j349692k788543j639521J31565
3955A41008590k89687n55242M99362R08480J608442K008694K314319K803100L379601
3946A53685659M488295N276810M517156O490203P539284P509673R719911J0519229
$$ y = [119186180, 117799905, 115701029, 113077604, 110265826, 108009989, 106432071, 104714808, 101168953, 98154841, 97108995, 96753820, 95656257, 95055107, 94663409, 94515151, 93909589, 93685552, 93365167, 93267585, 93249811, 95086139, 96162900, 96315353, 97734509, 99801807, 101771563, 103341662, 106139175, 109061052, 112653337, 115151038, 119121177, 124547832, 128299562, 133329394, 138886087, 143251349, 147571588, 151947517, 154933744, 156838075, 156191391, 155054654, 153676300, 149375056, 146654781, 145305089, 142516546, 140877025, 141008590, 140718903, 140163661, 140663023, 141571503, 143179945, 145188639, 147502958, 150306058, 153685659, 158173954, 163450764, 167967920, 174458123, 181997407, 189507080, 199226991, 209746220]
3938B09746220J2103040J2379254J4605275J4983657J4758460J6788818J7795910
3931C13160634J9436693K1599964J9342101J6301633P000115n582225j6181110
3924C75077805k1239080k3927210k4100552k1232887j9556907j5391914j3130605
3917B36498650j3600260j1353349r591308q189733p857949o157565o188701n665850
3909A67893935n370529n324914o392688n348685n370871m091762l125793m405854
3901A28462839l332392k361000j500782k762537j979780k214233j275162k016741
3893A11020212j269665k210323p16456j969237j143908L50721j627690o00308
3885A01833346j359104j51923K12449p45012o52492j049991j639095j035766k188675
$$ y = [209746220, 221849260, 234228514, 248833789, 263817446, 278575906, 295364724, 313160634, 332597327, 354197291, 373539392, 389841025, 396841140, 391258915, 375077805, 353838725, 329911515, 305810963, 284578076, 265021169, 249629255, 236498650, 222898390, 211545041, 201953733, 193764000, 185906051, 179748486, 173559785, 167893935, 162523406, 157198492, 150805804, 145457119, 140086248, 135994486, 132868693, 128462839, 125130447, 122769447, 121268665, 118506128, 116526348, 114312115, 113036953, 111020212, 109750547, 107540224, 106823768, 104854531, 103710623, 104061344, 102433654, 101833346, 100474242, 100322319, 100534768, 99789756, 99137264, 98087273, 96448178, 95412412, 93223737]
3876I3223737r12487p14901j198743r82558k502879j024554l78696m61123R7622
3867H5145418K12722r25324l44412K261380l20896p73617Q48231M47694O09338
3858H7160534J16581N0323K42522J00238Q8975J96495Q86260L59899M43607K35444
3848H9880878L41309J153279P14139Q02313J160442P69940m70421k187620j145523
3839I1018736j979005l270113j459438j006277j668660r14329M52353o53680k21508
3830H0298079j546724r41529q3119k93553n46858m69513O50534l75447o98078
3821G5993792j755938j383068j754844j408816j390351r78342l40804q73976j80967
3812F5926686r71188p44028K20101J51839O18035J74076j2765k23229R92364K11906
$$ y = [93223737, 92311250, 91596349, 90397606, 89415048, 86912169, 85887615, 85508919, 85047796, 85145418, 85358140, 84432816, 84088404, 86349784, 86028888, 85255271, 86103502, 86551196, 87160534, 87277115, 87327438, 87569960, 87670198, 87759173, 87955668, 88841928, 89201827, 89645434, 89880878, 90222187, 91375466, 92089605, 92891918, 94052360, 94822300, 94351879, 92164259, 91018736, 89039731, 85769618, 84310180, 83303903, 81635243, 80720914, 81173267, 80519587, 80298079, 78751355, 77809826, 77726707, 77433154, 76886296, 76416783, 77067317, 76691870, 75993792, 74237854, 72854786, 71099942, 69691126, 68300775, 67322433, 66981629, 66107653, 65926686, 64955498, 64211470, 64431571, 64583410, 65201445, 65375521, 65362756, 65139527, 66131891, 66343797]
3802F6343797J634372R96640N29476J302969Q96620J439689J566624R41465J343858
3793G6995510K479384J071535J583777J373128M87872l58933L87928K29275K226842
3784H6476318J393082J640137K835974L204264J849869L158708K319854J484324
3776A04362530Q47865q41354j068885l925825m495557k644507l777801l887715
3768H4568751k910579l152377l872755l256663o51757k307941k155380j888356
3760F4372943j722144r08883j796414j509025r73843j438192j69808j018224r02150
3751E3934260L48596j19721L28425q95004o26239j541333Q5453j181385j042537
3742D9290515J88239l25824n10053J41200j64689p33527N05297k6486l03964m04724
$$ y = [66343797, 67978169, 68974809, 69504285, 70807254, 71703874, 73143563, 74710187, 75651652, 76995510, 79474894, 80546429, 82130206, 83503334, 83991206, 83632273, 84020201, 84249476, 86476318, 87869400, 89509537, 92345511, 95549775, 97399644, 100558352, 102878206, 104362530, 105210395, 104369041, 103300156, 99374331, 94878774, 92234267, 88456466, 84568751, 81658172, 78505795, 74633040, 71376377, 70724620, 68416679, 66261299, 64372943, 62650799, 61741916, 59945502, 58436477, 57462634, 56024442, 55854634, 54836410, 53934260, 54282856, 54163135, 54491560, 53596556, 52970317, 51428984, 51514437, 50333052, 49290515, 49478754, 49152930, 48642877, 48784077, 48619388, 47885861, 48391158, 48364672, 48060708, 47655984]
3732D7655984J01288p5018J202844M48094L01635N79253P47773J557078P38135
3723E3257066J084807J325078J974863J482982M53404L8596k040049l047455j867473
3714E2661819n67054j659847m56810k41614r8884j029779j843904r08888K72230
3705D6127269o08310j001096m8281J058077J100895O19627M02008n56376L05594
3696D7399407R56161q6318J000934j11158O44310J362802R89704J891560Q30413
3687E4877815O93670K488825J889874R51420K724352K630728K211529K883745
3679G1351958M976736L607805M463040M420958L248121K927947L143116K142718
3671A00282399L012513L587481K902033M316537O123124O139277M531093L181336
$$ y = [47655984, 47757272, 47682254, 48885098, 49333192, 49634827, 50214080, 50961853, 52518931, 53257066, 54341873, 55666951, 57641814, 59124796, 59578200, 59616796, 57576747, 54529292, 52661819, 52094765, 50434918, 49978108, 49736494, 49637610, 48607831, 46763927, 45855039, 46127269, 45518959, 44517863, 44469582, 45527659, 46628554, 47248181, 47650189, 47093813, 47399407, 48355568, 48269250, 49270184, 49159026, 49803336, 51166138, 52155842, 54047402, 54877815, 55571485, 58060310, 59950184, 60901604, 63625956, 66256684, 68468213, 71351958, 76328694, 79936499, 84399539, 88820497, 92068618, 94996565, 98139681, 100282399, 103294912, 106882393, 109784426, 114100963, 120224087, 126363364, 130894457, 134075793]
3663A34075793k67423n539863n705162o418830r029121q115646n344800n820556
3655H7834392n364921k803705l518548m086603k596593k114647j984239j423546
3647F3941590k397901k406858j468826j475983k753887j499621r80210j351339
3639D9606965j742283j620582j835106L8983j311355r45731j416944j97083j245030
3630C9331834j117172r58355j007942j048584J02089L8728r79500r96633r04263
3621C2460202j210599l47231L16469k7669P33761L43341o24585r01704K61469
3612C1003454J31863j35727n54645J136096O61985o21298r35820o87263J35957
3603C0134602O10968r2369j147197k25097m53147l59944m5726m46423Q02283q5771
$$ y = [134075793, 133808370, 128268507, 122563345, 116144515, 107115394, 98999748, 93654948, 87834392, 82469471, 79665766, 76147218, 72060615, 69464022, 67349375, 65365136, 63941590, 61543689, 59136831, 57668005, 56192022, 53438135, 51938514, 50958304, 49606965, 47864682, 46244100, 44408994, 44447977, 43136622, 42190891, 40773947, 40576864, 39331834, 38214662, 37256307, 36248365, 35199781, 35301870, 35340598, 34361098, 33364465, 32460202, 31249603, 30902372, 31218841, 31191172, 31924933, 32268274, 31643689, 30741985, 31003454, 31135317, 30999590, 30444945, 31581041, 32243026, 31621728, 30685908, 29998645, 30134602, 30745570, 30653201, 29506004, 29280907, 28827760, 28467816, 28422090, 27975667, 28777950, 28692179]
3593B8692179L46632k30951j403776J10505J66812k26008K52123p11402n96473
3584B6399641m39180q2238l90112O50379p59403n90286Q88127j092652j058995
3575B3525281J22794R9113k82240j486550M25139m48854M16858L72949n03511
3566B2240979J39162j013620j11060P3990q12594m94403j01183j6247k64879q0080
3556A9560065N34868J73414j027581l19169p80546P51719k3889r43820l8836r97888
3546A6888337k54239l6481P57722k96449K73155L06887j39060q78077k69705K49508
3536A6601598m17493o3026M07135r5022l18221J55224k63158r0846J8730j00427
3526A5834494L11051M76696J37586N54481K82160n76262O84718J60786N51771
$$ y = [28692179, 29038811, 28807860, 27404084, 27514589, 27681401, 27455393, 27707516, 26996114, 26399641, 25960461, 25878223, 25488111, 26138490, 25379087, 24788801, 25676928, 24584276, 23525281, 23648075, 23747188, 23464948, 21978398, 22403537, 21954683, 22371541, 22744490, 22240979, 22380141, 21366521, 21255461, 21329451, 20516857, 20022454, 19921271, 19905024, 19640145, 19560065, 20094933, 20268347, 19240766, 18921597, 18141051, 18892770, 18868881, 17925061, 17886225, 16888337, 16634098, 16597617, 17355339, 17058890, 17332045, 17638932, 17499872, 16621795, 16352090, 16601598, 16184105, 16121079, 16528214, 16433192, 16114971, 16270195, 16007037, 15916191, 15934921, 15834494, 16145545, 16622241, 16759827, 17314308, 17596468, 17020206, 17704924, 17865710, 18417481]
3517A8417481L95678o9885m09189J50280k97954j146095k5229o69543L48787P99339
3507A7493670J3412j342300Q5973k71357M76878j121143l28199l8060r22115O90151
3497A4736910j09933j808603j5616k23438l29761m59084K60056j43047j04432
3488A1803052L23511N93558p16792P05643l2859j649258N78974k00634n57600
3479A0847595k56247K33j268150J040534k44654M05933r69618j22853J11446L99320
3469I943539N9073j3269K9230L49403M38492j92171j12380q3694m6386k23175
3459A0148662Q08387J151013k41717K70719J13944m95803j091377o43545o47906
3450I372377k61309M99131J24523j003445N73394j0101o74653n95261k83787P76222
$$ y = [18417481, 18813159, 18743274, 18334085, 18484365, 18186411, 17040316, 17015087, 16345544, 16694331, 17493670, 17507082, 16164782, 16250755, 15979398, 16456276, 15335133, 15006934, 14968874, 14046759, 14736910, 14626977, 12818374, 12802758, 12579320, 12249559, 11790475, 12050531, 11907484, 11803052, 12126563, 12720121, 12003329, 12708972, 12676113, 11026855, 11605829, 11405195, 10847595, 10591348, 10591581, 9323431, 10363965, 10119311, 10525244, 9555626, 9432773, 9544219, 9943539, 10002612, 9989343, 10018573, 10367976, 10806468, 10614297, 10501917, 10418223, 10371837, 10148662, 10957049, 12108062, 11866345, 12137064, 12251008, 11755205, 10663828, 10020283, 9372377, 9111068, 9610199, 9734722, 8731277, 9304671, 9294570, 8619917, 8024656, 7740869, 8517091]
3440H517091j42282j068376J270146M10490r25306K37515n94012J192383k47663
3431H649986l68437L40596p08663N25607k06307p58682O13282J31400q59598j16606
3421G242578N66063L13700M4886n83272J050038o19951J53258m79880J79035O5062
3411G931517o36954n7967m75825R39299J66588m06533L89890m0158j3440L84811
3401H181228L18450N8798j65214L91513j278813Q2521K08674l27531q0637J24289
3391G513278n91887j15053N95578J7993J35456L76496r80713q04323J444958O57472
3381H249255o7670j22593Q03029m77080j021715p58977R2295Q83296P6867j39659
3371G517048O16631l21895m6307k27405P42945M37763j81057o18408K73146L27396
$$ y = [8517091, 8374809, 7306433, 8576579, 8987069, 8061763, 8299278, 7705266, 8897649, 8649986, 8281549, 8622145, 7913482, 8439089, 8232782, 7474100, 8087382, 8218782, 7359184, 7242578, 7808641, 8122341, 8167227, 7583955, 8633993, 8014042, 8167300, 7687420, 7866455, 7931517, 7294563, 7236596, 6760771, 7700070, 7866658, 7460125, 7850015, 7809857, 7796417, 8181228, 8499678, 8558476, 8393262, 8784775, 7505962, 7588483, 7797157, 7469626, 7388989, 7513278, 6921391, 6806338, 7401916, 7419909, 7555365, 7931861, 6951148, 6146825, 7591783, 8249255, 8181585, 8058992, 8862021, 8384941, 7363226, 6604249, 6696544, 7579840, 7656707, 7517048, 8133679, 7811784, 7765477, 7538072, 8281017, 8718780, 8537723, 7919315, 8192461, 8519857]
3361H519857l77994J053199n73821P62438J78972N00344q69658j15053Q05351
3352I883635k66019j98939O76625k77833o03350j56203q54428O88160J84791r1539
3342H984900J027385R6534m7053O9724o65424J462608J30920l36307P90993j24074
3332A1390206j6317R86619q35743j66927o80708l74399o29189q4368L78100l79975
3322I587299q32459j489858O69058M11998J11958l23373M22520M39440m97609
3313H498974n05536K20526J046319l42202m95202J23877J5145j102352K06141
3304G665690J309018M4494m12234n29062K78611m35316l21257o41378J016263
3295G974829j93227k39826Q71560p50908K28860o61852J63577j30015L51831k53894
$$ y = [8519857, 8141863, 9195062, 8621241, 9383679, 9562651, 10062995, 9193337, 9078284, 9883635, 9617616, 9418677, 10095302, 9817469, 9214119, 9057916, 8203488, 8891648, 9076439, 8984900, 10012285, 10108819, 10061766, 10131490, 9466066, 10928674, 11059594, 10723287, 11514280, 11390206, 11373889, 12360508, 11524765, 11357838, 10677130, 10302731, 9673542, 9589174, 9967274, 9587299, 8754840, 7264982, 7934040, 8346038, 8457996, 8134623, 8557143, 8996583, 8498974, 7993438, 8213964, 9260283, 8918081, 8422879, 8546756, 8561901, 7459549, 7665690, 8974708, 9019202, 8606968, 8077906, 8356517, 7921201, 7599944, 6958566, 7974829, 7781602, 7541776, 8413336, 7662428, 7891288, 7229436, 7393013, 7262998, 7614829, 7360935]
3285G360935J27169q7445J697k95620M21913j98716L47050P14897j14926J19280
3275H396234q34660J47988K68990L04612O8980k50993k42730l9857J11768Q19458
3265H749790M79521j088803N27368O02701j87118J044302R57194k008278n66435
3256H510242N70425P41107K18469j5243P85748p21499L04096k70465k99817R03196
3246A0726259j031027n06120Q42892k31375J078537J92964k62320r58787Q8244
3237I939267J85629P38847N8432K42253N13808K23092j06638l03616o43385K85228
3227A1132917N58239j36892L20563R635M36714J08761p21841K42609l92552J287024
3217A2845177N19952K2841N10713N44445k2742L93107k85224Q04598p64625J50937
$$ y = [7360935, 7488104, 7400659, 7402356, 7106736, 7528649, 7329933, 7676983, 8391880, 8276954, 8396234, 7561574, 7709562, 7978552, 8283164, 8352144, 8101151, 7858421, 7818564, 7930332, 8749790, 9229311, 8140508, 8667876, 9270577, 9083459, 10127761, 11084955, 9076677, 8510242, 9080667, 9821774, 10040243, 10025000, 10810748, 10089249, 10393345, 10122880, 9823063, 10726259, 9695232, 9189112, 10032004, 9800629, 10879166, 11072130, 10809810, 9851023, 9939267, 10124896, 10863743, 10922175, 11164428, 11678236, 11901328, 11794690, 11491074, 10847689, 11132917, 11691156, 11554264, 11874827, 11884462, 12321176, 12429937, 11708096, 11950705, 11558153, 12845177, 13365129, 13387970, 13898683, 14443128, 14420386, 14813493, 14528269, 15332867, 14568242, 14719179]
3207A4719179O05159n80313J158164R2614P34203K56822M22265p0839J16117J603866
3197A9057237J20953K25692k1786K61519O51054m9372Q57935L69463J250979L05971
3187B3029645O45261O26027K89005R59703R83635K42195J070885L37501J90489
3178B8374346K76668J08313J360318J793830M89649L40460J406362J199381M15448
3169C5764775J103255J792878Q37022J555589Q82265R32783J919359J463753P53584
3160D7005263J412175K738976J549683P49387K662590K737481K374668K973199
3152F4203422J171750K110909K540031K081551M421541L893543K661364M708452
3144H7792563N669512O593191O233180O799029P252873Q302959R918134J2163535
$$ y = [14719179, 15324338, 14744025, 15902189, 15994803, 16729006, 16985828, 17408093, 17337254, 17453371, 19057237, 19178190, 19403882, 19382096, 19643615, 20294669, 20245297, 21103232, 21472695, 22723674, 23029645, 23674906, 24300933, 24589938, 25549641, 26533276, 26775471, 27846356, 28183857, 28374346, 28651014, 28759327, 30119645, 31913475, 32403124, 32743584, 34149946, 35349327, 35764775, 36868030, 38660908, 39497930, 41053519, 41935784, 42868567, 44787926, 46251679, 47005263, 48417438, 51156414, 52706097, 53455484, 56118074, 58855555, 61230223, 64203422, 65375172, 67486081, 70026112, 72107663, 76529204, 80422747, 83084111, 87792563, 93462075, 100055266, 106288446, 113087475, 120340348, 128643307, 138561441, 150724976]
3136A50724976J3502795J4502099J4339932J1745405N937584j62321m677101m054112
3128B01859257l016636K25294M098571M305887P020782O077408O359475N850983
3120B32781021N560633N672928O577740Q247441Q395374R165583Q928141R580276
3112B94909137J1808726J5357854J6860752J8260811J9376181J7324874J2411660
3105D06309995R262217Q259734R053917R668670J0166615Q433439M809891K511040
3097D68475518l2389k480130k970171l397087p639148r741855j2685776j2865759
3089D16663203j4594672j4587895j4290323j1978512q653390p553512m527564
3082C40477335j868203N78986L946803N939838Q320243R807601Q114741N316170
$$ y = [150724976, 164227771, 178729870, 193069802, 204815207, 210752791, 210590470, 205913369, 201859257, 198842621, 199067915, 203166486, 207472373, 214493155, 220570563, 226930038, 232781021, 238341654, 244014582, 250592322, 258839763, 267235137, 276400720, 285328861, 294909137, 306717863, 322075717, 338936469, 357197280, 376573461, 393898335, 406309995, 415572212, 423831946, 432885863, 442554533, 452721148, 461154587, 465964478, 468475518, 468443129, 465962999, 462992828, 459595741, 451956593, 442214738, 429528962, 416663203, 402068531, 387480636, 373190313, 361211801, 352558411, 345004899, 340477335, 338609132, 339188118, 343134921, 349074759, 357395002, 367202603, 375317344, 380633514]
3074C80633514K293748j170820n883311p083455p486164o883379p806579r683870
3066C36929684j4051475j5189690j5954184j6810348j5700447j4708259j4100845
3059B30414436j2612622j2884771j1509923j1163127j1026616r561113p803262
3052A53853002o994918o472223n297746m331933n145270m008946k735854l374477
3044A15491635l126407j487712l63973k193461r93198n53855j115269J328739
3036A06986499L84334Q8200o50854k274596j995333l755535l505819m064667m541637
3027H6670592k968862k034140k855445k111429j765477m10189p89638j322924
3019G2412488n73545k05360p74432p586m41023p22481k34797J525656L69783O27223
$$ y = [380633514, 382927262, 381756442, 375873131, 368789676, 361303512, 354420133, 346613554, 336929684, 322878209, 307688519, 291734335, 274923987, 259223540, 244515281, 230414436, 217801814, 204917043, 193407120, 182243993, 171217377, 161656264, 153853002, 146858084, 140385861, 135088115, 130756182, 125610912, 121601966, 118866112, 115491635, 112365228, 110877516, 110513543, 108320082, 107326884, 106773029, 105657760, 106986499, 107370833, 107459033, 106808179, 104533583, 102538250, 98782715, 95276896, 91212229, 86670592, 83701730, 81667590, 78812145, 76700716, 74935239, 74525050, 73735412, 72412488, 71838943, 71633583, 70859151, 70851565, 70410542, 69688061, 69453264, 70978920, 71348703, 71975926]
3009G1975926J376385J339416R42748j64678p87693j435288k016293k266143k50266
3000F8714114o07807j171816k92044q50631j097002j884067j529019n36152o41997
2991F0103579q33644k394395r41904q56650n38778j068522o30736R15275j034414
2982E2719811N07738j019942M46609J008750O17383o12740q60466J423051Q57692
2973E5087886P18088k96445n9164J13703p73760j428623j644589M69773L46876
2964E2533745o74447l35889J625754k0103m67486j61883R73301J225791J752572
2955E6451355R50515L18114K471232J147676J757438K69762M27534m69798j071715
2946F2252113r90869j760801p16981r39248m94130r25809N91412O60173K28266
$$ y = [71975926, 73352311, 74691727, 75634475, 75469797, 74682104, 73246816, 71230523, 68964380, 68714114, 68106307, 66934491, 66642447, 65791816, 64694814, 62810747, 61281728, 60745576, 60103579, 59269935, 56875540, 55933636, 55076986, 54538208, 53469686, 52838950, 53754225, 52719811, 53227549, 52207607, 52654216, 53662966, 54280349, 53667609, 52807143, 54230194, 55087886, 55805974, 55509529, 55450365, 55564068, 54790308, 53361685, 51717096, 52186869, 52533745, 51859298, 51523409, 53149163, 53129060, 52661574, 52499691, 53472992, 54698783, 56451355, 57401870, 57719984, 60191216, 61338892, 63096330, 63366092, 63793626, 63323828, 62252113, 61261244, 59500443, 58783462, 57844214, 57350084, 56424275, 57015687, 57675860, 57904126]
2937E7904126P94216K696762K256407K57624J965914J766129K783668J44535J87973
2928G0757354J97441j91243j732377j478805j608861k052998k281357k497874
2920E9111280l324227k883911j561336j444425j396820j269474j101432L89412
2912D6519067O13513m39094J4197J439557N47306N53790K12714K18728K01993
2903D9881771m62788l211228l520729j613979j831196k470336j423828j459743
2895C3887944j764842j095530n78292j026942n23181j364218r99071K37936j015563
2886B5758241M4778j098116r17370n57364o06778k29919L33626l17317o05235
2877B1804546r17993r50796K53228J05693q45828K61367p21970k45357k85531
$$ y = [57904126, 58698342, 61395104, 63651511, 63909135, 65875049, 67641178, 70424846, 70569381, 70757354, 70954795, 70763552, 69031175, 67552370, 65943509, 63890511, 61609154, 59111280, 55787053, 52903142, 51341806, 49897381, 48500561, 47231087, 46129655, 46519067, 47132580, 46693486, 46707683, 48147240, 48694546, 49248336, 49461050, 49679778, 49881771, 49418983, 46207755, 42687026, 41073047, 39241851, 36771515, 35347687, 33887944, 32123102, 31027572, 30449280, 29422338, 28899157, 27534939, 26535868, 26773804, 25758241, 25803019, 24704903, 23787533, 23230169, 22623391, 22393472, 22727098, 22409781, 21804546, 20886553, 19935757, 20188985, 20294678, 19448850, 19710217, 18988247, 18742890, 18457359]
2868A8457359O51973R81941K82006K59495J58082K55686P43858J474302q7504
2859B3177198K96397m1079m1037Q64642r01043k9852O2796p51643m65483j335622
2849B0835274k45586J79653p33565r45642n49807r7338p3268J36426j87374j2311
2839A8306462r27006R832M30736n75277n34550Q51232O69433l6489J49488N90939
2829A8934800J021807j65976J58998K03766q00628m90856Q085k38244J27819o36997
2819A8122574k61757o66609q05764J90182j159812J78656O13207J15037j34681
2810A6191033l07865m60531m85512n09512n63949J25258L31814O9169m9928O1700
2800A4401677n7018M3863R16335K97993j99859n39608Q48740L22404o33917j764361
$$ y = [18457359, 19109332, 20091273, 20373279, 20632774, 20790856, 21046542, 21790400, 23264702, 23177198, 23473595, 23432516, 23391479, 24256121, 23355078, 23325226, 23388022, 22636379, 22170896, 20835274, 20589688, 20769341, 20035776, 19090134, 18540327, 18442989, 18369721, 18506147, 18318773, 18306462, 17379456, 17389288, 17820024, 17244747, 16710197, 17561429, 18230862, 18194373, 18343861, 18934800, 19956607, 19790631, 19949629, 20153395, 19352767, 18861911, 18869996, 18631752, 18759571, 18122574, 17860817, 17194208, 16388444, 16578626, 15418814, 15597470, 16210677, 16325714, 16191033, 15883168, 15422637, 14937125, 14427613, 13863664, 13988922, 14320736, 14389905, 14339977, 14401677, 14344659, 14388522, 15304857, 15602850, 15402991, 14863383, 15712123, 16034527, 15400610, 13636249]
2790A3636249j37039j70131k44847j80002p38955j129619R59240N84147p16362
2781A1862681Q86682j59664k49447j026912K51103O8453J39550P2483Q63254l70778
2771A2337405l35323M85626q7031n20284O25192j226748j147444j53273M84113
2762A0462233j546191L4216N78073o44044J208122o30705j632868m30252o70815
2753F727769N8858O51879q3354L47460M38101j513447j052587L31086r0263J32681
2743E948183j30768Q8485n39731l51656J4454J40190M68485m56722O5129K66752
2733E512801K42548n9652o43795o09321o13314R81746K56205L6019M16757r4417
2723E425577l79901o06091j30445p78733J56620M94274r68464k75473K29702K43424
$$ y = [13636249, 13499210, 13329079, 13084232, 12904230, 12165275, 11035656, 11994896, 12579043, 11862681, 12749363, 12589699, 12340252, 11313340, 11564443, 11632896, 11772446, 11844929, 12708183, 12337405, 12002082, 12487708, 12400677, 11880393, 12505585, 11278837, 10131393, 9978120, 10462233, 8916042, 8950258, 9528331, 8884287, 10092409, 9461704, 7828836, 7398584, 6727769, 6786627, 7438506, 7355152, 7702612, 8140713, 6627266, 5574679, 5905765, 5815502, 5948183, 5817415, 5905900, 5366169, 5014513, 5028967, 5169157, 5637642, 5180920, 5246049, 5512801, 5755349, 5695697, 5051902, 4442581, 3829267, 4811013, 5067218, 5103237, 5519994, 5425577, 5045676, 4439585, 4309140, 3530407, 3687027, 4181301, 3212837, 2937364, 3167066, 3410490]
2713C410490M66214O68479q2797j031341P3522O54475O4371p61884J07011Q70563
2703D439103p83560j012619J65799K46029J93598P81410J34145J0287j196853
2694B977339j41142m78684O33144p39829P36931Q9439M33313m82093p26099r0928
2684B211391J003391j88266m79642M22228j434273M28472M50389Q55376k06363
2675C062703M43659k07816p83806p2312k63630J79607Q4823J62068l68822Q77023
2665C113497M17176k68295J614043m85827Q0312K31910k05262L38114l38111o43949
2655C853608Q50021J91813R4388p22559l08829q84722K42097Q68216n64423q3955
2645C535655M55443p34733k60170k83748l06546J006923M23773r11109k55176
$$ y = [3410490, 3876704, 4545183, 4462386, 3431045, 3504567, 4159042, 4223413, 3461529, 3568540, 4439103, 3655543, 2642924, 2808723, 3054752, 3248350, 4029760, 4163905, 4174192, 2977339, 2836197, 2357513, 2990657, 2250828, 2987759, 3077198, 3510511, 3028418, 2302319, 2211391, 3214782, 3026516, 2546874, 2969102, 1534829, 1963301, 2413690, 3269066, 3062703, 3506362, 3298546, 2514740, 2442428, 2178798, 2358405, 2443228, 2605296, 2236474, 3113497, 3530673, 3262378, 4876421, 4390594, 4470906, 4702816, 4497554, 4835668, 4497557, 3853608, 4703629, 4895442, 4989830, 4267271, 3958442, 3073720, 3315817, 4184033, 3619610, 3535655, 3991098, 3256365, 2996195, 2712447, 2405901, 3412824, 3836597, 2925488, 2670312]
2636B670312N83491Q64209R37919k92364l90390N9163J73701m93110j22247l16906
2626C673778N07553l02773o67688K57997L29993O22458l97682P8074k58913m82028
2616C360769j009697p75209M39083Q3178M4445L13279l64742J77926M85107J86234
2606B940373o20133l62777P4116Q60745l84082n1502p5635p87333Q36776n73446
2596A857102N05070R09546m07670J040660k83222m18186n31973l94246M7288Q4121
2586B408490R93161p43003o38550l19309k13355N92302O49885m82667m82399K92626
2576B057181O48121k66649j72356Q43173k54841n95916K29916q14644J209484
2567B883469J74058n85652M71814L46806n51803L80977l32134j73060j14608O51695
$$ y = [2670312, 3253803, 4118012, 5055931, 4763567, 4373177, 4432340, 4606041, 4112931, 3990684, 3673778, 4181331, 3878558, 3210870, 3468867, 3798860, 4421318, 4023636, 4101710, 3842797, 3360769, 2351072, 1575863, 2014946, 2098124, 2142569, 2455848, 2091106, 2269032, 2754139, 2940373, 2320240, 1957463, 2031579, 2892324, 2508242, 2456740, 2381105, 1593772, 2430548, 1857102, 2362172, 3271718, 2864048, 3904708, 3621486, 3203300, 2671327, 2277081, 2324369, 2408490, 3401651, 2658648, 2020098, 1700789, 1487434, 2079736, 2729621, 2246954, 1764555, 2057181, 2705302, 2438653, 2266297, 3109470, 2854629, 2258713, 2488629, 1673985, 2883469, 3057527, 2471875, 2943689, 3290495, 2738692, 3119669, 2787535, 2614475, 2499867, 3151562]
2557C151562j54707o52194O47594o52651Q11898P7186j16568l952r85958Q57676
2547B979886N96055q97810k81142R3603P94006K80049Q34262l48236q8257M99406
2537D461822k47702Q6641l58379n47147Q71615Q6711q85628P739l49461p3059
2527C053152Q48497q5121j9312M76156J35844k07762r0938J33886j72342J490471
2517E562531O97312j82055k206558N29908M46377o62463o83545N59700M17355
2508D478562o87721O85051q77722J54034J030220o03721j294208K58134r14331
2499B228298j67725J028987P49199J34627j96747j83262n07236m25408J244132
2490C904865n42167K9775M81207q79511N85417L74210o23624l41713M59615L73404
$$ y = [3151562, 2996855, 2344661, 2992255, 2339604, 3151502, 3228688, 3112120, 3108168, 2122210, 2979886, 3575941, 2678131, 2396989, 2490592, 3284598, 3564647, 4398909, 4050673, 3962416, 4461822, 4214120, 4300761, 3942382, 3395235, 4266850, 4353561, 3467933, 3475672, 3126211, 3053152, 3901649, 3816528, 3797216, 4273372, 4409216, 4201454, 4110516, 4244402, 4072060, 5562531, 6259843, 6077788, 3871230, 4401138, 4847515, 4185052, 3501507, 4061207, 4478562, 3790841, 4475892, 3598170, 3752204, 4782424, 4178703, 2884495, 3142629, 2228298, 2060573, 3089560, 3838759, 3973386, 3776639, 3593377, 3086141, 2660733, 3904865, 3362698, 3392473, 3873680, 2994169, 3579586, 3953796, 3330172, 2988459, 3448074, 3821478]
2480C821478J2502q71925n96226n67674N64877j1039k44615o00129Q8221p30727
2470H64743q4487K75879j011089J233470L88583l44488j09224k31740J07602K54442
2460A343691j04999K15447l744o33332j837k29358M86914O12976r2302J9385L00879
2449A913720m8926n54546l4690m01207K08304n12507p56041l56904j17585K81846
2439c78536R01461J50423N05664j70896o81254o56769n70763L0336P94169M58730
2429C82565j072192M54933P5746p759J96809l60435M13712n56436j54328j87758
2419h15143J91469K02339N19578M53811o00768r06608L04648N18695K2306j35378
2409b45051k74190l64230r4674k10984R247N02128N9268O73040L77982j435856
$$ y = [3821478, 3833980, 2962055, 2365829, 1798155, 2363032, 2351993, 2107378, 1507249, 1595470, 864743, 780256, 1056135, 45046, 1278516, 1667099, 1322611, 1213387, 981647, 1089249, 1343691, 1238692, 1454139, 1450395, 817063, 815226, 585868, 1072782, 1685758, 1593456, 1612841, 1913720, 1864794, 1310248, 1275558, 874351, 1082655, 570148, -185893, -542797, -660382, -378536, 522925, 673348, 1179012, 1008116, 326862, -329907, -900670, -870334, -76165, 382565, -689627, -234694, -158948, -166707, 30102, -330333, 83379, -473057, -627385, -815143, -623674, -421335, 98243, 552054, -48714, -955322, -650674, -131979, -109673, -245051, -519241, -883471, -978145, -1189129, -1179882, -677754, -618486, 54554, 432536, -1003320]
2399a003320L62378m10007L25079N90965q77736j32016J12254M78139J27549P52892
2389C26177k14059k1481m10662J11934L90520m6778q59224O62936j93526j28348
2379c82511L07405M76330r06520m5149O11770m22868p61017m91555K81589L01172
2369a031354M35807J8983l58397M9551P82262l05595L69538l08049Q88590k71511
2359B69825j046828M88650n89926k87799o3159L38207O19034K50183n7723j345770
2349a425306M06564N21070q68049p3446O69844l80681k74285J51837K82826M69675
2339e19951n86210M39041K84629Q27274l19630Q21318l05223q3251J57230l49318
2329C65909R5766j581299J55528J620502J01270J98760k28063k5921R5826L86446
$$ y = [-1003320, -640942, -1050949, -725870, -134905, -1012641, -1144657, -1032403, -554264, -426715, 326177, 112118, 90637, -320025, -208091, 182429, 135651, -723573, -60637, -254163, -382511, -75106, 401224, -505296, -550445, 61325, -361543, -1122560, -1614115, -1332526, -1031354, -595547, -576564, -934961, -885410, -103148, -408743, -39205, -347254, 541336, 269825, -777003, -288353, -878279, -1166078, -1229237, -891030, -271996, -21813, -79536, -1425306, -1018742, -497672, -1365721, -1439167, -769323, -1150004, -1424289, -1272452, -989626, -519951, -1106161, -667120, -382491, 444783, 125153, 946471, 641248, 557997, 715227, 365909, 461675, -1119624, -964096, 656406, 757676, 956436, 728373, 702452, 798278, 1184724]
2319A184724K4854l8765o74019K12737O41522n96218L8367o35010k82461Q8003
2309c6266J67346m63748L48052m71822R39353m41306o26414K63157n12334j83732
2299a017714O04928j9415q49217K74163Q08633j49536l66642j48291P70346l24994
2289d17739k65667l59041J7426J166545N5475k34777j20241N58212l50162k57226
2279b07195M47664J39883J35154j0930L43196r03371o60949J89177l53014O50545
2269b29840p0839k42413J003095O43537m63198m60789K08213L22501p52603p17892
2259g60228K34130O51667J44921l28481o98826K67298K57882n38364J244697O42703
2249A117399q44326j14515l49891M50287Q83473j307038m12304Q35475P97431
$$ y = [1184724, 1209578, 1170813, 496794, 709531, 1351053, 754835, 793202, 158192, -124269, -36266, 131080, -332668, 15384, -456438, 482915, 41609, -584805, -321648, -833982, -1017714, -412786, -432201, -1281418, -1007255, -198622, -348158, -714800, -863091, -92745, -417739, -683406, -1042447, -1025021, 141524, 196999, -37778, -158019, 400193, 50031, -207195, 240469, 380352, 515506, 504576, 847772, -55599, -716548, -527371, -880385, -229840, -300679, -543092, 460003, 1103540, 640342, 179553, 387766, 710267, -42336, -760228, -526098, 125569, 270490, -57991, -756817, -489519, -231637, -770001, 474696, 1117399, 273073, 158558, -191333, 258954, 1142427, -164611, -576915, 258560, 1055991]
2240A055991l01280j360623n3361l8795q7311K22174j42276n84043J090383L93276
2230A94135o6554j31288o72048O74048j12710L62770L51397m1316r99353q481
2220d49400K79834O3746J505860J63731n67069K52676m89877n67253J004945m50916
2210G46277r60470N96758M90964k06188J346909o78966j466834j13718O09203
2201C63935M30539L84925L08839L12927N43408n03269n59560O7801K42608n6149
2191A536004o1452K33986r67051n00488N47876L42379j606q29031N31811l09026
2181E23402O69102J003986Q31145m95873m87212o88493k32314N13496k43527J061538
2171B455250N5098N71929l3481j503419K52693O75933K16076j07243k24030J454495
$$ y = [1055991, 754711, -605912, -659273, -698068, -785379, -563205, -705481, -1289524, -199141, 194135, 127581, -3707, -675755, -1707, -114417, 248353, 599750, 558434, -440919, -449400, -169566, -105820, 1400040, 1563771, 996702, 1249378, 759501, 192248, 1197193, 746277, -214193, 382565, 873529, 667341, 2014250, 1335284, -131550, -245268, 363935, 794474, 1179399, 1488238, 1801165, 2344573, 1841304, 1281744, 1349545, 1592153, 1536004, 1474552, 1708538, 741487, 240999, 788875, 1131254, 1129648, 300617, 832428, 523402, 1192504, 2196490, 3027635, 2531762, 2044550, 1356057, 1123743, 1637239, 1393712, 2455250, 2510348, 3082277, 3048796, 1545377, 1798070, 2474003, 2690079, 2582836, 2358806, 3813301]
2161C813301k67458k90972R77844M96740j08054o23878k73479L15130N65816J77002
2151D781992K55561M53631j98545R79178n0668m4265R75860N99014n99279r5555
2141G056924O67088p7779l11787j13327l62975J049820M81958m6919R62042J058224
2131A0363269R27486K77288R6591m50526m21431R96548O30312m98984K77250r42926
2121A1254877N27402O81447N38339N38193K22578J208459P93340K56523J18675
2112A6139833L9010J323647J486542J748412J73431J657129J774164J665645J680533
2103B7688346J313269J360521J197370K269039L525830K565293L549425M112386
2095D7581479L653373M279350N683920N929091N544428P072116Q689003J0266672
$$ y = [3813301, 3545843, 3254871, 4232715, 4729455, 4621401, 3997523, 3724044, 4039174, 4604990, 4781992, 5037553, 5491184, 5292639, 6271817, 6221149, 6176884, 7152744, 7751758, 7152479, 7056924, 7724012, 7646233, 7334446, 7221119, 6858144, 7907964, 8389922, 8343003, 9305045, 10363269, 11290755, 11568043, 11664634, 11214108, 10792677, 11789225, 12419537, 11920553, 12197803, 11254877, 11782279, 12463726, 13002065, 13540258, 13762836, 14971295, 15764635, 16021158, 16139833, 16178843, 17502490, 18989032, 20737444, 20910875, 22568004, 24342168, 26007813, 27688346, 29001615, 30362136, 31559506, 33828545, 37354375, 39919668, 43469093, 47581479, 51234852, 55514202, 61198122, 67127213, 72671641, 79743757, 88432760, 98699432]
2087I8699432J2282465J4436043J7014317J9235565K4097778K9226914L0233081
2080B45225595K8509490J5128043q008300k7238442l4824428l0542681k7323749
2073A60925528k3591890j7362202j3102327j0816658q022718o507078o864154
2066G4658501o269589m924805m068941m644673m897917m210949l614130k318635
2058C9708862j791774l106565j770690k291640o68373j962173j196252n39534
2050B6381861o38292j240544q49523J05390j811124j514584j084947n14267r20077
2041A7913893p93887m20302j177112n32264j346242j109727l00200M0636l64129
2032A1910666j076886l30911r34723q74000J281795n4982l34281n41803k26685
$$ y = [98699432, 110981897, 125417940, 142432257, 161667822, 185765600, 214992514, 245225595, 273735085, 288863128, 280854828, 253616386, 218791958, 188249277, 160925528, 137333638, 119971436, 106869109, 96052451, 88029733, 81522655, 74658501, 68388912, 63464107, 59395166, 54750493, 49852576, 45641627, 42027497, 39708862, 37917088, 34810523, 33039833, 30748193, 30079820, 28117647, 26921395, 26381861, 25743569, 24503025, 23653502, 23758892, 21947768, 20433184, 19348237, 18833970, 17913893, 17120006, 16699704, 15522592, 14990328, 13644086, 12534359, 12234159, 12274795, 11910666, 10833780, 10502869, 9568146, 8694146, 9975941, 9920959, 9586678, 9044875, 8818190]
2023H818190R7252o31330p18390j94267j50416O60024m49726j054832j106412
2014E270093J60403K81393l50441j53563M21693j77854o10699K53029L72119j19822
2004E346351N62061q97762j45906K7158q74708M45681j91675j84260j071908m75108
1994B539924L48348O6634L71900K63596J56085k42532m04608M72345m5352l59647
1984C166693K28429q8355Q28451O01127j247919n97482M60624l12574l10083K1282
1974B750193O9402m02177k71248M29499q39272N89915J06273n1429Q51070m17918
1964B814308j349474O21815M61213N69585l85695j028802j38933J98934r16017
1955H46934K04638k3746o14143K16665L66739l34688K35397J33748o059J45347
$$ y = [8818190, 8915442, 8284112, 7565722, 7371455, 7221039, 7881063, 7431337, 6376505, 5270093, 5430496, 5711889, 5361448, 5207885, 5629578, 5451724, 4841025, 5094054, 5466173, 5346351, 5908412, 5010650, 4864744, 4891902, 4017194, 4462875, 4271200, 4086940, 3015032, 2539924, 2888272, 2954906, 3326806, 3590402, 3746487, 3503955, 3099347, 3571692, 3526340, 3166693, 3395122, 3306767, 4135218, 4736345, 3488426, 2890944, 3351568, 3038994, 2728911, 2750193, 2819595, 2417418, 2146170, 2575669, 1736397, 2326312, 2432585, 2381156, 3232226, 2814308, 1464834, 2086649, 2547862, 3117447, 2731752, 1702950, 1564017, 1762951, 846934, 1051572, 1027826, 413683, 630348, 997087, 662399, 897796, 1031544, 1025485, 1170832]
1945A170832N33241p13239L98937p48493k39771N13124M7176m2947J8625J1737
1935I49222J00205Q3712j92899O45162m02451l37092Q37304k47074l97894Q18611
1925A856806M4498n32290j74390o4932k02623K65511k02382l34925R0927K82619
1915A028819m34494J81501M08961n75967L89749K40911n93731K22420M84399j098912
1905B53656j39418M95692j37377K90101l73340k28990m12833Q24733l79249J58818
1895C51793n73586j49546J45579P04021M66282j31599J55815J36639Q6129p45041
1885D46486j21764l76628Q25987l51833Q2301N55049M45675q04504n57941P1308
1875B14136O2379L11407J60081l35586p18810J368145m62050l48315l84070K47671
$$ y = [1170832, 1704073, 990834, 1389771, 641278, 401507, 914631, 961807, 918860, 937485, 949222, 1049427, 1133139, 940240, 1585402, 1182951, 845859, 1683163, 1436089, 1038195, 1856806, 1901304, 1369014, 1194624, 1129692, 927069, 1192580, 990198, 655273, 746200, 1028819, 594325, 775826, 1184787, 608820, 998569, 1239480, 645749, 868169, 1352568, 253656, 114238, 609930, 472553, 762654, 389314, 160324, -252509, 572224, 192975, 351793, -221793, -371339, -225760, 478261, 944543, 812944, 968759, 1105398, 1191527, 446486, 324722, -51906, 774081, 422248, 504549, 1059598, 1505273, 700769, 142828, 214136, 276515, 587922, 748003, 412417, -306393, 1061752, 599702, 251387, -132683, 114988]
1865A14988j5951m55211K7450j81068p2725J182029K58980q32691p01647N87819
1855h8027J779645l75373k16461r5896o38813l82058L92328p0862l30134M91515
1845D65864j54265j26705O20873O96164n04416J44329o8632R72487m23646m48165
1835A173888K649N9821n1633N76501q8910j056644o79465J19572n70544R6749
1825d18016N95393l69062n52361Q5711M49834Q24802r18234k91698J69373J465186
1815A040928l19494p10682M80004j290301J257743p86830J78353m14751J058718
1806D93688n4982n33856J64356r963k33624k9881k00999L78021k53185m84672
1796g65097n10875L1461N29623J791325L15551m29923j506767q65910M15768q9742
$$ y = [114988, 99037, -356174, -328724, -509792, -582517, 599512, 858492, 25801, -675846, -88027, 1691618, 1316245, 1099784, 1003888, 365075, -16983, 375345, 304483, -25651, 465864, 311599, 184894, 805767, 1501931, 997515, 1141844, 1073212, 2045699, 1622053, 1173888, 1176537, 1236358, 1184725, 1761226, 1672316, 615672, -63793, 55779, -514765, -418016, 177377, -191685, -744046, -658335, -208501, 616301, -301933, -593631, -424258, 1040928, 721434, 10752, 490756, -799545, 458198, -328632, -150279, -565030, 493688, 438706, -95150, 69206, 59243, -174381, -204262, -405261, -27240, -280425, -765097, -1275972, -1244511, -714888, 1076437, 1391988, 962065, -544702, -1410612, -994844, -1084586]
1786a084586m16398J181302J99712n55754N86477l68573L12134P3193M20483k24437
1776A23553O20792m82023k03160J58641m78866n94440o14488K00820J191066K61697
1766A83592P25562q57500o25259Q39488o99649l63607O19088N92034k78109R0107
1756B25747J15599j42041N6443j61224P3954k15345J97515k06131K42444o04021
1746d17060j73658L42149L03977M35485p56206q78629L65567Q44490O2405J21471
1736B49991n6699O5913m8948q22348J16117O46759P1407j05328n23581k79533
1726f86250N40386L88307L43012p20304m70607j9433j40962O76973o75832j75153
1716i39863k35969N00880O08976n94248o41819M6408O93630M54373l33n05155
$$ y = [-1084586, -1500984, -319682, -119970, -675724, -89247, -457820, -145686, -72493, 347990, 123553, 744345, 262322, 59162, 217803, -261063, -855503, -1469991, -1269171, -78105, 183592, 909154, 51654, -573605, 265883, -433766, -797373, -178285, 413749, 135640, 225747, 341346, 199305, 255748, 94524, 168478, -46867, 150648, -55483, 186961, -417060, -590718, -248569, 55408, 490893, -265313, -1143942, -778375, 66115, 128520, 249991, 193292, 259205, 210257, -612091, -495974, 150785, 222192, 116864, -406717, -686250, -145864, 242443, 585455, -134849, -605456, -624889, -765851, -88878, -764710, -939863, -1175832, -674952, -65976, -660224, -1302043, -1255635, -562005, -107632, -107965, -613120]
1706f13120j4015O35930O3393k20184j98913O5490k86384K7128k69919K35144
1696e75450M30207P83910j06053o47113k02754r9381n66543O21525k47923k40622
1686h50197R80754j25955L21552o15738K0268P83414l55164P16885q42461n54183
1676e20825k7035k68798M99749N2050K3317J022577m12492m23955l13346r78861
1666a347619L69193l59228K60987K97656O24189M40027m67269n42806K66651R4465
1656c63754p9860m91479P3791M27338j9074k50861j60393N48348p149l82995j84611
1645h90699l19684K07618L45850J255597N00923q78660n74563m31292k91592N04292
1635e72210M53782j64938n78723P07580J74590J92340r53136j17860Q16840n69394
$$ y = [-613120, -627135, 8795, 72188, -147996, -346909, -281419, -567803, -540675, -810594, -575450, -145243, 638667, 532614, -114499, -317253, -416634, -983177, -361652, -609575, -850197, 130557, 4602, 326154, -289584, -269316, 514098, 158934, 875819, 33358, -520825, -547860, -816658, -316909, -264859, -241542, 781035, 368543, -55412, -368758, -1347619, -978426, -1337654, -1076667, -779011, -154822, 285205, -182064, -724870, -458219, -363754, -443614, -935093, -861302, -433964, -453038, -703899, -864292, -315944, -323093, -706088, -890699, -1210383, -1002765, -656915, 598682, 1099605, 220945, -353618, -784910, -1076502, -572210, -118428, -283366, -862089, -154509, 20081, 212421, -740715, -858575, -41735, -611129]
1625f11129O0035k57234L07781N73599P76226o09988m70840J34029j228730J51232
1615a175019n41640J582867L5185o70512o60479O33752J07455L16153l02485m29991
1605a104714M03007r48424J350199Q03962L01199j471271J1429P81232m21912
1596b95293P15475p1119K53023l75765j46766o40017Q35390R20808j623642o5665
1586d93571n54551P84356j32249j88057J2489J29953n01110J67299k39986O54150
1576c61277L63953K1250J66818L21947J28073r80828k89579n191J99732P92704
1566C57602p18741M20Q9305l45903K40539m12779m387J61884P95725K07468K91390
1555F62523p78487J80384m30376m88516n20087K44637K33889m41754O92440K5318
$$ y = [-611129, -551094, -808328, -500547, 73052, 849278, 239290, -231550, -97521, -1326251, -1175019, -1716659, -133792, -98607, -769119, -1429598, -795846, -688391, -372238, -674723, -1104714, -701707, -1650131, -299932, 504030, 805229, -666042, -654613, 126619, -295293, 420182, 349063, 602086, 226321, 79555, -560462, 274928, 1195736, -427906, -493571, -1048122, -263766, -396015, -584072, -571583, -441630, -942740, -775441, -1015427, -361277, 2676, 23926, 190744, 512691, 640764, -340064, -629643, -634834, -435102, 357602, -361139, -360719, -271414, -617317, -376778, -789557, -793944, -632060, 163665, 371133, 662523, -115964, 64420, -365956, -854472, -1374559, -1129922, -896033, -1337787, -645347, -620029]
1545f20029N3939N03902p45532k08878K25141O7916Q21758l70903l12240J3800
1535e71126n52038k73753J118589K86462j40352n54771P21557k72059j304598
1526a542089K83478L47879N236O56515O01818P1754q32112p87391K90769L31274
1516e72869q54193K76654Q51878O88260m12127j80473M58527l25737m22638J43690
1506c49028R31418m09969l35825Q99371l57419j300942O61879p7010j36932k58376
1496g32833j49615J027579l447p21886Q16460O56952o18017r31098p93887J159418
1486b90374J275885k60490J40115l99219j218237k23164l46610J137809Q69486
1477F85201r42671O91638P4138k53623n12690p0762K44449j89257o37448M42829
$$ y = [-620029, -566090, -62188, -807720, -1016598, -791457, -723541, 98217, -272686, -584926, -571126, -1123164, -1396917, -278328, 8134, -132218, -686989, 34568, -237491, -1542089, -1258611, -910732, -905496, -248981, 352837, 424591, -407521, -1194912, -904143, -572869, -1427062, -1150408, -298530, 389730, -22397, -202870, 255657, -70080, -492718, -349028, 582390, 172421, -163404, 735967, 378548, -922394, -260515, -337525, -474457, -732833, -882448, 145131, 141684, -580202, 236258, 893210, 275193, -655905, -1449792, -290374, 985511, 725021, 865136, 465917, -752320, -975484, -1322094, -184285, 685201, -257470, 434168, 508306, 254683, -258007, -328769, -84320, -273577, -911025, -468196]
1467d68196O58466l56565j178818J19693k13484R61299J25019l55048j26299l4809
$$ y = [-468196, 190270, -166295, -1345113, -1225420, -1438904, -477605, -352586, -707634, -833933, -868742]
$$ [...]
##END NTUPLES=NMR SPECTRUM
##END=
