##TITLE=1H_CA-8914-1
 CDCl3, 8 sc, 
 5.08.2021
##JCAMPDX= 6.0         $$ Bruker NMR JCAMP-DX V2.0
##DATA TYPE= NMR SPECTRUM
##DATA CLASS= NTUPLES
##ORIGIN= UXNMR, Bruker Analytische Messtechnik GmbH
##OWNER= root
$$ XWIN-NMR		Version 3.5
$$ Thu Aug  5 08:34:44 2021 Russian Standard Time (UT+4h)  she@DPX200
##.OBSERVE FREQUENCY= 200.131506
##.OBSERVE NUCLEUS= ^1H
##.ACQUISITION MODE= SIMULTANEOUS
##.ACQUISITION SCHEME= undefined
##.AVERAGES= 8
##.DIGITISER RES= 18
##SPECTROMETER/DATA SYSTEM= spect
##.PULSE SEQUENCE= zg30
##.SOLVENT NAME= CDCl3
##.SHIFT REFERENCE= (INTERNAL, CDCl3, 0, 17.4898)
##AUDIT TRAIL= $$ (NUMBER, WHEN, WHO, WHERE, WHAT)
$$ ##TITLE= Audit trail, XWIN-NMR		Version 3.5
$$ ##JCAMPDX= 5.01
$$ ##ORIGIN= Bruker BioSpin GmbH
$$ ##OWNER= she
$$ F:/spectra/data/she/nmr/H-F/1/pdata/1/auditp.txt
$$ ##AUDIT TRAIL=  $$ (NUMBER, WHEN, WHO, WHERE, WHAT)
(   1,<2021-08-05 08:33:32.34 +0400>,<she>,<DPX200>,
      <created by zg, POWCHK disabled, PULCHK disabled
       configuration hash MD5:
       00 E9 B6 7A A2 85 ED C7 34 08 36 98 17 FE 4E 26
       data hash MD5: 16K
       A9 CB AC F9 07 EF DD A9 71 CB E1 2D B7 30 41 0C>)
(   2,<2021-08-05 08:33:34.84 +0400>,<she>,<DPX200>,
      <Start of raw data processing
       efp BC_mod = 2 LB = 0.24 FT_mod = 6 PKNL = 1 PHC0 = -13358.37 PHC1 = 14.60099 SI = 16K 
       data hash MD5: 16K
       3C A6 5E B5 8B 56 87 40 71 BA C5 35 BE 47 2D A4>)
(   3,<2021-08-05 08:33:56.81 +0400>,<she>,<DPX200>,
      <pk PHC0 = 2.322535 PHC1 = 0 
       data hash MD5: 16K
       09 18 61 7E 41 2F D5 91 C7 AE A3 17 97 39 11 F7>)
(   4,<2021-08-05 08:34:00.29 +0400>,<she>,<DPX200>,
      <abs ABSG = 5 
       data hash MD5: 16K
       51 35 1B 7D 82 17 6C 98 E5 81 08 F8 D6 2F CA DD>)
$$ ##END=
$$ 
$$ hash MD5
$$ 6C 6D C1 8B EE EB 33 F0 AF 41 E4 86 D5 C8 9F FB
##$RELAX= 
##$RELAX= 
##$RELAX= 
##$RELAX= 
##$RELAX= 
##$RELAX= 
$$ Bruker specific parameters
$$ --------------------------
##$DU= <F:/spectra>
##$EXPNO= 1
##$NAME= <H-F>
##$PROCNO= 1
##$TYPE= <nmr>
##$USER= <she>
##$AMP= (0..31)
100 100 100 100 100 100 100 100 100 100 100 100 100 100 100 100 100 100 
100 100 100 100 100 100 100 100 100 100 100 100 100 100 
##$AQSEQ= 0
##$AQ_mod= 1
##$AUNM= <au_zg>
##$AUTOPOS= <>
##$BF1= 200.13
##$BF2= 200.13
##$BF3= 200.13
##$BF4= 200.13
##$BF5= 200.13
##$BF6= 200.13
##$BF7= 200.13
##$BF8= 200.13
##$BYTORDA= 1
##$CFDGTYP= 0
##$CFRGTYP= 5
##$CHEMSTR= <none>
##$CNST= (0..31)
1 1 145 1 1 1 1 1 1 1 1 1 1 1 1 1 1 1 1 1 1 1 1 1 1 1 1 1 1 1 1 1 
##$CPDPRG= <>
##$CPDPRG1= <>
##$CPDPRG2= <>
##$CPDPRG3= <>
##$CPDPRG4= <mlev>
##$CPDPRG5= <mlev>
##$CPDPRG6= <mlev>
##$CPDPRG7= <mlev>
##$CPDPRG8= <mlev>
##$CPDPRGB= <>
##$CPDPRGT= <>
##$D= (0..31)
0 1.2 0 0 0 0 0 0 0 0.06 0 0.03 0 0 0 0 0.0002 0 0 0 0 0 0 0 0 0 0 0 0 
0 0 0 
##$DATE= 1628138011
##$DBL= (0..7)
120 120 120 120 120 120 120 120 
##$DBP= (0..7)
150 150 150 150 150 150 150 150 
##$DBP07= 0
##$DBPNAM0= <>
##$DBPNAM1= <>
##$DBPNAM2= <>
##$DBPNAM3= <>
##$DBPNAM4= <>
$$ [...]
##$SUBNAM3= <"">
##$SUBNAM4= <"">
##$SUBNAM5= <"">
##$SUBNAM6= <"">
##$SUBNAM7= <"">
##$SUBNAM8= <"">
##$SUBNAM9= <"">
##$SW= 20.0188882624521
##$SWIBOX= (0..15)
0 0 2 0 0 0 0 0 0 0 0 0 0 0 0 0 
##$SW_h= 4006.41025641026
##$TD= 16384
##$TD0= 1
##$TE= 0
##$TE2= 300
##$TE3= 300
##$TEG= 300
##$TL= (0..7)
0 120 120 120 120 120 120 120 
##$TP= (0..7)
150 150 150 150 150 150 150 150 
##$TP07= 0
##$TPNAME0= <>
##$TPNAME1= <>
##$TPNAME2= <>
##$TPNAME3= <>
##$TPNAME4= <>
##$TPNAME5= <>
##$TPNAME6= <>
##$TPNAME7= <>
##$TPOAL= (0..7)
0.5 0.5 0.5 0.5 0.5 0.5 0.5 0.5 
##$TPOFFS= (0..7)
0 0 0 0 0 0 0 0 
##$TUNHIN= 0
##$TUNHOUT= 0
##$TUNXOUT= 0
##$USERA1= <user>
##$USERA2= <user>
##$USERA3= <user>
##$USERA4= <user>
##$USERA5= <user>
##$V9= 5
##$VALIST= <valist>
##$VCLIST= <CCCCCCCCCCCCCCC>
##$VD= 0
##$VDLIST= <DDDDDDDDDDDDDDD>
##$VPLIST= <PPPPPPPPPPPPPPP>
##$VTLIST= <TTTTTTTTTTTTTTT>
##$WBST= 1024
##$WBSW= 4
##$XGAIN= (0..3)
0 0 0 0 
##$XL= 0
##$YL= 0
##$YMAX_a= 199418
##$YMIN_a= -278694
##$ZGOPTNS= <>
##$ZL1= 120
##$ZL2= 120
##$ZL3= 120
##$ZL4= 120
##$ABSF1= 17.6364
##$ABSF2= -2.382641
##$ABSG= 5
##$ABSL= 3
##$ALPHA= 0
##$AQORDER= 0
##$ASSFAC= 0
##$ASSFACI= 0
##$ASSFACX= 0
##$ASSWID= 0
##$AUNMP= <proc_1d>
##$AZFE= 0.1
##$AZFW= 0.1
##$BCFW= 0
##$BC_mod= 2
##$BYTORDP= 0
##$COROFFS= 0
##$CY= -3
##$DATMOD= 1
##$DC= 0
##$DFILT= <>
##$DTYPP= 0
##$F1P= 0
##$F2P= 0
##$FCOR= 1
##$FTSIZE= 16384
##$FT_mod= 6
##$GAMMA= 0
##$GB= 0
##$INTBC= 1
##$INTSCL= 1.334414e-10
##$ISEN= 128
##$LB= 0.24
##$LEV0= 0
##$LPBIN= 0
##$MAXI= 10000
##$MC2= 0
##$MEAN= 0
##$ME_mod= 0
##$MI= 1.114404
##$NCOEF= 0
##$NC_proc= -9
##$NLEV= 6
##$NOISF1= 3.799351
##$NOISF2= 2.8
##$NSP= 0
##$NTH_PI= 0
##$NZP= 0
##$OFFSET= 17.48978
##$PC= 1
##$PHC0= -13356.05
##$PHC1= 14.60099
##$PH_mod= 1
##$PKNL= yes
##$PPARMOD= 0
##$PSCAL= 0
##$PSIGN= 0
##$REVERSE= no
##$SF= 200.130008975254
##$SI= 16384
##$SIGF1= 3
##$SIGF2= 2
##$SINO= 5.538805
##$SIOLD= 16384
##$SREGLST= <1H.CDCl3>
##$SSB= 0
##$STSI= 16384
##$STSR= 0
##$SW_p= 4006.41025641026
##$SYMM= 0
##$S_DEV= 0
##$TDeff= 16384
##$TDoff= 0
##$TI= <>
##$TILT= no
##$TM1= 0
##$TM2= 0
##$TOPLEV= 0
##$USERP1= <user>
##$USERP2= <user>
##$USERP3= <user>
##$USERP4= <user>
##$USERP5= <user>
##$WDW= 1
##$XDIM= 16384
##$YMAX_p= 347589225
##$YMIN_p= -3437595
$$ End of Bruker specific parameters
$$ ---------------------------------
##NTUPLES= NMR SPECTRUM
##VAR_NAME=  FREQUENCY,     SPECTRUM/REAL,   SPECTRUM/IMAG
##SYMBOL=    X,             R,               I
##VAR_TYPE=  INDEPENDENT,   DEPENDENT,       DEPENDENT
##VAR_FORM=  AFFN,          ASDF,            ASDF
##VAR_DIM=   16384,         16384,           16384
##UNITS=     HZ,            ARBITRARY UNITS, ARBITRARY UNITS
##FACTOR=    0.24454680195387, 1,            1
##FIRST=     3500.22991363568, 0,            0
##LAST=      -506.180342774577, 0,           0
##MIN=       -506.180342774577, -3437595,    0
##MAX=       3500.22991363568, 347589225,    0
$$ Real data points
##PAGE= N=1
##DATA TABLE= (X++(R..R)), XYDATA
$$ [...]
6736C111359P42827n84937k40785J05783l26932l64280n81894K63698K88458J026115
$$ 3111359 3854186 3269249 3028464 3134247 2807315 2443035 1861141 2124839 2413297 3439412
6726C439412o61048n0426K76790l57410m05562m17297J003629M64364K13524P4499
$$ 3439412 2778364 2727938 3004728 2647318 2241756 1824459 2828088 3292452 3505976 3580475
6716C580475l34088Q997o16197Q90496J17401M47677m30974p53706N96608j090556
$$ 3580475 3246387 3255384 2639187 3529683 3647084 4094761 3663787 2910081 3506689 2416133
6706B416133m22611o0289J063579o9484j699699k01587J921980R82329J91188
$$ 2416133 1993522 1933233 2996812 2927328 1227629 1026042 2948022 3930351 4121539
6697D121539j235507l66913K56926Q47714p42180L16592K23610m08977o4367P9039
$$ 4121539 2886032 2519119 2776045 3623759 2881579 3198171 3421781 3012804 2948437 3027476
6687C027476J056375p03788l99523L31135l4292l25573R11377o72035K23458j96827
$$ 3027476 4083851 3380063 2980540 3311675 3277383 2951810 3863187 3191152 3414610 3217783
6677C217783Q0781N72677n71614j05618n29837m53424J119218R49168k11621K69659
$$ 3217783 3298564 3871241 3299627 3194009 2664172 2210748 3329966 4279134 4067513 4337172
6667D337172N05224K70j622952j14136n39716O0570L46044J33909M05233Q87325
$$ 4337172 4842396 4842666 3219714 3105578 2565862 2626432 2972476 3106385 3511618 4398943
6657D398943n83103j577231N11846J050358j89928p5798O27535m88957N21662
$$ 4398943 3815840 2238609 2750455 3800813 3610885 3535087 4162622 3673665 4195327
6648D195327j41478J154902N3839j034543M81383J96819j1238j81966m77113m66317
$$ 4195327 4053849 5208751 5262590 4228047 4709430 4906249 4895011 4713045 4235932 3769615
6638C769615j77201j72034N19969n49338l56653R08298Q58255m40718p01898L70150
$$ 3769615 3592414 3420380 3940349 3391011 3034358 3942656 4800911 4360193 3658295 4028445
6628D028445j62848L92517N73345M8020l95853R117L39744N7433j00030m39051
$$ 4028445 3865597 4258114 4831459 4879479 4483626 4492743 4832487 4889920 4789890 4350839
6618D350839N6451J27236J30269l8669K00002m04161p47511k95571K40084R4147
$$ 4350839 4407290 4534526 4664795 4626126 4826128 4421967 3674456 3378885 3618969 3713116
6608C713116J06825J327209l82217j083696R3044O88305J305853n03783o6519
$$ 3713116 3819941 5147150 4764933 3681237 3774281 4462586 5768439 5264656 5198137
6599E198137N58607J72789k32609l31593k71993o08937M55939J93789m194q97014
$$ 5198137 5756744 5929533 5696924 5365331 5093338 4484401 4940340 5134129 5129935 4232921
6589D232921n1985Q05627K70921j1009l3458N3483K68468k4825j88194p08562
$$ 4232921 4180936 4986563 5257484 5246475 5213017 5266500 5534968 5510143 5321949 4613387
6579D613387Q31978J639987k8979p40047k69498j1412n43186R52351Q94766J13504
$$ 4613387 5445365 7085352 7056373 6316326 6046828 6035416 5492230 6444581 7339347 7452851
6569G452851q84347M13599P12044q10301k69124M74270q0573R25139m97673q98197
$$ 7452851 6568504 6982103 7694147 6883846 6614722 7088992 7008419 7933558 7435885 6537688
6559F537688L38447L42621J161229k81449M6717m229l53147m73046l28467K9755
$$ 6537688 6876135 7218756 8379985 8098536 8145253 8141024 7787877 7314831 6986364 7016119
6549G016119J29331j214745J8000O06101M65220Q5762l33776R20496o0411n70854
$$ 7016119 7145450 5930705 5948705 6554806 7020026 7105788 6772012 7692508 7632097 7061243
6539G061243J196176P46838k16249k27044n88850J23943R8013j99172k89467J030768
$$ 7061243 8257419 9004257 8788008 8560964 7972114 8096057 8194070 7994898 7705431 8736199
6529H736199p11031j141479N93019M43835m91644k22805N64441l21768m02505
$$ 8736199 8025168 6883689 7476708 7920543 7428899 7206094 7770535 7448767 7046262
6520G046262M31089N03101m33469L756J79593P396j48263j097804K66064J57317
$$ 7046262 7477351 7980452 7546983 7550739 7730332 7737728 7589465 6491661 6757725 6915042
6510F915042J23086Q9812j84803J96791L2735R98288K48000o66153o88103o43477
$$ 6915042 7038128 7127940 6943137 7139928 7172663 8170951 8418951 7752798 7064695 6421218
6500F421218L37286N49168M9252l21149K59975J66767J06255n60955J86527Q62961
$$ 6421218 6758504 7307672 7356924 7035775 7295750 7462517 7568772 7007817 7194344 8057305
6490H057305P06005l72668j034877j11123r3851R80860k91218K42517L44012o00620
$$ 8057305 8763310 8390642 7355765 7244642 7150791 8131651 7840433 8082950 8426962 7826342
6480G826342O68776m38217j050510J083595R18261K180j488314j45515j27938
$$ 7826342 8495118 8056901 7006391 8089986 9008247 9010427 7522113 7376598 7248660
6471G248660K91337Q24622J83018p22140j37158M35033L90288q4024L01826O27045
$$ 7248660 7539997 8364619 8547637 7825497 7688339 8123372 8513660 8429636 8731462 9358507
6461I358507j399860N2384m01855P82019L14889k14251l21592o42082M98402M66143
$$ 9358507 7958647 8011031 7609176 8391195 8706084 8491833 8170241 7528159 8026561 8492704
6451H492704P1878L44793n98864M4573P49910K29716p74706m89075Q29943Q5632
$$ 8492704 8564582 8909375 8310511 8355084 9104994 9334710 8560004 8070929 8900872 8986504
6441H986504Q8860j45610J30165L18004m13816L56559J131273n95476L4425m90757
$$ 8986504 9075364 8929754 9059919 9377923 8964107 9320666 10451939 9856463 9890888 9400131
6431I400131P54016Q5175K04706o51972p29557L38039N79289L47051M68083p59639
$$ 9400131 10154147 10239322 10444028 9792056 9062499 9400538 9979827 10326878 10794961 10035322
6421A0035322n45692Q47279O65540j97163o93990r0316M99589J89856m86970n06386
$$ 10035322 9489630 10336909 11002449 10805286 10111296 10020980 10520569 10710425 10223455 9717069
6411I717069j26125R30644l1506O57123n73578N43760j091506l46276N94724j63985
$$ 9717069 9590944 10521588 10490082 11147205 10573627 11117387 10025881 9679605 10274329 10110344
6401A0110344j82233Q78766Q22976j52232k88330j62531j440385K65594l69785
$$ 10110344 9928111 10806877 11629853 11477621 11189291 11026760 9586375 9851969 9482184
6392I482184N3465O66071n7438k22909j10687M73063K70491l1459M1265j266059
$$ 9482184 9535649 10201720 10144282 9921373 9810686 10283749 10554240 10522781 10564046 9297987
6382I297987K95728O25479J143424j0978r77376O63673j196983M44919q0252M81023
$$ 9297987 9593715 10219194 11362618 11351640 10374264 11037937 9840954 10285873 10205621 10686644
6372A0686644P34668p02591J96209Q414K93297N76387o85089k77761l82425J31356
$$ 10686644 11421312 10718721 10914930 10923344 11216641 11793028 11107939 10830178 10447753 10579109
6362A0579109M62640M08351p45368j22870L70696N26591l71807J60525K00544
$$ 10579109 11041749 11450100 10704732 10581862 10952558 11479149 11107342 11267867 11468411
6353A1468411J23382o11265M5154K54265k55348o13632j79217R26720P56427o49
$$ 11468411 11591793 10980528 11025682 11279947 11024599 10410967 10231750 11158470 11914897 11914248
6343A1914248J65301p21129n05889P02788m1157O66045n19888L99944Q72116k72257
$$ 11914248 12079549 11358420 10852531 11555319 11514162 12180207 11660319 12060263 12932379 12660122
6333A2660122o98651o5909M61714o50409P82632P4428N30155q09080k69791J91375
$$ 12660122 11961471 11895562 12357276 11706867 12489499 12563927 13094082 12285002 12015211 12206586
6323A2206586K43695l77660j66341K60596N23810N93947j456722K60036J360043
$$ 12206586 12450281 12072621 11906280 12166876 12690686 13284633 11827911 12087947 13447990
6314A3447990K06689l33585k94958p56496Q11432p36500N9143L56248K03462l7639
$$ 13447990 13654679 13321094 13026136 12269640 13081072 12344572 12403715 12759963 12963425 12925786
6304A2925786j67896k56608K44239J125198j23673k30259P71637K38354l73943
$$ 12925786 12757890 12501282 12745521 13870719 13747046 13516787 14288424 14526778 14152835
6295A4152835P6393o50957k69226L65008m51113N38944R21806m53587j147028
$$ 14152835 14229228 13578271 13309045 13674053 13222940 13761884 14683690 14230103 13083075
6286A3083075k97660O03959Q58879O7518j524940n57633J076292k20960R5857
$$ 13083075 12785415 13389374 14248253 14315771 12790831 12233198 13309490 13088530 13184387
6277A3184387L81021n65780k73963K56916L89251O59880Q8944l64112J62321m86444
$$ 13184387 13565408 12999628 12725665 12982581 13371832 14031712 14120656 13756544 13918865 13432421
6267A3432421R03592o88873q48227J341241m03030p91354n75140j77416P24422
$$ 13432421 14336013 13647140 12798913 14140154 13737124 12945770 12370630 12193214 12917636
6258A2917636l98029k6970J164044K377R8748K53089o18826q0833j4516o21125
$$ 12917636 12519607 12492637 13656681 13659058 13757806 14010895 13392069 13311236 13296720 12675595
6248A2675595K11044J62611M38329o38381Q76212K12957j154260m61214K52342
$$ 12675595 12886639 13049250 13487579 12849198 13725410 13938367 12784107 12322893 12575235
6239A2575235R83890M31668j73094P1494N13851n7984J11563P01188R8584n98073
$$ 12575235 13559125 13990793 13817699 13889193 14403044 14345060 14456623 15157811 15256395 14658322
6229A4658322o96624L13052Q70320p15364J89468L89396m83596M94758M00596
$$ 14658322 13961698 14274750 15145070 14429706 14619174 15008570 14524974 15019732 15420328
6220A5420328o37149J08822n29768N18089O03434l58976l38927K85216m43734
$$ 15420328 14783179 14892001 14362233 14880322 15483756 15124780 14785853 15071069 14627335
6211A4627335L54624k39131O22588j86373p42330Q5208J37699J67195R19697M24379
$$ 14627335 14981959 14742828 15365416 15179043 14436713 14521921 14659620 14826815 15746512 16170891
6201A6170891k16766j53924m52148J72844O8407k94520k68656K85702K6768l10456
$$ 16170891 15954125 15800201 15348053 15520897 15589304 15294784 15026128 15311830 15338598 15028142
6191A5028142j20285M79077k20973N11651J19436q2481K12620o64506o0035l59755
$$ 15028142 14907857 15386934 15165961 15677612 15797048 15714567 15927187 15262681 15202646 14842891
6181A4842891K74503J066210P36465p11279m82799R32922p41436k13165j83104
$$ 14842891 15117394 16183604 16920069 16208790 15725991 16658913 15917477 15704312 15521208
6172A5521208O18350J41573m55496m77137k28914K80341Q47304p3758l94507J032158
$$ 15521208 16139558 16281131 15825635 15348498 15119584 15399925 16247229 16173471 15778964 16811122
6162A6811122L32765j161507K19483j76220j27857O69715K54558P5020J47324
$$ 16811122 17143887 15982380 16201863 16025643 15897786 16567501 16822059 16897079 17044403
6153A7044403j07755q27902K54651M2435J135878K19165n64491J44655J69947
$$ 17044403 16936648 16108746 16363397 16405832 17541710 17760875 17196384 17341039 17510986
6144A7510986O83979O01859j277494j219987J96387N66429J28125J08652M71434
$$ 17510986 18194965 18796824 17519330 16299343 16495730 17062159 17190284 17298936 17770370
6135A7770370l94375k69986J3116Q80726l58562j84274o17990M79778Q32603J25620
$$ 17770370 17375995 17106009 17119125 17999851 17641289 17457015 16839025 17318803 18151406 18277026
6125A8277026J17971o37483L75108n11325o9761J82220K18758J89471l42577P52584
$$ 18277026 18394997 17757514 18132622 17621297 17551536 17733756 17952514 18141985 17799408 18551992
6115A8551992q37752n14758j17037j53380J101687j09573O59727N64814j66461
$$ 18551992 17714240 17199482 17082445 16929065 18030752 17921179 18580906 19145720 18979259
6106A8979259p5693n83123k47026P435j4586M11333K18115L6333j85689l89338
$$ 18979259 18903566 18320443 18073417 18080852 18066266 18477599 18695714 18732047 18546358 18157020
6096A8157020N80285K59010J17902p89300L90507K43184p31012p5627N07642N84404
$$ 18157020 18737305 18996315 19114217 18324917 18715424 18958608 18227596 18151969 18659611 19244015
6086A9244015m8220L29982j65955R2900K75776r3724K18504J18557p67789j02439
$$ 19244015 19195795 19525777 19359822 19452722 19728498 19634774 19853278 19971835 19204046 19101607
6076A9101607J868852j146531l58331P65596r67948l72023K45473N13218p4400
$$ 19101607 20970459 19823928 19465597 20231193 19263245 18891222 19136695 19649913 19575513
6067A9575513K5685K11947M871q61528J037910r7343M74926M85868q58513l77316
$$ 19575513 19601198 19813145 19818016 18956488 19994398 19897055 20371981 20857849 19999336 19622020
6057A9622020J57986R63093R3008k87098K39704J951362p34580j030737j0040
$$ 19622020 19780006 20743099 20836107 20549009 20788713 22740075 22005495 20974758 20964718
6048B0964718k35489P53490j00980p5669r8887K90526n73219j30793R4196L99242
$$ 20964718 20729229 21482719 21381739 21306070 21207183 21497709 20924490 20793697 20887893 21287135
6038B1287135J21526J15489l23998p37554J231935M5727n27699l7059J03571J023768
$$ 21287135 21408661 21524150 21200152 20462598 21694533 21740260 21212561 21175502 21279073 22302841
6028B2302841j053388L90054L35581m53893l62612R78093j14138j04633M8962
$$ 22302841 21249453 21639507 21975088 21521195 21158583 22136676 22022538 21917905 21966867
6019B1966867l99200L83245J19382m34807r8776J206007K50500m59344J02922
$$ 21966867 21567667 21950912 22070294 21635487 21536711 22742718 22993218 22533874 22636796
6010B2636796M4300o34368k04527N34987O66567k31389n36147K55689P18448l69901
$$ 22636796 22681096 22046728 21842201 22377188 23043755 22812366 22276219 22531908 23250356 22880455
6000B2880455l0448K33044q97171P28686J451488j41477n32537J284006q55337
$$ 22880455 22850007 23083051 22185880 22914566 24366054 24224577 23692040 24976046 24120709
5991B4120709j92499O07591n46176j12044m14547J062100L72824q19021R08054
$$ 24120709 23928210 24535801 23989625 23877581 23463034 24525134 24897958 24078937 24986991
5982B4986991k5558O49994L02651m20545N97237j039817P49725m67216K27512
$$ 24986991 24961433 25611427 25914078 25493533 26090770 25050953 25800678 25333462 25560974
5973B5560974K6186J65159Q00557J05710K226l03725M42348P54660j87884L0485
$$ 25560974 25587160 25752319 26552876 26658586 26660812 26357087 26799435 27554095 27366211 27396696
5963B7396696L11174Q63904M52396N5972M32598P0441m23725o5544R85577j68424
$$ 27396696 27707870 28571774 29024170 29080142 29512740 29583181 29159456 29093912 30079489 29911065
5953B9911065p08386M01278R7961j39265j01040L53054q91015j3066P05566K33721
$$ 29911065 29202679 29603957 29701918 29562653 29461613 29814667 28923652 28910586 29616152 29849873
5943B9849873l12069r8565P37153k50115m67533N26938J19027o09546k24870P73680
$$ 29849873 29537804 29439239 30176392 29926277 29458744 29985682 30104709 29495163 29270293 30043973
5933C0043973J56866K02853K34138m25370J42220J024454j68337m7399o71354
$$ 30043973 30200839 30403692 30637830 30212460 30354680 31379134 31210797 31163398 30492044
5924C0492044J01745r5462l34655o37258O40866O22250L75893j75416m14069P12779
$$ 30492044 30593789 30498327 30163672 29526414 30167280 30789530 31165423 30990007 30575938 31288717
5914C1288717j15909N28090l16452n67118k01691N18313M29613K29852J175420
$$ 31288717 31172808 31700898 31384446 30817328 30615637 31133950 31563563 31793415 32968835
5905C2968835j78716m40251j62890p23461M1051q1669P93992Q5667M69611J117499
$$ 32968835 32790119 32349868 32186978 31463517 31504568 31422899 32216891 32302558 32772169 33889668
5895C3889668j117220m98387Q49059l689m15424J05706J92037n32683P93748N00927
$$ 33889668 32772448 32274061 33123120 33119431 32704007 32809713 33001750 32469067 33262815 33763742
5885C3763742j082694j46605q44417J258824P75263j086983O89971n9304O152
$$ 33763742 32681048 32534443 31690026 32948850 33724113 32637130 33327101 33267797 33273949
5876C3273949m0209M02356j229771k35654L10918J053726j80590J770J277397
$$ 33273949 33233740 33636096 32406325 32170671 32481589 33535315 33354725 33356495 34633892
5867C4633892O51953L67816N88608k66678J74283K80061n74349p85684P88623
$$ 34633892 35285845 35653661 36242269 35975591 36149874 36429935 35855586 35069902 35858525
5858C5858525j162285n79710l86477J044234k60599n95358L01207j338347J09801
$$ 35858525 34696240 34116530 33730053 34774287 34513688 33918330 34219537 32881190 32990991
5849C2990991N11170M96442j031780R7404J24358M29522p79406m8598R3212J062006
$$ 32990991 33502161 33998603 32966823 33064227 33188585 33618107 32838701 32790103 32883315 33945321
5839C3945321J2197j269810M72326L41390l55870m87678l53076L66006l33873
$$ 33945321 33957518 32687708 33160034 33501424 33145554 32657876 32304800 32670806 32336933
5830C2336933m5812M96699k4516j12830q14807Q07991J1412k78058m04531N05668
$$ 32336933 32291121 32787820 32763304 32650474 31835667 32643658 32655070 32377012 31972481 32478149
5820C2478149Q51094l7449L36258j95910J77056K27690K68780N72471l94255k13206
$$ 32478149 33329243 33291794 33628052 33432142 33609198 33836888 34105668 34678139 34283884 34070678
5810C4070678R50331q29256P6100M7501K4495N64878J54838L90597L16670l39894
$$ 34070678 35021009 34191753 34267853 34315354 34339849 34904727 35059565 35450162 35766832 35426938
5800C5426938l18388P08672n29563j35878n04529o47879n96847n40766M89055
$$ 35426938 35108550 35817222 35287659 35151781 34647252 33999373 33402526 32861760 33350815
5791C3350815j34939L58465K35791q52504o00147J016160M96989l56028o94179
$$ 33350815 33215876 33574341 33810132 32957628 32357481 33373641 33870630 33514602 32820423
5782C2820423j457546J494156O4516K86146j98583r63190P75200o07516j8531
$$ 32820423 31362877 32857033 32921549 33207695 33009112 32045922 32821122 32213606 32195075
5773C2195075M58497q16504L99094O21845l18357l3162Q7959m3146k42859R0365
$$ 32195075 32653572 31837068 32236162 32858007 32539650 32506488 32594447 32551301 32308442 32398807
5763C2398807O10272p6850J19874l78907o95780m83767K39715J39682k41032k62843
$$ 32398807 33009079 32932229 33052103 32673196 31977416 31493649 31733364 31873046 31632014 31369171
5753C1369171k19951R6246m63089o5641k05857k01559m10929p46703j501569J030977
$$ 31369171 31149220 31245466 30782377 30716736 30510879 30309320 29898391 29151688 27650119 28681096
5743B8681096N85644r65996q3496j02674j169750J82426n0613M25999r10533p12390
$$ 28681096 29266740 28300744 28217248 28114574 26944824 27127250 27076637 27502636 26592103 25879713
5733B5879713M62976o77698o72845l52947M89171L48376k54461O6166k42799p25024
$$ 25879713 26342689 25664991 24992146 24639199 25128370 25476746 25222285 25288451 25045652 24320628
5723B4320628n28869q57336k48884J516432o8445M32719M54106j608718N1117
$$ 24320628 23791759 22934423 22685539 24201971 24133526 24566245 25020351 23411633 23462750
5714B3462750K72454q20248M24577O20054p64586l29793j7436o38276N49863K16873
$$ 23462750 23735204 22914956 23339533 23959587 23195001 22865208 22847772 22209496 22759359 22976232
5704B2976232o03490k70365m723m10274L41229M0757L88846o11341L2260q7754
$$ 22976232 22372742 22102377 22097654 21687380 22028609 22069366 22458212 21846871 21879131 21791377
5694B1791377k91932r00127L66260j5712k25725j63810P14933J81748m16699K03821
$$ 21791377 21499445 20599318 20965578 20949866 20724141 20560331 21275264 21457012 21040313 21244134
5684B1244134o17638M00889j934827k2398K71145n12551p59487N12293O9270n7875
$$ 21244134 20626496 21027385 19092558 19070160 19341305 18828754 18069267 18581560 18650830 18592955
5674A8592955j13884Q7426O03331m02242m23595r50570m86494J69622j73458M9489
$$ 18592955 18479071 18566497 19169828 18767586 18343991 17393421 16906927 17076549 16903091 16952580
5664A6952580M1080j41558k95977K66159l0601P92104M23899o58368n47055j45208
$$ 16952580 16993660 16852102 16556125 16822284 16791683 17583787 18007686 17349318 16802263 16657055
5654A6657055M97495k27619q00780J16332K72486j5746k86549j94601J035216
$$ 16657055 17154550 16926931 16126151 16242483 16514969 16499223 16212674 16018073 17053289
5645A7053289N50398l04635l00559j23753m96737n16974J203374l42454m96639
$$ 17053289 17603687 17299052 16998493 16874740 16378003 15861029 17064403 16721949 16225310
5636A6225310R1899L68543q32915m21772O76098K47617J35725k24092K786N09811
$$ 16225310 16317209 16685752 15852837 15431065 16107163 16354780 16490505 16266413 16269199 16779010
5626A6779010R2011j474798m52524L93505K11879L60508j37854K79485N995p8533
$$ 16779010 16871021 15396223 14943699 15337204 15549083 15909591 15771737 16051222 16057217 15978684
5616A5978684N55169j231278m49156O07045J77700O88212l47932J667894p69749
$$ 15978684 16533853 15302575 14853419 15460464 15638164 16326376 15978444 17646338 16876589
5607A6876589l69628l04751M97204N7245Q9088r2222n60805K74492k13107k1353
$$ 16876589 16506961 16202210 16699414 16756659 16845747 16753525 16192720 16467212 16254105 16232752
5597A6232752j3376K08820K78741n65676N83100N23507L83309j17209l70048J071116
$$ 16232752 16219376 16428196 16706937 16141261 16724361 17247868 17631177 17513968 17143920 18215036
5587A8215036m86363k98304O96906K50275p28047n5391L32324J533145K87941
$$ 18215036 17728673 17430369 18127275 18377550 17649503 17594112 17926436 19459581 19747522
5578A9747522j579539n00199Q32898J343727J33891o2044o56296O79430L17842
$$ 19747522 18167983 17667784 18500682 19844409 19978300 19916256 19259960 19939390 20257232
5569B0257232j007949N61283P157O3096K01372R5113J65874O29398m98539R48238
$$ 20257232 19249283 19810566 19817723 19880819 20082191 20177304 20343178 20972576 20474037 21422275
5559B1422275J85276j73314J88335R71528L45485q45133J589N63002O0940j75046
$$ 21422275 21607551 21434237 21622572 22594100 22939585 22094452 22096041 22659043 22719983 22544937
5549B2544937L68973r18314L65120J69372j0731J73543q64279O19541l23239k63567
$$ 22544937 22913910 21995596 22360716 22530088 22519357 22692900 21828621 22448162 22124923 21861356
5539B1861356m66529K21748r50773j32473l40103j73428N76167l12013L89899
$$ 21861356 21394827 21616575 20665802 20533329 20193226 20019798 20595965 20283952 20673851
5530B0673851p00268j74985M74924m58038M27691L54145q0895q25512M33381j48182
$$ 20673851 19973583 19798598 20273522 19815484 20243175 20597320 20516425 19690913 20124294 19976112
5520A9976112J60819k90190R01493Q09028P1933m80747p06173M44573L8134K65201
$$ 19976112 20136931 19846741 20748234 21557262 21629195 21148448 20442275 20886848 20924982 21190183
5510B1190183J22135L23310M85342j048022O06680L37871k05827O2580P54485
$$ 21190183 21312318 21635628 22120970 21072948 21679628 22017499 21811672 21874252 22628737
5501B2628737P8243m36107j580407l54356J005702m21900P77559n40407L57055
$$ 22628737 22706980 22270873 20690466 20336110 21341812 20919912 21697471 21157064 21514119
5492B1514119P09681q23596L9132K57936q90832K38756Q5976r2538L36825m97213
$$ 21514119 22223800 21400204 21439336 21697272 20806440 21045196 21131172 21038634 21375459 20878246
5482B0878246n32429O11658q68711o61232P05364j382505o1826l31224N12885
$$ 20878246 20345817 20957475 20088764 19427532 20132896 18750391 18688565 18357341 18870226
5473A8870226L39063l09599M03217k78767P13443j533891l11874k3069k3819j27701
$$ 18870226 19209289 18899690 19302907 19024140 19737583 18203692 17891818 17868749 17844930 17717229
5463A7717229N45741j226516n55871N69385K28615o74470P43849J00081n82185
$$ 17717229 18262970 17036454 16480583 17049968 17278583 16604113 17347962 17448043 16865858
5454A6865858l57620j57063j26651j85444K22655j70137L144M62109j61382j000090
$$ 16865858 16508238 16351175 16224524 16039080 16261735 16091598 16094742 16556851 16395469 15395379
5444A5395379o0709J15056n80126O7801K34309L86246q04461k89078R39988M27012
$$ 15395379 15334670 15449726 14869600 14937401 15171710 15557956 14753495 14464417 15404405 15831417
5434A5831417m47461p2167O2570L58349M56151l63294j262688p3738O50204j65065
$$ 15831417 15383956 15311789 15374359 15732708 16188859 15825565 14562877 14489139 15139343 14974278
5424A4974278o42890L38303N58698n2827n15712J15659K34394J84938m20874K68839
$$ 14974278 14331388 14669691 15228389 15175562 14659850 14775509 15009903 15194841 14773967 15042806
5414A5042806K78721q30868J835571k42002o65366n97586k43260K95474M5481
$$ 15042806 15321527 14490659 16326230 16084228 15418862 14821276 14578016 14873490 14918971
5405A4918971P27830J6025q46773J29163L90433M59886m75008K40654q34434K08508
$$ 14918971 15646801 15662826 14816053 14945216 15335649 15795535 15320527 15561181 14726747 14935255
5395A4935255o69348O62532O88472j232081k3275m65423j19642j34282J586192
$$ 14935255 14265907 14928439 15616911 14384830 14361555 13896132 13776490 13642208 15228400
5386A5228400q57457K75687L79344K89871o53356J17980k16971l21014m21460
$$ 15228400 14370943 14646630 15025974 15315845 14662489 14780469 14563498 14242484 13821024
5377A3821024K37869k4655J11641k15613k70459j89781J92215Q19201j162204
$$ 13821024 14058893 14034238 14145879 13930266 13659807 13470026 13662241 14481442 13319238
5368A3319238P83786m04674K03740M56971k38447r60567Q22885L01473J50168
$$ 13319238 14103024 13698350 13902090 14359061 14120614 13160047 13982932 14284405 14434573
5359A4434573Q59492J31578j97208k8823J5302l40087K46333n89560N20840o26163
$$ 14434573 15294065 15425643 15228435 15199612 15214914 14874827 15121160 14531600 15052440 14426277
5349A4426277n45811L5212K77686n76767K00347P73913K6569N26558n29888O83581
$$ 14426277 13880466 13915678 14193364 13616597 13816944 14590857 14617426 15143984 14614096 15297677
5339A5297677k66560N49382l84670p90317J68395P58056j26269l93167j43112
$$ 15297677 15031117 15580499 15195829 14405512 14573907 15331963 15205694 14812527 14669415
5330A4669415N975k33152L80468l38880j51056l22722P61507k07150k57493M99872
$$ 14669415 14675390 14442238 14822706 14483826 14332770 14010048 14771555 14564405 14306912 14806784
5320A4806784m79069p92557L06640M59264k80243j28197O45967j34633K94249
$$ 14806784 14327715 13535158 13841798 14301062 14020819 13892622 14538589 14403956 14698205
5311A4698205Q3313J81423n22554n07813N25803o96165J3826P80581L38007j377392
$$ 14698205 14781518 14962941 14440387 13932574 14458377 13762212 13776038 14556619 14894626 13517234
5301A3517234K03867R08892j001029l62000o4110p62210J672788J00664k88835
$$ 13517234 13721101 14629993 13628964 13266964 13202854 12440644 14113432 14214096 13925261
5292A3925261j027661M75517P44842p07639k25477n8915L16515k3207K68584N8017
$$ 13925261 12897600 13373117 14117959 13410320 13184843 13125928 13442443 13419236 13687820 13745837
5282A3745837L66181K35143Q2999L83698J32931q39430j476781K97632M35039
$$ 13745837 14112018 14347161 14430160 14813858 14946789 14107359 12630578 12928210 13363249
5273A3363249K28576L438O87170n38203m44304n31411K7589J190344K82640l0921
$$ 13363249 13591825 13595263 14282433 13744230 13299926 12768515 12796104 13986448 14269088 14238167
5263A4238167l42459M59521k35199k20461k3420j166492N5543P98603P70973N04629
$$ 14238167 13895708 14355229 14120030 13899569 13876149 12709657 12765200 13563803 14334776 14839405
5253A4839405k7940j49187l23084Q30241J82802o04094J19490q39791j538888
$$ 14839405 14811465 14662278 14339194 15169435 15352237 14748143 14867633 14027842 12488954
5244A2488954L64482P93871J162003n30064K79821j45896M89091K47166o74624
$$ 12488954 12853436 13647307 14809310 14279246 14559067 14413171 14902262 15149428 14474804
5235A4474804j84253r215J15445O07391j32315J49231Q99213k38483j019237L96994
$$ 14474804 14290551 14281336 14396781 15004172 14871857 15021088 15920301 15681818 14662581 15059575
5225A5059575N81481M1972K10614P14475K68608o09368j45821N83106L73263j23232
$$ 15059575 15641056 15683028 15893642 16608117 16876725 16267357 16121536 16704642 17077905 16954673
5215A6954673L6608j153011k87693J145382Q45175k52280j70410O8454J46720
$$ 16954673 16991281 15838270 15550577 16695959 17541134 17288854 17118444 17186898 17333618
5206A7333618j386563M88066O18482p42253m00088Q04978J63332O03492J6128
$$ 17333618 15947055 16435121 17053603 16311350 15911262 16716240 16879572 17483064 17499192
5197A7499192K76192R9812L85892l13191o41808R87011N22709K18962J54522K17601
$$ 17499192 17775384 17875196 18261088 17947897 17306089 18293100 18815809 19034771 19189293 19406894
5187A9406894K91472N43149L13039l14747n12882n94773J214287j230306P58598
$$ 19406894 19698366 20241515 20554554 20239807 19726925 19132152 20346439 19116133 19874731
5178A9874731P33352m45697K75725j26249P6587Q73238j98895M20825R9578P28706
$$ 19874731 20608083 20162386 20438111 20311862 20388449 21261687 21062792 21483617 21583195 22311901
5168B2311901n183o93268m7138J90638J339509k64194L9157J06605N74880j44820
$$ 22311901 22306718 21613450 21566312 21756950 23096459 22832265 22871422 22978027 23552907 23408087
5158B3408087p33357J538845O35360l9709l78275O72771P06823j43148N70335
$$ 23408087 22674730 24213575 24848935 24809226 24430951 25103722 25810545 25667397 26237732
5149B6237732J60275R39973N8617O48735n70989R62147K05111J74924N60386k64850
$$ 26237732 26398007 27337980 27396597 28045332 27474343 28436490 28641601 28816525 29376911 29112061
5139B9112061J0590Q70855Q65314j7968M025Q73411N2318J012748J069491J5317
$$ 29112061 29122651 29993506 30858820 30840852 30844877 31718288 31770606 32783354 33852845 33868162
5129C3868162J240220K21657m3864N13140M22255J450837M65926J10375Q08885
$$ 33868162 35108382 35330039 35286175 35799315 36221570 37672407 38138333 38248708 39057593
5120C9057593O02293N94751J276629m091K04483O60776M61324P13424J421225
$$ 39057593 39659886 40254637 41531266 41527175 41731658 42392434 42853758 43567182 44988407
5111D4988407M86589P49666R33661J194557J069484Q12880O22021J065452R82941
$$ 44988407 45474996 46224662 47158323 48352880 49422364 50235244 50857265 51922717 52905658
5102E2905658R90300J062851J065979J288766J630199R74324J643866K491386
$$ 52905658 53895958 54958809 56024788 57313554 58943753 59918077 61561943 64053329
5094F4053329Q35746K233081J682501J655029J396899J533690K095941K621560
$$ 64053329 64889075 67122156 68804657 70459686 71856585 73390275 75486216 78107776
5086G8107776J760039J957043L168200K950717K651073J904246L333672L562427
$$ 78107776 79867815 81824858 84993058 87943775 90594848 92499094 95832766 99395193
5078I9395193L712542L333737L947323M438938L651101M101459M559390L666465
$$ 99395193 103107735 106441472 110388795 114827733 118478834 122580293 127139683 130806148
5070A30806148M414561N369965N310297L966873L793246M428098M678009L525054
$$ 130806148 135220709 140590674 145900971 149867844 153661090 158089188 162767197 166292251
5062A66292251L452248K585049L239264J462621R43069J75141k86937m37781q82854
$$ 166292251 169744499 172329548 175568812 177031433 177974502 178149643 177862706 177424925 176542071
5053A76542071l355633l271586l063356m183744m814035m825391m428005m683282
$$ 176542071 173186438 169914852 166851496 162667752 157853717 153028326 148600321 143917039
5045A43917039n034073n214357m200571l750490l917663m467274l277028l989537
$$ 143917039 138882966 133668609 129468038 125717548 121799885 117332611 114055583 110066046
5037A10066046m196856l440504k579612k601242k491804l091839j963628k747177
$$ 110066046 105869190 102428686 99849074 97247832 94756028 91664189 89700561 86953384
5029H6953384k599224j562588j426204k824925j677585j153613j157658j988632
$$ 86953384 84354160 82791572 81365368 78540443 76862858 75709245 74551587 72562955
5021G2562955n06967k150635j687353r86561j299551r39362l13289j690466n91687
$$ 72562955 72055988 69905353 68218000 67231439 65931888 64992526 64679237 62988771 62397084
5012F2397084l24835j112415j159098n69111j259101M42861k9185o93724l82895
$$ 62397084 62072249 60959834 59800736 59231625 57972524 58415385 58386200 57692476 57309581
5003E7309581r82333j257699K53905q88076n51536P03357j210726m62337J08198
$$ 57309581 56327248 55069549 55323454 54435378 53883842 54587199 53376473 52914136 53022334
4994E3022334j112704M2636J67505j021610p76806k51242M99736n42234l44428
$$ 53022334 51909630 51952266 52119771 51098161 50321355 50070113 50569849 50027615 49683187
4985D9683187N52200k0713k67680J94211Q4952J89907l56552K21566m63850q53957
$$ 49683187 50235387 50214674 49946994 50141205 50226157 50416064 50059512 50281078 49817228 48963271
4975D8963271J61224Q04056l67031k38413L57052q4592j59393Q75584Q63573j206329
$$ 48963271 49124495 49928551 49561520 49323107 49680159 49595567 49436174 50311758 51175331 49969002
4965D9969002j474341k18759P35398J161260m22302J95684l18252P48083J12929
$$ 49969002 48494661 48275902 49011300 50172560 49750258 49945942 49627690 50375773 50488702
4956E0488702M6019J89354K8671L97630O9994m80442J27496M14992J287661Q75693
$$ 50488702 50534721 50724075 50752746 51150376 51220370 50739928 50867424 51282416 52570077 53445770
4946E3445770O58895L98845L93766P52786O90875K26461O34474p33872J013960
$$ 53445770 54104665 54503510 54897276 55650062 56340937 56567398 57201872 56468000 57481960
4937E7481960Q60891N46449P03689K22593Q82991N58489l64254O56933M52311
$$ 57481960 58342851 58889300 59592989 59815582 60698573 61257062 60892808 61549741 62002052
4928F2002052J267688J342769n77984O46654K75883m9975P93374k82255N99077
$$ 62002052 63269740 64612509 64034525 64681179 64957062 64907087 65700461 65418206 66017283
4919F6017283P11389J73745J384540O3232k6688M47162R73594Q57314m5619m92908
$$ 66017283 66728672 66902417 68286957 68350189 68323501 68770663 69744257 70601571 70555952 70063044
4909G0063044J560991K11446M38853o83432q16632K9418j791M82530J084487o33198
$$ 70063044 71624035 71835481 72274334 71590902 70774270 70803688 70801897 71284427 72368914 71735716
4899G1735716q95074l29656m69361k94138M8970j36547P89541k06476j307904
$$ 71735716 70840642 70510986 70041625 69747487 69796457 69659910 70449451 70242975 68935071
4890F8935071l2416O29370q63890p24858k35698L87692m25522K03372q2246n66497
$$ 68935071 68902655 69532025 68668135 67943277 67707579 68095271 67669749 67873121 67790875 67224378
4880F7224378m08022M85294N55564p88352j26576k92536L94048M64337p88547
$$ 67224378 66816356 67301650 67857214 67068862 66942286 66649750 67043798 67508135 66719588
4871F6719588J14421P92807n47747L65496j70107m97134l0967N42714N46891K67700
$$ 66719588 66834009 67626816 67079069 67444565 67274458 66777324 66746357 67289071 67835962 68103662
4861F8103662r09191O43586l08835N24115o09911N5421Q84121l51684K82400m85818
$$ 68103662 67194471 67838057 67529222 68053337 67443426 67498847 68382968 68031284 68313684 67827866
4851F7827866p03791J020538q05759L29911P40172p74595P2061o89426q6734l91553
$$ 67827866 67124075 68144613 67338854 67668765 68408937 67634342 67706403 67016977 66930243 66538690
4841F6538690l49960l56093p79414J24041j169132j047536n40802M68963m28592
$$ 66538690 66188730 65832637 65053223 65177264 64008132 62960596 62419794 62888757 62460165
4832F2460165j64077j27787j65903j39098M75178j027065k76321K01035r29302
$$ 62460165 62296088 62168301 62002398 61863300 62338478 61311413 61035092 61236127 60306825
4823F0306825p0214p54378o5091O07599j623020n20793J463672N2478n26657m80479
$$ 60306825 60236611 59482233 59417142 60024741 58401721 57880928 59344600 59397078 58870421 58389942
4813E8389942Q75166j79549M43635L55748N26370n60858q2161m64331L5443q7580
$$ 58389942 59265108 59085559 59529194 59884942 60411312 59850454 59768293 59303962 59339405 59251825
4803E9251825R29882K5505k73157j9679R3940L97162m27063M88631K33940r9100
$$ 59251825 60181707 60207212 59934055 59914376 60008316 60405478 59978415 60467046 60700986 60601886
4793F0601886o64178Q40463P52947k33982j13026j61906K17679r69382Q7499N07899
$$ 60601886 59937708 60778171 61531118 61297136 61184110 61022204 61239883 60270501 60358000 60865899
4783F0865899P2250p64738p9962J42836n77055j305812J7362n15433q99575J93767
$$ 60865899 60938149 60173411 60093449 60236285 59659230 58353418 58370780 57855347 56955772 57149539
4773E7149539M48543M76220m9746j71108M00396j124963m51216J262469o18502
$$ 57149539 57598082 58074302 58024556 57853448 58253844 57128881 56677665 57940134 57321632
4764E7321632o50638J84356l17256l20239J24752q83241K04916O50653p84120
$$ 57321632 56670994 56855350 56538094 56217855 56342607 55459366 55664282 56314935 55530815
4755E5530815M16204M11877m84644M90279P34024n90243P57603K20013N45500
$$ 55530815 55947019 56358896 55874252 56364531 57098555 56508312 57265915 57485928 58031428
4746E8031428j99268m92992N62999K41936j71725n56254P88273K05534M96075
$$ 58031428 57832160 57339168 57902167 58144103 57972378 57416124 58204397 58409931 58906006
4737E8906006l32726o924k7882p04434M5248O5751L72440J66502K47152j071690
$$ 58906006 58573280 58566356 58538474 57834040 57879288 57945039 58317479 58483981 58731133 57659443
4727E7659443o31002R3182j181270J217188P01767J93373j226525q92111m23294
$$ 57659443 57028441 57121623 55940353 57157541 57859308 58052681 56826156 55934045 55510751
4718E5510751M20361j40120q28966K6861M06398M36856q88383L60599J077362
$$ 55510751 55931112 55790992 54962026 54988887 55395285 55832141 54943758 55304357 56381719
4709E6381719j4119l75527m26581m05290Q39377k56430J2053j87356R157M45755
$$ 56381719 56367600 55992073 55565492 55160202 55999579 55743149 55755202 55567846 55577003 56022758
4699E6022758j328294J87271L65513L18885J26132O2526k22560q92955L46604
$$ 56022758 54694464 54881735 55247248 55566133 55692265 55754791 55532231 54639276 54985880
4690E4985880J044896p884p17335L07501K51966r02012K31412J069589k02385
$$ 54985880 56030776 56022892 55305557 55613058 55865024 54963012 55194424 56264013 56061628
4681E6061628k10210J61163M1594P57587O57264p84652m5183J9460K0195k01959
$$ 56061628 55851418 56012581 56054175 56811762 57469026 56684374 56639191 56658651 56678846 56476887
4671E6476887K04524P1656p06701M48035o90802k73591J46294K04203m20553n27933
$$ 56476887 56681411 56753067 56046366 56494401 55803599 55530008 55676302 55880505 55459952 54932019
4661E4932019N31356r9757q02207J125705o2195j190673L83446J97579K64263
$$ 54932019 55463375 55363618 54561411 55687116 55624921 54434248 54817694 55015273 55279536
4652E5279536L65371p72613K58672m64248M84203j75032m83570J93649k74334
$$ 55279536 55644907 54872294 55130966 54666718 55150921 54975889 54492319 54685968 54411634
4643E4411634P7315m83867O21938K73472j32966K26922q13893m4323J631624o9189
$$ 54411634 54488949 54005082 54627020 54900492 54767526 54994448 54180555 54136232 55767856 55698667
4633E5698667m99119J84111P00350m76557J5962r16726P91942M07214N0446J041411
$$ 55698667 55199548 55383659 56084009 55607452 55623414 54706688 55498630 55905844 55956290 56997701
4623E6997701j448042M629J095622J14797m6717p52710m56065J132585J46294
$$ 56997701 55549659 55554288 56649910 56764707 56717990 55965280 55509215 56641800 56788094
4614E6788094q10269o11544K73911J187991N0243L33248P4139m63246k9710J80804
$$ 56788094 55977825 55366281 55640192 56828183 56878426 57211674 57285813 56822567 56792857 56973661
4604E6973661L62206Q4067L10189J036554m91292k88525P95467m71641J73951
$$ 56973661 57335867 57419934 57730123 58766677 58275385 57986860 58782327 58310686 58484637
4595E8484637J000129k02071l35445r90754L24278Q65069J42958l27148n2094
$$ 58484637 59484766 59282695 58947250 57956496 58280774 59145843 59288801 58961653 58909559
4586E8909559j5386J89461R22336n54535k14288j98797N80706P6434k86861p49412
$$ 58909559 58894173 59083634 60005970 59451435 59237147 59038350 59619056 59695490 59408629 58659217
4576E8659217R86172k5934P0357O12113p0653j064497q4351O14599N62733j057455
$$ 58659217 59645389 59619455 59689812 60301925 60231272 59166775 59082424 59697023 60259756 59202301
4566E9202301K78981O92583R75906M75175m07575m69J72040Q58647n05668J025030
$$ 59202301 59481282 60173865 61149771 61624946 61217371 61216902 61388942 62247589 61741921 62766951
4556F2766951R14127J30776L19916j3013L71332L18273k96599M80178j09555J214295
$$ 62766951 63681078 63811854 64131770 64118757 64490089 64808362 64511763 64991941 64882386 66096681
4546F6096681L25810J110899K17092k37171J065115K95090J62939N36421O14505
$$ 66096681 66422491 67533390 67750482 67513311 68578426 68873516 69036455 69572876 70187381
4537G0187381J290914j27402K08890L89307K027092R67979l88997Q58335J464482
$$ 70187381 71478295 71350893 71559783 71949090 73976182 74944161 74555164 75413499 76877981
4528G6877981Q0401P18846K028308J384499P49190J338625J633261N00129O70188
$$ 76877981 76958382 77677228 79705536 81090035 81839225 83177850 84811111 85311240 85981428
4519H5981428M71407J462770J658412J408368J053801J283044K233367J116783
$$ 85981428 86452835 87915605 89574017 90982385 92036186 93319230 95552597 96669380
4511I6669380K102440J598113J937041J155596J504012J597974J363366K347417
$$ 96669380 98771820 100369933 102306974 103462570 104966582 106564556 107927922 110275339
4503A10275339J965533K809194J804687L407528J811682K491240K543739K753181
$$ 110275339 112240872 115050066 116854753 120262281 122073963 124565203 127108942 129862123
4495A29862123K968655J721779K649316K156445K748659K253902J976969K316718
$$ 129862123 132830778 134552557 137201873 139358318 142106977 144360879 146337848 148654566
4487A48654566K987509L099516K994007K279280K760062L177609L991973L306643
$$ 148654566 151642075 154741591 157735598 160014878 162774940 165952549 169944522 173251165
4479A73251165K932705L726018L001426M072672N283756N221913N916245P473297
$$ 173251165 176183870 179909888 182911314 186983986 192267742 197489655 203405900 210879197
4471B10879197P322319P932102R596604J0362051J1627525J2886985J4125020
$$ 210879197 218201516 226133618 235730222 246092273 257719798 270606783 284731803
4464B84731803J3941478J3881740J2194633Q840349M977210r00617o467176j1613606
$$ 284731803 298673281 312555021 324749654 333590003 338567213 337666596 331199420 319585814
4456C19585814j3485990j5261788j5756795j4078264j1273723j0331693r766641
$$ 319585814 306099824 290838036 275081241 261002977 249729254 239397561 229630920
4449B29630920p803225o810750o332104m523198m505650l798893k937327l148455
$$ 229630920 221827695 215016945 208684841 204161643 199655993 195857100 192919773 189771318
4441A89771318k804088l65693m56761j497231k02972O47447K50054R20572n87355
$$ 189771318 186967230 186601537 186144776 184647545 184444573 185092020 185342074 186262646 185675291
4432A85675291R94924J271809K808063K079919J788193L125342J968110L423293
$$ 185675291 186670215 187942024 190750087 192830006 194618199 197743541 199711651 203134944
4424B03134944N637049N228197M633897M840101P336055R483655Q630519J0625277
$$ 203134944 208771993 214000190 218634087 223474188 230810243 240293898 248924417 259549694
4416B59549694J2057732J1730377J3496570J3562936J2813706J1297121Q870867
$$ 259549694 271607426 283337803 296834373 310397309 323211015 334508136 343379003
4409C43379003M210222j645665o772114j1967869j3910079j5198457j5165060
$$ 343379003 347589225 345943560 339171446 327203577 313293498 298095041 282929981
4402B82929981j4359454j2209210j0939066j0032534q845691o980156o476521
$$ 282929981 268570527 256361317 245422251 235389717 226544026 219563870 213087349
4395B13087349n119589n487579m698655l429777l779905l697148j506605j961531
$$ 213087349 207967760 202480181 197781526 194351749 190571844 186874696 185368091 183406560
4387A83406560k032331j626912j172166p23938r55095j587250j361832k4753m89086
$$ 183406560 181374229 179747317 178575151 177851213 176896118 175308868 173947036 173922283 173433197
4378A73433197N68533J98836l03317l9715n00346N65409Q25998k54909Q11705
$$ 173433197 174001730 174200566 173897249 173857534 173357188 173922597 174748595 174493686 175305391
4369A75305391J373130Q21026M74365J191058J142869Q73298J571927K2427J939639
$$ 175305391 176678521 177499547 177973912 179164970 180307839 181181137 182753064 182775491 184715130
4360A84715130J445057J191448J925858J647487J876939K578164J636939J970985
$$ 184715130 186160187 187351635 189277493 190924980 192801919 195380083 197017022 198988007
4352A98988007K116151K481298K518203J581029K827151K513795K226391K287207
$$ 198988007 201104158 203585456 206103659 207684688 210511839 213025634 215252025 217539232
4344B17539232L075034K055805K785912L544873K472849K907516L525735K622011
$$ 217539232 220614266 222670071 225455983 229000856 231473705 234381221 237906956 240528967
4336B40528967L474334L004835L772504L822857K797701L100222L571225L797578
$$ 240528967 244003301 247008136 250780640 254603497 257401198 260501420 264072645 267870223
4328B67870223L978531L668577M186824L168386K690174L131177J831169K216569
$$ 267870223 271848754 275517331 279704155 282872541 285562715 288693892 290525061 292741630
4320B92741630K152020K716335K370629J636447K251895J330008P63988R50343
$$ 292741630 294893650 297609985 299980614 301617061 303868956 305198964 305962952 306913295
4312C06913295K17997J18065p34526r87324m91351j640445j195203j817548k778590
$$ 306913295 307131292 307249357 306514831 305527507 305036156 303395711 302200508 300382960 297604370
4303B97604370l385272k646181k385458l856877k762202l431185m332003m461981
$$ 297604370 294219098 291572917 289187459 285330582 282568380 279137195 274805192 270343211
4295B70343211l620671m515092l973278m289296m326030m528198m231229m246078
$$ 270343211 266722540 262207448 258234170 253944874 249618844 245090646 240859417 236613339
4287B36613339l814286l639825m420617l471310m363545l537594l923851l617760
$$ 236613339 232799053 229159228 224738611 221267301 216903756 213366162 209442311 205824551
4279B05824551l997625l666656k324149l606422l319665k884471k989519l168890
$$ 205824551 201826926 198160270 195836121 192229699 188910034 186025563 183036044 179867154
4271A79867154k638745j478056l267691l003222k114748k786667k736317l692702
$$ 179867154 177228409 175750353 172482662 169479440 167364692 164578025 161841708 158149006
4263A58149006j386603k209348k140485j340745l311381j946046j934279k642201
$$ 158149006 156762403 154553055 152412570 151071825 147760444 145814398 143880119 141237918
4255A41237918j286928j809438j303239k407374r75286k225327j923944j348484
$$ 141237918 139950990 138141552 136838313 134430939 133455653 131230326 129306382 127957898
4247A27957898j562549j361962j651038r67335r88665r14433j649496j721011
$$ 127957898 126395349 125033387 123382349 122415014 121426349 120511916 118862420 117141409
4239A17141409p12023l04367j299958j67764k015811r78144j417455j142294j092956
$$ 117141409 116429386 116125019 114825061 114657297 112641486 111663342 110245887 109103593 108010637
4230A08010637n24182K46691j693584J63949K45018j389802j105936q54723m04855
$$ 108010637 107486455 107733146 106039562 106203511 106448529 105058727 103952791 103098068 102693213
4221A02693213j332766l81998J70735L81574m03635o15362n58671N9665k89290
$$ 102693213 101360447 100978449 101149184 101530758 101127123 100511761 99953090 100012755 99723465
4212I9723465j89702p82282o4524K14848m96896n94155J22495P07018j053529
$$ 99723465 99533763 98751481 98686957 98901805 98404909 97810754 97933249 98640267 97586738
4203I7586738p41370O72496J04002L15985o91086j357434L15800N0935k37413
$$ 97586738 96845368 97517864 97621866 97937851 97246765 95889331 96205131 96256066 96018653
4194I6018653K00273L90028J64385J38568M15962j22919M39688j98269J32905
$$ 96018653 96218926 96608954 96773339 96911907 97327869 97204950 97644638 97446369 97579274
4185I7579274R28774J62460Q8303L39400J341812Q47831P34562m84619M08669
$$ 97579274 98508048 98670508 98758811 99098211 100440023 101287854 102022416 101537797 101946466
4176A01946466j12142K35014J900517J180603p7203R87441O72653P41286J337222
$$ 101946466 101834324 102069338 103969855 105150458 105073255 106060696 106733349 107474635 108811857
4167A08811857j08998J429267J464245J144080O74159K075744j672Q32935Q02775
$$ 108811857 108702859 110132126 111596371 112740451 113414610 115490354 115488682 116321617 117124392
4158A17124392J663066R62727J384219K199766J499678J456316J488103J627395
$$ 117124392 118787458 119750185 121134404 123334170 124833848 126290164 127778267 129405662
4150A29405662N42565K052600J556128K457939J893246J252433J922633J495913
$$ 129405662 129948227 132000827 133556955 136014894 137908140 139160573 141083206 142579119
4142A42579119J792648K069235J850676L038825J886749J734532K301875J788264
$$ 142579119 144371767 146441002 148291678 151330503 153217252 154951784 157253659 159041923
4134A59041923L413067K969736L356573L418808L209930L667369L903145N029494
$$ 159041923 162454990 165424726 168781299 172200107 175410037 179077406 182980551 188010045
4126A88010045L594147O131969L847295N185333N848611N259570N040142O570680
$$ 188010045 191604192 197736161 201583456 206768789 212617400 217876970 222917112 229487792
4118B29487792P757440O076383P626696P291504R536089Q151621P556060Q972345
$$ 229487792 237245232 243321615 250948311 258239815 267775904 275927525 283483585 292455930
4110B92455930Q817497Q246667P372317P619599P337521O178004M866318L058015
$$ 292455930 301273427 309520094 316892411 324512010 331849531 338027535 342893853 345951868
4102C45951868J305004o15746j995121k799164m057175m677815o561563o686380
$$ 345951868 347256872 346641126 344646005 341846841 337789666 333111851 326550288 319863908
4094C19863908p921131p062622o750562q084980p521809p501244p645476n848345
$$ 319863908 311942777 304880155 298129593 290044613 282522804 275021560 267376084 261527739
4086B61527739n759869m910753n176375m937697l626852l440207m190771k641104
$$ 261527739 255767870 250857117 245680742 240743045 237116193 233675986 229485215 226844111
4078B26844111l977730k419810k049320j697356j234607j503900j414327j555898
$$ 226844111 222866381 220446571 218397251 216699895 215465288 213961388 212547061 210991163
4070B10991163o80087l41691q92917j67549p1497q44639J322323J369755J293273
$$ 210991163 210311076 209969385 209076468 208908919 208837422 207992783 209315106 210684861 211978134
4061B11978134J830166J581860J282129K800504K464748K559939K570343M905193
$$ 211978134 213808300 215390160 216672289 219472793 221937541 224497480 227067823 231973016
4053B31973016L030792L340419K869386K639478J275805J731895J486811j98460
$$ 231973016 235003808 238344227 241213613 243853091 245128896 246860791 248347602 248149142
4045B48149142P23048l65787n08851j015131p35043j042130q54192p15022j553577
$$ 248149142 248872190 248506403 247997552 246982421 246247378 245205248 244351056 243636034 242082457
4036B42082457j595481j803989j317997j234585j917901j774780j785384k883124
$$ 242082457 240486976 238682987 237364990 236130405 234212504 232437724 230652340 227769216
4028B27769216l151099l145365l717922l412418l826175k961281k901030l469783
$$ 227769216 224618117 221472752 217754830 214342412 210516237 207554956 204653926 201184143
4020B01184143l486821k331501k705425l282763k897631k255525j328266j796910
$$ 201184143 197697322 195365821 192660396 189377633 186480002 184224477 182896211 181099301
4012A81099301n71444r90941j758321j509726k880851j394928n70920r43331k46374
$$ 181099301 180527857 179536916 177778595 176268869 173388018 171993090 171422170 170478839 170232465
4003A70232465k124440j556181j723229k325908k971141l836123k527722j925344
$$ 170232465 168108025 166551844 164828615 162502707 159531566 155695443 153167721 151242377
3995A51242377k305524k893067l022854j234762j818315j836180j750978k137761
$$ 151242377 148936853 146043786 143020932 141786170 139967855 138131675 136380697 134242936
3987A34242936j887980n11498q46447l89310m00429q74890n88390j593889j156894
$$ 134242936 132354956 131843458 130997011 130607701 130207272 129332382 128743992 127150103 125993209
3978A25993209J97864k5958j227866j832404L35824n63491k75195q70544k11806
$$ 125993209 126191073 126165115 124937249 123104845 123440669 122877178 122601983 121731439 121519633
3969A21519633p48901r90151J29982N45159n45556J25942N22893m85212O7257
$$ 121519633 120770732 119780581 119910563 120455722 119910166 120036108 120559001 120073789 120141046
3960A20141046P52673N00856j748913O88340O23966O45926m20626l96793J386286
$$ 120141046 120893719 121394575 119645662 120334002 120957968 121603894 121183268 120786475 122172761
3951A22172761L1530J056416Q66148M18658N8318M44124P44022K91960J46629
$$ 122172761 122204291 123260707 124126855 124545513 124603831 125047955 125791977 126083937 126230566
3942A26230566K255Q46664R13050R15026m69094J455366J178219M89774P26967
$$ 126230566 126232821 127079485 127992535 128907561 128438467 129893833 131072052 131561826 132288793
3933A32288793O98150J35852R37276Q71283J259907K079480R39168K027886K026410
$$ 132288793 132986943 133122795 134060071 134931354 136191261 138270741 139209909 141237795 143264205
3924A43264205M11287R93360J124073J273572M91902Q00940J036459J92177L66118
$$ 143264205 143675492 144668852 145792925 147066497 147558399 148359339 149395798 149587975 149954093
3915A49954093J08373p83381o02461j146992p74266q61449p13130m42578q45230
$$ 149954093 150062466 149279085 148676624 147529632 146755366 145893917 145180787 144738209 143892979
3906A43892979j483165j829616q78714k035767k244938j437279j728060r95078
$$ 143892979 142409814 140580198 139701484 137665717 135420779 133983500 132255440 131260362
3898A31260362k122941j472987j155294j392474r99489q38722j824295q8985k194346
$$ 131260362 129137421 127664434 126509140 125116666 124117177 123278455 121454160 121365175 119170829
3889A19170829j531043o57638j560057k10207j307844j393444q86441j1963L8443
$$ 119170829 117639786 116982148 115422091 115211884 113904040 112510596 111624155 111612192 111650635
3880A11650635j275486j153612o62704p87750j230333p23942m61978J54875j008597
$$ 111650635 110375149 109221537 108558833 107771083 106540750 105816808 105354830 105509705 104501108
3871A04501108l18814j21903k113278m69799n8392M4763k03951q64629l44198
$$ 104501108 104182294 104060391 101947113 101477314 101418922 101463685 101259734 100395105 100050907
3862A00050907r02097l37201M87202m96737M5053o17348k6274K36226p60031N27437
$$ 100050907 99148810 98811609 99298811 98802074 98847127 98229779 98203505 98439731 97679700 98207137
3852I8207137J21905M39121O34248J89276n47079L65893J19311l72908l76791
$$ 98207137 98329042 98768163 99402411 99591687 99044608 99410501 99529812 99156904 98780113
3843I8780113N37167j046920L27799J588273n03724J485938K70272n44118m31016
$$ 98780113 99317280 98270360 98598159 100186432 99682708 101168646 101438918 100894800 100463784
3834A00463784K074093j78196O12474K68562l72552J005927Q93800n75012l37281
$$ 100463784 102537877 102359681 102972155 103240717 102868165 103874092 104767892 104192880 103855599
3825A03855599l48066Q6472n22612p39683j155211m54630j719628k044026K2101
$$ 103855599 103507533 103594005 103071393 102331710 101176499 100721869 99002241 96958215 96980316
3816I6980316j59889j125418k38745q46743j841153j342060n51926r44369j057524
$$ 96980316 96820427 95695009 95456264 94609521 92768368 91426308 90874382 89930013 88872489
3807H8872489o58421q09385k70273m63873p17331j038898j074123o89715l91177
$$ 88872489 88214068 87404683 87134410 86670537 85953206 84914308 83840185 83150470 82759293
3798H2759293j412047K08313k52969j148986M19377j4992n62207o19511Q35011
$$ 82759293 81347246 81555559 81302590 80153604 80572981 80557989 79995782 79376271 80211282
3789H0211282K31456o03215o41028P33177j33558j89727O85870n02631K78329
$$ 80211282 80442738 79839523 79198495 79931672 79798114 79608387 80294257 79791626 80069955
3780H0069955L29363j154705q3575J92296L16214L25675p73814p04263O35017
$$ 80069955 80399318 79244613 79161038 79353334 79669548 79995223 79221409 78517146 79152163
3771G9152163P44108n44703m69378J98053n01377j37126k9792p14669k36231r64415
$$ 79152163 79896271 79351568 78882190 79080243 78578866 78441740 78411948 77697279 77461048 76496633
3761G6496633J72047k94299r6936k91751j138580j523685n2765o52782o62001
$$ 76496633 76668680 76374381 76277445 75985694 74847114 73323429 73270664 72617882 71955881
3752G1955881L38086m84127j78804K64798j742251o31512k23995l16012O17406
$$ 71955881 72293967 71809840 71631036 71895834 70153583 69522071 69298076 68982064 69599470
3743F9599470j150152j38834q4937j450659q06135q15299o7721j281448q79980
$$ 69599470 68449318 68310484 68225547 66774888 65968753 65153454 65085733 63804285 62924305
3734F2924305q81215K02615K20309K44750j217581m3810L18322m92498j571701
$$ 62924305 62043090 62245705 62466014 62710764 61493183 61449373 61767695 61275197 59703496
3725E9703496q87581Q75617k35663P19359k38758j171680J48544k25896m16730
$$ 59703496 58815915 59691532 59455869 60175228 59936470 58764790 58913334 58687438 58270708
3716E8270708j063913k70367m76182m59291R70484r99046o1155j105241o5112
$$ 58270708 57206795 56936428 56460246 56000955 56971439 55972393 55911238 54805997 54740885
3707E4740885j87961r39072L0017l21004J7686o85809J1260M7165n7823j32421
$$ 54740885 54552924 53613852 53643869 53322865 53340551 52654742 52666002 52713167 52655344 52522923
3697E2522923o06540l51837l79193m03541j019218P06145j62606k47778J18626
$$ 52522923 51916383 51564546 51185353 50781812 49762594 50468739 50306133 50058355 50176981
3688E0176981m98400M39144n45739K53602l12394m82055l11016L48166P20851
$$ 50176981 49678581 50117725 49571986 49825588 49513194 49031139 48720123 49068289 49789140
3679D9789140k68093K01295l0905m03581j94374M16295O9117n69337j62472N92195
$$ 49789140 49521047 49722342 49691437 49287856 49093482 49509777 49578894 49009557 48847085 49439280
3669D9439280L35777j278645K62079l52451m82418O52415j37294K84986K37884
$$ 49439280 49775057 48496412 48758491 48406040 47923622 48576037 48438743 48723729 48961613
3660D8961613m25787n63616M08237j002636q46257M80634K48886m31902k64357
$$ 48961613 48535826 47972210 48380447 47377811 46531554 47012188 47261074 46829172 46564815
3651D6564815m53428j04906r62064L30488J31682l35897l60295o95725q20579
$$ 46564815 46111387 46006481 45044417 45374905 45506587 45170690 44810395 44114670 43294091
3642D3294091l59531k58579n30585L82531j008571M38561L53726l4997n62885
$$ 43294091 42934560 42675981 42145396 42527927 41519356 41957917 42311643 42276646 41713761
3633D1713761j523847n07012N47908M70739m98863o8463j364966l59506p150n62015
$$ 41713761 40189914 39682902 40230810 40701549 40202686 40134223 38769257 38409751 38402601 37840586
3623C7840586P6512l46359J16546Q6941m25671O6717l17014L55794k21260l73681
$$ 37840586 37917098 37570739 37687285 37774226 37348555 37415272 37098258 37454052 37232792 36859111
3613C6859111o65303O68129m18422r66707O2870O70638p15124o57220N56117N73352
$$ 36859111 36193808 36861937 36443515 35476808 35539678 36210316 35495192 34837972 35394089 35967441
3603C5967441O66362q87698o33540j153802L69963l05938J15114K21994q96540
$$ 35967441 36633803 35746105 35112565 33958763 34328726 34022788 34137902 34359896 33463356
3594C3463356L58633j70426o52700j38852K35924k84908r0984j60792o70496l99226
$$ 33463356 33821989 33651563 32998863 32860011 33095935 32811027 32720043 32559251 31888755 31489529
3584C1489529k73843j35140q62459r84229M28970J41968M59403j86980m2308J083474
$$ 31489529 31215686 31080546 30218087 29233858 29662828 29804796 30264199 30077219 30034911 31118385
3574C1118385j69597k70191p08021p16712q19337R96866Q00138r37954K93832
$$ 31118385 30948788 30678597 29970576 29253864 28434527 29431393 30231531 29293577 29587409
3565B9587409M82056j417430q2350j036739m13586p25890n53855Q64018n03308
$$ 29587409 30069465 28652035 28569685 27532946 27119360 26393470 25839615 26703633 26200325
3556B6200325L6589J57714M16487j125716q65132P6777j56316O98097K41959k25000
$$ 26200325 26236914 26394628 26811115 25685399 24820267 24897044 24740728 25438825 25680784 25455784
3546B5455784k48518P76530o52272j178504m67002m83075J471747L77416j141276
$$ 25455784 25207266 25983796 25331524 24153020 23686018 23202943 24674690 25052106 23910830
3537B3910830r95368J19730R0079o37557l3674n01149Q9482j72084Q79211J77910
$$ 23910830 22915462 23035192 23125271 22487714 22454040 21952891 22042373 21870289 22749500 22927410
3527B2927410k3579j070075j06165N55860J00623j150897l84988M83602K61623
$$ 22927410 22903831 21833756 21727591 22283451 22384074 21233177 20848189 21331791 21593414
3518B1593414p53900M1736K53229L55267n25663k54121N99338l7055M45531n45749
$$ 21593414 20839514 20881250 21134479 21489746 20964083 20709962 21309300 21272245 21717776 21172027
3508B1172027Q6905p35111L29178l05986N011l41809l64302K18163J35475p26338
$$ 21172027 21258932 20523821 20852999 20547013 20552024 20210215 19845913 20064076 20199551 19473213
3498A9473213J94580k59764L71358n88309j5444l64063O92238k67744o55603o33190
$$ 19473213 19667793 19408029 19779387 19191078 19175634 18811571 19503809 19236065 18580462 17947272
3488A7947272J91753R02977r38225m19436M24602m62167k63287m51114n3057R6723
$$ 17947272 18139025 19042002 18103777 17684341 18108943 17646776 17383489 16932375 16879318 16976041
3478A6976041l22799n14871M49708n34737J9545J244633l01067j033499m02485
$$ 16976041 16653242 16138371 16588079 16053342 16072887 17317520 17016453 15982954 15580469
3469A5580469J729606j533863J98807p128k94721J94165o27711m34886m6721N62395
$$ 15580469 17310075 15776212 15975019 15967891 15673170 15867335 15239624 14804738 14758017 15320412
3459A5320412k43074k19277O0415k9012l37984L40156j06042n47972l49642L021
$$ 15320412 15077338 14858061 14918476 14889464 14551480 14891636 14785594 14237622 13887980 13891001
3449A3891001j69770J68658L71594j02458P76959q31647o75436l19549J67599
$$ 13891001 13721231 13889889 14261483 14159025 14935984 14104337 13428901 13109352 13276951
3440A3276951K76655n3323r885k89008j32639J15486N26262k48649Q8688K19634
$$ 13276951 13553606 13500283 13490398 13201390 13068751 13184237 13710499 13461850 13550538 13770172
3430A3770172q77883R7869m8950l64794L0658O11276L08778j32160j77704k23372
$$ 13770172 12892289 12990158 12941208 12576414 12607072 13218348 13527126 13394966 13217262 12993890
3420A2993890j42587R20148k04812r82431l07632k21637L96743J8988j97125l01579
$$ 12993890 12851303 13771451 13566639 12584208 12276576 12054939 12451682 12470670 12273545 11971966
3410A1971966O29631j29216o91326n64J88733O21878M29978j67612J42885j16814
$$ 11971966 12601597 12472381 11781055 11780491 11969224 12591102 13021080 12853468 12996353 12879539
3400A2879539o51785M79780o60995o57022K02728J58206P84033M73183l42254
$$ 12879539 12227754 12707534 12046539 11389517 11592245 11750451 12534484 13007667 12665413
3391A2665413l85644j26169m7799R93402M28886o25907m3677L46165q09929P89034
$$ 12665413 12279769 12153600 12105801 13099203 13528089 12902182 12858505 13204670 12394741 13183775
3381A3183775j53697J60247l81718r24922K85410j44231L62175l69165J62039
$$ 13183775 13030078 13190325 12808607 11883685 12169095 12024864 12387039 12017874 12179913
3372A2179913n8113k99847P09960N28456m59972k17064n5306o08593k91993P00434
$$ 12179913 12121800 11821953 12531913 13060369 12600397 12383333 12328027 11719434 11427441 12127875
3362A2127875k91136r07200M52829l46042N0318L30563j73681j4506p54813L54295
$$ 12127875 11836739 10929539 11382368 11036326 11086644 11417207 11243526 11229020 10474207 10828502
3352A0828502M87980k47608l52306N85470M21520l69396l29996Q52021m49155
$$ 10828502 11316482 11068874 10716568 11302038 11723558 11354162 11024166 11876187 11427032
3343A1427032j69504j75144k93293O15468k80580P4873m36434J120816o14710
$$ 11427032 11257528 11082384 10789091 11404559 11123979 11198852 10762418 11883234 11268524
3334A1268524l41319M91121m05559l05N2464k36762L84834Q1771j222567O03284
$$ 11268524 10927205 11418326 11012767 11012462 11064926 10828164 11212998 11294769 10072202 10675486
3324A0675486k99362L57767J5999K24449O212l02498J025826n75206p612L75977
$$ 10675486 10376124 10733891 10749890 10974339 10980551 10678053 11703879 11128673 11121061 11497038
3314A1497038J93323M07870n65345l05034M5324M81335m90029N96378j63551k22100
$$ 11497038 11690361 12098231 11532886 11227852 11273176 11754511 11264482 11860860 11697309 11475209
3304A1475209k45759m7048O65696r25925k40249M50311M8164j100830l11726O34114
$$ 11475209 11229450 11182402 11848098 10922173 10681924 11132235 11180399 10079569 9767843 10401957
3294A0401957o20748j29880P15955Q23703n45680r18666J59995Q47982m25831
$$ 10401957 9781209 9651329 10367284 11190987 10645307 9726641 9886636 10734618 10308787
3285A0308787k80446J196797j130601K33105J58991L71266n28108k33325j87058
$$ 10308787 10028341 11225138 10094537 10327642 10486633 10857899 10329791 10096466 9909408
3276I909408J074706J157674n66177m8192K19695R75586l00991J93086J39025
$$ 9909408 10984114 12141788 11575611 11527419 11747114 12722700 12421709 12614795 12753820
3267A2753820o41496R29340m49973J387934p54321o87568L55825N7962L72402
$$ 12753820 12112324 13041664 12591691 13979625 13225304 12537736 12893561 12951523 13323925
3258A3323925Q55520o89429o75930j433917l33478M74607P3167Q07082o22747
$$ 13323925 14179445 13490016 12814086 11380169 11046691 11521298 11594465 12401547 11778800
3249A1778800m51183n96841J40616l71352P51645K87783K16907L03792o55102
$$ 11778800 11327617 10730776 10871392 10500040 11251685 11539468 11756375 12060167 11405065
3240A1405065o83284L64745R22332j62542l41797R737p43490m07550L37368J989794
$$ 11405065 10721781 11086526 12008858 11846316 11504519 11514256 10770766 10363216 10700584 12690378
3230A2690378K96059M20056j020424L57702n49047m44906j74609n44563M85264
$$ 12690378 12986437 13406493 12386069 12743771 12194724 11749818 11575209 11030646 11515910
3221A1515910j65598r12828L66018K70418p83002R22014M0117q37278K46111L74391
$$ 11515910 11350312 10437484 10803502 11073920 10290918 11212932 11253049 10415771 10661882 11036273
3211A1036273M66135o47001j340327O67968O75212o48748M86677j98771o02886
$$ 11036273 11502408 10855407 9515080 10183048 10858260 10209512 10696189 10497418 9894532
3202I894532Q4227L23265l30121o89519N45225l6303J045979m02752o36456o54721
$$ 9894532 9978759 10302024 9971903 9282384 9827609 9791306 10837285 10434533 9798077 9143356
3192I143356r52487l75286R24264M23021J52094K3589R3591J26886M02390O86201
$$ 9143356 8190869 7815583 8739847 9162868 9314962 9338551 9432142 9559028 9961418 10647619
3182A0647619n70945O22598n32178j303651Q72046o471j080095Q652j11961R15945
$$ 10647619 10076674 10699272 10167094 8863443 9735489 9729018 8648923 8657575 8545614 9461559
3172I461559P6382K67207L91155K13777N27937l6118n27466M57940q44851K19178
$$ 9461559 9537941 9805148 10196303 10410080 10938017 10901899 10374433 10832373 9987522 10206700
3162A0206700N58940j35431p18450O58386J035852l20959J22545J00539j2989
$$ 10206700 10765640 10630209 9911759 10570145 11605997 11285038 11407583 11508122 11495133
3153A1495133N538J75412l70891P33758M22995K51306p70666L66240m27279L10265
$$ 11495133 11500671 11676083 11305192 12038950 12461945 12713251 11942585 12308825 11881546 12191811
3143A2191811K08423k16498M63119N65209O51952k54141K84809l33439O50317
$$ 12191811 12400234 12183736 12646855 13212064 13864016 13609875 13894684 13561245 14211562
3134A4211562J420474M4982N09661n27360Q46388j091916o161O82906l61378m02724
$$ 14211562 15632036 15677018 16186679 15659319 16505707 15413791 15407630 16090536 15729158 15326434
3124A5326434O65446O82949l2468l10589R90892O87273M80984k49728n55673N42776
$$ 15326434 15991880 16674829 16642361 16331772 17322664 18009937 18490921 18241193 17685520 18228296
3114A8228296j21100P95678Q88943L16692j9328M95206K74233k02268M47643J276029
$$ 18228296 18107196 18902874 19791817 20108509 20089181 20584387 20858620 20656352 21103995 22380024
3104B2380024L41965J002598j84119J140292N01412O7835J338013j095766o83725
$$ 22380024 22721989 23724587 23540468 24680760 25182172 25250007 26588020 25492254 24808529
3095B4808529K02319j126817k65227J22482M18665j40646j293950j329831L83472
$$ 24808529 25010848 23884031 23618804 23741286 24159951 24019305 22725355 21395524 21778996
3086B1778996o96085o58323l49075j297239k79102Q9637j023558m56533o25924
$$ 21778996 21082911 20424588 20075513 18778274 18499172 18588809 17565251 17108718 16482794
3077A6482794P5420r5298N25603j820135j62404P29538Q4391q16375n71045O59683
$$ 16482794 16558214 16462916 16988519 15168384 15005980 15735518 15819909 15003534 14432489 15092172
3067A5092172j083114Q46573J00546J92881o92068m45295r28111j054810K21534
$$ 15092172 14009058 14855631 14956177 15149058 14456990 14011695 13083584 12028774 12250308
3058A2250308Q21342q65366l3248o10710k50869O68227K40157j37187q84949q1858
$$ 12250308 13071650 12206284 12173036 11562326 11311457 11979684 12219841 12082654 11197705 11115847
3048A1115847p04691N19038k33881o2688R6177n41505q28956j06882N99768j56997
$$ 11115847 10411156 10930194 10696313 10633625 10729802 10188297 9359341 9252459 9852227 9695230
3038I695230l5808j85505k38918m18420q3580Q85683l41711K77184J46592j003500
$$ 9695230 9659422 9473917 9234999 8816579 8732999 9618682 9276971 9554155 9700747 8697247
3028H697247O61048o48984j040233R28219K66718m7267O49570L43860m26784m07930
$$ 8697247 9358295 8709311 7669078 8597297 8864015 8816748 9466318 9810178 9383394 8975464
3018H975464O327P14565l38637j134671N24936J095003K6165j277929j49920m52392
$$ 8975464 8981791 9696356 9357719 8223048 8747984 9842987 9869152 8591223 8441303 7988911
3008G988911P46672J20821m59925l34931P13496K21045L10878m10386j047154
$$ 7988911 8735583 8856404 8396479 8061548 8775044 8996089 9306967 8896581 7849427
2999G849427P28260L75326J97668Q98391O93728j001595j27430k68569J51160
$$ 7849427 8577687 8953013 9150681 10049072 10742800 9741205 9613775 9345206 9496366
2990I496366n44550J01158R1398J17677p290k69862j69270K18010J74949o52029
$$ 9496366 8951816 9052974 9144372 9262049 9254759 8984897 8815627 9033637 9208586 8556557
2980H556557j45050q06200J87841R34091m87489J163268l64940j589721Q99471
$$ 8556557 8411507 7605307 7793148 8727239 8239750 9403018 9038078 7448357 8347828
2971H347828m76347K46488n92896l81555l52399J548409l52089j28111K37513
$$ 8347828 7871481 8117969 7525073 7143518 6791119 8339528 7987439 7859328 8096841
2962H096841n80003L58503j6107l85387r09652m07393J418371l8027p782k21877
$$ 8096841 7516838 7875341 7859234 7473847 6564195 6156802 7575173 7537146 7529364 7307487
2952G307487m54068l55944o09424N74002K37517R66389m36692M54389m11697M45373
$$ 7307487 6853419 6497475 5888051 6462053 6699570 7665959 7229267 7683656 7271959 7717332
2942G717332K38673r14017o82657o04198Q83869K49380o55119N42577j343826
$$ 7717332 7956005 7041988 6359331 5755133 6639002 6888382 6233263 6775840 5432014
2933E432014J20113M63222L31666j62268l5449K87607k56662j82424p99447o10878
$$ 5432014 5552127 6015349 6347015 6184747 6149298 6436905 6180243 5997819 5198372 4587494
2923D587494m3077q856m64133K2181M08939J283527q71537o38987J119511r97587
$$ 4587494 4544417 4535561 4071428 4093609 4502548 5786075 4914538 4275551 5395062 4397475
2913D397475n85762K41256N70496j41042O26294M35506m12503M55436m93126Q06451
$$ 4397475 3811713 4052969 4623465 4482423 5108717 5544223 5131720 5587156 5094030 5900481
2903E900481p74823q67626M32938J89916n69016O86645J031439o17321m78571
$$ 5900481 5125658 4258032 4690970 4880886 4311870 4998515 6029954 5412633 4934062
2894D934062K47757k84283j155367N68408J43504l79297J50275Q02345j50346
$$ 4934062 5181819 4897536 3742169 4310577 4454081 4074784 4225059 5027404 4877058
2885D877058P56320p88987j052483O34082R24626m09705L12923j54855K70398
$$ 4877058 5633378 4844391 3791908 4425990 5350616 4940911 5253834 5098979 5369377
2876E369377L08678n48301l3514O78464j40355L24384J3181o86813O01234q67405
$$ 5369377 5678055 5129754 5096240 5774704 5634349 5958733 5971914 5285101 5886335 5018930
2866E018930J81692m83894Q18415J3699q16037R93897o29062K16045R27579l23055
$$ 5018930 5200622 4716728 5535143 5548842 4732805 5726702 5097640 5313685 6241264 5918209
2856E918209O33414K57765j18154o27291L0915Q15339M08626j92282r31604Q61111
$$ 5918209 6551623 6809388 6691234 6063943 6094858 6910197 7318823 7126541 6194937 7056048
2846G056048K16782j37917K17277j109010O61649K80090n27817p07785L69373
$$ 7056048 7272830 7134913 7352190 6243180 6904829 7184919 6657102 5949317 6318690
2837F318690j79882J58024O26302q71759l12881o41117m84373J536587M59676
$$ 6318690 6138808 6296832 6923134 6051375 5738494 5097377 4613004 6149591 6609267
2828F609267K7944l60358j94621O84695j11569L05372l18772l69363R33406k46258
$$ 6609267 6637211 6276853 6082232 6766927 6655358 6960730 6641958 6272595 7206001 6959743
2818F959743j45170J31584m91644N08891k80811m39051k62K95972Q2729j95325
$$ 6959743 6814573 6946157 6454513 6963404 6682593 6243542 6243280 6539252 6621981 6426656
2808F426656m12665l38290j14536m91333j63547K00204L68729K73914n39012Q56907
$$ 6426656 6013991 5675701 5561165 5069832 4906285 5106489 5475218 5749132 5210120 6067027
2798F067027k15528q55210O09129K28198r20000m50916R83492M13790n3174o80328
$$ 6067027 5851499 4996289 5605418 5833616 4913616 4462700 5446192 5859982 5806808 5126480
2788E126480m87284M20990M9960J34633j91693l36492N41203r80384K72289N56259
$$ 5126480 4639196 5060186 5110146 5244779 5053086 4716594 5257797 4277413 4549702 5105961
2778E105961M29630k16472N0572r6712K62680J94068J67867p42290M00327m31504
$$ 5105961 5535591 5319119 5369691 5272979 5535659 5729727 5897594 5155304 5555631 5124127
2768E124127k27231j212650n96869L66117m40828J065887N81012p18015M42968
$$ 5124127 4896896 3684246 3087377 3453494 3012666 4078553 4659565 3941550 4384518
2759D384518K1406n53311l84542j044376M80921N33519q31584R6654N54020N67213
$$ 4384518 4405924 3852613 3468071 2423695 2904616 3438135 2606551 2703205 3257225 3824438
2749C824438L67562k7241p72943p78813N34416o35728R4737M13706k31880j84173
$$ 3824438 4192000 4164759 3391816 2613003 3147419 2511691 2606428 3020134 2788254 2604081
2739B604081N23349M50031l92143m6778K20908p14027l68210J81375L18860r05396
$$ 2604081 3127430 3577461 3185318 3138540 3359448 2645421 2277211 2458586 2777446 1872050
2729A872050L16123q0280o09190K83259J543447k79657P8106r76251l01357k15784
$$ 1872050 2188173 2107893 1498703 1781962 3325409 3045752 3123858 2147607 1846250 1630466
2719A630466Q1159O53029Q23459o33306k99963K60010p74296k99091J025440m40348
$$ 1630466 1711625 2364654 3188113 2554807 2254844 2514854 1740558 1441467 2466907 2026559
2709B026559O81943o2134n32193L60888r32358P41332R84530m12625q1231k36501
$$ 2026559 2708502 2646368 2114175 2475063 1542705 2284037 3268567 2855942 2774711 2538210
2699B538210j060719J18836M16943L73394K89603j06034r75394K70931m17835
$$ 2538210 1477491 1596327 2013270 2386664 2676267 2570233 1594839 1865770 1447935
2690A447935o05204R90544L81823J01021k88709N08355p85905k44077N39486o37367
$$ 1447935 842731 1833275 2215098 2316119 2027410 2535765 1749860 1505783 2045269 1407902
2680A407902M29678P7509k15026M25460M34028o35212j64188P2828l19044P39284
$$ 1407902 1837580 1915089 1700063 2125523 2559551 1924339 1760151 1832979 1513935 2253219
2670B253219k11100l10867m73541p22515K88136L27151J045422l00896m94957
$$ 2253219 2042119 1731252 1257711 535196 823332 1150483 2195905 1895009 1400052
2661A400052K71258m99833J165453J35924o02075l58279L61307m06829n8549N9065
$$ 1400052 1671310 1171477 2336930 2472854 1870779 1512500 1873807 1466978 1408429 1467494
2651A467494J25040m73905j090315J52189J040282j69584j24049J033245j113634
$$ 1467494 1592534 1118629 28314 180503 1220785 1051201 927152 1960397 846763
2642H46763p1353j99990j65599j18433k4233o35357L8894J87472J182790k84257
$$ 846763 775410 575420 409821 291388 267155 -368202 -329308 -141836 1040954 756697
2632G56697m02728j57959J027772n38945Q67797M47037j423377l59126K00279
$$ 756697 353969 196010 1223782 684837 1552634 1999671 576294 217168 417447
2623D17447M3979n04122l4016Q38600K06311j266708n18813J448867k2413m75304
$$ 417447 461426 -42696 -76712 761888 968199 -298509 -817322 631545 609132 133828
2613A33828n2571j28857M08035r09505m33429J499412n35554K27463l02776P0583
$$ 133828 81257 -47600 360435 -549070 -982499 516913 -18641 208822 -93954 -23371
2603b3371J62976J133383o85261m08631J75217n34721n8687o1978N96900J04140
$$ -23371 139605 1272988 587727 179096 354313 -180408 -239095 -301073 295827 399967
2593C99967J41324o33146p58266Q02413Q55515M2850k83265K40605R195n60748
$$ 399967 541291 -91855 -850121 -47708 807807 850657 567392 807997 817192 256444
2583B56444J37867k21126O34051l75705K30327l81806P9593Q91896J28170n90089
$$ 256444 394311 173185 807236 431531 661858 280052 359645 1251541 1379711 789622
2573G89622n71591j62819J079958K76842J28730p33456M27175K5688m47537J16346
$$ 789622 218031 55212 1135170 1412012 1540742 807286 1234461 1260149 812612 928958
2563I28958j12741j054372N53543k99320n76927Q29609K89441j058711r9211J160507
$$ 928958 816217 -238155 315388 16068 -560859 268750 558191 -500520 -599731 560776
2553E60776K49033Q84975l50943j101776K57820P01772o37863j069547Q53947
$$ 560776 809809 1694784 1343841 242065 499885 1201657 563794 -505753 348194
2544C48194K23829j13052M40127N16277K72680j11588o4112n31387j25782P30543
$$ 348194 572023 458971 899098 1415375 1688055 1576467 1512355 980968 855186 1585729
2534A585729j58771n66561n10728M08814O86773k5760M85828K25828q15879l4840
$$ 1585729 1426958 860397 349669 758483 1445256 1419496 1905324 2131152 1315273 1280433
2524A280433J53199m09188N30878J07397n59867Q91620j70432O70116m25034p59076
$$ 1280433 1433632 1024444 1555322 1662719 1102852 1994472 1824040 2494156 2069122 1310046
2514A310046k13928m4351M50341n18385M6883P41287l35630l77960O75636M5062
$$ 1310046 1096118 1051767 1502108 983723 1030606 1771893 1436263 1058303 1733939 1779001
2504A779001j49832j346177j41986R01902N25105o08020J03643K05041j55114
$$ 1779001 1629169 282992 141006 1042908 1568013 959993 1063636 1268677 1113563
2495A113563L29245r30393Q37526j68564l5847l66460l93877O52138n59067L0531
$$ 1113563 1442808 512415 1349941 1181377 1145530 779070 385193 1037331 478264 508795
2485E08795L84956o21226N2817N06840m45815K99212Q38745k65350k06755K98253
$$ 508795 893751 272525 325342 832182 386367 685579 1524324 1258974 1052219 1350472
2475A350472N1646P47922k84901j095903K80024l05679q6327R20660o30395J86430
$$ 1350472 1402118 2150040 1865139 769236 1049260 743581 657254 1577914 947519 1133949
2465A133949q11908R85927q11231q94606j21271N39623J184354m12448o75275
$$ 1133949 322041 1307968 496737 -397869 -519140 20483 1204837 792389 117114
2456A17114m68304l76600M95094r08333P55304P39226j7507M41720k02204k75622
$$ 117114 -351190 -727790 -232696 -1141029 -385725 353501 335994 777714 575510 299888
2446B99888j110291J096599l23344Q056k18167j92738K78771P2650O75640k59083
$$ 299888 -810403 286196 -37148 -29092 -247259 -439997 -161226 -88576 587064 327981
2436C27981K81885K40769o58165l20183o64175J050269l46585N6908k82202m45434
$$ 327981 609866 850635 192470 -127713 -791888 258381 -88204 -31296 -313498 -758932
2426g58932P42868L06171K40980k72078Q32893j030859J35420K8108k45648Q96924
$$ -758932 -16064 290107 531087 259009 1091902 61043 196463 224571 -21077 875847
2416H75847j15725r6247k13729l04795p8737k9254M48388K2067j7058o17599L52031
$$ 875847 760122 663875 450146 145351 66614 37360 485748 507815 490757 -126842 225189
2405B25189J32711k11438P01406L47622q03644l59825J18261L15585k46880n06277
$$ 225189 357900 146462 847868 1195490 391846 32021 150282 465867 218987 -287290
2395b87290N16855J66484m40328k76052M95558o5674n35146k61656k06714n95193
$$ -287290 229565 396049 -44279 -320331 175227 109553 -425593 -687249 -893963 -1489156
2385a489156J091470J82017m35046O66504k59052j01325J07798N7047O90940k70429
$$ -1489156 -397686 -215669 -650715 15789 -243263 -344588 -236790 -179743 511197 240768
2375B40768o40975j22279M60427N4757n53623K05247l16750L82986L30152j625978
$$ 240768 -400207 -522486 -62059 -7302 -560925 -355678 -672428 -289442 40710 -1585268
2365a585268Q4144J844094l28017l40760M59279k3532m12326J29574m21076J18899
$$ -1585268 -1501124 342970 14953 -325807 133472 109940 -302386 -172812 -593888 -474989
2355d74989L7164L82329n80233Q72656j037054n7042J003437j583286J64174N14332
$$ -474989 -437825 -55496 -635729 236927 -800127 -857169 146268 -1437018 -1272844 -758512
2345g58512P24967k76076P7679k61507R3353n0550k72468O22750N77379M33445
$$ -758512 -33545 -309621 -231942 -493449 -400096 -450646 -723114 -100364 477015 910460
2335I10460K0291k36296j14202j33118l82390o4116n36912l26121J216281m84453
$$ 910460 930751 694455 580253 447135 64745 629 -536283 -862404 353877 -130576
2325a30576N20095L45166k70839j82530L99424p30186k41367J0548L26398O57311
$$ -130576 389519 734685 463846 281316 680740 -49446 -290813 -280265 46133 703444
2315G03444R77606J30983j258528K59774k4310J14312P60433K00149n61794n55068
$$ 703444 1681050 1812033 553505 813279 788969 903281 1663714 1863863 1302069 747001
2305G47001J79834j04848k82595j83770n38245K63876R8617o88431N430J161612
$$ 747001 926835 821987 539392 355622 -182623 81253 179870 -508561 -503131 658481
2295F58481p81569K01246l8990K52716M82722l54664M5746O85494m1638j008002
$$ 658481 -123088 78158 39168 291884 774606 419942 465688 1151182 1109544 101542
2285A01542o35807J38097L02120J29515L02553o41338Q58345p42481P39212q4726
$$ 101542 -534265 -396168 -94048 35467 338020 -303318 555027 -187454 551758 467032
2275D67032K10663m78101L66325r08389N34921K09512N62149l97317k89599K94613
$$ 467032 677695 199594 565919 -342470 192451 401963 964112 566795 277196 571809
2265E71809Q02936K97720q77464J30536k66120k73888M99599k79177K77611n86507
$$ 571809 1374745 1672465 795001 925537 659417 385529 885128 605951 883562 297055
2255B97055k43632O15145q60670R27544j434602P97185O14771K62656L83799q90058
$$ 297055 53423 668568 -192102 735442 -699160 98025 712796 975452 1359251 469193
2245D69193j32154Q02984J18626m43493j223073M58643J72446Q89130K59491m914
$$ 469193 337039 1140023 1258649 815156 -407917 50726 223172 1112302 1371793 1366879
2235A366879m64629p06543j79273O12380o65744m80863J809617Q74368r93749
$$ 1366879 902250 195707 16434 628814 -36930 -517793 1291824 2166192 1172443
2226A172443J088959O06398o59174l24288k61651r20279O94769m43472L79300
$$ 1172443 2261402 2867800 2208626 1884338 1622687 702408 1397177 953705 1333005
2217A333005M36567p73917j50295N38120J22966r0044N87449P8416j132076R89853
$$ 1333005 1769572 995655 845360 1383480 1506446 1416402 2003851 2082267 950191 1940044
2207A940044r7149o3449K88854n18705p63328j13944J62927n9939N20150L92454
$$ 1940044 1842895 1779446 2068300 1549595 786267 672323 835250 775311 1295461 1687915
2197A687915m629j9098O15449J122379n63483r00465l22646N76011P92109o39741
$$ 1687915 1683286 1664188 2279637 3402016 2838533 1938068 1615422 2191433 2983542 2343801
2187B343801j86690M50204n54802m0650M2211K13745L36006K37699l30005q802
$$ 2343801 2157111 2607315 2052513 2011863 2054074 2267819 2603825 2841524 2511519 2502717
2177B502717J024178J71318l44579K53607N93953j129513P04409r5011m93948
$$ 2502717 3526895 3698213 3353634 3607241 4201194 3071681 3776090 3681079 3187131
2168C187131m77461J92395O7426J501299n93224P04776j165793J044425R98354
$$ 3187131 2709670 2902065 2969491 4470790 3877566 4582342 3416549 4460974 5459328
2159E459328n21894J77412L48934j60234J36132N06172N70569n20647l78783Q08927
$$ 5459328 4937434 5114846 5463780 5303546 5439678 5945850 6516419 5995772 5616989 6425916
2149F425916K29580j002636K46505J111219q82063k6232L40454m21156J308284
$$ 6425916 6655496 5652860 5899365 7010584 6128521 6102289 6442743 6021587 7329871
2140G329871J211452q54485j200616J009467P62828N10641k24143j14728J371388
$$ 7329871 8541323 7686838 6486222 7495689 8258517 8769158 8545015 8430287 9801675
2131I801675J141911K27456p71709M42498J315745N60744l67153P02438K17980
$$ 9801675 10943586 11171042 10399333 10841831 12157576 12718320 12351167 13053605 13271585
2122A3271585l83647l09880J377260O75473P99943P08471j25737n5389P73516
$$ 13271585 12887938 12578058 13955318 14630791 15430734 16139205 16013468 15958079 16731595
2113A6731595J386804M21845K96004J38870L10244J050109J325013K030990j48245
$$ 16731595 18118399 18540244 18836248 18975118 19285362 20335471 21660484 23691474 23543229
2104B3543229O59186K295036K62598R01443J372781J235960J719307O88427J527109
$$ 23543229 24202415 26497451 26760049 27661492 29034273 30270233 31989540 32677967 34205076
2095C4205076K442473K454470J927018K936280J685381K331458L057442L390184
$$ 34205076 36647549 39102019 41029037 43965317 45650698 47982156 51039598 54429782
2087E4429782L045840M000137M464536M192154M492614N093645N952409O309025
$$ 54429782 57475622 61475759 65940295 70132449 74625063 79718708 85671117 91980142
2079I1980142Q061121R564447R796346J1079797J1733190J1673902J2350065J1111577
$$ 91980142 100041263 109605710 119402056 130481853 142215043 153888945 166239010 177350587
2071A77350587Q810799K888225j289507o743243j1904263j3673425j5568919j2766073
$$ 177350587 186161386 189049611 187760104 181016861 169112598 155439173 139870254 127104181
2063A27104181j1166594j0566597q710122p484393o152944o199177n447840n243877
$$ 127104181 115937587 105370990 96660868 89176475 83023531 76824354 71376514 66132637
2055F6132637m573527l589927m431434l156727l350250l732889r80319j554226
$$ 66132637 61559110 57969183 53537749 50381022 47030772 43297883 42317564 40763338
2047D0763338k717770j695921j309843k413246j602423q54140j859052j112984
$$ 40763338 38045568 36349647 35039804 32626558 31024135 30169995 28310943 27197959
2039B7197959K08416j167108k152242j010088j100257m90628r06469j205991j05224
$$ 27197959 27406375 26239267 24087025 23076937 21976680 21486052 20579583 19373592 19268368
2030A9268368r03637p37537j588095n68307m7685J6260n66206l23375k77724j039362
$$ 19268368 18364731 17627194 16039099 15470792 15423107 15439367 14873161 14549786 14272062 13232700
2020A3232700N88598p69691j715904j53812j082621L13243O9679n9826j82998
$$ 13232700 13821298 13051607 11335703 11181891 10099270 10412513 10482192 10422366 10239368
2011A0239368o21941Q06528k41003p70851n68974n0423O9784L74764l43117j480112
$$ 10239368 9617427 10423955 10182952 9412101 8843127 8792704 8862488 9237252 8894135 7414023
2001G414023M06308R3316p36811J5871j118095M01934m74808M53491K98732n17826
$$ 7414023 7820331 7913647 7176836 7192707 6074612 6476546 6001738 6455229 6753961 6236135
1991F236135K36402P25384k52240n73693j268429J67235k31567O37258L67924
$$ 6236135 6472537 7197921 6945681 6371988 5103559 5270794 5039227 5676485 6044409
1982F044409j240172o76835q08336J107923j62942k06765L27739p01002K60615
$$ 6044409 4804237 4127402 3319066 4426989 4264047 4057282 4385021 3684019 3944634
1973C944634M25576k1172O62718l41099j045527o44783j45789R70614j54696q37580
$$ 3944634 4370210 4349038 5011756 4670657 3625130 2980347 2834558 3805172 3650476 2812896
1963B812896K84383J14105k35012k05362K4361k9527j05925M34228J78978j129466
$$ 2812896 3097279 3211384 2976372 2771010 2795371 2765844 2659919 3094147 3273125 2143659
1953B143659j812O57211j92849k0104p04901o15284J489319L75233p28086j248622
$$ 2143659 2141847 2799058 2606209 2586105 1881204 1265920 2755239 3130472 2402386 1153764
1943A153764O6672R79795m11835J39212k14474O39079l25384m97037O08096p62188
$$ 1153764 1220436 2200231 1788396 1927608 1713134 2352213 2026829 1529792 2137888 1375700
1933A375700N73465J64734k80956j025839l81501O03570R28372m73865J6982k73997
$$ 1375700 1949165 2113899 1832943 807104 425603 1029173 1957545 1483680 1500662 1226665
1923A226665L6418l44576M09086O67734p83722j256932J51577N10589M87217J234290
$$ 1226665 1263083 918507 1327593 1995327 1211605 -45327 106250 616839 1104056 2338346
1913B338346N9061j166969n25656k39591K9391P17669J75635L07440p35891n39878
$$ 2338346 2397407 1230438 704782 465191 494582 1212251 1387886 1695326 959435 419557
1903D19557L12866j7303k29200R0631K29765L64410n06903J30578j08273q97604
$$ 419557 732423 715120 485920 576551 806316 1170726 663823 794401 686128 -211476
1893b11476m4388Q14539j14830q09486J51062J291702P6659j169085P00748m82773
$$ -211476 -255864 558675 443845 -365641 -214579 1077123 1153782 -15303 685445 202672
1883B02672M55398j22638j058225L85781K09297R16999J89661K00424m60020O84341
$$ 202672 658070 535432 -522793 -137012 72285 989284 1178945 1379369 919349 1603690
1873A603690m33894k84240K32516q24883k38947R61015L27021N42637J15269o61796
$$ 1603690 1169796 885556 1118072 293189 54242 1015257 1342278 1884915 2000184 1338388
1863A338388j088716p3994k23489N00538k20958p54983J56626R7765L38583R06227
$$ 1338388 249672 175678 -47811 452727 231769 -523214 -366588 -268823 69760 975987
1853I75987Q60268q97011o52291O24099K21749j65663K40251j031509J3746Q48801
$$ 975987 1836255 939244 286953 911052 1132801 967138 1207389 175880 189626 1038427
1843A038427o05970L38086P38306M46850j345245o66676L31589R02267J71842
$$ 1038427 432457 770543 1508849 1955699 610454 -56222 275367 1177634 1349476
1834A349476l31337j24095M16512K80294o7988K05158l37935R0198N87120k0727
$$ 1349476 1018139 894044 1310556 1590850 1522862 1728020 1390085 1480283 2067403 2046676
1824B046676l77113n05272r64199N81089O16839m23648j653614K53816J171459
$$ 2046676 1669563 1164291 200092 781181 1398020 974372 -679242 -425426 746033
1815G46033L35861p33875n26522R85579k65783p31692r7973j01991J99917n60331
$$ 746033 1081894 348019 -178503 807076 541293 -190399 -288372 -390363 -190446 -750777
1805g50777N16992M32704M66905n4711l35233n30145l64214l92610J5459J003670
$$ -750777 -233785 198919 665824 611113 275880 -254265 -618479 -1011089 -995630 8040
1795H040J84683j63008M39698j93594k0414n21387j10015L44697m04118k37906
$$ 8040 192723 29715 469413 275819 255405 -265982 -375997 -31300 -435418 -673324
1785f73324P90722m06916l37351m73690k79491N12374P50990o7096r2837L55680
$$ -673324 117398 -289518 -626869 -1100559 -1380050 -867676 -116686 -183782 -276619 79061
1775G9061j80405k26802j11603m10805n57265N44874k61143K11450K57367m28976
$$ 79061 -101344 -328146 -439749 -850554 -1407819 -862945 -1124088 -912638 -655271 -1084247
1765a084247K20762N61203N23388L09023k29133p58082L74354r5635o45686K50693
$$ -1084247 -863485 -302282 221106 530129 300996 -457086 -82732 -178367 -824053 -573360
1755e73360n44248m26552N78108Q33844Q8333j38481M30211N21228l26821o33180
$$ -573360 -1117608 -1544160 -966052 -132208 -43875 -182356 247855 769083 442262 -190918
1745a90918m14890M84629K86309o69369O12274K3826O7964N94337o11637l42998
$$ -190918 -605808 -121179 165130 -504239 108035 131861 199825 794162 182525 -160473
1735a60473o32186K29305P81313J21O372m3328j024901O52578k52297J7933k61991
$$ -160473 -792659 -563354 217959 218080 224452 181124 -843777 -191199 -443496 -425563 -687554
1724f87554n69364Q95349J48835q58785Q48204L80345n51962n96126j97247l64017
$$ -687554 -1256918 -361569 -212734 -1071519 -223315 157030 -394932 -991058 -1188305 -1552322
1714a552322L83552J076795m40275l05695k60185M84687J084251J73965r20071
$$ -1552322 -1168770 -91975 -532250 -837945 -1098130 -613443 470808 644773 -275298
1705b75298k05934K06317Q37503l35695m71342k74391l22070m7510l54400J100701
$$ -275298 -481232 -274915 562588 226893 -244449 -518840 -840910 -888420 -1242820 -142119
1695a42119R61968j89012q9777m01054q2431r06207q20778Q22889Q28865p23427
$$ -142119 819849 630837 541060 140006 57575 -848632 -1669410 -846521 -17656 -741083
1685g41083N30922p802l10079k62314J87942Q39447L7011l63155m44129j02051
$$ -741083 -210161 -217963 -528042 -790356 -602414 237033 274044 -89111 -533240 -635291
1675f35291l20477n9113j84172O27609M34983l44469R5246Q1411p64054n75426
$$ -635291 -955768 -1014881 -1199053 -571444 -136461 -480930 -385684 -304273 -1068327 -1643753
1665a643753N97834O96820j071944M63086O17322J70470L16943k91793K86531
$$ -1643753 -1045919 -349099 -1421043 -957957 -340635 -170165 146778 -145015 141516
1656A41516J48572l28899K71437q46540q19877L79813J428881o14782m689J74008
$$ 141516 290088 -38811 232626 -613914 -1433791 -1053978 374903 -239879 -244568 -70560
1646g0560J16936l78594R58727l46450j658612P28963J327081k5594n24125m56864
$$ -70560 46376 -332218 626509 280059 -1378553 -649590 677491 651897 127772 -329092
1636c29092m99825P42688K51112p11892o26552P63485n15862j10174j1886K47538
$$ -329092 -828917 -86229 164883 -547009 -1173561 -410076 -925938 -1036112 -1047998 -800460
1626h00460j40875J11262k3182L37690m97476M23108K45863k40749J73409l73908
$$ -800460 -941335 -830073 -853255 -515565 -1013041 -589933 -344070 -584819 -411410 -785318
1616g85318m07792k98584K09183J307067j91385l59507L65428k20048l50945N11079
$$ -785318 -1193110 -1491694 -1282511 24556 -166829 -526336 -160908 -380956 -731901 -220822
1606b20822O6446j35621M14323o69379m7936J055899q79212o32502K70169J307729
$$ -220822 -154376 -289997 124326 -545053 -592989 462910 -416302 -1048804 -778635 529094
1596E29094q70568o5200P26435n94893J64319k25006n39036j65914M5262J113814
$$ 529094 -341474 -406674 319761 -275132 -110813 -335819 -874855 -1040769 -995507 118307
1586A18307M82947l39488j11908m63548j001368L47078j124239Q99202J99303
$$ 118307 601254 261766 149858 -313690 -1315058 -967980 -2092219 -1193017 -993714
1577i93714q85622P00618O73758L21691j2189Q90770q70649L57876k11833O98806
$$ -993714 -1879336 -1178718 -504960 -183269 -195458 695312 -175337 182539 -29294 669512
1567F69512k87662r71325j3375J1709p59694L45607K52044Q83717K97235J67509
$$ 669512 381850 -589475 -602850 -591141 -1350835 -1005228 -753184 130533 427768 595277
1557E95277j092774P41614N6176j294430m38251J209397l15179N16790L25921
$$ 595277 -497497 244117 300293 -994137 -1432388 -222991 -538170 -21380 304541
1548C04541l62811l54297L18727q32031p31160M62539j9133o23490K70654N86529
$$ 304541 -58270 -412567 -93840 -925871 -1657031 -1194492 -1213625 -1837115 -1566461 -979932
1538i79932K79739n2059J63850P06473l60460K68925k97749M68660j079189P1272
$$ -979932 -700193 -752252 -588402 118071 -242389 26536 -271213 197447 -881742 -810470
1528h10470L26928O33007k71894p7145L83284j525446K31797J302485J63885J97428
$$ -810470 -483542 149465 -122429 -199574 183710 -1341736 -1109939 192546 356431 553859
1518E53859q28344j97741j55449J37616O0079J16299j4969R746p34521k52824
$$ 553859 -274485 -472226 -627675 -490059 -429980 -313681 -328650 -318904 -1053425 -1306249
1508a306249K46832j33078K2188m06029m7685J057191R02075o12928j158891n67611
$$ -1306249 -1059417 -1192495 -1170307 -1576336 -1624021 -566830 335245 -277683 -1436574 -2004185
1498b004185N07035J12372K16395n01582J451703K36242j348172O37917K79982
$$ -2004185 -1497150 -1384778 -1168383 -1669965 -218262 17980 -1330192 -692275 -412293
1489d12293Q0042k77120K49476m81757n99814J90135L96196k32375R2947O22159
$$ -412293 -332251 -609371 -359895 -841652 -1441466 -1251331 -855135 -1087510 -994563 -372404
1479c72404n28613j64164M59252J43312P57295j74301N94843p69244p21789K51101
$$ -372404 -901017 -1065181 -605929 -462617 294678 120377 715220 -54024 -775813 -524712
1469e24712J64218m06399J5589O93926K69732p68789k85631O20452j41858K53745
$$ -524712 -360494 -766893 -751304 -57378 212354 -556435 -842066 -221614 -363472 -109727
1459a09727m59681l91007K31421Q7367P17289K39918k03727K03544m50306q9756
$$ -109727 -569408 -960415 -728994 -641627 75662 315580 111853 315397 -134909 -224665
1449b24665O68126n73746o89799J11161j60476R21162q8517l46244O17746n35811
$$ -224665 443461 -130285 -820084 -708923 -869399 51763 -36754 -382998 234748 -301063
1439c01063n35269p79471O90867J73980j30942J450998o87568n91803K51699M89211
$$ -301063 -836332 -1615803 -924936 -750956 -881898 569100 -118468 -710271 -458572 30639
1429C0639M08156o81775l01133k76381k27795j20302r51817Q41066M9229Q7772
$$ 30639 438795 -242980 -544113 -820494 -1048289 -1168591 -2120408 -1279342 -1230113 -1142341
1419a142341O82749M21991L59916j04934o66522K47943M38286J49376O6052n82712
$$ -1142341 -459592 -37601 322315 217381 -449141 -201198 237088 386464 452516 -130196
1409a30196K26547l43390m5663K22049l02865J66811J76938n77697M84489J466483
$$ -130196 96351 -247039 -292702 -70653 -373518 -206707 -29769 -607466 -122977 1343506
1399A343506l76734r99906N02860L58287q84303P08505p71381L15234L27014p32072
$$ 1343506 966772 -33134 469726 828013 -56290 652215 -119166 196068 523082 -208990
1389b08990n07774J00512K48116l06923m31245j89353O33257N32039K64646K32585
$$ -208990 -716764 -616252 -368136 -675059 -1106304 -1295657 -662400 -130361 134285 366870
$$ [...]
##END NTUPLES=NMR SPECTRUM
##END=
