##TITLE=1H_CA-8913
 CDCl3, 8 sc, 
 4.08.2021
##JCAMPDX= 6.0         $$ Bruker NMR JCAMP-DX V2.0
##DATA TYPE= NMR SPECTRUM
##DATA CLASS= NTUPLES
##ORIGIN= UXNMR, Bruker Analytische Messtechnik GmbH
##OWNER= root
$$ XWIN-NMR		Version 3.5
$$ Wed Aug  4 10:08:17 2021 Russian Standard Time (UT+4h)  she@DPX200
##.OBSERVE FREQUENCY= 200.131506
##.OBSERVE NUCLEUS= ^1H
##.ACQUISITION MODE= SIMULTANEOUS
##.ACQUISITION SCHEME= undefined
##.AVERAGES= 8
##.DIGITISER RES= 18
##SPECTROMETER/DATA SYSTEM= spect
##.PULSE SEQUENCE= zg30
##.SOLVENT NAME= CDCl3
##.SHIFT REFERENCE= (INTERNAL, CDCl3, 0, 17.4947)
##AUDIT TRAIL= $$ (NUMBER, WHEN, WHO, WHERE, WHAT)
$$ ##TITLE= Audit trail, XWIN-NMR		Version 3.5
$$ ##JCAMPDX= 5.01
$$ ##ORIGIN= Bruker BioSpin GmbH
$$ ##OWNER= she
$$ F:/spectra/data/she/nmr/H-F/1/pdata/1/auditp.txt
$$ ##AUDIT TRAIL=  $$ (NUMBER, WHEN, WHO, WHERE, WHAT)
(   1,<2021-08-04 10:07:16.62 +0400>,<she>,<DPX200>,
      <created by zg, POWCHK disabled, PULCHK disabled
       configuration hash MD5:
       00 E9 B6 7A A2 85 ED C7 34 08 36 98 17 FE 4E 26
       data hash MD5: 16K
       CA 45 47 42 1D CC 7F 08 38 88 7C 92 03 D2 6D EB>)
(   2,<2021-08-04 10:07:19.25 +0400>,<she>,<DPX200>,
      <Start of raw data processing
       efp BC_mod = 2 LB = 0.24 FT_mod = 6 PKNL = 1 PHC0 = -13357.1 PHC1 = 14.00099 SI = 16K 
       data hash MD5: 16K
       80 F8 6C 84 07 6E 74 9F 6B 8C D6 32 40 F4 12 56>)
(   3,<2021-08-04 10:07:34.29 +0400>,<she>,<DPX200>,
      <pk PHC0 = -0.1057896 PHC1 = 0.8000003 
       data hash MD5: 16K
       D0 70 73 3C 14 E0 3F 37 C7 F3 12 BC FF 09 77 24>)
(   4,<2021-08-04 10:07:37.37 +0400>,<she>,<DPX200>,
      <abs ABSG = 5 
       data hash MD5: 16K
       17 B9 83 B5 AB 77 7A BA C6 F3 F9 2B 51 FE 93 CF>)
$$ ##END=
$$ 
$$ hash MD5
$$ 7D 6F 7B 32 FB 9A A0 B7 59 24 B9 31 F9 23 FB 8B
##$RELAX= 
##$RELAX= 
##$RELAX= 
##$RELAX= 
##$RELAX= 
##$RELAX= 
$$ Bruker specific parameters
$$ --------------------------
##$DU= <F:/spectra>
##$EXPNO= 1
##$NAME= <H-F>
##$PROCNO= 1
##$TYPE= <nmr>
##$USER= <she>
##$AMP= (0..31)
100 100 100 100 100 100 100 100 100 100 100 100 100 100 100 100 100 100 
100 100 100 100 100 100 100 100 100 100 100 100 100 100 
##$AQSEQ= 0
##$AQ_mod= 1
##$AUNM= <au_zg>
##$AUTOPOS= <>
##$BF1= 200.13
##$BF2= 200.13
##$BF3= 200.13
##$BF4= 200.13
##$BF5= 200.13
##$BF6= 200.13
##$BF7= 200.13
##$BF8= 200.13
##$BYTORDA= 1
##$CFDGTYP= 0
##$CFRGTYP= 5
##$CHEMSTR= <none>
##$CNST= (0..31)
1 1 145 1 1 1 1 1 1 1 1 1 1 1 1 1 1 1 1 1 1 1 1 1 1 1 1 1 1 1 1 1 
##$CPDPRG= <>
##$CPDPRG1= <>
##$CPDPRG2= <>
##$CPDPRG3= <>
##$CPDPRG4= <mlev>
##$CPDPRG5= <mlev>
##$CPDPRG6= <mlev>
##$CPDPRG7= <mlev>
##$CPDPRG8= <mlev>
##$CPDPRGB= <>
##$CPDPRGT= <>
##$D= (0..31)
0 1.2 0 0 0 0 0 0 0 0.06 0 0.03 0 0 0 0 0.0002 0 0 0 0 0 0 0 0 0 0 0 0 
0 0 0 
##$DATE= 1628057236
##$DBL= (0..7)
120 120 120 120 120 120 120 120 
##$DBP= (0..7)
150 150 150 150 150 150 150 150 
##$DBP07= 0
##$DBPNAM0= <>
##$DBPNAM1= <>
##$DBPNAM2= <>
##$DBPNAM3= <>
##$DBPNAM4= <>
$$ [...]
##$SUBNAM3= <"">
##$SUBNAM4= <"">
##$SUBNAM5= <"">
##$SUBNAM6= <"">
##$SUBNAM7= <"">
##$SUBNAM8= <"">
##$SUBNAM9= <"">
##$SW= 20.0188882624521
##$SWIBOX= (0..15)
0 0 2 0 0 0 0 0 0 0 0 0 0 0 0 0 
##$SW_h= 4006.41025641026
##$TD= 16384
##$TD0= 1
##$TE= 0
##$TE2= 300
##$TE3= 300
##$TEG= 300
##$TL= (0..7)
0 120 120 120 120 120 120 120 
##$TP= (0..7)
150 150 150 150 150 150 150 150 
##$TP07= 0
##$TPNAME0= <>
##$TPNAME1= <>
##$TPNAME2= <>
##$TPNAME3= <>
##$TPNAME4= <>
##$TPNAME5= <>
##$TPNAME6= <>
##$TPNAME7= <>
##$TPOAL= (0..7)
0.5 0.5 0.5 0.5 0.5 0.5 0.5 0.5 
##$TPOFFS= (0..7)
0 0 0 0 0 0 0 0 
##$TUNHIN= 0
##$TUNHOUT= 0
##$TUNXOUT= 0
##$USERA1= <user>
##$USERA2= <user>
##$USERA3= <user>
##$USERA4= <user>
##$USERA5= <user>
##$V9= 5
##$VALIST= <valist>
##$VCLIST= <CCCCCCCCCCCCCCC>
##$VD= 0
##$VDLIST= <DDDDDDDDDDDDDDD>
##$VPLIST= <PPPPPPPPPPPPPPP>
##$VTLIST= <TTTTTTTTTTTTTTT>
##$WBST= 1024
##$WBSW= 4
##$XGAIN= (0..3)
0 0 0 0 
##$XL= 0
##$YL= 0
##$YMAX_a= 190117
##$YMIN_a= -192377
##$ZGOPTNS= <>
##$ZL1= 120
##$ZL2= 120
##$ZL3= 120
##$ZL4= 120
##$ABSF1= 17.49344
##$ABSF2= -2.525597
##$ABSG= 5
##$ABSL= 3
##$ALPHA= 0
##$AQORDER= 0
##$ASSFAC= 0
##$ASSFACI= 0
##$ASSFACX= 0
##$ASSWID= 0
##$AUNMP= <proc_1d>
##$AZFE= 0.1
##$AZFW= 0.1
##$BCFW= 0
##$BC_mod= 2
##$BYTORDP= 0
##$COROFFS= 0
##$CY= -3
##$DATMOD= 1
##$DC= 0
##$DFILT= <>
##$DTYPP= 0
##$F1P= 0
##$F2P= 0
##$FCOR= 1
##$FTSIZE= 16384
##$FT_mod= 6
##$GAMMA= 0
##$GB= 0
##$INTBC= 1
##$INTSCL= 1.334414e-10
##$ISEN= 128
##$LB= 0.24
##$LEV0= 0
##$LPBIN= 0
##$MAXI= 10000
##$MC2= 0
##$MEAN= 0
##$ME_mod= 0
##$MI= 1.114404
##$NCOEF= 0
##$NC_proc= -6
##$NLEV= 6
##$NOISF1= 3.799351
##$NOISF2= 2.8
##$NSP= 0
##$NTH_PI= 0
##$NZP= 0
##$OFFSET= 17.49467
##$PC= 1
##$PHC0= -13357.21
##$PHC1= 14.80099
##$PH_mod= 1
##$PKNL= yes
##$PPARMOD= 0
##$PSCAL= 0
##$PSIGN= 0
##$REVERSE= no
##$SF= 200.130007998215
##$SI= 16384
##$SIGF1= 3
##$SIGF2= 2
##$SINO= 5.538805
##$SIOLD= 16384
##$SREGLST= <1H.CDCl3>
##$SSB= 0
##$STSI= 16384
##$STSR= 0
##$SW_p= 4006.41025641026
##$SYMM= 0
##$S_DEV= 0
##$TDeff= 16384
##$TDoff= 0
##$TI= <>
##$TILT= no
##$TM1= 0
##$TM2= 0
##$TOPLEV= 0
##$USERP1= <user>
##$USERP2= <user>
##$USERP3= <user>
##$USERP4= <user>
##$USERP5= <user>
##$WDW= 1
##$XDIM= 16384
##$YMAX_p= 387362557
##$YMIN_p= -357140
$$ End of Bruker specific parameters
$$ ---------------------------------
##NTUPLES= NMR SPECTRUM
##VAR_NAME=  FREQUENCY,     SPECTRUM/REAL,   SPECTRUM/IMAG
##SYMBOL=    X,             R,               I
##VAR_TYPE=  INDEPENDENT,   DEPENDENT,       DEPENDENT
##VAR_FORM=  AFFN,          ASDF,            ASDF
##VAR_DIM=   16384,         16384,           16384
##UNITS=     HZ,            ARBITRARY UNITS, ARBITRARY UNITS
##FACTOR=    0.24454680195387, 1,            1
##FIRST=     3501.20862072295, 0,            0
##LAST=      -505.201635687307, 0,           0
##MIN=       -505.201635687307, -357140,     0
##MAX=       3501.20862072295, 387362557,    0
$$ Real data points
##PAGE= N=1
##DATA TABLE= (X++(R..R)), XYDATA
$$ [...]
$$ plain form
7122 -126462 -224328 -207570 -152832 -118586 -146723 -39882 -89213 -152964 -123565 -76204 -95418
7111 -95418 101689 16559 -143123 -125350 -44426 -108533 -133095 -48849 14839 43264 5459
7100 5459 -78711 14047 -30715 -49543 -42499 60818 38939 -52044 -45397 -56287 -115040 -175825
7088 -175825 -54899 -46420 -90751 19199 46498 -42419 -119950 -107515 -125848 -8636 81836
7077 81836 115442 133720 239633 221589 172527 212561 302385 390877 468967 343298 305543
7066 305543 495220 354302 229735 117467 206480 185949 101221 58234 122239 126154 57256
7055 57256 12892 113072 34359 -21572 -108435 -125007 -82660 -104214 -105423 -83297 19018 -114527
7043 -114527 -111323 -93615 -14462 -78255 -175362 -123605 -127067 -1936 -15158 -16525 123564 78821
$$ packed form
7122a26462r7866J6758N4738L4246k8137J06841m9331o3751K9399M7361j9214
7111i5418J97107q5130j59682J7773Q0924o4107k4562Q4246O3688K8425l7805
7100E459q4170R2758m4762j8828P044J03317k1879r0983O647j0890n8753o0785
7088a75825J20926Q479m4331J09950K7299q8917p7531J2435j8333J17212R0472
7077H1836L3606J8278J05913j8044m9062M0034Q9824Q8492P8090j25669l7755
7066C05543J89677j40918j24567j12268Q9013k0531q4728m2987O4005L915o8898
7055E7256m4364J00180p8713n5931q6863j6572M2347k1554j209K2126J02315j33545
7043a14527L204J7708P9153o3793r7107N1757l462J25131j3222j367J40089m4743
$$ plain form
7031 78821 22563 -14006 -35478 5216 4047 -2030 -78078 -34966 71531 44038 -74607 -56786
7019 -56786 -83331 -90128 -188971 -105723 -54029 -108333 -89059 -51935 -49810 -4819 -50246 -157358
7007 -157358 -119943 -96333 -84592 -6450 -34873 -24554 -17680 -62401 -96860 -84965 -25086 -87244
6995 -87244 -86153 -50357 -90047 -151013 -175381 -204741 -135486 -103903 -31348 -137182 -185796 -142311
6983 -142311 -131895 -97321 -35081 -118635 -79896 -153888 -179508 -181263 -117397 -15537 -13588 69904
6971 69904 121884 14361 -124314 -136224 -238698 -286106 -322238 -290278 -273327 -213877 -184810
6960 -184810 -219190 -94006 -44897 -242130 -190344 -160988 -179793 -123736 -116647 -99512 -30746
6949 -30746 -7401 -51834 -154475 -202778 -92820 -50617 -83080 -174440 -227260 -125548 -86427
$$ packed form
7031G8821n6258l6569k1472M0694j169o077p6048M3112J06497k7493j18645J7821
7019e6786k6545o797r8843Q3248N1694n4304J9274L7124K125M4991m5427j07112
7007a57358L7415K3610J1741P8142k8423J0319O874m4721l4459J1895N9879o2158
6995h7244J091L5796l9690o0966k4368k9360O9255L1583P2555j05834m8614M3485
6983a42311J0416L4574O2240q3554L8739p3992k5620j755O3866J01860J949Q3492
6971F9904N1980j07523j38675j1910j02474m7408l6132L1960J6951N9450K9067
6960a84810l4380J25184M9109j97233N1786K9356j8805N6057P089J7135O8766
6949c0746K3345m4433j02641m8303J09958M2203l2463r1360n2820J01712L9121
$$ plain form
6938 -86427 -132329 -209248 -251943 -228935 -100852 -144711 -129657 -46742 -137806 -131196 -87163 -76687
6926 -76687 -101350 -79387 -210737 -156875 -63537 -73757 -164615 -138766 -144013 15729 38369 -10623
6914 -10623 -46752 -32693 -91051 -288545 -261451 -205348 -180283 -144657 -147269 -57180 63443 9631
6902 9631 19296 -35900 -152422 -175752 -39781 -131461 -194085 -132000 -123244 -93070 -166841 -67288
6890 -67288 -5561 -44293 -61091 -67109 3355 68340 25224 -38736 -43134 -55335 -4867 -180970
6878 -180970 -139159 -53992 -69450 31844 -27360 -66401 -62207 -110183 -150017 -32335 -20031
6867 -20031 -31755 -76577 -35523 47553 -71521 -73060 16535 -47809 -42974 -3777 -94553 -73797
6855 -73797 -148290 -66501 -96945 -201217 -100174 -74815 -44485 -145450 -100011 -102213 -154589
$$ packed form
6938h6427m5902p6919m2695K3008J28083m3859J5054Q2915r1064O610M4033J0476
6926g6687k4663K1963j31350N3862R3338j0220r0858K5849n247J59742K2640m8992
6914a0623l6129J4059n8358j97494K7094N6103K5065L5626k612R0089J20623n3812
6902I631R665n5196j16522k3330J35971r1680o2624O2085Q756L0174p3771R9553
6890f7288O1727l8732j6798o018P0464O4985m3116o3960m398j2201N0468j76103
6878a80970M1811Q5167j5458J01294n9204l9041M194m7976l9834J17682J2304
6867b0031j1724m4822M1054Q3076j19074j539Q9595o4344M835L9197r0776K0756
6855g3797p4493Q1789l0444j04272J01043K5359L0330j00965M5439k202n2376
$$ plain form
6844 -154589 -121583 -62966 -150206 -229748 -84603 -157291 -129834 -37744 -85800 -117534 -123234 -120104
6832 -120104 -120920 -128298 -144679 -48366 42479 1695 -33587 -3658 5404 -35248 -42096 -115934 -135685
6819 -135685 -46356 -21560 -130740 -164288 -99635 -36419 -36592 -114754 -107284 -59563 -117972 -97073
6807 -97073 -153059 -41191 30926 -106664 -113774 -18970 81272 12167 -65194 -30427 -51973
6796 -51973 -53827 -16777 65030 -39269 -112842 -27477 -25445 61020 35226 38218 -73359 -142292
6784 -142292 -149383 -34645 28647 -128726 -70985 21679 -35699 -11280 -31510 -17807 53741
6773 53741 21710 15384 -55569 -104023 -47913 -52901 -10947 -25320 -110331 -4825 -124942 -114276
6761 -114276 -100338 -120145 -43812 -23510 52775 66851 71202 25638 -47419 -20388 -17678 36891
$$ packed form
6844a54589L3006N8617q7240p9542J45145p2688K7457R2090m8056l1734n700L130
6832a20104q16p378j6381R6313R0845m0784l5282K9929R062m0652o848p3838j9751
6819a35685Q9329K4796j09180l3548O4653O3216j73p8162P470M7721n8409K0899
6807i7073n5986J11868P2117j37590p110R4804J00242o9105p7361L4767k1546
6796e1973j854L7050Q1807j04299p3573Q5365K032Q6465k5794K992j11577o8933
6784a42292p091J14738O3292j57373N7741R2664n7378K4419k0230J3703P1548
6773E3741l2031o326p0953m8454N6110m988M1954j4373q5011J05506j20117J0666
6761a14276J3938j9807P6333K0302P6285J4076M351m5564p3057K7031K710N4569
$$ plain form
6749 36891 -275 -158605 -217003 -186309 -188019 -156900 -150509 -183160 -120435 -45445 -97859 -168420
6737 -168420 -77419 -88465 -184775 -130485 -161114 -169126 -157784 -115866 -67619 -83880 -72215 -204131
6725 -204131 -140752 -39346 -8779 23249 -71474 -61472 -112343 -4792 51155 -77452 68172
6714 68172 14169 -113730 65895 45688 40698 4711 -64624 -96149 -135710 -145222 -52158 510
6702 510 -37009 35763 -20856 -29700 4876 -112693 -134048 -43750 -47189 -24 -22250 -96677
6690 -96677 -81044 -132751 -96396 -177482 -145941 -91088 -159565 -120366 -177586 -132108 -98924 -46113
6678 -46113 -55896 53821 -15977 691 74494 105882 4666 -33764 52574 -27081 -87900 -57834
6666 -57834 -125146 -220074 -177741 -67475 -35810 -44680 -70053 4647 -108897 -112241 -127404 -168985
$$ packed form
6749C6891l7166j58330n8398L0694j710L1119O391l2651O2725P4990n2414p0561
6737a68420R1001j1046r6310N4290l0629q012J1342M1918M8247j6261J1665j31916
6725b04131O3379J01406L0567L2028r4723J0002n0871J07551N5947j28607J45624
6714F8172n4003j27899J79625k0207m990l5987o9335l1525l9561r512R3064N2668
6702E10l7519P2772n6619q844L4576j17569k1355R0298l439M7165k2226p4427
6690i6677J5633n1707L6355q1086L1541N4853o8477L9199n7220M5478L3184N2811
6678d6113r783J09717o9798J6668P3803L1388j01216l8430Q6338p9655o0819L0066
6666e7834o7312r4928M2333J10266L1665q870k5373P4700j13544l344j5163m1581
$$ plain form
6654 -168985 -117241 15359 68606 197538 32811 -58515 -21971 -18746 -25306 11329 -127217
6643 -127217 -179196 -24677 -38384 -32697 36154 19548 -50636 -65774 -107125 18921 -44313
6632 -44313 -52747 79493 69884 109114 124128 85935 -66149 -166638 -69877 -84651 -139874 -135870
6620 -135870 -4209 -6048 -20771 -1749 17944 40271 32339 -150846 -101712 -46678 15432 43406
6608 43406 -87616 -86360 -102645 -142783 -157075 -118289 -45685 -12172 33957 46754 -29673 -75607
6596 -75607 -93337 -124217 -28497 -69684 -131599 -14355 30098 -141986 -196585 -157912 -92297
6585 -92297 -120415 -83633 -128058 -91897 -64039 13352 -50889 23669 12435 45097 6530 -71555
6573 -71555 -94766 -80885 -4323 7959 -53140 -78478 -98416 4585 14247 16661 -110472 -96389
$$ packed form
6654a68985N1744J32600N3247J28932j64727r1326L6544L225o560L6635j38546
6643a27217n1979J54519j3707N687O8851j6606p0184j5138m1351J26046o3234
6632d4313q434J32240r609L9230J5014l8193j52084j00489R6761j4774n5223M004
6620a35870J31661j839j4723J9022J9693K2327p932j83185M9134N5034O2110K7974
6608D3406j31022J256j6285m0138j4292L8786P2604L3513M6129J2797p6427m5934
6596g5607j7730l0880R5720m1187o1915J17244M4453j72084n4599L8673O5615
6585i2297k8118L6782m4425L6161K7858P7391o4241P4558j1234L2662l8567p8085
6573g1555k3211J3881P6562J2282o1099k5338j9938J03001R662K414j27133J4083
$$ plain form
6561 -96389 -75988 -108384 -81552 50433 55281 -63818 -97641 -37311 -14014 -88541 -87213 -42429
6549 -42429 -7663 -40542 -43008 -60351 -69385 -104345 -177851 -85630 13317 16794 104248 1420
6537 1420 58668 65550 140515 73427 38475 -14604 -45291 21484 -76719 -56526 45320 149464
6525 149464 -3638 -19775 45782 76059 52108 55782 94540 100161 214296 105756 119083
6514 119083 -59996 -13201 31375 13367 158206 228557 49691 78373 -92792 -72700 8749
6503 8749 40200 92154 106254 143987 110565 107126 190930 296776 231766 217461 183801 126879
6491 126879 200939 112642 100707 218009 153501 74558 123927 201067 329906 221241 314315
6480 314315 428619 494187 456634 474289 496952 542327 675948 856608 878212 1013850 944595
$$ packed form
6561i6389K0401l2396K6832J31985M848j19099l3823O0330K3297p4527J328M4784
6549d2429L4766l2879k466j7343r034l4960p3506R2221R8947L477Q7454j02828
6537A420N7248O882P4965o7088l4952n3079l0687O6775r8203K0193J01846J04144
6525A49464j53102j6137O5557L0277k3951L674L8758N621J14135j08540J3327
6514A19083j79079M6795M4576j8008J44839P0351j78866K8682j71165K0092Q1449
6503H749L1451N1954J4100L7733l3422l439Q3804J05846o5010j4305l3660n6922
6491A26879P4060q8297j1935J17302o4508p8943M9369P7140J28839j08665R3074
6480C14315J14304O5568l7553J7655K2663M5375J33621J80660K1604J35638o9255
$$ plain form
6469 944595 970967 1193260 1224949 1262739 1280835 1401846 1564328 1659866 1591240 1426091 1350403
6458 1350403 1250737 1185152 1213218 1144574 1141324 1025377 941636 859417 727102 662341 713720
6447 713720 635789 525761 564344 489526 398460 341441 257214 429491 263667 165499 196868
6436 196868 306658 229232 175188 97822 53813 75085 208170 258973 168138 133021 181028
6425 181028 127338 -1891 11457 146520 185831 154046 113067 61924 30247 94154 98805
6414 98805 114504 88959 156451 123664 91733 91840 174403 176747 155012 144258 14189 -149337
6402 -149337 -134556 146685 119923 40123 -10102 -5601 -108874 -53190 66644 77090 -27066
6391 -27066 -12444 5164 -37098 -15666 -17227 -70016 -117845 -84353 -90719 -9498 29212 63242
$$ packed form
6469I44595K6372K22293L1689L7790J8096J21011J62482R5538o8626j65149p5688
6458A350403r9666o5585K8066o8644l250j15947q3741q2219j32315o4761N1379
6447G13720p7931j10028L8583p4818r1066n7019q4227J72277j65824r8168L1369
6436A96868J09790p7426n4044p7366m4009K1272J33085N0803r0835l5117M8007
6425A81028n3690j29229J3348J35063L9311l1785m0979n1143l1677O3907M651
6414I8805J5699k5545O7492l2787l1931J07Q2563K344k1735j0754j30069j63526
6402a49337J4781K81241k6762p9800n0225M501j03273N5684J19834J0446j04156
6391b7066J4622J7608m2262K1432j561n2789m7829L3492o366Q1221L8710L4030
$$ plain form
6379 63242 -42685 51762 17630 -22832 73555 204975 138274 30248 56263 -106433 -22641
6368 -22641 48369 27132 -70918 33440 -28534 15282 129136 26867 -92562 -33124 52949
6357 52949 -47859 -3183 44362 146558 130917 -77091 -56967 36319 54016 99686 -5275
6346 -5275 116887 15493 -84261 -7487 -58488 -6472 4679 -41841 80566 46422 -5337
6335 -5337 38385 -85934 -112444 -30212 47827 28690 7466 41899 -30952 19041 55182 -41618
6323 -41618 -44651 -95249 -33998 -96892 -22869 57893 -180353 -212720 -94530 49743 32521
6312 32521 37451 82274 -49533 -86165 -62247 -26365 18588 -36246 -9274 -20545 40989 34130
6300 34130 -17711 -34631 -166767 -101347 -3832 -82018 -44209 -109693 -117006 -83636 -81880 -105209
$$ packed form
6379F3242j05927R4447l4132m0462R6387J31420o6701j08026K6015j62696Q3792
6368b2641P1010k1237r8050J04358o1974M3816J13854j02269j19429N9438Q6073
6357E2949j00808M4676M7545J02196j5641k08008K0124R3286J7697M5670j04961
6346e275J22162j01394r9754P6774n1001N2016J1151m6520J22407l4144n1759
6335e337M3722j24319k6510Q2232P8039j9137k1224L4433p2851M9993L6141r6800
6323d1618l033n0598O1251o2894P4023Q0762k38246l2367J18190J44273j7222
6312C2521M930M4823j31807l6632K3918L5882M4953n4834K6972j1271O1534o859
6300C4130n1841j6920j32136O5420R7515p8186L7809o5484p313L3370J756k3329
$$ plain form
6288 -105209 -54112 -48573 13093 138063 -75507 -22677 -90296 -4981 -118030 -219060 -141197
6277 -141197 -87849 -79876 -70860 -123302 -78023 -55878 -31092 -67157 -38331 -110603 -80090 -93909
6265 -93909 -20020 54336 48468 -39559 -132819 -73252 21728 -25330 -46501 -29609 -27022 40890
6253 40890 10265 -125865 76 24742 -86766 33291 -15340 -50944 -103274 -36620 -115412
6242 -115412 18911 -109513 -155164 -140693 -53467 -16683 -46960 62558 42518 -22181 -147797
6231 -147797 1107 62652 -3428 45696 -10687 19125 58932 13241 41708 -50585 -45378 -26154
6219 -26154 -14789 -499 -4173 -32077 -146140 -54349 917 48634 150939 81318 -6982 -46720
6207 -46720 -167140 -112354 -104354 -107329 19861 66213 68979 229 -149577 -121835 -81258 -2499
$$ packed form
6288a05209N1097N539O1666J24970k13570N2830o7619Q5315j13049j01030P7863
6277a41197N3348P973R016n2442M5279K2145K4786l6065K8826p2272L0513j3819
6265i3909P3889P4356n868q8027r3260N9567R4980m7058k1171J6892K587O7912
6253D0890l0625j36130J25941K4666j11508J20057m8631l5604n2330O6654p8792
6242a15412J34323j28424m5651J4471Q7226L6784l0277J09518k0040o4699j25616
6231a47797J48904O1545o6080M9124n6383K9812L9807m5691K8467r2293N207J9224
6219b6154J1365J4290l674k7904j14063R1791N5266M7717J02305o9621q8300l9738
6207d6720j20420N4786Q000k975J27190M6352K766o8750j49806K7742M0577P8759
$$ plain form
6195 -2499 1842 -18950 -61626 -116666 -52359 -125808 -4576 -2783 38840 80271 -101623 -14945
6183 -14945 -78839 -112166 -77917 12258 -45748 -56090 -18368 -154940 -148110 -262066 -145972
6172 -145972 -77418 -151659 -98138 -44089 -88614 -96205 -1169 -50557 -104267 -85769 -96797 -188814
6160 -188814 -185616 -211359 -184704 -163573 -107216 -54250 -11323 -48172 -26478 -64495 -150625 -191383
6148 -191383 -22053 117741 30140 -57760 5572 116420 -38170 -61180 -126122 -160473 -167767
6137 -167767 -229037 -54505 -112020 -197650 -30573 -44630 -107358 6071 -18198 24555 -30270
6126 -30270 -21785 -41149 -47204 64296 17115 -75821 -212328 -100324 9957 -78627 -36860
6115 -36860 74724 64660 13059 34569 113190 -85402 -104396 -111207 -82543 -131267 -134422 1760
$$ packed form
6195b499M341k0792m2676n5040O4307p3449J21232J793M1623M1431j81894Q6678
6183a4945o3894l3327L4249R0175n8006j0342L7722j36572O830j13956J16094
6172a45972O8554p4241N3521N4049m4525p591R5036m9388n3710J8498j1028r2017
6160a88814L198k5743K6655K1131N6357N2966M2927l6849K1694l8017q6130m0758
6148a91383J69330J39794q7601q7900O3332J10848j54590k3010o4942l4351p294
6137a67767o1270J74532n7515q5630J67077j4057o2728J13429k4269M2753n4825
6126c0270Q485j9364o055J11500m7181r2936j36507J12004J10281q8584M1767
6115c6860J11584j0064n1601K1510P8621j98592j8994o811K8664m8724l155J36182
$$ plain form
6103 1760 41043 -59656 -13704 -118161 -81684 -39730 -48985 8914 -28081 -79332 -94906 -71130
6091 -71130 -9262 -80341 -165473 -59073 -39871 -9887 -109738 -140041 -15138 -28148 -105280
6080 -105280 -101214 -155174 -85996 -70752 -22000 61490 4984 62712 27744 1106 86755 -51919
6068 -51919 -28181 32797 -21803 -62427 80852 -79964 -122129 62620 168779 28483 32645
6057 32645 34905 9218 -20366 -42000 24452 -30020 -39722 41475 17917 -33311 16014 -44817
6045 -44817 -16625 -50005 -8769 -8727 39134 11430 -4233 -4051 47716 -9050 -33606 -42594 43951
6032 43951 -52514 -211527 -50945 45802 19980 65807 -12852 -63802 25159 72910 43556
6021 43556 22080 37270 15805 786 7390 32364 -41572 -85053 3929 -73587 -19347 36162
$$ packed form
6103A760L9283j00699M5952j04457L6477M1954r255N7899l6995n1251j5574K3776
6091g1130O1868p1079q5132J06400J9202K9984r9851l0303J24903j3010p7132
6080a05280M066n3960O9178J5244M8752Q3490n6506N7728l4968k6638Q5649j38674
6068e1919K3738O0978n4600m0624J43279j60816m2165J84749J06159j40296M162
6057C2645K260k5687k9584k1634O6452n4472r702Q1197k3558n1228M9325o0831
6045d4817K8192l3380M1236M2M7861k7704j5663J82N1767n6766k4556q988Q6545
6032D3951r6465j59013J60582R6747k5822M5827p8659n0950Q8961M7751k9354
6021D3556k1476J5190k1465j5019O604K4974p3936m3481Q8982p7516N4240N5509
$$ plain form
6009 36162 -61916 -49781 -17109 -84907 -68430 -13501 -89933 -87941 -10768 -150990 -117220 -63240
5997 -63240 -59307 -74703 -42429 -5760 2121 -8129 22936 -38300 -101426 1417 18521 -24798
5985 -24798 -11901 -7343 -12767 34527 4639 50443 34480 8591 2886 99361 65766 -18383
5973 -18383 -83114 -180332 -211852 -131607 -109696 -27116 75594 -18073 -96785 -69978 -57178 66247
5961 66247 -7104 -22659 -50088 -161601 -60516 -126729 -66796 -2813 -44345 -33806 -116350
5950 -116350 -87961 -41632 -13055 -43351 -46043 -88999 -79226 58230 45758 79573 176194 102966
5938 102966 -2005 -106127 65033 74610 -9691 -47267 30610 71260 46147 143162 31655
5927 31655 89447 91387 40282 -9051 -61290 -52957 -113221 -89843 -75852 50211 88526 -11472
$$ packed form
6009C6162r8078J2135L2672o7798J6477N4929p6432J992P7173j40222L3770N3980
5997f3240L933j5396L2274L6669P881j0250L1065o1236o3126J02843J7104m3319
5985b4798J2897M558n424M7294k9888M5804j5963k5889n705R6475l3595q4149
5973a8383o4731r7218l1520Q0245K1911Q2580J02710r3667p8712K6807J2800J23425
5961F6247p3351j5555k7429j11513J01085o6213N9933O3983m1532J0539q2544
5950a16350K8389M6329K8577l0296k692m2956R773J37456j2472L3815R6621p3228
5938A02966j04971j04122J71160R577q4301l7576P7877M0650k5113R7015j11507
5927C1655N7792J940n1105m9333n2239Q333o0264K3378J3991J26063L8315r9998
$$ plain form
5915 -11472 -37042 -68972 -6621 41796 -73886 -32789 -45129 -6055 61661 115826 -39118
5904 -39118 53048 190636 79077 -14209 -90786 -109487 -156510 -147901 -196696 -44677 49852
5893 49852 3635 -56142 -164547 30836 58759 69319 -90325 -121829 81013 68904 96968
5882 96968 32482 -41987 -57700 48283 63875 -2282 37771 45621 49200 -1636 -93497 45823
5870 45823 -72545 -113218 -31909 83190 87937 -11692 -55180 -104619 -1744 85435 90870 26115
5858 26115 41764 111020 72587 -269 -22500 52998 156776 83930 -47113 46 16684
5847 16684 29070 94542 199400 19727 25475 59914 -9701 48561 1229 9458 11938 -61420
5835 -61420 -44093 45367 76022 -14665 -9648 -30671 11093 -40569 -128180 -172275 -93368 -93827
$$ packed form
5915a1472k5570l1930O2351M8417j15682M1097j2340L9074O7716N4165j54944
5904c9118R2166J37588j11559r3286p6577j8701m7023Q609m8795J52019R4529
5893D9852m6217n9777j08405J95383K7923J0560j59644l1504K02842j2109K8064
5882I6968o4486p4469j5713J05983J5592o6157M0053P850L579n0836r1861J39320
5870D5823j18368m0673Q1309J15099M747r9629m3488m9439J02875Q7179N435o4755
5858B6115J5649O9256l8433p2856k2231P5498J03778p2846j31043M7159J6638
5847A6684J2386O5472J04858j79673N748L4439o9615N8262m7332Q229K480p3358
5835f1420J7327Q9460L0655r0687N017k1023M1764n1662q7611m4095P8907m59
$$ plain form
5823 -93827 -85832 39013 -62488 -77722 -55601 -120193 -93311 -109465 -79577 12888 38121 86769
5811 86769 -10602 -25687 108783 77411 103356 124664 -9138 -53691 -41146 60864 59388
5800 59388 27455 -343 23975 84107 55216 -19597 -43220 115236 200434 109286 31174 -6004
5788 -6004 116396 70522 108322 66957 -136040 -14144 -12446 -2084 -43670 -43932 -89364 -3561
5776 -3561 20354 46078 -52414 -23452 -43067 -54116 -48672 -13522 65893 66150 59025 18905 -23931
5763 -23931 11876 20956 -114867 -102866 9274 54938 -136084 -176888 -135562 13937 30747
5752 30747 -5684 -6545 -109406 -91609 -10415 3633 44203 20220 -34446 -42600 -50872 -23207
5740 -23207 78209 40167 30586 18154 132453 105518 -116274 -31578 -27307 -118719 -32014 -14605
$$ packed form
5823i3827P995J24845j01501j5234K2121o4592K6882j6154K9888R2465K5233M8648
5811H6769r7371j5085J34470l1372K5945K1308j33802m4553J2545J02010j476
5800E9388l1933k7798K4318O0132k8891p4813k3623J58456Q5198r1148p8112l7178
5788f004J22400m5874L7800m1365k02997J21896J698J0362m1586k62m5432Q5803
5776c561K3915K5724r8492K8962j9615j1049N444L5150P9415K57p125m0120m2836
5763b3931L5807R080j35823J2001J12140M5664j91022m0804M1326J49499J6810
5752C0747l6431q61j02861J7797Q1194J4048M0570k3983n4666q154q272K7665
5740b3207J01416l8042r581j2432J14299k6935k21792Q4696M271r1412Q6705J7409
$$ plain form
5728 -14605 20951 -21550 60168 48340 79823 62750 77612 36391 137325 80612 -73757
5717 -73757 -13002 -69691 23036 162429 98414 127495 -9063 -89464 -84881 108341 30426
5706 30426 -19526 -6753 -19271 -65622 -40143 -18157 24639 93908 40067 -7116 -78259 -34399
5694 -34399 -112411 -53208 -64959 -89762 -44776 -43261 -40278 -55758 -83876 -36678 27591 41395
5682 41395 42168 -48757 -152032 -33589 -19826 -4343 5512 80373 142541 120389 -4106 27939
5670 27939 17468 -42960 59516 185748 94696 95624 -48924 -162864 -32403 98623 -2319
5659 -2319 54910 89537 44037 -8615 -14606 37232 -33196 -71761 -96886 -151746 -61495 5394
5647 5394 94144 49535 56835 -65302 -106828 40364 21485 -16424 -20226 -15863 -35489 16732
$$ packed form
5728a4605L5556m2501Q1718j1828L1483j7073J4862m1221J00934n6713j54369
5717g3757O0755n6689R2727J39393o4015K9081j36558q0401M583J93222p7915
5706C0426m9952J2773j2518m6351K5479K1986M2796O9269n3841m7183p1143M3860
5694c4399p8012N9203j1751k4803M4986J515K983j5480k8118M7198O4269J3804
5682D1395P73r0925j03275J18443J3763J5483R855P4861O2168k2152j24495L2045
5670B7939j0471o0428J02476J26232r1052R28j44548j13940J30461J31026j00942
5659b319N7229L4627m5500n2652n991N1838p0428l8565k5125n4860R0251O6889
5647E394Q8750m4609P300j22137m1526J47192j8879l7909l802M363j9626N2221
$$ plain form
5635 16732 12784 35950 62253 187321 70561 -9068 -109643 -40392 -20232 17855 -19711
5624 -19711 -22970 95962 80215 94510 -75354 -100168 48791 -12998 -109961 -45849 -104700
5613 -104700 -189465 -21243 42185 -30262 -18431 -77180 -62299 -72423 -49547 66437 54097
5602 54097 94412 41061 -27391 -105065 -109673 -64852 -131811 -103250 1145 24444 131446 113718
5590 113718 72306 115729 83261 183049 157052 44618 -9249 79690 164714 58217 14989
5579 14989 -20842 -18883 -38596 -112429 -4134 105567 67123 -51312 -44726 -15008 51649 48084
5567 48084 105984 120290 -6487 -61069 -59019 -42922 80049 1468 20272 -106765 -9459
5556 -9459 132838 153068 82488 115263 79401 12406 31731 -2696 16840 85016 117790 123263
$$ packed form
5635A6732l948K3166K6303J25068j16760p9629j00575O9251K0160L8087l7566
5624a9711l259J18932j5747J4295j69864k4814J48959o1789r6963O4112n8851
5613a04700q4765J68222O3428p2447J1831n8749J4881j0124K2876J15984j2340
5602E4097M0315n3351o8452p7674m608M4821o6959K8561J04395K3299J07002j7728
5590A13718m1412M3423l2468R9788k5997j12434n3867Q8939Q5024j06497m3228
5579A4989l5831J959j9713p3833J08295J09701l8444j18435O586K9718O6657l565
5567D8084N7900J4306j26777n4582K050J6097J22971p8581J8804j27037R7306
5556i459J42297K0230p0580L2775l5862o6995J9325l4427J9536O8176L2774N473
$$ plain form
5544 123263 107772 76088 78392 115587 110545 18269 47474 54385 15636 -4695 14585 -1057
5532 -1057 49936 -74977 -16513 18136 -44807 -110704 35621 101057 105056 50677 74336 -11924
5520 -11924 -72264 12643 59334 -34097 -3563 48464 106285 196309 124923 30894 94118 170528
5508 170528 9476 88017 143495 71578 67887 60820 74689 70175 126832 163597 173911 18235
5496 18235 12662 982 -31291 99276 39936 45119 -4043 67457 26008 -63560 -26159 -1870
5484 -1870 56492 125134 158175 55385 156347 171458 47555 90078 2189 11891 37442 -23108
5472 -23108 -12207 -67537 14173 -66354 52144 100579 148529 228970 234410 93688 32164 34254
5460 34254 170527 308849 132327 105113 183810 171836 123603 41833 -3486 -15340 -28282
$$ packed form
5544A23263j5491l1684K304L7195n042r2276K9205O911l8749k0331J9280j5642
5532a057N0993j24913N8464L4649o2943o5897J46325O5436L999n4379K3659q6260
5520a1924o0340Q4907M6691r3431L0534N2027N7821R0024p1386r4029O3224P6410
5508A70528j61052P8541N5478p1917l691p067J3869m514N6657L6765J0314j55676
5496A8235n573j1680l2273J30567n9340N183m9162P1500m1449q9568L7401K4289
5484a870N8362O8642L3041j02790J00962J5111j23903M2523q7889R702K5551o0550
5472b3108J0901n5330Q1710q0527J18498M8435M7950Q0441N440j40722o1524K090
5460C4254J36273J38322j76522k7214P8697j1974m8233q1770m5319j1854j2942
$$ plain form
5449 -28282 14868 32454 11605 116615 19531 32122 24322 64743 174250 136288 250435
5438 250435 130933 47757 62601 88148 163826 133492 124350 109078 141547 125559 160566 156892
5426 156892 -19908 -23625 -43978 16764 46097 46282 60482 155354 179363 201395 81100 9053
5414 9053 -50363 -12661 79649 87069 23 85511 71059 109025 92353 139581 104548 75796
5402 75796 191835 191014 182970 138784 5671 -56863 5685 51769 86915 112752 117073 70486
5390 70486 -37454 -12651 99254 159885 166445 110268 101746 149627 134346 77502 61400 79366
5378 79366 -17994 -48318 27955 109290 36754 55026 138149 106460 184781 202381 163762 118181
5366 118181 120750 79073 59856 -2731 42052 607 -42884 -26998 -39218 -126876 -56167 156349
$$ packed form
5449b8282M3150J7586k0849J05010r7084J2591p800M0421J09507l7962J14147
5438B50435j19502q3176J4844K5547P5678l0334r142j5272L2469j5988L5007l674
5426A56892j76800l717k0353O0742K9333J85J4200R4872K4009K2032j20295p2047
5414I053n9416L7702R2310P420q7046Q5488j4452L7966j6672M7228l5033k8752
5402G5796J16039q21q044m4186j33113o2534O2548M6084L5146K5837M321m6587
5390G0486j07940K4803J11905O0631O560n6177q522M7881j5281n6844j6102J7966
5378G9366r7360l0324P6273Q1335p2536J8272Q3123l1689P8321J7600l8619m5581
5366A18181K569m1677j9217o2587M4783m1445m3491J5886j2220q7658P0709K12516
$$ plain form
5354 156349 218219 227682 233897 201486 45046 -75799 -25439 96315 -25350 -21624 -10012
5343 -10012 132681 122161 44469 48911 100677 129770 83514 103685 154564 143686 67080 12464
5331 12464 14798 18729 19759 67131 -99722 -59679 -56075 13263 149513 59573 28399 23012
5319 23012 159620 152403 55810 122578 160552 120808 -5226 152729 210057 114207 70820
5308 70820 88581 59984 70309 188781 174297 134174 113333 20800 155840 120332 83025
5297 83025 130717 132914 176257 155923 125048 122324 104517 123692 208206 166144 97248 49077
5285 49077 -3590 84368 -8220 -46397 98892 157145 89559 180126 99723 77979 141856 173082
5273 173082 132197 114940 149747 128468 139801 181034 130368 9709 83072 222523 131923
$$ packed form
5354A56349O1870R463O215l2411j56440j20845N0360J21754j21665L726J1612
5343a0012J42693j0520p7692M442N1766K9093m6256K0171N0879j0878p6606n4616
5331A2464K334L931J030M7372j66853M0043L604O9338J36250q9940l1174n387
5319B3012J36608p217r6593O6768L7974l9744j26034J57955N7328r5850m3387
5308G0820J7761k8597J0325J18472j4484m0123k0841r2533J35040l5508l7307
5297H3025M7692K197M3343k0334l0875k724j7807J9175Q4514m2062o8896m8171
5285D9077n2667Q7958r2588l8177J45289N8253o7586R0567q0403k1744O3877L1226
5273A73082m0885j7257L4807k1279J1333M1233n0666j20659P3363J39451r0600
$$ plain form
5262 131923 95427 86160 146741 167587 154747 205880 167115 31078 68195 120443 142133 110000
5250 110000 140778 129403 -35236 76258 132856 103769 160393 208642 129251 18140 42576
5239 42576 16761 15349 70519 131525 109452 116063 136913 145628 196259 216206 209273 208252 211212
5226 211212 181847 139980 225128 275627 146701 160258 170667 278195 286837 261911 191931
5215 191931 214119 190822 288435 231701 176760 154234 254547 121094 165095 299192 131985
5204 131985 150439 79126 124057 165495 129935 80129 180248 289046 149226 228514 148835
5193 148835 218879 217266 226216 146005 185388 164795 137999 175987 275438 229018 155493 172729
5181 172729 320218 389873 180263 221294 235696 169828 193907 166385 241589 306950 278487
$$ packed form
5262A31923l6496r267O0581K0846j2840N1133l8765j36037L7117N2248K1690l2133
5250A10000L0778j1375j64639J11494N6598k9087N6624M8249p9391j11111K4436
5239D2576k5815j412N5170O1006k2073O611K0850Q715N0631J9947o933j021K960
5226B11212k9365m1867Q5148N0499j28926J3557J0409J07528Q642k4926o9980
5215A91931K2188k3297R7613n6734n4941k2526J00313j33453M4001J34097j67207
5204A31985J8454p1313M4931M1438l5560m9806J00119J08798j39820P9288p9679
5193A48835P0044j613Q950q0211L9383k0593k6796L7988R9451m6420p3525J7236
5181A72729J47489O9655k09610M1031J4402o5868K4079k7522P5204O5361k8463
$$ plain form
5170 278487 303367 261167 292723 288595 268425 338884 360621 360440 356802 342724 412209 418382 351967
5157 351967 401910 534108 483615 507721 463575 382327 442504 428092 408845 356005 324601
5146 324601 486156 324640 438128 585759 571191 547172 675483 733136 626474 594703
5136 594703 859522 937804 1005931 1120332 1174168 1314942 1392563 1652883 1750957 1606126 1574121
5125 1574121 1575266 1563641 1575341 1374715 1254106 1181106 1259786 1172841 1061040 990739 858720
5114 858720 740344 658858 766499 840220 869916 1013291 1048689 980487 891683 777945 769991
5103 769991 827000 817184 635995 623890 586269 643440 766693 659242 578506 636983 646264
5092 646264 595474 608025 674185 501465 532156 664667 730588 781285 819987 828035 796314
$$ packed form
5170B78487K4880m2200L1556m128k0170P0459K1737j81l638j4078O9485O173o6415
5157C51967M9943J32198n0493K4106m4146q1248O0177j4412j9247n2840l1404
5146C24601J61555j61516J13488J47631j4568k4019J28311N7653j06662l1771
5136E94703K64819P8282O8127J14401N3836J40774P7621K60320R8074j44831l2005
5125A574121J145j1625J1700k00626j20609p3000P8680q6945j11801p0301j32019
5114H58720j18376q1486J07641P3721K9696J43375L5398o8202q8804j13738p954
5103G69991N7009r816j81189j2105l7621N7171J23253j07451q0736N8477R281
5092F46264n0790J2551O6160j72720L0691J32511O5921N0697L8702Q048l1721
$$ plain form
5081 796314 786952 738410 721097 813049 880418 773903 799931 844453 683976 629455 638093 634841
5069 634841 461800 536211 519430 436767 610032 670805 571160 680701 686421 662708 570160
5058 570160 544804 456255 494898 629638 660898 766367 748051 810568 756775 653568 728793
5047 728793 785590 819094 857126 890529 854389 622888 754466 705513 683404 668875 680063
5036 680063 705717 666173 682782 791419 815269 759401 764648 780379 796623 871140 824508 723201
5024 723201 670233 747852 818290 911839 914880 765100 821808 866212 998367 846039 673689
5013 673689 713952 737445 856467 881977 729292 784435 827834 730231 704089 748359 775420
5002 775420 899005 901961 930638 1064018 982253 1076263 1117112 1057590 1089748 1282024 1263273
$$ packed form
5081G96314r362m8542j7313R1952O7369j06515K6028M4522j60477n4521Q638l252
5069F34841j73041P4411j6781q2663J73265O0773r9645J09541N720k3713r2548
5058E70160k5356q8549L8643J34740L1260J05469j8316O2517n3793j03207P5225
5047G28793N6797L3504L8032L3403l6140k31501J31578m8953k2109j4529J1188
5036F80063K5654l9544J6609J08637K3850n5868N247J5731J6244P4517m6632j01307
5024G23201n2968P7619P0438R3549L041j49780N6708M4404J32155j52328j72350
5013F73689M0263K3493J19022K5510j52685N5143M3399r7603k6142M4270K7061
5002G75420J23585K956K8677J33380q1765R4010M0849n9522L2158J92276j8751
$$ plain form
4991 1263273 1316421 1226713 1198472 1207333 1312975 1421534 1386011 1316936 1393818 1475229 1540316
4980 1540316 1475245 1474124 1502427 1634014 1571671 1539096 1665221 1703483 1825251 1844443 1755088
4969 1755088 1752613 1828296 1843038 1956654 1839619 1782516 1905318 1929089 2028525 2035474 2255689
4958 2255689 2263717 2163333 2244741 2349094 2345636 2350073 2446533 2462323 2496724 2470824 2553139 2400379
4946 2400379 2538257 2555970 2606222 2677300 2622413 2667183 2801700 2831861 2931207 2962841 2957391
4935 2957391 3095883 3352371 3446107 3395321 3481430 3693310 3765196 3810457 3918609 4110571
4925 4110571 4284034 4425220 4560849 4702320 4782744 5030432 5194415 5485015 5643106 5783540
4915 5783540 6052697 6137159 6433658 6589217 6713048 6923921 7151941 7414935 7694096 8065256
$$ packed form
4991A263273N3148q9708k8241Q861J05642J08559l5523o9075P6882Q1411O5087
4980A540316o5071j121K8303J31587o2343l2575J26125L8262J21768J9192q9355
4969A755088k475P5683J4742J13616j17035n7103J22802K3771R9436O949K20215
4958B255689Q028j00384Q1408J04353l458M437R6460J5790L4401k5900Q2315j52760
4946B400379J37878J7713N0252P1078n4887M4770J34517L0161R9346L1634n450
4935B957391J38492K56488R3736n0786Q6109K11880P1886M5261J08152J91962
4925D110571J73463J41186J35629J41471Q0424K47688J63983K90600J58091J40434
4915E783540K69157Q4462K96499J55559J23831K10873K28020K62994K79161L71160
$$ plain form
4905 8065256 8219377 8386921 8753414 9213463 9683256 10011889 10470097 10862316 11240347 11643120
4895 11643120 12121064 12403454 12789576 13228668 13743092 14314170 14848680 15445298 16064814
4886 16064814 16664089 17368882 18224103 19199535 20314090 21519635 22726572 24009951 25675714
4877 25675714 27599021 29560436 31944132 34792111 38008450 41817516 46209220 51314303
4869 51314303 57236009 64091696 71878554 81009732 91409216 103537758 117662510 134352476
4861 134352476 153504620 173519417 194436226 215768227 232478622 242456356 248736596
4854 248736596 247437140 235847943 220049403 201691088 179723723 157766732 138421984
4847 138421984 121215700 106384724 94385712 84676519 76448738 69378424 63681460 58720592
$$ packed form
4905H065256J54121J67544L66493M60049M69793L28633M58208L92219L78031M02773
4895A1643120M77944K82390L86122M39092N14424N71078N34510N96618O19516
4886A6064814N99275P04793Q55221R75432J114555J205545J206937J283379J665763
4877B5675714J923307J961415K383696K847979L216339L809066M391704N105083
4869E1314303N921706O855687P786858R131178J0399484J2128542J4124752J6689966
4861A34352476J9152144K0014797K0916809K1332001J6710395R977734O280240
4854B48736596j299456j1589197j5798540j8358315k1967365k1956991j9344748
4847A38421984j7206284j4830976j1999012r709193q227781p070314n696964m960868
$$ plain form
4839 58720592 54084064 49978319 46363911 43276581 40596402 38130774 35784480 33897301
4831 33897301 32123262 30474802 29005803 27642134 26564057 25383323 24410368 23555581
4823 23555581 22806111 22065882 21279767 20543700 19862952 19084340 18391696 17812508 17075893
4814 17075893 16619086 16095367 15527659 15235629 14749543 14227321 13660572 13289542 12956326
4805 12956326 12483517 12062616 11650422 11345429 10933794 10615913 10382539 10074987 9694828
4796 9694828 9374390 9067520 8800378 8554965 8315027 8099931 8015486 7893542 7658397 7471116
4786 7471116 7390865 7255691 7037266 6961021 6693585 6602277 6510983 6610441 6455181 6266604
4776 6266604 6246467 6085345 5915482 5798813 5827607 5620766 5535422 5381147 5262769 5242108
$$ packed form
4839E8720592m636528m105745l614408l087330k680179k465628k346294j887179
4831C3897301j774039j648460j468999j363669j078077j180734r72955q54787
4823B3555581p49470p40229p86115p36067o80748p78612o92644n79188p36615
4814A7075893m56807n23719n67708k92030m86086n22222n66749l71030l33216
4805A2956326m72809m20901m12194l04993m11635l17881k33374l07552l80159
4796I694828l20438l06870k67142k45413k39938k15096q4445j21944k35145j87281
4786G471116q0251j35174k18425p6245k67436r1308r1294R9458j55260j88577
4776F266604k0137j61122j69863j16669K8794k06841q5344j54275j18378k0661
$$ plain form
4766 5242108 5061412 4964409 4848001 4612435 4543611 4435939 4347903 4193833 4028513 3922995
4756 3922995 3776415 3765229 3662435 3573053 3543287 3485478 3455194 3426442 3292153 3191976 2988361
4745 2988361 2957620 2957641 2969419 2912560 2740852 2686376 2786505 2772429 2652821 2653871 2648464 2647222
4733 2647222 2583338 2517668 2509206 2616294 2581086 2536635 2587441 2564524 2573654 2451273 2527160
4722 2527160 2446715 2355800 2283765 2290716 2312049 2306215 2281932 2239191 2237132 2049267 2095181 2160025
4710 2160025 2185550 2296545 2357596 2294775 2208903 2199406 2252840 2223661 2193386 2133226 2106127
4699 2106127 2018337 2017371 1917388 1948664 1912456 1873222 1878750 1910405 1809737 1861286 1804347 1805985
4687 1805985 1889808 1875354 1891311 1809611 1762810 1788260 1652537 1693333 1758531 1769809 1771769
$$ packed form
4766E242108j80696r7003j16408k35566o8824j07672q8036j54070j65320j05518
4756C922995j46580j1186j02794q9382k9766n7809l0284k8752j34289j00177k03615
4745B988361l0741K1J1778n6859j71708n4476J00129j4076j19608J050n407j242
4733B647222o3884o5670q462J07088l5208m4451N0806k2917R130j22381P5887
4722B527160q0445r0915p2035O951K1333n834k4283m2741k059j87865M5914O4844
4710B160025K5525J10995O1051o2821q5872r497N3434k9179l0275o0160k7099
4699B106127q7790r66r9983L1276l6208l9234N528L1655j00668N1549n6939J638
4687A805985Q3823j4454J5957q1700m6801K5450j35723M0796O5198J1278J960
$$ plain form
4676 1771769 1691277 1665692 1612295 1645582 1721763 1749135 1724306 1607849 1595393 1683413 1721501
4665 1721501 1725016 1602845 1593276 1564069 1646830 1670591 1669870 1696303 1710185 1736750 1730508 1732984
4653 1732984 1676355 1614644 1748048 1612593 1541875 1706781 1774186 1726125 1758549 1711338 1678938
4642 1678938 1688611 1750587 1687218 1588618 1617212 1638300 1644205 1684721 1694682 1620983 1691805 1640412
4630 1640412 1685974 1595113 1667379 1771883 1594863 1634043 1595240 1588300 1617145 1576580 1579460
4619 1579460 1644825 1628826 1721910 1826117 1744953 1687464 1605701 1652615 1754895 1776549 1634792
4608 1634792 1560579 1676138 1756445 1781791 1794736 1848364 1837225 1907379 1938994 2044082 1966097
4597 1966097 1845928 1984304 1923037 1953172 1957476 2164874 2246559 2057493 2126093 2349323 2616377
$$ packed form
4676A771769q0492k5585n3397L3287P6181K7372k4829j16457j2456Q8020L8088
4665A721501L515j22171r569k9207Q2761K3761p21K6433J3882K6565o242K476
4653A732984n6629o1711J33404j35455p0718J64906O7405m8061L2424m7211l2400
4642A678938R673O1976o3369r8600K8594K1088N905M0516R961p3699P0822n1393
4630A640412M5562r0861P2266J04504j77020L9180l8803o940K8845m0565K880
4619A579460O5365j5999R3084J04207q1164n7489q1763M6914J02280K1654j41757
4608A634792p4213J15559Q0307K5346J2945N3628j1139P0154L1615J05088p7985
4597A966097j20169J38376o1267L0135M304K07398Q1685j89066O8600K23230K67054
$$ plain form
4586 2616377 2669233 2721138 2911006 2903641 2988235 3128612 3042967 2946517 2852982 2649252 2542252
4575 2542252 2388820 2277090 2260084 2203316 2121711 2080617 1997189 1960316 1965130 1918028 1867345
4564 1867345 1767221 1876488 1750736 1741593 1817121 1685408 1715269 1773023 1707767 1757029 1671574
4553 1671574 1629858 1679980 1665496 1657945 1574006 1669219 1728455 1647047 1708289 1749274 1762987 1644217
4541 1644217 1643066 1678362 1657534 1647505 1704029 1678807 1490659 1459282 1420811 1504700 1626028
4530 1626028 1608202 1616274 1533689 1444090 1509229 1464116 1505999 1510427 1497582 1444001 1448995 1398799
4518 1398799 1530249 1516751 1482911 1472904 1392697 1440249 1398337 1435740 1402527 1280512 1239807
4507 1239807 1363189 1380366 1358863 1351438 1470750 1347039 1427680 1397012 1435232 1252902 1156557
$$ packed form
4586B616377N2856N1905J89868p365Q4594J40377q5645r6450r3535k03730j07000
4575B542252j53432j11730j7006n6768q1605m1094q3428l6873M814m7102n0683
4564A867345j00124J09267j25752r143P5528j31713K9861N7754o5256M9262q5455
4553A671574m1716N0122j4484p551q3939R5213N9236q1408O1242M0985J3713j18770
4541A644217j151L5296k0828j0029N6524k5222j88148l1377l8471Q3889J21328
4530A626028j7826Q072q2585q9599O5139m5113M1883M428j2845n3581M994n0196
4518A398799J31450j3498l3840j0007q0207M7552m1912L7403l3213j22015m0705
4507A239807J23382J7177k1503p425J19312j23711Q0641l0668L8220j82330r6345
$$ plain form
4496 1156557 1236327 1249800 1148884 1141635 1276584 1236266 1233562 1170311 1300461 1311196 1330354
4485 1330354 1322047 1233064 1276697 1215005 1119700 1115981 1062566 1145622 1187926 1179020 1158036 1105554
4473 1105554 1152139 1229942 1161418 1267790 1239581 1206941 1094126 1121969 1100635 1130025 1164544
4462 1164544 1163053 1016485 1062796 1066265 947681 1127388 1074499 1043997 1052597 1167250 1174935
4451 1174935 1119907 1087245 864561 932248 932943 985105 1016237 953731 981790 1063453 1159057 1083012
4439 1083012 981690 1031585 985235 964205 941336 902748 960550 947800 856598 977944 973533
4428 973533 881455 839602 803651 763550 726537 733253 787940 885741 839635 843349 817502 808709
4416 808709 759579 792303 861900 921530 839599 829143 739769 772110 840348 803453 780356 756480
$$ packed form
4496A156557P9770J3473j00916p249J34949m0318k704o3251J30150J0735J9158
4485A330354q307q8983M3633o1692r5305l719n3415Q3056M2304q906k0984n2482
4473A105554M6585P7803o8524J06372k8209l2640j12815K7843k1334K9390L4519
4462A164544j491j46568M6311L469j18584J79707n2889l0502Q600J14653P685
4451A174935n5028l2662k22684O7687O95N2162L1132o2506K8059Q1663R5604p6045
4439A083012j01322M9895m6350k1030k2869l8588N7802j2750r1202J21346m411
4428I73533r2078m1853l5951m0101l7013O716N4687R7801m6106L714k5847q793
4416H08709m9130L2724O9597N9630q1931j0456q9374L2341O8238l6895k3097k3876
$$ plain form
4404 756480 770098 641988 632793 720461 548419 483657 526727 453068 485294 615041 582535
4393 582535 571808 581347 610115 594205 652220 712045 762350 704546 740745 609452 606467 732334
4381 732334 613739 493290 508372 501879 539386 607648 520014 515723 596287 464888 509040
4370 509040 599843 579287 574186 515563 465146 485418 513552 584657 707537 650324 564742 605283
4358 605283 588541 589190 511231 610477 700579 617676 597748 473330 451222 437495 494616 508560
4346 508560 527599 566609 621165 558557 539716 487275 450604 485834 497536 540493 504845 485467
4334 485467 442578 366395 483380 541557 487978 310069 279002 447476 465217 526911 481291
4323 481291 430253 391874 371179 266056 328440 348475 285782 355128 315088 371378 433289
$$ packed form
4404G56480J3618j28110r195Q7668j72042o4762M3070p3659L2226J29747l2506
4393E82535j0727R539K8768j5910N8015N9825N0305n7804L6199j31293k985J25867
4381G32334j18595j20449J5082o493L7507O8262q7634m291Q0564j31399M4152
4370E09040R0803k0556n101n8623n0417K0272K8134P1105J22880n7213q5582M0541
4358F05283j6742O49p7959R9246R0102q2903j9928j24418k2108j3727N7121J3944
4346E08560J9039L9010N4556o2608j8841n2441l6671L5230J1702M2957l5648j9378
4334D85467m2889p6183J16985N8177n3579j77909l1067J68474J7741O1694m5620
4323D81291n1038l8379k0695j05123O2384K0035o2693O9346m0040N6290O1911
$$ plain form
4312 433289 495105 470479 451430 409187 269187 159939 296654 271836 196589 260896 309355
4301 309355 332028 362957 347279 200902 222061 346328 305528 387243 295551 350809 333837
4290 333837 400036 311456 388448 342013 302609 143994 132672 113701 101752 277793 146448
4279 146448 226919 267616 199542 165044 249945 313705 271076 207617 276066 311433 262316 244765
4267 244765 293994 168139 132404 193642 333115 248774 294819 247841 386100 343513 296006
4256 296006 153028 165840 308618 279550 451922 318057 310788 141855 97053 164969 172329
4245 172329 178205 82905 210218 258916 249043 278315 259783 289106 365605 288168 305818 402255
4233 402255 529856 411152 382652 288215 276405 291288 229517 417591 397972 279405 183706
$$ packed form
4312D33289O1816k4626j9049m2243j40000j09248J36715k4818p5247O4307M8459
4301C09355K2673L0929j5678j46377K1159J24267m0800Q1715r1692N5258j6972
4290C33837O6199q8580P6992m6435l9404j58615j1322j8971j1949J76041j31345
4279A46448Q0471M0697o8074l4498Q4901O3760m2629o3459O8449L5367m9117j7551
4267B44765M9229j25855l5735O1238J39473q4341M6045m6978J38259m2587m7507
4256B96006j42978J2812J42778k9068J72372j33865p269j68933m4802O7916P360
4245A72329N876r5300J27313M8698r873K9272j8532K9323P6499p7437J7650R6437
4233D02255J27601j18704k8500r4437j1810J4883o1771J88074j9619j18567r5699
$$ plain form
4222 183706 258996 251565 219807 347089 259617 219030 230512 382698 364784 174232 195501
4211 195501 188383 369620 426698 305137 297320 409712 401583 310862 365349 347788 276854 270373
4199 270373 341285 337901 208102 159367 153041 120895 151204 123728 243281 197028 76891
4188 76891 174259 193737 144860 262385 302935 275190 297311 158489 165795 275404 260794
4177 260794 196556 242966 285804 270194 234920 272194 263130 407557 432455 455558 394743 345368
4165 345368 308752 225197 300885 335133 415319 403370 450553 388480 274272 294656 298345 361334
4153 361334 371034 337119 284880 309632 394672 458209 412660 326060 341937 427013 389338 472874
4141 472874 463084 474265 540968 504729 422646 507748 468917 530705 610700 559267 523017 487652
$$ packed form
4222A83706P5290p431l1758J27282q7472m0587J1482J52186j7914j90552K1269
4211A95501p118J81237N7078j21561p817J12392q129r0721N4487j7561p0934o481
4199B70373P0912l384j29799m8735o326l2146L0309k7476J19553m6253j20137
4188G6891R7368J9478m8877J17525M0550k7745K2121j38822P306J09609j4610
4177B60794o4238M6410M2838j5610l5274L7274r064J44427K4898K3103o0815m9375
4165C45368l6616q3555P5688L4248Q0186j1949M7183o2073j14208K0384L689O2989
4153C61334R700l3915n2239K4752Q5040O3537m5549q6600J5877Q5076l7675Q3536
4141D72874r790J1181O6703l6239q2083Q5102l8831O1788P9995n1433l6250l5365
$$ plain form
4129 487652 584318 643480 674323 574710 637265 627682 689904 618831 713852 769620 788219 881415
4117 881415 949264 1088010 1225314 1324690 1512998 1706066 1862920 2099600 2140649 2286524
4107 2286524 2282423 2138283 2021999 1929889 1774337 1569321 1442840 1305030 1168742 1114378
4097 1114378 882902 861093 755999 722200 776341 693981 725240 758261 720161 661311 722647
4086 722647 785766 696049 681070 698953 641440 630367 630680 654212 744621 736821 585660 556559
4074 556559 468766 523668 484994 530117 542356 482062 443340 411153 373857 454923 574923
4063 574923 547617 552270 516848 396233 353498 415453 500273 495498 565749 540196 538042 523963
4051 523963 543073 574436 592556 575511 492003 463875 537131 516683 542931 649854 625794
$$ packed form
4129D87652R6666N9162L0843r9613O2555r583O2222p1073R5021N5768J8599R3196
4117H81415O7849J38746J37304R9376J88308J93068J56854K36680M1049J45875
4107B286524m101j44140j16284r2110j55552k05016j26481j37810j36288n4364
4097A114378k31476k1809j05094l3799N4141q2360L1259L3021l8100n8850O1336
4086G22647O3119q9717j4979J7883n7513j1073L13K3532R0409p800j51161k9101
4074E56559q7793N4902l8674M5123J2239o0294l8722l2187l7296Q1066J20000
4063E74923k7306M653l5422j20615m2735O1955Q4820m775P0251k5553k154j4079
4051E23963J9110L1363J8120j7045q3508k8128P3256k0448K6248J06923k4060
$$ plain form
4040 625794 674834 632017 649730 773310 750576 699896 635246 648323 655153 621795 638561 769013
4028 769013 674175 675654 820760 731227 691467 698705 752820 817389 837711 799334 834295 843387
4016 843387 886590 909931 1040726 914280 926029 962106 986472 1035550 993223 975268 971166
4005 971166 902443 932166 1022118 1053919 1105469 1111826 1022996 1139132 1147589 1119268 1168990 1101352
3993 1101352 1085868 1114455 1200638 1160511 1312134 1305953 1234629 1275626 1351567 1441155 1384760
3982 1384760 1387300 1443454 1547418 1688453 1727501 1682582 1676740 1778930 1915186 2018317 2165517
3971 2165517 2326076 2425959 2586661 2846999 2992344 3150888 3385899 3494417 3729565 3900528
3961 3900528 4064848 4141985 4165390 4241591 4123786 4078079 3863560 3644169 3664282 3632363 3608167
$$ packed form
4040F25794M9040m2817J7713J23580k2734n0680o4650J3077O830l3358J6766J30452
4028G69013r4838J479J45106q9533l9760P238N4115O4569K0322l8377L4961R092
4016H43387M3203K3341J30795j26446J1749L6077K4366M9078m2327j7955m102
4005I71166o8723K9723Q9952L1801N1550O357q8830J16136Q457k8321M9722o7638
3993A101352j5484K8587Q6183m0127J51623o181p1324M0997P5941Q9588n6395
3982A384760K540N6154J03964J41035L9048m4919n842J02190J36256J03131J47200
3971B165517J60559R9883J60702K60338J45345J58544K35011J08518K35148J70963
3961C900528J64320P7137K3405P6201j17805m5707k14519k19391K0113l1919k4196
$$ plain form
3950 3608167 3554829 3540134 3467630 3454864 3566736 3474414 3529648 3535855 3561496 3643409 3617330
3939 3617330 3640240 3747894 3786648 3634701 3834383 3935613 3984139 4012406 4058607 4138931 3974327
3928 3974327 3982749 4168657 4392080 4533812 4587265 4715617 4862994 5089504 5168907 5354096
3918 5354096 5530611 5755021 5972636 6166455 6423440 6550107 6925826 7215631 7413217 7761982
3908 7761982 8107702 8344297 8705198 9103152 9411201 9748443 10083546 10385581 10685257 10993609
3898 10993609 11460251 11881696 12344583 12821123 13423676 14100541 14729507 15419020 16142291
3889 16142291 16942874 17848745 18719659 19585007 20644464 21671257 22597805 23547374 24296310
3880 24296310 25100454 26015190 26949848 27659857 28490389 29532085 30441730 31528208 32820010
$$ packed form
3950C608167n3338j4695p2504j2766J11872r2322N5234O207K5641Q1913k6079
3939C617330K2910J07654L8754j51947J99682J01230M8526K8267M6201Q0324j64604
3928C974327Q422J85908K23423J41732N3453J28352J47377K26510P9403J85189
3918E354096J76515K24410K17615J93819K56985J26667L75719K89805J97586L48765
3908G761982L45720K36595L60901L97954L08049L37242L35103L02035K99676L08352
3898A0993609M66642M21445M62887M76540O02553O76865O28966O89513P23271
3889A6142291Q00583R05871Q70914Q65348J059457J026793R26548R49569P48936
3880B4296310Q04144R14736R34658P10009Q30532J041696R09645J086478J291802
$$ plain form
3871 32820010 34283532 36010939 37817119 39835948 42235456 45120045 48284939 52009374
3863 52009374 56494721 61638314 67627356 74475989 82480978 91759371 102648577 115017414
3855 115017414 129281667 146177501 166186963 189760866 217298932 250079159 285787551
3848 285787551 318749390 349780563 376744492 387362557 381811972 369086197 344653335
3841 344653335 308573268 271942495 238106703 206233911 178621373 156646784 139181663
3834 139181663 124705906 112747393 102956190 94628940 87346943 80898326 75198056 70155419
3826 70155419 65486677 61259194 57454103 53998355 50935866 48120154 45610393 43555663
3818 43555663 41505454 39667140 38014924 36587222 35232076 34055243 32889289 31677138
$$ packed form
3871C2820010J463522J727407J806180K018829K399508K884589L164894L724435
3863E2009374M485347N143593N989042O848633Q004989R278393J0889206J2368837
3855A15017414J4264253J6895834K0009462K3573903K7538066L2780227L5708392
3848B85787551L2961839L1031173K6963929J0618065n550585j2725775k4432862
3841C44653335l6080067l6630773l3835792l1872792k7612538k1974589j7465121
3834A39181663j4475757j1958513r791203q327250p281997o448617n700270n042637
3826G0155419m668742m227483l805091l455748l062489k815712k509761k054730
3818D3555663k050209j838314j652216j427702j355146j176833j165954j212151
$$ plain form
3810 31677138 30537190 29469199 28403412 27438023 26457647 25581048 24756088 23863784 23075946
3801 23075946 22362228 21749622 21032699 20329877 19700465 19200194 18606531 18121405 17494724
3792 17494724 16844175 16380325 15867887 15380967 14862932 14358412 13962938 13464815 13089555
3783 13089555 12599187 12327995 11901353 11566776 11379663 11092270 10910994 10786853 10485557
3774 10485557 10215138 10104687 9852780 9635218 9551178 9287806 9116695 9069673 8766910 8561635
3764 8561635 8419054 8422682 8236784 8058728 7912170 7679667 7417943 7256551 7221710 6949093
3754 6949093 6671128 6422655 6227418 6064630 5883680 5623083 5511919 5382788 5223931 5149120
3744 5149120 5044591 4945345 4849966 4726854 4579826 4476053 4296848 4193849 4145852 3989792
$$ packed form
3810C1677138j139948j067991j065787r65389r80376q76599q24960q92304p87838
3801B3075946p13718o12606p16923p02822o29412n00271n93663m85126o26681
3792A7494724o50549m63850n12438m86920n18035n04520l95474m98123l75260
3783A3089555m90368k71192m26642l34577j87113k87393j81276j24141l01296
3774A0485557k70419j10451k51907k17562q4040k63372j71111m7022l02763k05275
3764H561635j42581L628j85898j78056j46558k32503k61724j61392l4841k72617
3754F949093k77965k48473j95237j62788j80950k60597j11164j29131j58857p4811
3744E149120j04529r9246r5379j23112j47028j03773j79205j02999m7997j56060
$$ plain form
3734 3989792 3916653 3817570 3689717 3718741 3763811 3590393 3481588 3404884 3304967 3193750 3080193
3723 3080193 3212719 3173177 3146490 3115946 3073541 2978297 2994653 2957568 2975423 2953756 2818342
3712 2818342 2850937 2812682 2791631 2777742 2713845 2727238 2617505 2412299 2522856 2440364 2295352
3701 2295352 2388487 2446864 2484626 2448128 2402527 2382941 2428114 2277513 2144432 2125845 2133995
3690 2133995 2142193 2068066 2072656 2062911 1932245 1804801 1938308 1816942 1806142 1795402 1745160
3679 1745160 1661995 1698320 1625399 1688617 1687144 1555975 1568354 1559255 1556380 1531314 1493530 1457215
3667 1457215 1524777 1366873 1333619 1407197 1348964 1328204 1240435 1235042 1275119 1228844 1183226
3656 1183226 1220410 1291064 1305961 1294012 1177912 1179991 1183465 1127748 1020252 1047934 1066720
$$ packed form
3734C989792p3139r9083j27853K9024M5070j73418j08805p6704r9917j11217j13557
3723C080193J32526l9542k6687l0544m2405r5244J6356l7085J7855k1667j35414
3712B818342L2595l8255k1051j3889o3897J3393j09733k05206J10557q2492j45012
3701B295352R3135N8377L7762l6498m5601j9586M5173j50601j33081j8587Q150
3690B133995Q198p4127M590r745j30666j27444J33507j21366j0800j0740n0242
3679A745160q3165L6325p2921O3218j473j31169J2379r099k875k5066l7784l6315
3667A457215O7562j57904l3254P3578n8233k0760q7769n393M0077m6275m5618
3656A183226L7184P0654J4897j1949j16100K079L474n5717j07496K7682J8786
$$ plain form
3645 1066720 1073904 980944 1030262 1081730 1071158 1138556 1303103 1124417 1172266 1188355 1199479
3634 1199479 1168977 1149146 1125098 1192363 1138632 1007122 1082998 1084909 1046436 945104 1093567
3623 1093567 972776 859422 880084 936672 984729 964786 832048 750549 865810 914272 781328
3612 781328 864084 949970 834407 874815 861711 741260 782284 800096 875209 901117 815545
3601 815545 797318 789894 778593 866147 959226 1008047 997169 975688 993287 1157695 1328145
3590 1328145 1295983 1374470 1491181 1567838 1727952 2013019 2138859 2316543 2451993 2596302
3580 2596302 2596936 2566391 2558722 2410806 2238360 2013921 1799736 1614003 1525796 1319076 1187128
3569 1187128 1282046 1219182 1113425 970137 828752 793854 836378 870212 705234 554605
$$ packed form
3645A066720P184r2960M9318N1468j0572O7398J64547j78686M7849J6089J1124
3634A199479l0502j9831k4048O7265n3731j31510P5876J911l8473j01332J48463
3623A093567j20791j13354K0662N6588M8057j9943j32738q1499J15261M8462j32944
3612G81328Q2756Q5886j15563M0408j3104j20451M1024J7812P5113K5908q5572
3601H15545j8227p424j1301Q7554R3079M8821j0878k1481J7599J64408J70450
3590A328145l2162P8487J16711P6657J60114K85067J25840J77684J35450J44309
3580B596302O34l0545p669j47916j72446k24439k14185j85733q8207k06720j31948
3569A187128R4918o2864j05757j43288j41385l4898M2524L3834j64978j50629
$$ plain form
3559 554605 524772 658859 642812 557744 574745 500063 533883 659343 522671 554527 541381
3548 541381 502616 482939 454933 392296 414359 476276 350846 295111 398465 328937 407502
3537 407502 349895 348732 379153 369821 385199 448087 510512 516687 353698 394788 425440 375416
3525 375416 223477 270848 398265 348316 448456 424125 319920 287842 301093 324565 300762
3514 300762 250924 249313 204443 248330 362589 407849 351714 316394 207924 273513 304619
3503 304619 339301 338539 247182 196830 269755 262906 281471 328502 273414 287414 158503 156137
3491 156137 274135 206297 137223 142833 263396 282467 187601 75188 158419 188614 197812
3480 197812 133907 50643 -5207 33914 54128 178716 251976 257130 181280 211696 201686 227059
$$ packed form
3559E54605k9833J34087j6047q5068J7001p4682L3820J25460j36672L1856j3146
3548E41381l8765j9677k8006o2637K2063O1917j25430n5735J03354o9528P8565
3537D07502n7607j163L0421r332J5378O2888O2425O175j62989M1090L0652n0024
3525C75416j51939M7371J27417m9949J00140k4331j04205l2078J3251K3472k3803
3514C00762m9838j611m4870M3887J14259M5260n6135l5320j08470O5589L1106
3503C04619L4682p62r1357n0352P2925o849J8565M7031n5088J4000j28911k366
3491A56137J17998o7838o9074N610J20563J9071r4866j12413Q3231L0195R198
3480A97812o3905q3264n5850L9121K0214J24588P3260N154p5850L0416j0010K5373
$$ plain form
3468 227059 163746 208337 87558 57786 81560 85821 261638 318185 242094 123283 235923
3457 235923 182665 253017 176036 176511 195823 139765 242291 246168 165892 216540 277022 263170
3445 263170 142024 209995 215141 96719 120184 138750 131051 284474 301358 166539 162088
3434 162088 197820 321215 277427 302849 194374 193687 204977 148167 50726 30233 88945 144991
3422 144991 175932 112045 110988 58766 111576 96469 165477 205133 162702 135064 220327 182416
3410 182416 164023 107403 164882 134390 160573 181127 107352 96350 21290 88423 117869 292065
3398 292065 194166 110974 125012 128084 55919 63263 133298 161815 170541 215705 120659 -20686
3386 -20686 46127 115158 149464 157832 192107 175441 116110 124984 222726 200543 193659 77007
$$ packed form
3468B27059o3313M4591j20779k9772K3774M261J75817N6547p6091j18811J12640
3457B35923n3258P0352p6981M75J9312n6058J02526L877q0276N0648O0482j3852
3445B63170j21146O7971N146j18422K3465J8566p699J53423J6884j34819m451
3434A62088L5732J23395m3788K5422j08475o87J1290n6810r7441k0493N8712N6046
3422A44991L0941o3887j057n2222N2810j5107O9008L9656m2431k7638Q5263l7911
3410A82416j8393n6620N7479l0492K6183K0554p3775j1002p5060O7133K9446J74196
3398B92065r7899q3192J4038L072p2165P344P0035K8517Q726M5164r5046j41345
3386b0686O6813O9031L4306Q368L4275j6666n9331Q874R7742k2183o884j16652
$$ plain form
3374 77007 16031 49164 187898 168595 139332 54708 27597 -36742 160052 64861 6452
3363 6452 123969 125777 65920 83379 188725 100954 76964 23024 97 6213 85034 2853
3351 2853 31173 32772 109976 123113 139958 209716 202529 178693 1277 88014 116640 114896
3339 114896 30036 -52569 118358 148041 58560 59068 124598 146546 134361 58419 165158 74555
3327 74555 127184 105685 -85485 -36828 139230 64134 85677 159931 141248 77154 91169
3316 91169 145493 30138 -95742 -43061 138766 158173 58347 -57127 -37349 120712 69804
3305 69804 52935 75497 62538 144948 173930 104189 -60059 39426 87496 166535 95336 58831
3293 58831 144390 63710 47034 68690 75379 64145 184908 138548 37362 24494 53147 18612
$$ packed form
3374G7007o0976L3133J38734j9303k9263q4624k7111o4339J96794r5191n8409
3363F452J17517J808n9857J7459J05346q7771k3990n3940k2927O116P8821q2181
3351B853K8320J599P7204J3137J6845O9758p187k3836j77416Q6737K8626j744
3339A14896q4860q2605J70927K9683q9481N08O5530K1948j2185p5942J06739r0603
3327G4555N2629k1499j91170M8657J76058p5096K1543P4254j8683o4094J4015
3316I1169N4324j15355j25880N2681J81827J9407r9826j15474J9778J58061n0908
3305F9804j6869K2562j2959Q2410K8982o9741j64248R9485M8070P9039p1199l6505
3293E8831Q5559q0680j6676K1656O689j1234J20763m6360j01186j2868K8653l4535
$$ plain form
3281 18612 -43813 56763 -85715 -19033 27952 -25262 77850 166209 97262 59806 62597
3270 62597 122796 197304 109738 74712 119341 13885 84676 136161 108993 -108016 -41632
3259 -41632 101465 83667 105306 52179 99545 -40811 -5590 -67184 72361 87711 80909
3248 80909 28818 28200 56727 6810 64526 89878 22907 96023 146690 168793 248078 167380
3236 167380 101026 54456 -64571 -70091 -35668 12912 -3681 54427 89309 -50213 -27897
3225 -27897 -10685 -17560 -17723 -53120 3276 62148 43354 49688 84452 -17173 -72614 55158
3213 55158 140387 132763 87099 45941 33180 12423 -10097 24085 6547 89164 73650 -47234
3201 -47234 -61691 112879 40533 1011 11624 82100 116410 159860 140788 7912 38642
$$ packed form
3281A8612o2425J00576j42478O6682M6985n3214J03112Q8359o8947l7456K791
3270F2597O0199P4508q7566l5026M4629j05456P0791N1485k7168k17009O6384
3259d1632J43097j7798K1639n3127M7366j40356L5221o1594J39545J5350o802
3248H0909n2091o18K8527m9917N7716K5352o6971P3116N0667K2103P9285q0698
3236A67380o6354m6570j19027n520L4423M8580j6593N8108L4882j39522K2316
3225b7897J7212o875j63l5397N6396N8872j8794O334L4764j01625n5441J27772
3213E5158Q5229p624m5664m1158j2761k0757k2520L4182j7538Q2617j5514j20884
3201d7234j4457J74570p2346l9522J0613P0476L4310M3450j9072j32876L0730
$$ plain form
3190 38642 30027 901 -18299 70031 70515 151017 99186 62484 124203 50344 12933 121544
3178 121544 61002 -46541 37790 120715 162322 78392 73634 46914 94010 102294 25763 77284
3166 77284 214942 205354 181080 79843 68358 79011 200187 102901 -53345 44421 101038
3155 101038 73576 88402 170302 170129 189311 187108 229438 175160 136924 242648 323698 274165
3143 274165 189508 103220 121315 215758 122338 117822 186797 263114 212721 100017 63458 125184
3131 125184 166396 134608 135779 234409 231548 167396 270603 259400 178824 105527 266465 354450
3119 354450 397368 386500 300988 332052 275866 84495 354073 383329 361049 399697 454206
3108 454206 382462 505030 466482 393721 482044 631369 757334 866570 1015151 1075713 1187181
$$ packed form
3190C8642q615k9126j9200Q8330M84Q0502n1831l6702O1719p3859l7411J08611
3178A21544o0542j07543Q4331Q2925M1607q3930m758k6720M7096Q284p6531N1521
3166G7284J37658r588k4274j01237j1485J0653J21176r7286j56246R7766N6617
3155A01038k7462J4826Q1900j73J9182k203M2330n4278l8236J05724Q1050m9533
3143B74165q4657q6288J8095R4443r3420m516O8975P6317n0393j12704l6559O1726
3131A25184M1212l1788J171R8630k861o4152J03207j1203q0576p3297J60938Q7985
3119C54450M2918j0868q5512L1064n6186j91371K69578K9256k2280L8648N4509
3108D54206p1744J22568l8548p2761Q8323J49325J25965J09236J48581O0562J11468
$$ plain form
3097 1187181 1142429 1229099 1231812 1204857 1246587 1343770 1335669 1370153 1356663 1281801 1127350 1037962
3085 1037962 895184 891560 848699 804539 840906 786203 675869 654499 673200 641117 777437
3074 777437 758200 719694 697770 774895 1019975 1160198 1120882 1144289 1022497 859045 696019
3063 696019 610091 601220 661902 650715 585599 578826 511474 517872 599746 568353 474298 525357
3051 525357 571687 441541 245450 339273 335290 380854 294423 302057 384142 451192 489318 506425
3039 506425 554980 471744 448114 397316 342682 251482 274298 335208 300697 315759 311240 282555
3027 282555 142902 207429 314567 218300 221474 165879 104508 181912 157424 90931 -26289
3016 -26289 -70269 -10741 42876 -3521 113457 -1132 9676 90675 20257 15797 135696
$$ packed form
3097A187181m4752Q6670K713k6955M1730R7183q101L4484j3490p4862j54451q9388
3085A037962j42778l624m2861m4160L6367n4703j10334k1370J8701l2083J36320
3074G77437j9237l8506k1924P7125K45080J40223l9316K3407j21792j63452j63026
3063F96019q5928q871O0682j1187o5116o773o7352O398Q1874l1393r4055N1059
3051E25357M6330j30146j96091R3823l983M5564q6431P634Q2085O7050L8126J7107
3039E06425M8555q3236k3630n0798n4634r1200K2816O0910l4511J5062m519k8685
3027B82555j39653O4527J07138r6267L174n5595o1371P7404k4488o6493j17220
3016b6289m3980N9528N3617m6397J16978j14589J0808Q0999p0418m460J19899
$$ plain form
3005 135696 175812 76512 89785 234157 298793 235659 79812 123030 119587 139945 263852
2994 263852 207239 91667 86619 112928 46831 -42313 -20639 73704 88517 148685 211533 225433
2982 225433 101128 -12631 58135 108403 -20067 -59297 73018 62152 28068 78291 197160
2971 197160 141244 5115 26148 -9911 12411 -72853 -41139 -48748 17219 43621 -2933 41410
2959 41410 122316 6837 -56879 -120430 415 -55422 103084 104150 102476 8846 -20750 20827
2947 20827 -39094 -10983 -99262 -128290 -131436 -177644 -42255 4570 -91930 -29285 -52609 -27600
2935 -27600 -66277 -21897 9145 79628 111413 83832 115235 -56150 39145 94272 53218 76271
2923 76271 -39608 -134772 -88476 -38374 -28394 -48746 37147 31938 16491 88498 61170 -28844
$$ packed form
3005A35696M0116r9300J3273J44372O4636o3134j55847M3218l443K0358J23907
2994B63852n6613j15572n048K6309o6097q9144K1674R4343J4813O0168O2848J3900
2982B25433j24305j13759P0766N0268j28470l9230J32315j0866l4084N0223J18869
2971A97160n5916j36129K1033l6059K2322q5264L1714p609O5967K6402m6554M4343
2959D1410Q0906j15479o3716o3551J20845n5837J58506J066j674r3630k9596M1577
2947B0827n9921K8111q8279k9028l146m6208J35389M6825r6500O2645k3324K5009
2935b7600l8677M4380L1042P0483L1785k7581L1403j71385R5295N5127m1054K3053
2923G6271j15879r5164M6296N0102R980k0352Q5893n209j5447P2007k7328r0014
$$ plain form
2911 -28844 -78040 -60560 -40151 -33026 8891 64598 -96701 -114187 -134818 -100147 -46355 -47866
2899 -47866 -24251 137688 134505 9267 38596 45138 -68036 -12261 57287 33512 -19087 63140
2887 63140 84578 -19094 82837 10472 -45140 59562 2011 6620 40645 -50742 -174939
2876 -174939 -113227 -43413 -35104 23492 13322 38638 87943 17770 59431 -47120 -36581 108658
2864 108658 4956 -74973 -28322 -89596 -24402 1275 -19743 33403 -29511 71605 84717
2853 84717 -9136 -22797 -70193 -60162 23109 -20209 276 64148 102209 164903 83967 49650
2841 49650 153544 201795 101140 79480 -50563 77611 75833 108985 202206 193395 130520
2830 130520 256220 202565 132158 144241 69009 31786 -13176 -94317 -122549 -177178 -176255 -64815
$$ packed form
2911b8844m9196J7480K0409P125M1917N5707j61299j7486k0631L4671N3792j511
2899d7866K3615J61939l183j25238K9329O542j13174N5775O9548k3775n2599Q2227
2887F3140K1438j03672J01931p2365n5612J04702n7551M609L4025r1387j24197
2876a74939O1712O9814Q309N8596j0170K5316M9305p0173M1661j06551J0539J45239
2864A08658j03702p9929M6651o1274O5194K5677k1018N3146o2914J01116J3112
2853H4717r3853j3661m7396J0031Q3271m3318K0485O3872L8061O2694q0936l4317
2841D9650J03894M8251j00655k1660j30043J28174j778L3152R3221q811o2875
2830A30520J25700n3655p0407J2083p5232l7223m4962q1141k8232n4629R23J11440
$$ plain form
2818 -64815 -37570 -34882 68223 48789 -3743 1055 -59405 66581 200876 186643 65918
2807 65918 212845 188410 56766 -35656 37321 52205 36849 83645 104542 -20387 -4811
2796 -4811 60833 73532 107096 50841 136821 119646 52792 81553 -17129 76973 253339 159753
2784 159753 27541 11072 -26988 31797 9412 20243 104279 100510 70071 115765 96862 69718
2772 69718 44388 24370 106095 140800 106122 38757 6609 121327 134579 6405 22870
2761 22870 25326 15908 81530 -53472 104682 54983 3715 58722 41063 132541 125745 131127
2749 131127 8650 56459 42772 20828 52549 -71947 -51921 -45064 -34452 -83958 -36738
2738 -36738 77091 53466 40268 -18843 -18586 -10357 12035 150075 44536 65620 147755 101762
$$ packed form
2818f4815K7245K688J03105j9434n2532M798o0460J25986J34295j4233j20725
2807F5918J46927k4435j31644r2422P2977J4884j5356M6796K0897j24929J5576
2796d811O5644J2699L3564n6255Q5980j7175o6854K8761r8682R4102J76366r3586
2784A59753j32212j6469l8060N8785k2385J0831Q4036l769l0439M5694j8903k7144
2772F9718k5330k0018Q1725L4705l4678o7365l2148J14718J3252j28174J6465
2761B2870K456r418O5622j35002J58154m9699n1268N5007j7659R1478o796N382
2749A31127j22477M7809j3687k1944L1721j24496K0026O857J0612m9506M7220
2738c6738J13829k3625j3198n9111K57Q229K2392J38040j05539K1084Q2135m5993
$$ plain form
2726 101762 -6834 -15380 -1019 9884 76482 61145 38301 76535 48348 16055 12730 80567
2714 80567 103774 37402 -39783 -7070 4536 60520 17895 61959 67926 100631 81177 -74514
2702 -74514 -26833 -112518 -55480 -55753 15881 58448 42439 -80961 -76148 -92532 -46258 13779
2690 13779 -17990 3780 72568 68626 110954 80471 12358 -23138 -68815 -104261 -69592 -91776
2678 -91776 -38608 -63101 26539 69544 110625 -58705 -119714 -147790 -190845 -121516 24140
2667 24140 127706 87585 -25314 -114136 -30215 59620 101220 80599 47423 -24577 -32035 -78992
2655 -78992 -32207 -110016 -28030 38173 -50611 -24692 9985 1581 -18302 -31072 -2557 71091
2643 71091 -41576 -94386 13924 44605 23770 -50288 19157 20652 -107098 -50129 -114455
$$ packed form
2726A01762j08596q546J4361J0903O6598j5337k2844L8234k8187l2293l325O7837
2714H0567K3207o6372p7185L2713J1606N5984m2625M4064N967L2705j9454j55691
2702g4514M7681q5685N7038k73P1634M2567j6009j23400M813j6384M6274O0037
2690A3779l1769K1770O8788l942M2328l0483o8113l5496m5677l5446L4669k2184
2678i1776N3168k4493Q9640M3005M1081j69330o1009k8076m3055O9329J45656
2667B4140J03566m0121j12899q8822Q3921Q9835M1600k0621l3176p2000p458m6957
2655g8992M6785p7809Q1986O6203q8784K5919L4677q404j9883j2770K8515P3648
2643G1091j12667n2810J08310L0681k0835p4058O9445J495j27750N6969o4326
$$ plain form
2632 -114455 -80051 32676 41192 -44923 -10880 -4837 -51193 93976 82921 22778 -80310
2621 -80310 -81137 -92087 -75878 1471 6164 7220 5899 -26439 -27115 -6481 46993 -27409 -34136
2608 -34136 -56625 -20961 -21294 21634 -43129 -39856 -42504 -120769 -12962 23496 11459 -14402
2596 -14402 -6248 -26981 25656 -14558 25810 -65055 -24648 95573 82307 -39642 -113984 -24530
2584 -24530 -93176 -68740 -40031 4106 -20899 -35222 -61140 -96830 -91988 7874 121959 60314
2572 60314 81101 6270 -118988 -67615 -93670 -113233 -28388 9061 -97860 -118501 -12240
2561 -12240 -84322 -95016 -62997 -30692 6378 -69295 -38240 -48524 -21325 -40399 11680 11769
2549 11769 -59002 -52624 -74951 18314 147006 -51329 5182 44041 -8677 39604 -80637
$$ packed form
2632a14455L4404J12727Q516q6115L4043O043m6356J45169j1055o0143j03088
2621h0310q27j0950J6209P7349M693J056j321l2338o76K0634N3474p4402o727
2608c4136k2489L5664l33M2928o4763L273k648p8265J07807L6458j2037k5861
2596a4402Q154k0733N2637m0214M0368r0865M0407J20221j3266j21949p4342Q9454
2584b4530o8646K4436K8709M4137k5005j4323k5918l5690M842R9862J14085o1645
2572F0314K0787p4831j25258N1373k6055j9563Q4845L7449j06921k0641J06261
2561a2240p2082j0694L2019L2305L7070p5673L1055j0284K7199j9074N2079Q9
2549A1769p0771O378k2327R3265J28692j98335N6511L8859n2718M8281j20241
$$ plain form
2538 -80637 -63736 -120690 -66549 -89799 -59350 21638 -57190 -63688 67906 116794 28784 9979
2526 9979 -27948 -14344 19639 -148126 -164663 -101279 -80521 -60101 23466 -14930 -117578 20962
2514 20962 5163 -71020 -110621 -176969 -116580 -115864 -38593 -86445 -65224 -128271 -217270 -110197
2502 -110197 -21280 -153408 -140750 -93533 -112200 -28902 -35932 35824 -90661 -117255 -4741
2491 -4741 168 7281 50927 -87581 -51941 30621 -118513 -51820 -64249 -50831 16210 30486
2479 30486 22886 -70993 -137248 -148800 -13400 -94861 -3813 20199 -122574 -97174 -70536 -93832
2467 -93832 676 -39944 -99117 -81234 -12182 -21020 -98164 -117080 -65750 -91954 1027 30429
2455 30429 14410 114977 55424 96067 48635 54958 -39762 -90351 -60597 -25342 -71199 -37015
$$ packed form
2538h0637J6901n6954N4141k3250L0449Q0988p8828o498J31594M8888q8010j8805
2526I979l7927J3604L3983j67765j6537O3384K0758K0420Q3567l8396j02648J38540
2514B0962j5799p6183l9601o6348O0389P16P7271m7852K1221o3047q8999J07073
2502a10197Q8917j32128J2658M7217j8667Q3298p030P1756j26485k6594J12514
2491d741M909P113M3646j38508L5640Q2562j49134O6693j2429J3418O7041J4276
2479C0486p600r3879o6255j1552J35400q1461R1048K4012j42773K5400K6638k3296
2467i3832R4508m0620n9173J7883O9052q838p7144j8916N1330k6204R2981K9402
2455C0429j6019J00567n9553M0643m7432O323r4720n0589K9754L5255m5857L4184
$$ plain form
2443 -37015 22164 32121 -67985 -177037 -77349 -44864 -33196 -94453 -146577 -66903 129673
2432 129673 25404 -59112 -102095 -120292 -128937 -118945 -75944 -17762 11870 -13448 41629 -31175
2420 -31175 -70654 -53731 -55277 -88727 -131774 -203663 -150281 -98917 -21386 69414 18217 -58443
2408 -58443 -53683 -146339 -107155 -109396 -123157 -52622 -21746 64741 -59576 -115935 -114255 -80537
2396 -80537 -44039 -13775 70316 -66180 -45881 -7547 -43883 -50221 18526 53436 21092 -21703
2384 -21703 -94010 -87634 60430 -21697 80624 108064 33322 -9153 -89504 -75937 -12259 -60191
2372 -60191 -144557 -62346 -21511 27357 110343 93692 34950 154631 153716 128974 70052 -1317
2360 -1317 -34011 -130525 -69421 13493 -4614 -38715 -103922 -23851 -8793 -141169 14675 23445
$$ packed form
2443c7015N9179R957j00106j09052R9688L2485J1668o1257n2124P9674J96576
2432A29673j04269q4516m2983j8197q645R992M3001N8182K9632k5318N5077p2804
2420c1175l9479J6923j546l3450m3047p1889N3382N1364P7531R0800n1197p6660
2408e8443M760r2656L9184k241j3761P0535L0876Q6487j24317n6359J680L3718
2396h0537L6498L0264Q4091j36496K0299L8334l6336o338O8747L4910l2344m2795
2384b1703p2307O376J48064q2127J02321K7440p4742m2475q0351J3567O3678m7932
2372f0191q4366Q2211M0835M8868Q2986j6651n8742J19681r15k4742n8922p1369
2360a317l2694r6514O1104Q2914j8107l4101o5207Q0071J5058j32376J55844Q770
$$ plain form
2348 23445 -49349 -126231 37194 -20164 2003 27977 84047 117710 -13639 79502 46158
2337 46158 -2010 -124662 -31380 -36158 -55226 1198 8826 -20623 -14801 -112009 -91477 -166818
2325 -166818 -87101 33734 35216 -17706 -52818 -73416 -64648 -128385 -92063 -58400 62278 83060
2313 83060 67509 3577 -10520 66890 85559 196154 225506 214035 198251 122214 205739 228210
2301 228210 111395 36211 76397 122699 80689 9897 41767 14731 -8360 81486 27544
2290 27544 -19960 -85355 -86939 6867 9806 -26774 42921 17273 -49776 71907 -39587 -31626
2278 -31626 107951 -39840 -52714 -27559 12684 -24854 -153072 -140151 -97846 2388 83557
2267 83557 63954 -54636 -11806 -50427 -138986 11555 -69401 -97743 -61872 -16332 -21431 3453
$$ packed form
2348B3445p2794p6882J63425n7358K2167K5974N6070L3663j31349R3141l3344
2337D6158m8168j22652R3282m778j9068N6424P628k9449N822r7208K0532p5341
2325a66818P9717J20835J482n2922l5112k0598Q768o3737L6322L3663J20678K0782
2313H3060j5551o3932j4097P7410J8669J10595K9352j1471j5784p6037Q3525K2471
2301B28210j16815p5184M0186M6302m2010p0792L1870k7036k3091Q9846n3942
2290B7544m7504o5395j584R3806K939l6580O9695k5648o7049J21683j11494P961
2278c1626J39577j47791j2874K5155M0243l7538j28218J2921M2305J00234Q1169
2267H3557j9603j18590M2830l8621q8559J50541q0956k8342L5871M5540n099K4884
$$ plain form
2255 3453 -45079 9631 12720 185862 206693 109215 129550 70181 -19803 -27913 19876 31996
2243 31996 -21219 6015 104993 41661 102655 39235 -20651 58627 -75498 -181269 -71489
2232 -71489 16417 -111502 -126312 -5773 -5702 17281 89947 -1718 -25827 9629 -38871 37133
2220 37133 -54877 -132293 -24033 67228 106898 141773 154898 81049 114478 234667 271525
2209 271525 150846 107914 125064 81422 54696 -79022 -121291 -44528 -2963 -18088 81076
2198 81076 115294 40858 110489 121975 73302 51120 -58317 117233 97988 92480 100402 192922
2186 192922 172785 165414 79473 71726 182694 85683 97667 91845 123737 208049 206208 183010
2174 183010 287899 170633 226686 279075 263401 166953 179119 62557 94703 85154 71959
$$ packed form
2255C453m8532N4710L089J73142K0831r7478K0335n9369q9984q110M7789J2120
2243C1996n3215K7234R8978o3332O0994o3420n9886P9278j34125j05771J09780
2232g1489Q7906j27919j4810J20539P1K2983P2666r1665k4109L5456m8500P6004
2220C7133r2010p7416J08260R1261L9670L4875J3125p3849L3429J20189L6858
2209B71525j20679m2932J7150m3642k6726j33718m2269P6763M1565j5125R9164
2198H1076L4218p4436O9631J1486m8673k2182j09437J75550j9245n508P922R2520
2186A92922k0137p371q5941p747J10968r7011J1984n822L1892Q4312j841k3198
2174A83010J04889j17266N6053N2389j5674r6448J2166j16562L2146r549j3195
$$ plain form
2163 71959 87278 105694 163584 174386 83039 154012 181746 120846 203145 263039 287470 199467
2151 199467 193735 164977 172547 238616 222203 245887 291070 275092 135981 295269 392913 331393
2139 331393 364596 345904 300400 329618 382745 322448 347879 429313 483068 561320 517220 507904
2127 507904 498767 649198 696253 568263 628536 575408 722103 766575 793062 895055 824142
2116 824142 814239 861801 818170 895026 936245 942218 932153 1048798 1163493 1138379 1153006 1195182
2104 1195182 1347157 1430644 1414617 1563343 1588029 1565966 1678505 1871273 1938150 1944837 2046155
2093 2046155 2217074 2368383 2504238 2564543 2713687 2826410 3085723 3318102 3549299 3898296
2083 3898296 4255875 4717611 5155365 5776876 6500768 7123848 7914879 8749312 9811324
$$ packed form
2163G1959J5319J8416N7890J0802r1347P0973K7734o0900Q2299N9894K4431q8003
2151A99467n732k8758P570O6069j6413K3684M5183j5978j39111J59288R7644o1520
2139C31393L3203j8692m5504K9218N3127o0297K5431Q1434N3755P8252m4100r316
2127E07904r137J50431M7055j27990O0273n3128J46695M4472K6487J01993p0913
2116H24142r903M7562m3631P6856M1219N973j0065J16645J14695k5114J4627M2176
2104A195182J51975Q3487j6027J48726K4686k2063J12539J92768O6877O687J01318
2093B046155J70919J51309J35855O0305J49144J12723K59313K32379K31197L48997
2083C898296L57579M61736M37754O21511P23892O23080P91031Q34433J062012
$$ plain form
2074 9811324 10992371 12343875 13876150 15900850 18193656 21224931 24767189 29173046
2066 29173046 34142965 37372432 36966505 35168509 32711564 28320367 23583565 19845468
2058 19845468 17129938 14710890 12965595 11803915 10739039 9927388 9330548 8726247 8012079
2049 8012079 7458308 6972961 6334937 5820712 5496074 5157937 4802013 4492718 4234049 3981907
2039 3981907 3676809 3606179 3339921 3242892 3119984 3174327 2926787 2876942 2771001 2590102
2029 2590102 2470627 2534416 2411544 2380984 2303537 2181808 2073484 2044142 2028371 1910477
2019 1910477 1893580 1845514 1708535 1693268 1658298 1615822 1610222 1548158 1456520 1398318 1441517
2008 1441517 1438013 1289912 1141697 1106525 1074459 1171526 1039416 1056926 1029069 982777 1038301
$$ packed form
2074I811324J181047J351504J532275K024700K292806L031275L542258M405857
2066B9173046M969919L229467m05927j797996k456945m391197m736802l738097
2058A9845468k715530k419048j745295j161680j064876q11651n96840o04301p14168
2049H012079n53771m85347o38024n14225l24638l38137l55924l09295k58669k52142
2039C981907l05098p0630k66258r7029j22908N4343k47540m9845j05941j80899
2029B590102j19475O3789j22872l0560p7447j21729j08324k9342j5771j17894
2019A910477j6897m8066j36979j5267l4970m2476n600o2064r1638n8202M3199
2008A441517l504j48101j48215l5172l2066R7067j32110J7510k7857m6292N5524
$$ plain form
1997 1038301 1038345 1001936 962769 1039933 954328 862536 820080 849941 822409 703399 710692 685659
1985 685659 640319 602200 681772 581501 561135 610334 543866 587495 634220 677451 598565
1974 598565 436065 492940 587698 645254 458655 421072 332430 321621 363851 383281 295276
1963 295276 278410 338814 428262 296147 247242 204310 216357 223437 247101 327417 258961 304684
1951 304684 295956 382414 357668 221954 173192 237818 186607 261982 192609 261299 356799 354005
1939 354005 243737 101597 119029 237599 218730 201281 123977 188014 353178 260059 258441
1928 258441 268893 190869 95259 68323 22399 3675 39629 268221 308347 335610 301297
1917 301297 387514 306828 236602 301922 266808 196860 104454 93794 110156 109561 13564 -6761
$$ packed form
1997A038301M4l6409l9167P7164q5605r1792m2456K9861k7532j19010P293k5033
1985F85659m5340l8119P9572j00271k0366M9199o6468M3629M6725M3231p8886
1974E98565j62500N6875R4758N7556j86599l7583q8642j0809M2230J9430q8005
1963B95276j6866O0404Q9448j32115m8905m2932J2047P080K3664Q0316o8456M5723
1951C04684q728Q6458k4746j35714m8762O4626n1211P5375o9373O8690R5500k794
1939C54005j10268j42140J7432J18570j8869j7449p7304O4037J65164r3119j618
1928B58441J0452p8024r5610k6936m5924j8724L5954K28592M0126K7263l4313
1917C01297Q6217q0686p0226O5320l5114o9948r2406j0660J6362n95r5997k0325
$$ plain form
1905 -6761 60060 166580 246056 256328 89056 -7979 43399 80589 91061 152376 156106 94998
1893 94998 96850 92460 78019 91697 80430 114892 64223 -23381 -32369 -20445 121177 193379
1881 193379 122307 63078 3432 -75824 102934 130638 140945 214734 104959 138453 123230
1870 123230 220769 202728 112481 186490 140823 32869 20169 66176 157584 138319 175017
1859 175017 145450 55414 -30902 -151709 -124385 113969 220512 151088 186450 152716 -32759
1848 -32759 63186 94599 100547 32088 -80141 -68093 23473 48063 -20936 97301 100848 71916
1836 71916 42547 139773 107138 98308 103475 95774 70397 -13124 112985 124547 183679 183767 177729
1823 177729 161153 242634 193342 193989 240137 188636 212030 78354 83551 160831 136437 160634
$$ packed form
1905f761O6821J06520P9476J0272j67272r7035N1378L7190J0472O1315L730o1108
1893I4998J852m390j4441J3678j1267L4462n0669q7604q988J1924J41622P2202
1881A93379p1072n9229n9646p9256J78758K7704J0307P3789j09775L3494j5223
1870A23230R7539j8041r0247P4009m5667j07954j2700M6007R1408j9265L6698
1859A75017k9567r0036q6316j20807K7324K38354J06543o9424L5362l3734j85475
1848c2759R5945L1413N948o8459j12229J2048R1566K4590o8999J18237L547k8932
1836G1916k9369R7226l2635q830N167p701k5377q3521J26109J1562N9132Q8o038
1823A77729j6576Q1481m9292O47M6148n1501K3394j33676N197P7280k4394K4197
$$ plain form
1811 160634 84573 11310 47563 53566 -2795 48430 124512 79015 -65886 -97126 -126128 -48523
1799 -48523 -23659 69719 161114 127712 69751 45821 28756 62275 35129 -90403 56980
1788 56980 85335 117931 30619 79753 113898 71021 -9260 -26983 -85608 -33930 727 -86215
1776 -86215 -127155 -75502 -124297 -69447 1170 82468 5470 -165328 -111566 -3017 -88035
1765 -88035 -35866 -42268 -169155 -14384 106908 34467 57560 187508 209220 75014 41168
1754 41168 -103914 -52471 -73764 -138093 -34955 -99929 -59306 -91627 -46145 -67678 1379
1743 1379 -50994 -19931 -10142 -70035 -4767 -2486 11199 53725 78878 59542 36250 29020 4549
1730 4549 37727 -25664 -42954 -4310 -18533 -110349 -201203 -2702 -60042 24726 39999 -8020
$$ packed form
1811A60634p6061p3263L6253O003n6361N1225P6082m5497j44901l1240k9002P7605
1799d8523K4864R3378R1395l3402n7961k3930j7065L3519k7146j25532J47383
1788E6980K8355L2596q7312M9134L4145m2877q0281j7723n8625N1678L4657q6942
1776h6215m0940N1653m8795N4850P0617Q1298p6998j70798N3762J08549q5018
1765h8035N2169o402j26887J54771J21292p2441K3093J29948K1712j34206l3846
1754D1168j45082N1443k1293o4329J03138o4974M0623l2321M5482k1533O9057
1743A379n2373L1063R789n9893O5268K281J3685M2526K5153j9336k3292p230k4471
1730D549L3178o3391j7290L8644j4223r1816r0854J98501n7340Q4768J5273m8019
$$ plain form
1718 -8020 -96307 -172784 -113748 -37407 -44214 54101 24829 10194 23426 -25331 26070 -33963
1706 -33963 72824 38304 11766 -45962 -82738 -77705 -43520 70967 71891 77956 93779 139793
1694 139793 147961 -42278 6980 -65209 -38353 -116754 -128955 -102488 46877 -52939 -57477 47346
1682 47346 -58217 -141838 -160103 -156572 23977 82987 50774 31813 -32009 -70865 -64084 -73354
1670 -73354 -40738 82448 -9874 -78181 -68994 -20024 -101664 6934 -30505 -17957 -9669 54794
1658 54794 172121 110242 158213 121424 86758 -13968 -6934 -17486 -41576 -75412 -50047 46758
1646 46758 -84039 -140828 -78576 -162246 -196893 -207972 -161719 -80023 33015 34881 153949
1635 153949 122859 -107148 -23626 141516 23530 -155887 -63082 74733 41234 -120630
$$ packed form
1718h020q8287p6477N9036P6341o807R8315k9272j4635J3232m8757N1401o0033
1706c3963J06787l4520k6538n7728l6776N033L4185J14487R24O065J5823M6014
1694A39793Q168j90239M9258p2189K6856p8401j2201K6467J49365r9816m538J04823
1682D7346j05563q3621j8265L531J80549N9010l2213j8961o3822l8856O781r270
1670g3354L2616J23186r2322o8307R187M8970q1640J08598l7439J2548Q288O4463
1658E4794J17327o1879M7971l6789l4666j00726P034j0552k4090l3836K5365R6805
1646D6758j30797n6789O2252q3670l4647j1079M6253Q1696J13038J866J19068
1635A53949l1090k30007Q3522J65142j17986j79417R2805J37815l3499j61864
$$ plain form
1625 -120630 -141130 -21398 -77302 -118276 -44444 25591 62636 -9857 -129761 -69119 -12147
1614 -12147 -28452 -65371 -59358 20351 93300 -21815 22016 61215 4947 73773 -83541 -9213
1602 -9213 -54457 -58434 -22394 -35282 -95652 -14124 -60410 -101740 8424 -33327 2091 116841
1590 116841 24162 71318 145600 109065 -47748 -86085 -137237 -106976 -222173 -170426 -206847
1579 -206847 -109646 -45372 -124826 -62696 8657 44941 85627 33958 33049 -47491 -84183 -88071
1567 -88071 -106457 -42797 -37449 -14321 -33793 -78214 -134113 -45160 -5400 -74442 -40621 -8774
1555 -8774 -79951 -59253 -83261 -131479 -40108 43879 -18099 -42957 -165450 -117259 -28597 -82612
1543 -82612 -31676 -58647 -71125 -72778 -67182 -83993 -65709 -26431 58755 57171 -56008 -43073
$$ packed form
1625a20630k0500J19732n5904m0974P3832P0035L7045p2493j19904O0642N6972
1614a2147j6305l6919O013P9709P2949j15115M3831L9199n6268O8826j57314P4328
1602i213m5244l977L6040j2888o0370Q1528m6286m1330J10164m1751L5418J14750
1590A16841r2679M7156P4282l6535j56813l8337n1152L0261j15197N1747l6421
1579b06847R7201O4274p9454O2130P1353L6284M0686n1669r09q0540l6692l888
1567h8071j8386O3660N348K3128j9472m4421n5899Q8953L9760o9042L3821L1847
1555h774p1177K0698k4008m8218R1371Q3987o1978k4858j22493M8191Q8662n4015
1543h2612N0936k6971j2478j653N596j6811J8284L9278Q5186j584j13179J2935
$$ plain form
1531 -43073 21289 -38629 -113386 -115849 -178905 -117345 -27690 -38822 7482 2490 -7403 -35724
1519 -35724 -804 57463 7235 -39102 -35094 -63027 -61672 -9152 -91504 41235 4693 23222
1507 23222 -101987 -110594 -7636 50906 46081 31318 39812 87121 9367 43727 -27929 -59724
1495 -59724 -70957 -10448 -3273 44185 -46381 -144563 -147999 -64266 -125743 3076 22772 68434
1483 68434 -35520 -88356 -68184 -58543 -141460 -81322 64335 -2057 52924 171412 57301
1472 57301 -154329 -105785 -120330 -34123 1066 -24811 -70578 -20369 7794 148571 110830
1461 110830 31433 107763 204951 49323 -54359 -71434 -45518 95325 159537 26212 21036
1450 21036 7512 -983 79795 162049 60767 -31313 9492 4470 48429 6604 -161095 -131075
$$ packed form
1531d3073O4362n9918p4757k463o3056O1560Q9655j1132M6304m992r893k8321
1519c5724L4920N8267n0228m6337M008k7933J355N2520q2352J32739l6542J8529
1507B3222j25209q607J02958N8542m825j4763Q494M7309p7754L4360p1656l1795
1495e9724j1233O0509P175M7458r0566r8182l436Q3733o1477J28819J9696M5662
1483F8434j03954n2836K0172R641q2917O0138J45657o6392N4981J18488j14111
1472E7301k11630M8544j4545Q6207L5189k5877m5767N0209K8163J40777l7741
1461A10830p9397P6330R7188j55628j03682j7075K5916J40843O4212j33325n176
1450B1036j3524q495Q0778Q2254j01282r2080M0805n022M3959m1825j67699L0020
$$ plain form
1438 -131075 -16657 40487 -94978 -106950 -85167 -49123 501 -653 -17353 7479 -96723
1427 -96723 -127525 -70393 37090 9182 -49610 -22507 -84687 29207 61036 -53344 -36395
1416 -36395 -30285 -17641 -2575 -60031 -33873 -6989 38645 45754 -13637 27244 -48471 -9521
1404 -9521 60163 -61969 -63004 -13220 -45418 948 20487 98374 121016 45639 -27084 -86492
1392 -86492 -154607 -119696 4357 -44271 -62012 -43662 -102481 -7303 -30737 -109672 -120597 -55919
1380 -55919 54335 56113 -89417 -116407 -124784 -92717 -133316 -102258 -59458 -101949 -116676 -158384
1368 -158384 -126867 -132286 -72546 -101099 -104961 -133725 -78217 -5782 -33894 2174 40086 -42354
1356 -42354 -3814 -56054 -67666 -39229 -104738 -85367 -20301 32703 -28455 -100653 -183534 -121637
$$ packed form
1438a31075J14418N7144j35465j1972K1783L6044M9624j154j6700K4832j04202
1427i6723l0802N7132J07483k7908n8792K7103o2180J13894L1829j14380J6949
1416c6395O110J2644J5066n7456K6158K6884M5634P109n9391M0881p5715L8950
1404i521O9684j22132j035M9784l2198M6366J9539P7887K2642p5377p2723n9408
1392h6492o8115L4911J24053m8628j7741J8350n8819R5178k3434p8935j0925O4678
1380e5919J10254J778j45530k6990q377L2067m0599L1058M2800m2491j4727m1708
1368a58384L1517n419N9740k8553l862k8764N5508P2435k8112L6068L7912q2440
1356d2354L8540n2240j1612K8437o5509J9371O5066N3004o1158p2198q2881O1897
$$ plain form
1344 -121637 -29043 56413 96276 -64200 -63394 -13052 -46872 -32111 -7549 -59414 28774 -17151
1332 -17151 -49297 -107517 -188821 -54565 45768 -41220 -11153 19837 -42064 4846 153817
1321 153817 157658 48674 146176 73991 114177 39932 -5258 10517 29552 101160 32500 -35574
1309 -35574 -10497 106862 80402 39161 36911 1119 -4509 48237 50958 -28206 -110765 -75552
1297 -75552 -42900 -45695 70118 198990 72615 2974 6811 -102540 -122257 -115115 -103702 -30808
1285 -30808 -100214 -33327 5990 -49472 -17309 -24410 -107197 -107772 -100332 -102813 -49771 -54568 -132449
1272 -132449 -82173 -124731 -78538 32718 -58470 15162 14033 -5986 -35366 26488 96161 26740
1260 26740 -56476 -60203 40698 661 -114081 -89477 75956 70976 -20857 -56790 -20826 60132
$$ packed form
1344a21637R2594Q5456L9863j60476Q06N0342l3820J4761K4562n1865Q8188m5925
1332a7151l2146n8220q1304J34256J00333q6988L0067L0990o1901M6910J48971
1321A53817L841j08984R7502p2185M0186p4245m5190J5775J9035P1608o8660o8074
1309c5574K5077J17359k6460m1241k250l5792n628N2746K721p9164q2559L5213
1297g5552L2652k795J15813J28872j26375o9641L837j09351j9717P142J1413P2894
1285c0808o9406O6887L9317n5462L2163p101q2787n75P440k481N3042m797p7881
1272a32449N0276m2558M6193J11256r1188P3632j129k0019k9380O1854O9673o9421
1260B6740q3216l727J00901m0037j14742K4604J65433m980r1833l5933L5964Q0958
$$ plain form
1248 60132 210819 131326 26274 -95135 -72498 -80590 -75641 143986 109585 21332 -22637
1237 -22637 -9593 -61986 -135297 -22548 -50869 -13950 16361 -75697 -108615 -154263 -16344
1226 -16344 42868 1201 23444 41398 77162 -16505 29839 -57674 -71111 8466 8167 34800
1214 34800 2427 -183212 -63415 -90893 -119319 -39241 -44532 -43891 -75020 1611 -74657 -183443
1202 -183443 -53709 -57437 -86058 40921 -45098 -38983 -43254 28899 -125075 -72890 -63427 -59057
1190 -59057 -35531 17815 13228 -37326 32422 42392 70494 1165 -66995 19535 1596 20447
1178 20447 36155 85814 -20074 -107509 -71137 57052 65582 72594 18061 14885 4812 -18288
1166 -18288 -89751 -122507 -73628 -36986 -110395 -78584 -121064 -58942 -11034 -122916 -100438 -103975
$$ packed form
1248F0132J50687p9493j05052j21409K2637q092M949K19627l4401q8253m3969
1237b2637J3044n2393p3311J12749k8321L6919L0311r2058l2918m5648J37919
1226a6344N9212m1667K2243J7954L5764r3667M6344q7513j3437P9577k99K6633
1214C4800l2373j85639J19797k7478k8426Q0078n291O41l1129P6631p6268j08786
1202a83443J29734l728k8621J26979q6019O115m271P2153j53974N2185R463M370
1190e9057K3526N3346m587n0554O9748R970K8102o9329o8160Q6530j7939J8851
1178B0447J5708M9659j05888q7435L6372J28189Q530P012n4533l176j0073k3100
1166a8288p1463l2756M8879L6642p3409L1811m2480O2122M7908j11882K2478l537
$$ plain form
1154 -103975 -115717 -51665 -35722 17744 36586 -6290 41780 83896 -5014 45406 52618 9623
1142 9623 7664 168784 92983 -5611 14295 48552 7811 56697 79776 -47935 -89626 -93086
1130 -93086 -96864 -102326 7012 -154870 -99882 -59542 -48331 -87399 -75980 -134592 -31952 -89923
1118 -89923 -111802 -110347 -27046 -39571 -96527 -153125 -117235 -9450 -8811 -107236 -16930 2250
1106 2250 4235 -82808 -90822 -15882 18349 17122 -39460 -45975 33959 77871 41717 101028 77291
1093 77291 -100682 -99307 -20364 2858 -99862 -107714 -69296 -121205 -49992 -65201 -88678 -45212
1081 -45212 79710 75816 -18857 -26159 26239 -20397 -39866 -22433 11152 -118832 -9371 20937
1069 20937 23508 -32775 -78344 -62228 -194502 -125365 8153 2230 -123614 -77765 -8047 -19627
$$ packed form
1154a03975j1742O4052J5943N3466J8842m2876M8070M2116q8910N0420P212m2995
1142I623j959J61120p5801r8594J9906L4257m0741M8886K3079j27711m1691l460
1130i3086l778n462J09338j61882N4988M0340J1211l9068J1419n8612J02640n7971
1118h9923k1879J455Q3301j2525n6956n6598L5890J07785O39r8425R0306J9180
1106B250J985q7043q014P4940L4231j227n6582o515P9934M3912l6154N9311k3737
1093G7291j77973J375P8943K3222j02720p852L8418n1909P1213j5209k3477M3466
1081d5212J24922l894r4673p302N2398m6636j9469J7433L3585j29984J09461L0308
1069B0937K571n6283m5569J6116j32274O9137J33518n923j25844M5849O9718j1580
$$ plain form
1057 -19627 -13043 58107 1718 -42366 -84620 27974 82970 41658 -5894 -17974 56969 22835
1045 22835 -65725 -91215 -79967 -22250 -21407 -41693 -58718 -74848 -25082 31414 -28463 -102485
1033 -102485 -147958 -87852 54134 65744 86009 104311 -60793 -135219 23125 -85200 -15122
1022 -15122 40498 -47712 -129293 -155099 5788 67222 105012 89879 30346 -6656 40394 -41775
1010 -41775 -44820 -37506 -8453 -86275 -105161 3613 -29323 -19704 -75393 -140723 -30889 46799
998 46799 -83730 -79893 -24877 -34326 -112737 -94814 -13700 -36488 -11405 22073 -57059 -45347
986 -45347 -96909 -108609 -36636 45301 16204 -2132 -16875 -43462 -24679 93741 -53259 -67067
974 -67067 -67621 -22579 2473 23991 63212 116451 187979 99120 2683 -39169 -25160 52870
$$ packed form
1057a9627O584P1150n6389m4084m2254J12594N4996m1312m7552j2080P4943l4134
1045B2835q8560k5490J1248N7717Q43k0286j7025j6130M9766N6496n9877p4022
1033a02485m5473O0106J41986J1610K0265J8302j65104p4426J58344j08325P0078
1022a5122N5620q8210q1581k5806J60887O1434L7790j5133n9533l7002M7050q2169
1010d1775l045P314K9053p7822j8886J08774l2936R619n5689o5330J09834P7688
998D6799j30529L837N5016r449p8411J7923Q1114k2788K5083L3478p9132J1712
986d5347n1562j1700P1973Q1937k9097j8336j4743k6587J8783J18420j47000j3808
974f7067n54M5042K5052K1518L9221N3239P1528q8859r6437m1852J4009P8030
$$ plain form
962 52870 66188 52376 -28871 29576 66262 44576 33089 13653 99649 117640 71127 -85565
950 -85565 -99995 -87277 -105369 -3251 48869 -27535 -81060 -38503 -16235 -57198 2843 101569
938 101569 162358 65306 48482 70322 150376 71362 58929 119544 21244 -21449 -122642 -69427
926 -69427 -58126 46682 159026 181105 31013 -4658 -19370 -61092 -44842 -83103 23990
915 23990 -65200 -84303 4319 -8206 -129086 -74679 -59102 -57576 -96553 -48203 -8503 -22816
903 -22816 -61707 47131 35305 37019 9382 -8478 -38768 17267 -25687 -65275 -43595 -78607
891 -78607 -46060 67040 -1890 -20668 -14668 -72279 -20220 37990 101210 153611 133881 -53538
879 -53538 57863 75414 24888 -32480 64585 82824 41086 134425 124930 51526 14366 -40865
$$ packed form
962E2870J3318j3812q1247N8447L6686k1686j1487j9436Q5996J7991m6513j56692
950h5565j4430J2718j8092J02118N2120p6404n3525M2557K2268m0963O0041R8726
938A01569O0789r7052j6824K1840Q0054p9014j2433O0615r8300m2693j01193N3215
926f9427J1301J04808J12344K2079j50092l5671j4712m1722J6250l8261J07093
915B3990q9190j9103Q8622j2525j20880N4407J5577J526l8977M8350L9700j4313
903b2816l8891J08838j1826J714k7637j7860l0290N6035m2954l9588K1680l5012
891g8607L2547J13100o8930j8778O000n7611N2059N8210O3220N2401j9730j87419
879e3538J11401J7551n0526n7368R7065J8239m1738R3339r495p3404l7160n5231
$$ plain form
867 -40865 61549 32904 -68084 -90731 -20567 -51703 -124885 -27638 -75830 26210 94897
856 94897 94761 27706 -108355 -91210 -25551 -6269 62664 20565 -32949 155732 -12431 -38392
844 -38392 146287 102845 148180 53268 123874 148456 32879 -58096 -58951 -52882 -133788 12972
832 12972 -31000 -70135 -39645 -77043 -80352 22146 162478 174352 7449 -3039 875 -117643
820 -117643 28229 94429 116067 1189 25997 9636 -27377 106307 165638 190364 94467
809 94467 -11776 -28369 87183 21837 7792 -21541 9480 -26518 -386 33942 80856 54814
797 54814 -79289 -72972 -62561 -10179 -39693 -55186 -25324 -28271 -96053 4993 68681 -20906
785 -20906 11330 -14143 -64674 -58593 -47341 -30142 -114477 -104321 -70916 -2390 1664 92935
$$ packed form
867d0865J02414k8645j00988k2647P0164l1136p3182R7247m8192J02040O8687
856I4897j36o7055j36061J7145O5659J9282O8933m2099n3514J88681j68163k5961
844c8392J84679m3442M5335r4912P0606K4582j15577r0975q55O069q0906J46760
832A2972m3972l9135L0490l7398l309J02498J40332J1874j66903j0488L914j18518
820a17643J45872O6200K1638j14878K4808j6361l7013J33684N9331K4726r5897
809I4467j06243j6593J15552o5346j4045k9333L1021l5998K6132L4328M6914k6042
797E4814j34103O317J0411N2382k9514j5493K9862k947o7782J01046O3688q9587
785b0906L2236k5473n0531O081J1252J7199q4335J0156L3405O8526M054R1271
$$ plain form
773 92935 33998 -106380 14240 68103 27367 -15579 -79335 -110134 -125295 -110051 25615
762 25615 26929 14516 -63606 -53357 -34933 -46175 -58237 13566 21224 -46278 89412 131555
750 131555 41233 29324 -7935 46472 106161 -17578 -82228 -78024 -143250 -27286 33120 21392
738 21392 100739 4336 -784 3207 -24338 22707 74202 -25699 -123621 -91639 -83038 -134467 28799
725 28799 67797 54228 72520 46466 5017 -50073 -11934 -42085 -85957 -72761 -131411 -12062
713 -12062 63892 16746 70505 93310 98262 168486 142123 106553 165195 37168 -6743 -16354
701 -16354 -95589 -93590 -23365 -17505 -30124 -139352 -96144 31324 -50630 -89429 -205050 -56912
689 -56912 24920 89941 132545 102630 10333 16895 -29035 7762 99425 -74718 -88994 11861
$$ packed form
773I2935n8937j40378J20620N3863m0736m2946o3756l0799j5161J5244J35666
762B5615J314j2413p8122J0249J8424j1242j2062P1803P658o7502J35690M2143
750A31555r0322j1909l7259N4407N9689j23739o4650M204o5226J15964O0406j1728
738B1392P9347r6403n120L991k7545M7045N1495r9901r7922L1982Q601n1429J63266
725B8799L8998j3569J8292k6054m1449n5090L8139l0151m3872J3196n8650J19349
713a2062P5954m7146N3759K2805M952P0224k6363l5570N8642j28027m3911r611
701a6354p9235J999P0225N860j2619j09228M3208J27468q1954l8799j15621J48138
689e6912Q1832O5021M2604k9915r2297O562m5930L6797R1663j74143j4276J00855
$$ plain form
677 11861 -2969 -10929 66407 74337 200333 161250 42323 -69298 -64250 3656 110134 -79557
665 -79557 -67231 81457 26771 69877 135242 102388 95904 110932 122477 72113 8584 -26747
653 -26747 65719 -141210 -114626 -134178 -238893 -96466 -117298 13886 18127 -116420 -72045
642 -72045 -76518 -213241 -23934 -17175 -53951 -60938 -79478 -68972 14070 68485 -76443 -65325
630 -65325 -15269 -10250 35491 62210 54649 -20810 -58750 -36785 54568 59134 -104205 -9658
618 -9658 46356 12656 33033 142467 98062 66747 147412 132338 140772 106830 126817 75379
606 75379 61165 33744 -7203 68441 101239 48928 27552 62898 14727 28074 20655 25437
594 25437 -19973 -61796 91240 70110 131406 35758 34657 64825 55653 68760 -615 -30464
$$ packed form
677A1861j4830p960P7336P930J25996l9083j18927j11621N048O7906J06478j89691
665g9557J2326J48688n4686M3106O5365l2854o484J5028J1545n0364o3529l5331
653b6747R2466k06929K6584j9552j04715J42427k0832J31184M241j34547M4375
642g2045m473j36723J89307O759l6776o987j8540J0506Q3042N4415j44928J1118
630f5325N0056N019M5741K6719p561p5459l7940K1965R1353M566j63339R4547
618i658N6014l3700K0377J09434m4405l1315Q0665j5074Q434l3942J9987n1438
606G5379j4214k7421m0947P5644L2798n2311k1376L5346m8171J3347p419M782
594B5437m5410m1823J53036k1130O1296r5648j101L0168r172J3107o9375k9849
$$ plain form
582 -30464 81107 81590 -2468 -91168 -43002 -2397 44363 -9877 27152 100990 8750 -48503
570 -48503 -64436 -20325 -59639 160382 32295 -78178 -87971 94554 41898 -12823 65810
559 65810 43414 64415 -90819 -126103 -17878 104497 84789 90892 49803 148156 28742
548 28742 -124430 -76304 -8045 -87236 -84663 5095 6812 -34964 -58782 87253 127861 30424
536 30424 -23201 -9859 75484 73070 -14451 -88522 -62408 -18264 42142 45452 -44451 -61280
524 -61280 9393 25841 5667 -43287 81783 81096 -13472 11595 69459 140389 121833 59409
512 59409 130921 65900 12683 33841 -36997 36849 27964 8131 63920 89616 16444 71544
500 71544 48381 3497 -119670 -15214 -52596 5228 -24168 -28888 -18078 31737 47895 -31671
$$ packed form
582c0464J11571M83q4058q8700M8166M0605M6760n4240L7029P3838r2240n7253
570d8503j5933M4111l9314K20021j28087j10473r793J82525n2656n4721P8633
559F5810k2396K1001j55234l5284J08225J22375j9708O103m1089R8353j19414
548B8742j53172M8126O8259p9191K573Q9758J717m1776k3818J46035M0608r7437
536C0424n3625J3342Q5343k414q7521p4071K6114M4144O0406L310q9903j6829
524f1280P0673J6448k0174m8954J25070o87r4568K5067N7864P0930j8556o2424
512E9409P1512o5021n3217K1158p0838P3846q885j9833N5789K5696p3172N5100
500G1544k3163m4884j23167J04456l7382N7824k9396m720J0810M9815J6158p9566
$$ plain form
488 -31671 -35957 -22193 31470 101933 74203 9221 36222 18160 72084 66020 -32713 50758
476 50758 50270 -81762 -18698 -12042 -29063 8501 15428 -76044 36366 -1562 -7043 -96189 -14101
$$ packed form
488c1671m286J3764N3663P0463k7730o4982K7001j8062N3924o064r8733Q3471
476E0758m88j32032O3064O656j7021L7564O927r1472J12410l7928n481q9146Q2088
$$ [...]
##END NTUPLES=NMR SPECTRUM
##END=
