##TITLE=1H_CA-8912-2
 CDCl3, 8 sc, 
 6.08.2021
##JCAMPDX= 6.0         $$ Bruker NMR JCAMP-DX V2.0
##DATA TYPE= NMR SPECTRUM
##DATA CLASS= NTUPLES
##ORIGIN= UXNMR, Bruker Analytische Messtechnik GmbH
##OWNER= root
$$ XWIN-NMR		Version 3.5
$$ Fri Aug  6 08:36:57 2021 Russian Standard Time (UT+4h)  she@DPX200
##.OBSERVE FREQUENCY= 200.131506
##.OBSERVE NUCLEUS= ^1H
##.ACQUISITION MODE= SIMULTANEOUS
##.ACQUISITION SCHEME= undefined
##.AVERAGES= 8
##.DIGITISER RES= 18
##SPECTROMETER/DATA SYSTEM= spect
##.PULSE SEQUENCE= zg30
##.SOLVENT NAME= CDCl3
##.SHIFT REFERENCE= (INTERNAL, CDCl3, 0, 17.502)
##AUDIT TRAIL= $$ (NUMBER, WHEN, WHO, WHERE, WHAT)
$$ ##TITLE= Audit trail, XWIN-NMR		Version 3.5
$$ ##JCAMPDX= 5.01
$$ ##ORIGIN= Bruker BioSpin GmbH
$$ ##OWNER= she
$$ F:/spectra/data/she/nmr/H-F/1/pdata/1/auditp.txt
$$ ##AUDIT TRAIL=  $$ (NUMBER, WHEN, WHO, WHERE, WHAT)
(   1,<2021-08-06 08:35:53.82 +0400>,<she>,<DPX200>,
      <created by zg, POWCHK disabled, PULCHK disabled
       configuration hash MD5:
       00 E9 B6 7A A2 85 ED C7 34 08 36 98 17 FE 4E 26
       data hash MD5: 16K
       85 2A 51 34 54 CD DC 4F 6D BA 7F AA 5E 9C 21 E9>)
(   2,<2021-08-06 08:35:56.12 +0400>,<she>,<DPX200>,
      <Start of raw data processing
       efp BC_mod = 2 LB = 0.24 FT_mod = 6 PKNL = 1 PHC0 = -13355.47 PHC1 = 13.40099 SI = 16K 
       data hash MD5: 16K
       BA 29 25 83 AF 11 34 74 D4 24 68 23 17 EF 6B 53>)
(   3,<2021-08-06 08:36:09.56 +0400>,<she>,<DPX200>,
      <pk PHC0 = 0.2279191 PHC1 = 0 
       data hash MD5: 16K
       90 83 DC D4 42 87 45 52 DF 6B FB FB 45 24 50 3B>)
(   4,<2021-08-06 08:36:12.57 +0400>,<she>,<DPX200>,
      <abs ABSG = 5 
       data hash MD5: 16K
       83 CF 33 18 7F D8 12 5B 2A 84 35 C2 4C D5 66 8B>)
$$ ##END=
$$ 
$$ hash MD5
$$ 5F 8A 9F 69 18 0D 19 BC C0 52 96 8B 74 7A 02 34
##$RELAX= 
##$RELAX= 
##$RELAX= 
##$RELAX= 
##$RELAX= 
##$RELAX= 
$$ Bruker specific parameters
$$ --------------------------
##$DU= <F:/spectra>
##$EXPNO= 1
##$NAME= <H-F>
##$PROCNO= 1
##$TYPE= <nmr>
##$USER= <she>
##$AMP= (0..31)
100 100 100 100 100 100 100 100 100 100 100 100 100 100 100 100 100 100 
100 100 100 100 100 100 100 100 100 100 100 100 100 100 
##$AQSEQ= 0
##$AQ_mod= 1
##$AUNM= <au_zg>
##$AUTOPOS= <>
##$BF1= 200.13
##$BF2= 200.13
##$BF3= 200.13
##$BF4= 200.13
##$BF5= 200.13
##$BF6= 200.13
##$BF7= 200.13
##$BF8= 200.13
##$BYTORDA= 1
##$CFDGTYP= 0
##$CFRGTYP= 5
##$CHEMSTR= <none>
##$CNST= (0..31)
1 1 145 1 1 1 1 1 1 1 1 1 1 1 1 1 1 1 1 1 1 1 1 1 1 1 1 1 1 1 1 1 
##$CPDPRG= <>
##$CPDPRG1= <>
##$CPDPRG2= <>
##$CPDPRG3= <>
##$CPDPRG4= <mlev>
##$CPDPRG5= <mlev>
##$CPDPRG6= <mlev>
##$CPDPRG7= <mlev>
##$CPDPRG8= <mlev>
##$CPDPRGB= <>
##$CPDPRGT= <>
##$D= (0..31)
0 1.2 0 0 0 0 0 0 0 0.06 0 0.03 0 0 0 0 0.0002 0 0 0 0 0 0 0 0 0 0 0 0 
0 0 0 
##$DATE= 1628224553
##$DBL= (0..7)
120 120 120 120 120 120 120 120 
##$DBP= (0..7)
150 150 150 150 150 150 150 150 
##$DBP07= 0
##$DBPNAM0= <>
##$DBPNAM1= <>
##$DBPNAM2= <>
##$DBPNAM3= <>
##$DBPNAM4= <>
$$ [...]
##$SUBNAM3= <"">
##$SUBNAM4= <"">
##$SUBNAM5= <"">
##$SUBNAM6= <"">
##$SUBNAM7= <"">
##$SUBNAM8= <"">
##$SUBNAM9= <"">
##$SW= 20.0188882624521
##$SWIBOX= (0..15)
0 0 2 0 0 0 0 0 0 0 0 0 0 0 0 0 
##$SW_h= 4006.41025641026
##$TD= 16384
##$TD0= 1
##$TE= 0
##$TE2= 300
##$TE3= 300
##$TEG= 300
##$TL= (0..7)
0 120 120 120 120 120 120 120 
##$TP= (0..7)
150 150 150 150 150 150 150 150 
##$TP07= 0
##$TPNAME0= <>
##$TPNAME1= <>
##$TPNAME2= <>
##$TPNAME3= <>
##$TPNAME4= <>
##$TPNAME5= <>
##$TPNAME6= <>
##$TPNAME7= <>
##$TPOAL= (0..7)
0.5 0.5 0.5 0.5 0.5 0.5 0.5 0.5 
##$TPOFFS= (0..7)
0 0 0 0 0 0 0 0 
##$TUNHIN= 0
##$TUNHOUT= 0
##$TUNXOUT= 0
##$USERA1= <user>
##$USERA2= <user>
##$USERA3= <user>
##$USERA4= <user>
##$USERA5= <user>
##$V9= 5
##$VALIST= <valist>
##$VCLIST= <CCCCCCCCCCCCCCC>
##$VD= 0
##$VDLIST= <DDDDDDDDDDDDDDD>
##$VPLIST= <PPPPPPPPPPPPPPP>
##$VTLIST= <TTTTTTTTTTTTTTT>
##$WBST= 1024
##$WBSW= 4
##$XGAIN= (0..3)
0 0 0 0 
##$XL= 0
##$YL= 0
##$YMAX_a= 143771
##$YMIN_a= -197987
##$ZGOPTNS= <>
##$ZL1= 120
##$ZL2= 120
##$ZL3= 120
##$ZL4= 120
##$ABSF1= 17.43235
##$ABSF2= -2.586687
##$ABSG= 5
##$ABSL= 3
##$ALPHA= 0
##$AQORDER= 0
##$ASSFAC= 0
##$ASSFACI= 0
##$ASSFACX= 0
##$ASSWID= 0
##$AUNMP= <proc_1d>
##$AZFE= 0.1
##$AZFW= 0.1
##$BCFW= 0
##$BC_mod= 2
##$BYTORDP= 0
##$COROFFS= 0
##$CY= -3
##$DATMOD= 1
##$DC= 0
##$DFILT= <>
##$DTYPP= 0
##$F1P= 0
##$F2P= 0
##$FCOR= 1
##$FTSIZE= 16384
##$FT_mod= 6
##$GAMMA= 0
##$GB= 0
##$INTBC= 1
##$INTSCL= 1.334414e-10
##$ISEN= 128
##$LB= 0.24
##$LEV0= 0
##$LPBIN= 0
##$MAXI= 10000
##$MC2= 0
##$MEAN= 0
##$ME_mod= 0
##$MI= 1.114404
##$NCOEF= 0
##$NC_proc= -7
##$NLEV= 6
##$NOISF1= 3.799351
##$NOISF2= 2.8
##$NSP= 0
##$NTH_PI= 0
##$NZP= 0
##$OFFSET= 17.502
##$PC= 1
##$PHC0= -13355.24
##$PHC1= 13.40099
##$PH_mod= 1
##$PKNL= yes
##$PPARMOD= 0
##$PSCAL= 0
##$PSIGN= 0
##$REVERSE= no
##$SF= 200.130006531352
##$SI= 16384
##$SIGF1= 3
##$SIGF2= 2
##$SINO= 5.538805
##$SIOLD= 16384
##$SREGLST= <1H.CDCl3>
##$SSB= 0
##$STSI= 16384
##$STSR= 0
##$SW_p= 4006.41025641026
##$SYMM= 0
##$S_DEV= 0
##$TDeff= 16384
##$TDoff= 0
##$TI= <>
##$TILT= no
##$TM1= 0
##$TM2= 0
##$TOPLEV= 0
##$USERP1= <user>
##$USERP2= <user>
##$USERP3= <user>
##$USERP4= <user>
##$USERP5= <user>
##$WDW= 1
##$XDIM= 16384
##$YMAX_p= 298601476
##$YMIN_p= -649905
$$ End of Bruker specific parameters
$$ ---------------------------------
##NTUPLES= NMR SPECTRUM
##VAR_NAME=  FREQUENCY,     SPECTRUM/REAL,   SPECTRUM/IMAG
##SYMBOL=    X,             R,               I
##VAR_TYPE=  INDEPENDENT,   DEPENDENT,       DEPENDENT
##VAR_FORM=  AFFN,          ASDF,            ASDF
##VAR_DIM=   16384,         16384,           16384
##UNITS=     HZ,            ARBITRARY UNITS, ARBITRARY UNITS
##FACTOR=    0.24454680195387, 1,            1
##FIRST=     3502.67553616002, 0,            0
##LAST=      -503.734720250235, 0,           0
##MIN=       -503.734720250235, -649905,     0
##MAX=       3502.67553616002, 298601476,    0
$$ Real data points
##PAGE= N=1
##DATA TABLE= (X++(R..R)), XYDATA
$$ [...]
6816A757167J65147J16376l58084j41352r2432M3070n3975j0845J21594J16354
6806A663020L23785k20190O7257j36896k408K42022l56005K8874K42254m8077
6796A803636j77979K9594m1599R8317Q2772j59717P5990K30535k6454J09318j46104
6785A878309M5841k55982Q4914J11137k1260j8459N272J4326J28091k01135O7290
6774A838344k9657j11371m9784r6679K05400j9360P7880j45596L6298J85394R8738
6763A989607q5198r7944l5938J26186j30073k05769n9999p9119L56894Q3718j84808
6752A677557k46944L4610N9842n122J20500K3456J29720l31456j01735L98045
6742A758473J13493m5751J85009k89450n6585K17383k94643J16063L2599r1454
$$ plain form
6816 1757167 1922314 2038690 1680606 1539254 1446822 1489892 1435917 1425072 1546666 1663020
6806 1663020 1986805 1766615 1833872 1696976 1694568 1936590 1580585 1609459 1851713 1803636
6796 1803636 1625657 1655251 1613652 1711969 1794741 1635024 1711014 1941549 1915095 2024413 1878309
6785 1878309 1924150 1668168 1753082 1864219 1842959 1824500 1829772 1844098 1972189 1771054 1838344
6774 1838344 1808687 1697316 1647532 1550853 1756253 1736893 1814773 1669177 1705475 1890869 1989607
6763 1989607 1904409 1806465 1770527 1896713 1766640 1560871 1500872 1421753 1778647 1862365 1677557
6752 1677557 1430613 1465223 1525065 1519943 1640443 1663899 1793619 1462163 1360428 1758473
6742 1758473 1871966 1826215 2011224 1721774 1665189 1882572 1587929 1703992 1736591 1645137
6732A645137L6155O5908j83756k3701J80608l0278o9303P3758O4776r3302J68402
6721A834404Q146m8217m3251j06239m7858J03074J5250R319n0835j35833K3782
6710A561742J48839K87154k14852p6760K29651p6830L7942j92373k29031N9059
6700A534541o1320J04262J4202M072k0558q0181n9662k33J4943J50448J61413
6689A761927J20782Q5700j11217k84084Q7246Q1193k81121J29961R9437l4762
6679A655062o4005l1688J8863J48622J87178j00357K84079k7771k05677j42463
6669A721843Q044k25187j59015J08395R6220l5938q2199J15058j08004j80003
6659A259214K15559M2213l4879J05614l6403J83416r4084j05622J80659K20543
$$ plain form
6732 1645137 1681292 1747200 1563444 1539743 1720351 1690073 1620770 1694528 1759304 1666002 1834404
6721 1834404 1842550 1794333 1751082 1644843 1596985 1700059 1715309 1724628 1673793 1537960 1561742
6710 1561742 1710581 1997735 1782883 1706123 1935774 1858944 1896886 1704513 1475482 1534541
6700 1534541 1473221 1577483 1591685 1595757 1575199 1495018 1435356 1435123 1450066 1600514 1761927
6689 1761927 1882709 1968409 1857192 1573108 1660354 1741547 1460426 1590387 1689824 1655062
6679 1655062 1591057 1559369 1578232 1726854 1914032 1813675 2097754 2069983 1864306 1721843
6669 1721843 1729887 1504700 1345685 1454080 1550300 1514362 1432163 1547221 1439217 1259214
6659 1259214 1474773 1516986 1482107 1587721 1551318 1734734 1640650 1535028 1715687 1936230
6649A936230j05797j55070r50k40379o3168J72042j10729J75780n0033o9753k3034
6638A465139J29473M2224R3000p6366K55771P3462k81898M2591k29387K661J34239
6627A650909P5191J08390N170R0057j75046j40251M6728O1962j34762j48774j52039
6616A287535J23405J82064r3721J16169o0827J31499J30002q6077P1152O3613
6606A864814q5060j23940k3944q7408J6497K13496M9132l7046k27155l2760n0532
6595A476094J07567J32583j52811m3402L1925J14821L2146J92094o0613p7899
6585A752505m259j15315J233J15026L9273J5274L5065r0237K81499l11k60055
6574A769698n1811j50199K58779N4943J19881j76178j6807O8185j57977N1130
$$ plain form
6649 1936230 1830433 1675363 1674413 1434034 1370866 1542908 1432179 1607959 1557926 1488173 1465139
6638 1465139 1594612 1636836 1729836 1653470 1909241 1982703 1700805 1743396 1514009 1516670 1650909
6627 1650909 1726100 1834490 1839660 1929717 1754671 1614420 1661148 1723110 1588348 1439574 1287535
6616 1287535 1410940 1593004 1499283 1615452 1554625 1686124 1816126 1730049 1801201 1864814
6606 1864814 1779754 1655814 1631870 1544462 1560959 1774455 1823587 1786541 1559386 1526626 1476094
6595 1476094 1583661 1716244 1563433 1520031 1551956 1666777 1698923 1891017 1830404 1752505
6585 1752505 1748246 1632931 1634164 1749190 1788463 1803737 1838802 1748565 2030064 2029753 1769698
6574 1769698 1717887 1567688 1826467 1881410 2001291 1825113 1808306 1876491 1718514 1769644
6564A769644j10812K26787J18493j52181L4692R7894O59Q0932J41804J40997j36371
6553B212538k11036J19756m0450m5617J57972j48296k53675L705j01386L78010
6543B071521j97110k39702J89193n5765J65370j18417q9454J43407r1413j32209
6533A645421o9701L8917J3500L0720k252k16322Q4824M8888j04160K21987Q6741
6522A778563l04881K83998m878m2547k93380K28698r7394J05336K10777k56384
6512A607908j06882N7287k04632M7529M1150j9456K0503K1L0005J11202J26265
6501A710900K4275M9301p970j15030K8367J07467j81730k8405P9698j10256l4248
6490A522369j2021K40555l1937m0863j19451J09744P8418r1445p799j9042L52055
$$ plain form
6564 1769644 1658832 1885619 2004112 1851931 1886623 1984517 1985176 2066108 2207912 2348909 2212538
6553 2212538 2001502 2121258 2080808 2035191 2193163 2044867 1791192 1794897 1693511 2071521
6543 2071521 1874411 1634709 1823902 1768137 1933507 1815090 1725636 1869043 1777630 1645421
6533 1645421 1575720 1614637 1628137 1658857 1656605 1440283 1525107 1573995 1469835 1691822 1778563
6522 1778563 1473682 1757680 1752802 1710255 1416875 1645573 1548179 1653515 1864292 1607908
6512 1607908 1501026 1558313 1353681 1401210 1442360 1422904 1443407 1443428 1473433 1584635 1710900
6501 1710900 1735175 1784476 1776506 1661476 1689843 1797310 1615580 1587175 1666873 1556617 1522369
6490 1522369 1510348 1750903 1718966 1678103 1558652 1668396 1746814 1655369 1647570 1628528 1980583
6479A980583j57355N0926k08976j89574O2548j8254K69939r7504j42172J37445
6469A687606R3001o1279p0237J2790J56843M529J14485P1856j71740K1212j74733
6458A684333K9585P0351M3996j50812N0400P671K34605p7951j61225k9169J81586
6447A883370j49263J97936Q1959J88783N6742r6132k37213p7606j20725j7733
6437A710118J16306L72789J44147r2230j88953O2942K71316L6818O0968k23553
6427B270668J8805o6982o2690L54681l337J29447J41188k3289Q0337J25024L19796
6416C283648J55714m2184j75770O3268J96490M32646J78843J80053L60839L38905
6406D972452L43837O26048R34422J057071O90186J148960J306533J658159K301300
$$ plain form
6479 1980583 1823228 1874154 1665178 1475604 1538152 1519898 1789837 1692333 1550161 1687606
6469 1687606 1780607 1719328 1649091 1661881 1818724 1823253 1937738 2009594 1837854 1859066 1684333
6458 1684333 1713918 1784269 1828265 1677453 1727853 1735524 1970129 1892178 1730953 1701784 1883370
6447 1883370 1734107 1932043 2014002 2202785 2259527 2163395 1926182 1848576 1727851 1710118
6437 1710118 1826424 2199213 2343360 2251130 2062177 2125119 2396435 2433253 2494221 2270668
6427 2270668 2289473 2222491 2159801 2514482 2511145 2640592 2781780 2758491 2838828 2963852 3283648
6416 3283648 3439362 3397178 3221408 3284676 3481166 3913812 4092655 4272708 4633547 4972452
6406 4972452 5316289 5942337 6876759 7933830 8624016 9772976 11079509 12737668 15038968
6397A5038968K846922K595385R61208j912762m209780l678512k159316j518336
6389G963777j003207p16242n59737o22317m39762j79519j51104l05584m2831n89928
6379C353546m4621j50380j3549j19868j22683l08208l58529J76664j1117n1007
6369B350248J43470j24117l36177J45822K9600J1485j19968J16353l5714K52173
6359B433175k47739N3975n2310k07061j00444K99636k45060k02971J78193k32580
6349A676814l4684Q0070n5378n7716O6671O0688p9109M0994L5680m4965j60432
6338A528633J64956o5535k61898O8491L8852P3929k39393J85031j18017K6508
6328A401557K0141l7039j19458K43774J65918k53100j77592q7717K43997N2013
$$ plain form
6397 15038968 17885890 20481275 21442483 19529721 15319941 11641429 9482113 7963777
6389 7963777 6960570 6244328 5684591 5062274 4622512 4442993 4291889 3986305 3943474 3353546
6379 3353546 3308925 3158545 3144996 3025128 2902445 2594237 2235708 2412372 2401255 2350248
6369 2350248 2493718 2369601 2033424 2179246 2208846 2220331 2100363 2216716 2181002 2433175
6359 2433175 2185436 2239411 2187101 1980040 1879596 2179232 1934172 1731201 1909394 1676814
6349 1676814 1642130 1722200 1666822 1609106 1675777 1736465 1657356 1698350 1734030 1689065 1528633
6338 1528633 1693589 1628054 1366156 1434647 1473499 1547428 1308035 1493066 1375049 1401557
6328 1401557 1421698 1384659 1265201 1508975 1674893 1421793 1244201 1156484 1400481 1452494
6318A452494O2754l8922j96795L6444p866O2787q343q8814J44780N4993M7712
6307A521224M4921k13174J16026o2392j09730K2500J58637j1569q4604O9384k64499
6296A186724J48386p1203P2263J56907q5491j60475j64071J73691m7327L07001
6286A516405j42671r1209q6979J57593M6249q3475l8675o1078n9777j33936J93097
6275A215544J92497j0581k18714L7855R4791k2248j98408j25282K4163L83816
6265A373433j50374l2831J50420P4220j89542o9327j55573J85423r919j12872
6255A063058O1148J7067Q088J76706m3510k24625q751K50454j34625J28234l7234
6244A256010n716J87829K5291q4863j50953k84144j34236J70396J29510K51083
$$ plain form
6318 1452494 1515248 1476326 1279531 1315975 1308109 1370896 1362553 1273739 1418519 1473512 1521224
6307 1521224 1566145 1352971 1468997 1406605 1296875 1319375 1478012 1466443 1381839 1451223 1186724
6296 1186724 1335110 1263907 1336170 1493077 1407586 1247111 1083040 1256731 1209404 1516405
6286 1516405 1373734 1282525 1195546 1353139 1399388 1315913 1277238 1216160 1156383 1022447 1215544
6275 1215544 1408041 1397460 1178746 1216601 1311392 1289144 1090736 965454 989617 1373433
6265 1373433 1223059 1190228 1340648 1414868 1225326 1155999 1000426 1185849 1175930 1063058
6255 1063058 1124206 1141273 1149361 1326067 1282557 1057932 1049181 1299635 1165010 1293244 1256010
6244 1256010 1250294 1438123 1463414 1378551 1227598 943454 809218 979614 1109124 1360207
6234A360207n7604k6197k54856K18149Q7565Q693M5002j6044l18545J17467K6384
6223A190221K6621l0722l8070l1579q8743K25181j49864o8749K82686J23249j2264
6212A427967j05063j31760J25212n8287J05975p3436J90352j30620l15442k7746
6202A007152R6302J7621r9112J2308j8846Q7580o6216k53m1202K68359O6382P7879
6190A407954j59471O619j35010q5685M2421j7004j20427J31385N172r9623J43174
6179A119505l2815j18628k9027L96214m3412M6540J12323k58636O7224J4914j91260
6168A082942p9187J50451P6853K4645q8650P8120k26903j2820N7736Q4547M70
6157A148204o3051J453p6314J34054N2780J93059k41419j20716j0747Q8356J21633
$$ plain form
6234 1360207 1302603 1276406 1021550 1239699 1327264 1335957 1380959 1364915 1046370 1163837 1190221
6223 1190221 1216842 1186120 1148050 1116471 1027728 1252909 1103045 1034296 1316982 1440231 1427967
6212 1427967 1322904 1191144 1316356 1258069 1364044 1290608 1480960 1350340 1034898 1007152
6202 1007152 1103454 1121075 1021963 1034271 1015425 1103005 1036789 1036536 995334 1263693 1330075 1407954
6190 1407954 1248483 1255102 1120092 1034407 1076828 1059824 939397 1070782 1075954 976331 1119505
6179 1119505 1086690 968062 939035 1335249 1291837 1338377 1450700 1192064 1259288 1274202 1082942
6168 1082942 1003755 1154206 1231059 1255704 1167054 1245174 1018271 1005451 1063187 1147734 1148204
6157 1148204 1085153 1086606 1010292 1144346 1197126 1390185 1148766 1028050 1017303 1105659 1227292
6146A227292j13860J7482K6960j57878O5412J22278n0284l5312Q0721p8192M4401
6135A149020J5579J22621r6942j44405n4081J08952Q8905R5922k18094j99264
6125H68213N5669K77690p8228j00642k9777j42057M5028J99889p6618k3927m7032
6114I48208j0651K16278J5227J65948j6522K2780k05685k41745J93374n9057q391
6103A019764K3320l7037J35326j27372r4370j63463r4011K61625P8873L1142K01336
6092A235133m494n0231j17619o8964q5984P9170J73658j50134k2670l3544J67394
6081A121715o1971J6955J3083q5900K4388N777K15599j8526j55309l10539L46847
6070A112119J8702q6449M9599k33439J65047j26526j16589J24720P7708L9825
$$ plain form
6146 1227292 1113432 1130914 1157874 999996 1065408 1187686 1137402 1102090 1182811 1104619 1149020
6135 1149020 1164599 1287220 1190278 1045873 991792 1100744 1189649 1285571 1067477 868213
6125 868213 923882 1201572 1123344 1022702 992925 850868 895896 1095785 1019167 995240 948208
6114 948208 937557 1153835 1169062 1335010 1318488 1341268 1135583 893838 1087212 1028155 1019764
6103 1019764 1043084 1006047 1141373 1014001 919631 756168 662157 923782 1002655 1033797 1235133
6092 1235133 1230639 1180408 1062789 993825 907841 987011 1160669 1010535 987865 954321 1121715
6081 1121715 1059744 1076699 1089782 1003882 1028270 1034047 1249646 1231120 1075811 765272 1112119
6070 1112119 1130821 1044372 1093971 860532 1025579 899053 782464 907184 984892 1024717
6060A024717K67022R3232k93379j38911j48593R1332P0168J31906j99092Q9027
6050I87429r0286r2537J52917J3360M6675o7374J31221k63646j00640K04601l9157
6039H82563K56130k2552j27510j24988P0609P5247j19842j28234L16244L9332
6029A116999o606o3274q5580j083j54333j36125K8389K74712K24848J7175k22669
6018I92453Q9448P0276r8839k37410j02584J75238j1593m6982K27171O3056m6017
6007A074217j14073K26685j22423L07Q0390J1701k91186k86752J84774k9979M0977
5996G74638Q9274J0845M1647K29734Q4896J10739j46290l08578M1680L5251O6712
5985A030548k4774k09896K67965Q2912l34108n092L9989K5495k40313K91412K00193
$$ plain form
6060 1024717 1291739 1384971 1091592 952681 804088 895420 965588 1097494 898402 987429
6050 987429 897143 804606 957523 970883 1017558 950184 1081405 817759 717119 921720 882563
6039 882563 1138693 1116141 988631 863643 934252 1009499 889657 761423 1077667 1116999
6029 1116999 1110393 1047119 961539 960456 806123 669998 698387 973099 1197947 1215122 992453
6018 992453 1081901 1152177 1053338 815928 713344 888582 876989 830007 1057178 1120234 1074217
6007 1074217 960144 1186829 1064406 1064713 1145103 1156804 865618 578866 763640 733661 774638
5996 774638 863912 874757 916404 1146138 1231034 1341773 1195483 886905 928585 963836 1030548
5985 1030548 1005774 795878 1063843 1146755 812647 807555 847544 873039 632726 924138 1124331
5974A124331N5855j28700J69812j86978j2111l1306o2885K46573l14362j5580
5964H44649K34869j60765J9518K21580k53137k11172K54926L6647q6312L17334
5954A218137o1815p2249j34163j25299R8846J11615l1543k0690k5680Q9073l6076
5943A010156l8118j2399R8546m1252j56842J43330K82339J1789p6584q8441j97329
5932I35195O7464m7780k7503m464q2729Q5577P7692o7069L3593r502J49591J73425
5920A283490k76286l7711J45401j93116J17027r3697j6423J97302o5475L2087
5910A092599j05727J73176J0946J11664j49338J10574O3487p0023o1820J52587
5900A328125R3175n7088Q3614k98160M0168r0794j26837K10250Q1342K1639O4188
$$ plain form
5974 1124331 1180186 1051486 1221298 1034320 1022209 990903 928018 1174591 860229 844649
5964 844649 1079518 918753 938271 1159851 906714 695542 950468 987115 900803 1218137
5954 1218137 1156322 1084073 949910 824611 923457 1035072 1003529 982839 957159 1046232 1010156
5943 1010156 972038 959639 1058185 1016933 860091 1003421 1285760 1297549 1220965 1132524 935195
5932 935195 1002659 954879 927376 922912 840183 925760 1003452 936383 969976 960474 1110065 1283490
5920 1283490 1007204 969493 1114894 921778 1038805 945108 928685 1125987 1060512 1092599
5910 1092599 986872 1160048 1170994 1282658 1133320 1243894 1307381 1237358 1175538 1328125
5900 1328125 1421300 1364212 1447826 1149666 1189834 1099040 972203 1182453 1263795 1285434 1349622
5889A349622N3314J41162k66593L7231K1167l2448k2983l9314j20636j4646O9677
5878A175553j62091K26046R9194k62244j18530J59372J9371K3624K21096j24724
5868A256667k8492P9949k09153K71017k0596j02408N8930n7627j14701k3315P8534
5857A188805J65032n1245l24934j10023K96660K52931p4316k25318k7726j7895
5847A071971P6832j50816J6862n6851P7857K23956k5036J46224j93601M182l8431
5836A153149j30406o8367J51374o1420O3506j48676j45094L53152o4443P630O9134
5825A179539l8693O8314l1584J0661q0954J13755P7146l61267o0287J68062l6898
5814A007794K42994K4526j20167j72151J09250K04337j00945m5545K24886k25257
$$ plain form
5889 1349622 1402936 1544098 1277505 1314736 1335903 1303455 1280472 1241158 1120522 1105876 1175553
5878 1175553 1013462 1239508 1338702 1076458 957928 1117300 1136671 1160295 1381391 1256667
5868 1256667 1228175 1308124 1098971 1369988 1349392 1246984 1305914 1248287 1133586 1110271 1188805
5857 1188805 1353837 1302592 977658 867635 1164295 1417226 1342910 1117592 1089866 1071971
5847 1071971 1148803 997987 1014849 957998 1035855 1259811 1234775 1380999 1187398 1191580 1153149
5836 1153149 1022743 954376 1105750 1044330 1107836 959160 814066 1167218 1102775 1110405 1179539
5825 1179539 1140846 1209160 1177576 1188237 1107283 1221038 1298184 936917 876630 1044692 1007794
5814 1007794 1250788 1275314 1155147 982996 1092246 1296583 1195638 1150093 1374979 1149722
5804A149722o5499Q9407m9159J04377K05292q4163p0517n4106j73929O389p1858
5793I85956m3660Q2904J63964J23046J78319j26020l1824m7884q1151j42237L3483
5782A094896J98248k17405J93064k3883r5971K45680j36517l1975R1474k11670
5772A105941P5509K69904k63734o4526J56128j02550J84348L1442k40573K13550
5762A365439j51221K3665J66340k08062j00213K43800J010k96157L330J52319
5752A200250j9178N5932J08261N2948J51283K2414k8902j74274P2513Q7379k44544
5741A284082p8477n1501K10964j51478R7468j2681M00007k69575l28533J44655
5731A244931J69311O2774j34553J02070J4885K8622K2876M4471m1481k43270o0247
$$ plain form
5804 1149722 1084223 1173630 1124471 1228848 1434140 1349977 1279460 1225354 1051425 1057814 985956
5793 985956 942296 1025200 1189164 1312210 1490529 1364509 1332685 1284801 1203650 1061413 1094896
5782 1094896 1293144 1075739 1268803 1244920 1148949 1394629 1258112 1226137 1317611 1105941
5772 1105941 1181450 1451354 1187620 1123094 1279222 1176672 1361020 1392462 1151889 1365439
5762 1365439 1214218 1237883 1404223 1196161 1095948 1339748 1340758 1044601 1047931 1200250
5752 1200250 1181072 1237004 1345265 1398213 1549496 1571910 1543008 1368734 1441247 1528626 1284082
5741 1284082 1205605 1154104 1365068 1213590 1311058 1298377 1698384 1428809 1100276 1244931
5731 1244931 1414242 1477016 1342463 1444533 1459418 1488040 1510916 1555387 1513906 1270636 1210389
5720A210389K00456o0174J9740r2064k848m6377l5950M7664L03433j03586J76324
5709A617007J83987k98020j22666N3770P7275n8269Q7611J89958m0624Q6712o4206
5698A712535M686j88601J239q6584k2813J68087l774j34644N9680L12263m5588
5687A776486R166J5274l9517l1488L2166J17652l4122j3806K28493n7784j2560
5676A989960J47864k22537P7529M2544K5315J3935J69615J2862k39655j24939
5666A892493J78987K9567N5023L06355j23031p8318J8200K44916J44314Q9747
5656B758253k95537O8832K09478q9792K890K61476q1512k19302L0068L09826N3618
5645C008298j23069K45747P1604J39327l7444L5575L66237l1467O549K76764J95006
$$ plain form
5720 1210389 1410845 1350671 1370411 1278347 1275499 1229122 1193172 1240836 1544269 1440683 1617007
5709 1617007 1800994 1502974 1380308 1434078 1511353 1453084 1540695 1730653 1690029 1776741 1712535
5698 1712535 1717221 1528620 1529859 1443275 1420462 1588549 1584775 1450131 1509811 1822074 1776486
5687 1776486 1785652 1800926 1761409 1729921 1762087 1879739 1845617 1831811 2060304 2002520 1989960
5676 1989960 2137824 1915287 1992816 2035360 2060675 2074610 2244225 2257087 2017432 1892493
5666 1892493 2071480 2101047 2156070 2462425 2339394 2261076 2279276 2524192 2668506 2758253
5656 2758253 2462716 2531548 2741026 2651234 2654124 2915600 2834088 2614786 2644854 2954680 3008298
5645 3008298 2885229 3130976 3202580 3341907 3304463 3340038 3706275 3674808 3681357 3958121 4153127
5634D153127K22908l0154j5260J4508K81439L839n5936K84649j6213K01928K30084
5623E274919o107J37846J73739j2068M2713N21706m2604j39132N11156J15821
5613F577989K55782L48313J40064O7502J94697K71568J94856J66950L63084K2483
5603H603288N5055J91908l8321L77347L13747K3314O8300K02205P393k1983r7123
5592I685130J14091L70568J17200J36766J10668O5369J13293J59960J56516J75712
5582A1205273J68106M3432j35439p5397J91047J80215Q564k69621k05159r8022
5572A1012999R3142l00755l18375J3861n629j46999r0064j61863o9595p7604k6571
5561I922547J98722o2109J21463j08199l08586j43373j30529R2225j96953j30491
$$ plain form
5634 4153127 4376035 4345881 4330621 4345129 4626568 4630407 4574471 4859120 4842907 5044835 5274919
5623 5274919 5268812 5406658 5580397 5568329 5611042 6132748 6090144 5951012 6462168 6577989
5613 6577989 6833771 7182084 7322148 7389650 7584347 7855915 8050771 8217721 8580805 8603288
5603 8603288 8658343 8850251 8811930 9189277 9503024 9526338 9594638 9796843 9804236 9782253 9685130
5592 9685130 9799221 10169789 10286989 10423755 10534423 10599792 10713085 10873045 11029561 11205273
5582 11205273 11373379 11416811 11281372 11205975 11397022 11577237 11585801 11316180 11111021 11012999
5572 11012999 11106141 10805386 10487011 10500872 10495243 10348244 10258180 10096317 10026722 9949118 9922547
5561 9922547 10121269 10059160 10180623 10072424 9763838 9620465 9489936 9582161 9385208 9254717
5551I254717l31835j48862m6088k83283l00693q9694L4239l33776k20324l46031
5541G188370k61806k46442m8711p1094l17846m0217j92355l55778j33587j90244
5531E330290K58279l54056j93015m9514k38949L16691J49785j05952l04504q1896
5521D727159l11981l39863J17763j87644Q9573O5980k45152j75155k2926k51944
5511C465810q1683Q7137p9724p5233j7525r9222j5374P1809k96684R9054q488
5500C049877j73847j46524k03411L342L0256R1148N9598M6932l3282O0938M9281
5489B834308j60083m3843j10063m4920M8551k0934k41140q0176K59063j4402J8337
5478B444698j56103P5914j3948K6097j06815q7261K56066M1487J87682k37815
$$ plain form
5551 9254717 8922882 8774020 8727932 8444649 8143956 8054262 8088501 7754725 7534401 7188370
5541 7188370 6926564 6680122 6631411 6560317 6242471 6202254 6009899 5654121 5520534 5330290
5531 5330290 5588569 5234513 5041498 4991984 4753035 5069726 5219511 5113559 4809055 4727159
5521 4727159 4415178 4075315 4193078 4005434 4095007 4160987 3915835 3740680 3717754 3465810
5511 3465810 3384127 3471264 3391540 3316307 3298782 3199560 3184186 3255995 2959311 3058365 3049877
5500 3049877 2876030 2729506 2526095 2529437 2559693 2650841 2710439 2757371 2724089 2785027 2834308
5489 2834308 2674225 2630382 2520319 2475399 2523950 2503016 2261876 2181700 2440763 2426361 2444698
5478 2444698 2288595 2364509 2350561 2376658 2269843 2182582 2438648 2480135 2667817 2430002
5468B430002K19165m0034m76480K39781J14223J8502j66095o8609K94152l9173
5458B525434j15138L68n5694k15706j5855J70059j04482l9405q590N9909L37282
5447B538182q8669k16458O162K1200l8075l01582n588J09066O472L2912r1622
5436A972000J69831k6877j047J12599j62997n7444K53784j49414J32064M1152
5426B283651L9190q0560n5882J9151r8511k962J12968O1247K4604n031K5283J93148
5414B516296q1880J28716j94574k73140J74637Q7981l0728q5772j25056J66545
5404B283025J82151O7032L3149k82034k7147q4316r9765J36679n3491K18344k13323
5393B160304N5001j41733P7345L57295j42242P6474J25108q92r6513O650j9206
$$ plain form
5468 2430002 2649167 2609133 2132653 2372434 2486657 2505159 2339064 2270455 2564607 2525434
5458 2525434 2410296 2410664 2354970 2139264 2123409 2293468 2188986 2149581 2140991 2200900 2538182
5447 2538182 2449513 2233055 2239217 2260417 2222342 1920760 1915172 2024238 2030710 2063622 1972000
5436 1972000 2141831 2114954 2113907 2226506 2063509 2006065 2259849 2110435 2242499 2283651
5426 2283651 2322841 2242281 2186399 2205550 2107039 2104077 2217045 2278292 2302896 2297865 2323148 2516296
5414 2516296 2434416 2563132 2368558 2095418 2270055 2358036 2327308 2241536 2116480 2283025
5404 2283025 2465176 2532208 2565357 2283323 2256176 2171860 2072095 2208774 2155283 2373627 2160304
5393 2160304 2215305 2073572 2150917 2508212 2365970 2442444 2567552 2566660 2470147 2476797 2457591
5382B457591p9482K70522K4630l0447J42452K48012O0522k95303l680J0082k8891
5371B776008N8610j68647r6427J33924K64449j23955j34044J69910k72533L48366
5361B955661J8955j09195k44434J56836J780J32099Q9442j6075Q8602p4909L1944
5350C030706N9514J45988k99057k43074p5347q6337J20313J21289o4863k9829
5340B679303p7549p4796Q4203o4667j16059K14491n4229J45136o2465K41675j97544
5329B717499m9105q3325j02378k2633p1714Q0932J60542M5847m4615q1643k58645
5318B290762K25668J89482O1152J66713j26976j03407p6326K37071k36385N7203
5308B684957Q6882K1036J35755q8114j52739J14773K16331m76161J15794Q037
$$ plain form
5382 2457591 2378109 2648631 2673261 2642814 2785266 3033278 3093800 2798497 2794817 2804899 2776008
5371 2776008 2834618 2665971 2569544 2703468 2967917 2843962 2709918 2879828 2607295 2955661
5361 2955661 2974616 2865421 2620987 2777823 2779603 2911702 3001144 2985069 3073671 2998762 3030706
5350 3030706 3090220 3236208 2937151 2694077 2618730 2532393 2652706 2773995 2709132 2679303
5340 2679303 2601754 2526958 2611161 2546494 2430435 2644926 2590697 2735833 2673368 2915043 2717499
5329 2717499 2668394 2585069 2482691 2460058 2388344 2469276 2629818 2675665 2631050 2549407 2290762
5318 2290762 2516430 2705912 2767064 2933777 2806801 2703394 2627068 2864139 2627754 2684957
5308 2684957 2771839 2792875 2928630 2840516 2687777 2802550 3018881 2542720 2658514 2666551
5298B666551R5231J70155j24359N5475n5588l3178R1566M6200j48547o0516Q6194
5287B789184J5928k81329L7490K87255J17822r2099o229K45612j8988l1366R4567
5276C157847k80098L2898K0796O0101K50417k46299J46487k47535P8768J49839
5266C123221n9094l86369J84362J35101j29253K9433q565J78901k0532Q5241R6858
5255C229304k58778N7929k52871O8813J63745p0157R5538J45362k04316K45421
5245C219990Q6085q7304j6457j38897K65272p1482j41296J44660K85726r7212
5235C449085Q2125n892r9930j5227p5843k02052K24516K21773P1923l06216K2718
5224C366980P319j29254n3476M5036o8011M946J33384J20510j29520K1182J57567
$$ plain form
5298 2666551 2761782 2931937 2807578 2863053 2807465 2774287 2865853 2912053 2763506 2702990 2789184
5287 2789184 2805112 2523783 2561273 2848528 2966350 2874251 2868022 3113634 3094646 3063280 3157847
5276 3157847 2877749 2910647 2931443 2991544 3241961 2995662 3142149 2894614 2973382 3123221
5266 3123221 3064127 2677758 2862120 2997221 2867968 2897401 2888836 3067737 3047205 3132446 3229304
5255 3229304 2970526 3028455 2775584 2844397 3008142 2937985 3033523 3178885 2974569 3219990
5245 3219990 3306075 3218771 3202314 3063417 3328689 3257207 3115911 3260571 3546297 3449085
5235 3449085 3531210 3525318 3425388 3410161 3334318 3132266 3356782 3578555 3650478 3344262 3366980
5224 3366980 3374299 3245045 3191569 3236605 3168594 3173540 3306924 3427434 3297914 3319096 3476663
5213C476663l6744J40737P0728p9066j55480J53493O3465R0516N3884j3798J11799
5202C876197k35787j37472m4116K32979J15527j8142j70534L48380J11458n9771
5192D018719j23764m2286N1956j08778M1495J39360Q802l42510J61365M4178J69296
5181D017833m6687o4490J62332J20112j98122K0281J96784M3889L68680J87360
5171D807972l57147j04615j40484L8277j50852L25820L73678l06735r0325L83300
5161D778889j64554P0513K07811R016R712j06760J17652N0475j06988r9238J18511
5150D885039M8224k4476J67732J80404j07336p5460K5977J26926L2267o2001O1313
5139E258609J22204p3356m8529J7965j56442J55947j00036m848K92719J58324
$$ plain form
5213 3476663 3439919 3580656 3651384 3572318 3416838 3570331 3633796 3724312 3778196 3764398 3876197
5202 3876197 3640410 3502938 3458822 3691801 3807328 3789186 3618652 3967032 4078490 4018719
5192 4018719 3894955 3852669 3904625 3795847 3837342 3976702 3985504 3642994 3804359 3848537 4017833
5181 4017833 3971146 3906656 4068988 4189100 3990978 4011259 4208043 4251932 4620612 4807972
5171 4807972 4450825 4346210 4205726 4244003 4093151 4418971 4792649 4485914 4395589 4778889
5161 4778889 4614335 4684848 4892659 4901675 4911387 4804627 4922279 4972754 4865766 4766528 4885039
5150 4885039 4933263 4908787 5076519 5256923 5149587 5074127 5100104 5227030 5259297 5197296 5258609
5139 5258609 5380813 5307457 5258928 5276893 5120451 5276398 5176362 5171514 5464233 5622557
5129E622557M2878n5030N6998k4867J27366m945q1693K3290j06860P7978M1279
5118E718951j2345N0371j72534N0358r0287K02737J30917J62155N1775k05868
5108E886230o205j0591L50479J2098P1027J85037l09653j05367J94141j36709
5098F130487j1825J18404j12937J75816M8256k56882J14047K08942j5038p6918
5088F322352j39329P4694M42350M36177q0604j8514j42100J80855K53143M58370
5078G787394q1497o2425j3623k40471o0110n5364k46976J00744l29701l5168J30554
5067F893357l73551q6129M2841K24935J9182N1668J10102M4969o4351J09487K00124
5056G172634J57927J10715n1695K25708J18857J18420K62614j10155o7367J05685
$$ plain form
5129 5622557 5665435 5610405 5667403 5642536 5769902 5764957 5683264 5706554 5599694 5677672 5718951
5118 5718951 5706606 5756977 5584443 5634801 5544514 5747251 5878168 6040323 6092098 5886230
5108 5886230 5880025 5869434 6219913 6232011 6303038 6488075 6178422 6073055 6267196 6130487
5098 6130487 6118662 6237066 6124129 6299945 6348201 6091319 6205366 6414308 6399270 6322352
5088 6322352 6183023 6257717 6700067 7136244 7055640 7037126 6895026 7075881 7329024 7787394
5078 7787394 7705897 7643472 7629849 7389378 7329268 7273904 7026928 7127672 6797971 6762803 6893357
5067 6893357 6519806 6433677 6476518 6701453 6720635 6772303 6882405 6927374 6863023 6972510 7172634
5056 7172634 7330561 7441276 7389581 7615289 7734146 7852566 8115180 8005025 7937658 8043343
5046H043343p248j8308k85968j84820l04612l61666J73356k06514N1860n923j72169
5035F721331N7399o7820j41869l02514k35199l6658L4109O5650j61720J59703
5025F092412o4486J67048J98873k08997K6385Q4138j45488R7902j16236j95738
5015E935813l1074J67190m5430j72697j07196O4106m1335m0803j36732p1459O134
5004E526517M1378P8410n7042m8526l0001K11127j14351j74942P8248K28267J01405
4993E840490j5925r0582j18636J55833K7580K6064J10413J35971k35099J8014
4983E854123J71415L8062J7147L01315K0186j56300K87093r1911K70K22247J45356
4972F809003Q876q3502L4520L06289J83755J37701J46565J5403Q2003J90593P3793
$$ plain form
5046 8043343 8036095 8017787 7731819 7546999 7242387 6880721 7054077 6847563 6899423 6893500 6721331
5035 6721331 6778730 6710910 6569041 6266527 6031328 5994670 6028779 6094429 5932709 6092412
5025 6092412 6027926 6194974 6393847 6184850 6211235 6295373 6149885 6247787 6131551 5935813
5015 5935813 5904739 6071929 6026499 5853802 5746606 5810712 5769377 5728574 5591842 5520383 5526517
5004 5526517 5567895 5646305 5589263 5540737 5510736 5721863 5607512 5432570 5510818 5739085 5840490
4993 5840490 5824565 5733983 5615347 5771180 5798760 5824824 5935237 6071208 5836109 5854123
4983 5854123 6025538 6063600 6080747 6382062 6402248 6245948 6533041 6441130 6441400 6663647 6809003
4972 6809003 6817879 6734377 6768897 7075186 7258941 7396642 7543207 7558610 7640613 7831206 7904999
4961G904999o6457K67082L72471L14603J81951J96094J70052L31508K17128J06262
4951I995693J68475J55445M18607K66779M31610M06150L84931K22291O78253Q91673
4941A4019907P55378K87574K52678J20153K93933K1225J71211K77458k219L54202
4931A6551500O3548l2253K98310M71939M08414N14516M27225K91097K82502K82095
4921A9558893M97102L76236J87944K69019K15452k66814k67262M8070l37368N112
4911B0286384n645k16225J49319J27544m9755M84869K84225l9338L35937O98494
4901B2055809L17577L50862L47394M45332L93284M46225K61108K15521J81855
4892B5014967Q6205L83383K29513o0710k07007J21298n664l08315l21038l1211
$$ plain form
4961 7904999 7838542 8105624 8478095 8792698 8974649 9170743 9340795 9672303 9889431 9995693
4951 9995693 10164168 10319613 10738220 11004999 11436609 11842759 12227690 12449981 13128234 14019907
4941 14019907 14775285 15062859 15315537 15435690 15729623 15750848 15922059 16199517 16197298 16551500
4931 16551500 16615048 16582795 16881105 17353044 17761458 18275974 18703199 18994296 19276798 19558893
4921 19558893 20055995 20432231 20620175 20889194 21104646 20837832 20570570 20618640 20281272 20286384
4911 20286384 20280739 20064514 20213833 20341377 20291622 20776491 21060716 21021378 21357315 22055809
4901 22055809 22373386 22724248 23071642 23516974 23910258 24356483 24617591 24833112 25014967
4892 25014967 25101172 25484555 25714068 25653358 25446351 25567649 25561985 25253670 24932632 24901421
4882B4901421j45695j43066l44420n51263m11100l24672r8967o03584m71399P9309
4872B1886564k08090k78853p8441K26868j23713k04168o3009k50272m23052n0567
4862B0433267k89410k2723k20169m11667k97716l49116l88073l62040o01664o69614
4852A6821075n23700n27565m85664l73458n23306m47411o78314m17466k96873
4843A2547318p0621n95706k96008l74037l78809j70319q5998j81932j46355j25794
4833A0121739l50817j26707j04296K9268k99006J2097O0055M4580n6009N2214
4823I383118j08119k16421l6198K3559k9190m813J63835M49457k59136K55916
4813I622008K5589K3203J53475J82552K50221K15106J67000K29750Q1688L02264
$$ plain form
4882 24901421 24755726 24612660 24268240 23716977 23305877 22981205 22882238 22278654 21807255 21886564
4872 21886564 21678474 21399621 21321180 21548048 21424335 21220167 21157158 20906886 20483834 20433267
4862 20433267 20143857 20121134 19900965 19489298 19191582 18842466 18454393 18092353 17490689 16821075
4852 16821075 16297375 15769810 15284146 14910688 14387382 13939971 13261657 12844191 12547318
4843 12547318 12476697 11880991 11584983 11210946 10832137 10661818 10575820 10393888 10247533 10121739
4833 10121739 9770922 9644215 9539919 9569187 9270181 9282278 9342333 9386913 9330904 9383118
4823 9383118 9274999 9058578 9022380 9045939 9016749 9011936 9175771 9625228 9366092 9622008
4813 9622008 9647597 9670800 9824275 10006827 10257048 10472154 10639154 10868904 10950592 11252856
4803A1252856M19088M06562M38785N43731M22402O09602N91517M04486N33814
4794A5622843O55908P05549N65279L79409L27491N94849O34564M41825N73298
4785B0501015J00296L53707j02183K25231K58339q6413J90021k7307N7834K16244
4775B1686784m0497L62284L42977k627J83107J21006J39433J33649M86849K2544
4765B3435509J41558M26106N5416K58734K84019K0107K0814m16657j5756o4687
4755B4145163m25974l57544j08831j2258n16681n06988m41005k40101j27458n56105
4745B0852218m84081n90479n50646l00009j83761n32042l85209l88438m33228
4736A7004325l98509R118k49115m11285j46786j19144l73250J36836j67747l38163
$$ plain form
4803 11252856 11671944 12078506 12517291 13061022 13483424 14093026 14684543 15089029 15622843
4794 15622843 16278751 16984300 17549579 17928988 18256479 18851328 19485892 19927717 20501015
4785 20501015 20601311 20955018 20852835 21078066 21336405 21249992 21440013 21412706 21470540 21686784
4775 21686784 21646287 22008571 22351548 22348921 22532028 22653034 22792467 22926116 23412965 23435509
4765 23435509 23577067 24003173 24058589 24317323 24601342 24621449 24642263 24225606 24209850 24145163
4755 24145163 23719189 23361645 23252814 23240556 22723875 22216887 21775882 21535781 21408323 20852218
4745 20852218 20368137 19777658 19227012 18927003 18743242 18211200 17825991 17437553 17004325
4736 17004325 16605816 16614934 16365819 15954534 15807748 15688604 15315354 15452190 15284443 14946280
4726A4946280k09779l91126k97307n46082m26507k58029m43762l73331l59537
4717A1640820k24130m47997o42725m73045m44376k84674m41470j68760k05660
4708H307983o44090k64131l25734m27562j20075l50740n2224K5960k17355k89915
4698E642117j85559k34268n09963M3898K04076r2788k34426p8353R7412N9581
4688D711727j26448j14269k41509j06014j03609q3937j3561j72484N3699R2881
4678C896476j71084k85165l26158L3287J23305m4490L5586j14013j98929K4452
4668B973267L8539l9474J46898j29247j46501J53400k8982K9486j38422k32594
4658B626370O5863r3825m1971j9402R9966K1401j21247j02125K4551p0099r6787
$$ plain form
4726 14946280 14736501 14345375 14048068 13501986 13075479 12817450 12373688 12000357 11640820
4717 11640820 11416690 10968693 10325968 9852923 9408547 9123873 8682403 8513643 8307983
4708 8307983 7663893 7399762 7074028 6646466 6526391 6175651 6123427 6149387 5932032 5642117
4698 5642117 5456558 5222290 4712327 4756225 4960301 4867513 4633087 4554734 4652146 4711727
4688 4711727 4585279 4471010 4229501 4123487 4019878 3935941 3922380 3749896 3803595 3896476
4678 3896476 3725392 3440227 3114069 3147356 3270661 3226171 3261757 3147744 2948815 2973267
4668 2973267 3011806 2972332 3119230 2989983 2843482 2996882 2967900 2997386 2858964 2626370
4658 2626370 2692233 2598408 2556437 2537035 2637001 2658402 2537155 2435030 2459581 2389482 2292695
4647B292695J14401N9349k78900J08996n6342J4315j87374p4176o3465O0996l1799
4636A958696k20307J34925K7961P5314J1617q5341R1740N8828j72418k16531P1739
4625A736223P997N4654j85021k35359J53234q7278K8383J05962k8323K34456J48775
4614A933703k99813o8515M5118j22805J21854j11332k55077J11227J95531j11431
4604A438460N275l364J12234n9691k57191J77485L0114l6817K11589j60761R3524
4593A550857q5091R4828n9520l90708K94387N256N0803j39294J34958j10459k31420
4582A114597r0115J47109J26058k1149M8701p4242J6081L40558j36741k90897
4572A179960p330J0468J23325J5614q6284k3997J38330M2968j1047j50585j96778
$$ plain form
4647 2292695 2407096 2466445 2187545 2296541 2240199 2254514 2067140 1992964 1929499 1990495 1958696
4636 1958696 1738389 1873314 1901275 1976589 1988206 1902865 1994605 2053433 1881015 1664484 1736223
4625 1736223 1744220 1798874 1613853 1378494 1531728 1444450 1472833 1578795 1550472 1784928 1933703
4614 1933703 1633890 1565375 1610493 1487688 1609542 1498210 1243133 1354360 1549891 1438460
4604 1438460 1443735 1440371 1552605 1492914 1235723 1413208 1443322 1406505 1618094 1457333 1550857
4593 1550857 1465766 1560594 1501074 1110366 1404753 1410009 1460812 1321518 1456476 1346017 1114597
4582 1114597 1024482 1171591 1297649 1276500 1325201 1250959 1267040 1607598 1470857 1179960
4572 1179960 1172630 1183098 1306423 1322037 1235753 1211756 1350086 1393054 1382007 1231422 1034644
4561A034644J91512J92648K0084k0415O0873j55877J79836R583k62588J372p9226
4550A172446l7328J18368p5764K26982k0336O9820r6423k30902K2987j6118Q5944
4539A219676J51008M01829k91814j56200K12801Q2001J45825j40024K63106J89692
4529B077900m41776J48158J19952K23720O1759j39294J19710o796o1456j25170
4519A976707k58425l6379n1229q6099l34247m6489K04056j58766j06272Q226M5249
4508A156332K7064k09239J45565k14903o5839K60193k01769p218L01367j59438
4498A032115o4236K5405L00617k26662k38660P1448J427K51166J72575j62192
4488A163003m746K4666j5390L304P6207q7430k70730j8877O9261Q2001n1076K64396
$$ plain form
4561 1034644 1226156 1418804 1438888 1418473 1479346 1323469 1503305 1512888 1250300 1251672 1172446
4550 1172446 1135118 1253486 1177722 1404704 1384368 1454188 1357765 1126863 1149850 1133732 1219676
4539 1219676 1370684 1772513 1480699 1324499 1537300 1619301 1765126 1625102 1888208 2077900
4529 2077900 1636124 1784282 1904234 2127954 2189713 2050419 2170129 2163333 2101877 1976707
4519 1976707 1718282 1681903 1630674 1544575 1210328 1163839 1367895 1209129 1102857 1111083 1156332
4508 1156332 1183396 974157 1119722 904819 838980 1099173 897404 890186 1191553 1032115
4498 1032115 967879 993284 1293901 1067239 828579 900027 901454 1152620 1325195 1163003
4488 1163003 1158257 1182923 1167533 1170837 1247044 1159614 888884 870007 939268 1021269 970193 1234589
4476A234589J12664r3659j77460J0372m3789J57733k4990k45166J00239K20952
4466A251485p2173M0594p7605L1092j44885M3171K07827q3996l25409M7346j56366
4455G61081M6968l2739L80588o2017q5600N4757r1513J59213n2733o6627L9142
4444A050520N1333J8900K50553j1293N9274n0545k2108J12228P0152m12937K8390
4433A144467K29416k33661m4000K05459L7517k8897j38143J55548j5874j18987
4423A192845K33058p6243L5657j4886Q2839J95185n1186M309R5857j4119j19251
4412A564065j20675k63664K03362J82892j7527J20600j61323l3352N7715Q3030
4402A615123J25824K283M3958O1190J50759J57704J38344q8044O5162j18780O3210
$$ plain form
4476 1234589 1347253 1253594 1076134 1086506 1042717 1200450 1175460 930294 1030533 1251485
4466 1251485 1179312 1219906 1142301 1173393 1028508 1071679 1279506 1195510 870101 917447 761081
4455 761081 808049 775310 1155898 1093881 1008281 1063038 971525 1130738 1078005 1011378 1050520
4444 1050520 1101853 1120753 1371306 1360013 1419287 1368742 1346634 1458862 1529014 1116077 1144467
4433 1144467 1373883 1140222 1096222 1301681 1339198 1310301 1172158 1327706 1311832 1192845
4423 1192845 1425903 1349660 1385317 1370431 1453270 1648455 1597269 1601578 1697435 1683316 1564065
4412 1564065 1443390 1179726 1383088 1565980 1548453 1669053 1507730 1474378 1532093 1615123
4402 1615123 1740947 1743230 1787188 1848378 1999137 2156841 2295185 2207141 2272303 2153523 2216733
4391B216733R9459J92870J15604p9785n4639K04726J13585j15396P6231l7104
4381B732284p966J55484O1611l5775Q7870j1792P2301J0244p9368m6629j17814
4370B820450j09615j584j42558L7338j15303K0019N3956j70581J06128J05809
4360B604059j74614k16166J22486J50706p9350k23092J16092k85456R2618K07631
4350B314914K56739J09253l29719Q9059K66006M9537P644K32440K44586r5628
4340C144831J7020J28731q3460k22959j52418J27402j86672p1419Q9383J69946
4330B960385J69817Q5910Q6845K2964l44507K9111j52346Q6255N1664k28074l00699
4319B467325l68578O4846P3594j04524j7687r2902j35684Q727N637J27571q2481
$$ plain form
4391 2216733 2316192 2509062 2624666 2544881 2490242 2694968 2808553 2693157 2769388 2732284
4381 2732284 2724318 2879802 2941413 2905638 2993508 2981716 3054017 3064261 2984893 2938264 2820450
4370 2820450 2710835 2709251 2566693 2604031 2488728 2508747 2562703 2392122 2498250 2604059
4360 2604059 2429445 2213279 2335765 2486471 2407121 2184029 2300121 2014665 2107283 2314914
4350 2314914 2571653 2680906 2351187 2440246 2706252 2755789 2763433 2995873 3240459 3144831
4340 3144831 3161851 3290582 3207122 2984163 2831745 2959147 2772475 2701056 2790439 2960385
4330 2960385 3130202 3216112 3302957 3325921 2981414 3010525 2858179 2944434 2996098 2768024 2467325
4319 2467325 2098747 2163593 2237187 2132663 2114976 2022074 1886390 1895117 1900754 2028325 1945844
4308A945844l2859q4656j79613j20680p4211J18859K89258J45677k26687k4683
4298A756249N6487q5054J42956j53142N030J27804J78102m1407q6676q4677K04527
4287B020199j79865j65303R1256J11828j0350K3044M7864k83181J64543j42377
4277A677658j10805J40782J92066K28200J5815j46460r319K61924J80345J17932
4267B548138j28995k2093N8671j61170J8364r7525M03359K7045J1328J20966J22064
4256B900152l1212O0640j08078L8538M06911J07436J22423K72739k7161j7985
4246C724403K86899J34232l1777l7144l04567Q96J95540N3689J73561Q3653o2037
4235D217348J72277K12234j0353l6335K17594n5797L2530L20400L94957K59073
$$ plain form
4308 1945844 1912985 1828329 1648716 1528036 1453825 1572684 1861942 2007619 1780932 1756249
4298 1756249 1812736 1727682 1870638 1717496 1722526 1850330 2028432 1987025 1900349 1815672 2020199
4287 2020199 1840334 1675031 1766287 1878115 1867765 1890809 1938673 1655492 1820035 1677658
4277 1677658 1566853 1707635 1899701 2127901 2143716 1997256 1987937 2249861 2430206 2548138
4267 2548138 2419143 2397050 2455721 2294551 2312915 2215390 2618749 2645794 2657122 2778088 2900152
4256 2900152 2868940 2929580 2821502 2860040 3266951 3374387 3496810 3769549 3742388 3724403
4246 3724403 4011302 4145534 4113757 4076613 3772046 3772942 3968482 4022171 4195732 4279385 4217348
4235 4217348 4389625 4601859 4591506 4555171 4772765 4716968 4749498 5069898 5464855 5723928
4225E723928r2587M0076L50655O38821J48481M54540O73771M78043L52743L48988
4215I117459N87398M36720N23635M55648n3394k07137l88921k68690k17561j77538
4205I807619l6615j65463j71836K09697J9180L0034J95792O3797J60323P33078
4195A0845606L29890N33977L33053R02149Q60489P41489Q26146R16097J261817
4186A7550713J092595J011752J078817R29325r8418k23725o94850j325131j165240
4177A8155838j084570j184343q21413o25684m84491l07435m43673l84557O576
4168A2826248P2171J06382J30842L68627L10356L50990L57073N58375Q77924Q00887
4158A6759875J153448J173916R39704J344622N87790K05416l36730p46216j265677
$$ plain form
4225 5723928 5631341 5671417 6022072 6660893 6809374 7263914 7937685 8415728 8768471 9117459
4215 9117459 9704857 10141577 10665212 11120860 11067466 10860329 10471408 10202718 9985157 9807619
4205 9807619 9771004 9605541 9433705 9643402 9662582 9692616 9888408 9952205 10112528 10845606
4195 10845606 11175496 11709473 12042526 12944675 13805164 14546653 15372799 16288896 17550713
4186 17550713 18643308 19655060 20733877 21663202 21564784 21341059 20646209 19321078 18155838
4177 18155838 17071268 15886925 15065512 14439828 13955337 13647902 13204229 12819672 12826248
4168 12826248 12898419 13004801 13135643 13504270 13814626 14165616 14522689 15081064 15958988 16759875
4158 16759875 17913323 19087239 20026943 21371565 21959355 22164771 21828041 21081825 19816148
4149A9816148j355714j455789j532220j213472j254970q03814m67020m63974m20018
4140A0849157l71177l84083m04481k40850K750j5509J54324L7371Q8512J08783
4130I824797N11370K64671L4117K11761P152N4459l1750j99470j19015l09807
4120A0248285o28854n05827l35924m07273j66932j39273k47714p76123m29233
4111F611132o33695m55870j28384j07484k94253k84747j87896l58754k39870P3783
4101C993962K26857k33065l82350j76647Q3159j9361k05073j09991N6630R9521
4091C333642k6553k07197p5534k92314m4625K6492Q8624J21198q9171Q5391r3518
4080B826435k79982n2124p2374K31798m3123k86378K05268R0837m37254r4184
$$ plain form
4149 19816148 18460434 17004645 15472425 14258953 13003983 12200169 11733149 11269175 10849157
4140 10849157 10477980 10093897 9689416 9448566 9451316 9435807 9590131 9627502 9716014 9824797
4130 9824797 10336167 10600838 10634955 10846716 10853868 10908327 10876577 10677107 10558092 10248285
4120 10248285 9619431 9113604 8777680 8370407 8203475 8064202 7816488 7040365 6611132
4111 6611132 5977437 5521567 5393183 5285699 4991446 4706699 4518803 4160049 3920179 3993962
4101 3993962 4220819 3987754 3605404 3428757 3511916 3492555 3287482 3177491 3234121 3333642
4091 3333642 3307089 3099892 3024358 2732044 2687419 2713911 2802535 2923733 2834562 2919953 2826435
4080 2826435 2546453 2494329 2421955 2653753 2610630 2324252 2529520 2620357 2183103 2088919
4070B088919J90401j46272Q2747J5240p6380J49072K82902j28962l1984k18179
4060B207504k50603Q1165L16062m6045k24259J81718k672K31423L5562p8627k29776
4049B221452L59439L04242L4389q5370R4020p7825j62878J78317J61078l86579
4039B640285m8697J57451J49730k927P2825o12J13451j07990N174J0668K40088
4028C229446K3994m1924N9848J24339K76863r9490j10505J2034k3n0330J51470
4017C575722K31291j53630j17870N3869M6887K58342P7257K2897q7438P8110j48466
4006C836971n826o2202J37788l2494J31114P5091j64113j69702K09347j7473L7754
3995C976255N213J0465K71796J00034J55477K25177J47548Q6728j33053P8481
$$ plain form
4070 2088919 2279320 2133048 2215795 2231035 2154655 2303727 2586629 2457667 2425683 2207504
4060 2207504 1956901 2038066 2354128 2308083 2083824 2265542 2262870 2494293 2529855 2451228 2221452
4049 2221452 2580891 2885133 2919522 2834152 2928172 2850347 2687469 2865786 3026864 2640285
4039 2640285 2591588 2749039 2898769 2895842 2968667 2968055 3081506 2973516 2978690 2989358 3229446
4028 3229446 3253440 3211516 3271364 3395703 3672566 3573076 3462571 3474605 3474582 3424252 3575722
4017 3575722 3807013 3653383 3535513 3589382 3636269 3894611 3971868 3994765 3907327 3985437 3836971
4006 3836971 3831145 3768943 3906731 3874237 4005351 4080442 3916329 3746627 3955974 3938501 3976255
3995 3976255 3981468 3991933 4263729 4363763 4519240 4744417 4891965 4978693 4845640 4924121
3985D924121K5300k37455j51641j44112J02206j3558j26180N5786K19744M7158
3975D701369l3636L30942k42743J69026K51882L44001j42940L25981K60809J16991
3965F081682K42512J33734K77241J43503P066K57988L18619R6718L07901M18828
3955H285792L93558M93527K77844J19274L12136J60351q8823l28614j24753j45158
3945I355134m4794Q3546p6806N6239j19064L9603K98051N27891M26290P7253M29420
3934A1052763L99854M73936K37389L03585J64208K44357K15446K40159J48872
3925A3480569N3113J51941L61440P30307L81752M54860M97593Q64427O54031N43689
3915A8173722J276662J062703J243947P75513L79005l56181m24523J75615L16382
$$ plain form
3985 4924121 4949421 4711966 4560325 4416213 4518419 4504861 4378681 4434467 4654211 4701369
3975 4701369 4667733 4998675 4755932 4924958 5176840 5520841 5377901 5703882 5964691 6081682
3965 6081682 6324194 6457928 6735169 6878672 6885738 7143726 7462345 7559063 7866964 8285792
3955 8285792 8679350 9172877 9450721 9569995 9882131 10042482 9953659 9625045 9500292 9355134
3945 9355134 9310340 9393886 9317080 9373319 9254255 9293858 9591909 10119800 10546090 10623343 11052763
3934 11052763 11452617 11926553 12163942 12467527 12631735 12876092 13091538 13331697 13480569
3925 13480569 13533682 13685623 14047063 14777370 15159122 15613982 16111575 16976002 17630033 18173722
3915 18173722 19450384 20513087 21757034 22532547 22911552 22555371 22130848 22306463 22622845
3906B2622845J81097J64764M78854O4325j49603j03966j28001L27518o622J34830
3896B3586041N18861P34137O24471O98074J216217J032347J109521J550397J488885
3887C2558951K038428J969037K400102L151606L206353L475310L948194M114509
3879E6862490M948150N157987N241426M620754L464559R64741j524566k894497
3871G6841044k707122j985440n95929R53213J620493K719301L902848N129632
3863H5878040O907614Q612242J1052828J2820130J5478108J8551911K2540185
3856A81841058K7575249L3642035L3477110K2066024n708738l8727315m8025867
3849B06139556l8268392k6199186j8690009j3900586j1563127r824761q527215
$$ plain form
3906 22622845 22803942 22968706 23447560 23511885 23362282 23258316 23130315 23457833 23451211 23586041
3896 23586041 24104902 24839039 25463510 26161584 27377801 28410148 29519669 31070066 32558951
3887 32558951 34597379 36566416 38966518 42118124 45324477 48799787 52747981 56862490
3879 56862490 61810640 66968627 72210053 76830807 80295366 81260107 79735541 76841044
3871 76841044 74133922 72148482 71552553 72505766 74126259 76845560 80748408 85878040
3863 85878040 92785654 101397896 112450724 125270854 140748962 159300873 181841058
3856 181841058 209416307 243058342 276535452 298601476 292892738 254165423 206139556
3849 206139556 167871164 141671978 122981969 109081383 97518256 87693495 79166280
3842G9166280p265160o649247n262261m559648l416920l619290l163508k818799
3834D2411447k660573k394009k089848j682230j539542j466716j132214j115837
3826B8330478r65778q96883q50797o99112q27093n88120p15905m14475n41237
3817B1831078p64752o17934o69538n54934j63866m23947l16367j89239n03470
3808A7627031n00500l5095o6856j37914l7312k42526j50393J0317P8803k7253
3798A6518302K51827K95844R8327R1708o1492J80397J15918K40799L54649J67348
3788A8253627M30046K62641L00439K85649O93571O85475N28442M81730P40411
3779B2662031Q98260M81129J003600R88021P57959J008714J093925J112789J075615
$$ plain form
3842 79166280 71901120 65251873 59989612 55429964 52013044 48393754 45230246 42411447
3834 42411447 39750874 37356865 35267017 33584787 32045245 30578529 29446315 28330478
3826 28330478 27364700 26467817 25617020 24917908 24090815 23502695 22786790 22372315 21831078
3817 21831078 21066326 20448392 19778854 19223920 19060054 18636107 18319740 18130501 17627031
3808 17627031 17126531 17091436 17024580 16886666 16849354 16606828 16456435 16466752 16545555 16518302
3798 16518302 16770129 17065973 17164300 17256008 17194516 17374913 17490831 17731630 18086279 18253627
3788 18253627 18683673 18946314 19246753 19532402 20225973 20911448 21439890 21921620 22662031
3779 22662031 23560291 24041420 25045020 26033041 26791000 27799714 28893639 30006428 31082043
3770C1082043J333815J396717J374386J132814J588624J871676J449533J941545
3762D3171153J949787J850956J896240K207443K245846K063351K242399K263816
3754E9890991K320353K417486K401937K806136K466428K562433K511379K624256
3746H0001399K309245J527398L16143o67452k159444k134210k361589k267206
3738G4564284k131617k162045j972237j890438j772958j904052j711894j802504
3730E9216539j826008k125072j376060j635254j830038j871821j801655j727640
3722D5022991j641802j593030j759451k070667j591947j481653j431917j393664
3714C2058860j587149j235747j207492j191315j537927j224943q70035j206536
$$ plain form
3770 31082043 32415858 33812575 35186961 36319775 37908399 39780075 41229608 43171153
3762 43171153 45120940 46971896 48868136 51075579 53321425 55384776 57627175 59890991
3754 59890991 62211344 64628830 67030767 69836903 72303331 74865764 77377143 80001399
3746 80001399 82310644 83838042 84154185 83486733 81327289 79193079 76831490 74564284
3738 74564284 72432667 70270622 68298385 66407947 64634989 62730937 61019043 59216539
3730 59216539 57390531 55265459 53889399 52254145 50424107 48552286 46750631 45022991
3722 45022991 43381189 41788159 40028708 37958041 36366094 34884441 33452524 32058860
3714 32058860 30471711 29235964 28028472 26837157 25299230 24074287 23204252 21997716
3706B1997716r36819r78097o69959q20350j095699p13924p39130o61295m25447
3697A4956996m69875n72527l07460r43272n23058k12763k77118k64117l21225
3688A1065581n01962l03986k70774j14266l92989n08189j89364k03278j68544
3679H412229j61896n5027j78830j76432j72526j41582k42194l55028j62014j24019
3669F642681L1020J52413k59449o2187L9339n6956K36089k7866q1980J37353J17754
3658F868211L0512r7774l68589l36245j76798j23496m40147l37052j6203j67239
3648D835180k04174k30276J21243l45n2352k58566L165j28085j61262R3381j44432
3637C873477n1389j6174k54426n7751L247n0585Q8669j70800j10177L89942J6785
$$ plain form
3706 21997716 21060897 20082800 19412841 18592491 17496792 16782868 16043738 15382443 14956996
3697 14956996 14487121 13914594 13607134 12663862 12140804 11928041 11650923 11386806 11065581
3688 11065581 10563619 10259633 9988859 9874593 9481604 8973415 8784051 8580773 8412229
3679 8412229 8250333 8195306 8016476 7840044 7667518 7525936 7283742 6928714 6766700 6642681
3669 6642681 6673701 6826114 6566665 6504478 6543817 6486861 6722950 6695084 6613104 6750457 6868211
3658 6868211 6898723 6800949 6432360 6096115 5919317 5795821 5355674 5018622 5002419 4835180
3648 4835180 4631006 4400730 4521973 4521628 4469276 4210710 4213875 4085790 3924528 4017909 3873477
3637 3873477 3822088 3805914 3551488 3493737 3496984 3446399 3535068 3364268 3254091 3644033 3660818
3626C660818n1531m62706j13421R7090L1666J0888P0007M8812J4318j44932O6121
3615C227130P3393r540l17714J48156l6968Q2414K8314M1413N3780k11211P983
3604C087150K77576K58417m6057J00500k0467K02608K15873K75211J80092K38954
3594D769857L69749M08889o9607j19534N3636m0737m49885l54452k40098l86661
3584C941157k48261k6284m68782M4181R528j35925J4095q5641j30376J40955k41466
3573B813181l7697R8506R1441j63619l8904j25742K44468K5596l55k76770N1023
3562B681128L25560j01785j80470Q938J64607R972P944k6088J83534j74242P0129
3551B969227k19309L22662K1496j42218K02574k0095l4793N2420O7850N4678j57802
$$ plain form
3626 3660818 3609287 3146581 3033160 3130250 3161916 3172804 3242811 3291623 3305941 3161009 3227130
3615 3227130 3300523 3290983 2973269 3121425 3084457 3166871 3195185 3236598 3290378 3079167 3087150
3604 3087150 3364726 3623143 3577086 3677586 3657119 3859727 4075600 4350811 4530903 4769857
3594 4769857 5139606 5548495 5478888 5359354 5412990 5372253 4922368 4567916 4327818 3941157
3584 3941157 3692896 3666612 3197830 3242011 3251539 3115614 3129709 3044068 2913692 3054647 2813181
3573 2813181 2775484 2873990 2965431 2801812 2762908 2637166 2881634 2907230 2906875 2630105 2681128
3562 2681128 3006688 2904903 2724433 2733371 2897978 2907950 2915894 2889806 3073340 2899098 2969227
3551 2969227 2749918 3072580 3094076 2951858 3154432 3134337 3099544 3151964 3219814 3274492 3116690
3540C116690j65365J73893q5490j40296P7661L40384o4198J16429J83238j61357
3530C391589j52260p2735L00738j65929k32040J36234n2902J8431K11859j27301
3520C255684J29100J04877J47897J5376K3010k28194K6861j49690Q7109L27743
3510C739773k59481J91573L69172k35636p6817K40066j01071K04506J56726J14684
3500D343495O455L6565k2698j90237J78649J48450M9272k7652L35044K45062k711
3489E099694P4875Q6303K7017K64807K18782J6356J26222K94481J76653R0652
3479F475842L52342j05714L4675K30592J87817M0783J23856N9198M08319K90689
3469H098399j64671J98830P5946K35021L86719J94340J9517N2926K44365N24628
$$ plain form
3540 3116690 2951325 3125218 3039728 2899432 2977093 3317477 3253279 3369708 3552946 3391589
3530 3391589 3239329 3166594 3467332 3301403 3069363 3205597 3152695 3171126 3382985 3255684
3520 3255684 3384784 3489661 3637558 3652934 3675944 3447750 3474611 3324921 3412030 3739773
3510 3739773 3480292 3671865 4041037 3805401 3728584 3968650 3867579 4072085 4228811 4343495
3500 4343495 4349950 4386515 4363817 4173580 4352229 4500679 4549951 4522299 4857343 5102405 5099694
3489 5099694 5174569 5260872 5287889 5552696 5771478 5787834 5914056 6208537 6385190 6475842
3479 6475842 6828184 6722470 6757145 6987737 7175554 7216337 7340193 7399391 7807710 8098399
3469 8098399 7933728 8132558 8208504 8443525 8830244 9024584 9044101 9097027 9341392 9866020
3459I866020J75084L27601K85562J24445K14186K14801K90445N64282M53007M20928
3449A2936361M01472J64460N16095L68082L66078K69495P74324Q74458L32432
3440A7003257N97339P30981Q23456Q29511P34140Q75791R41780P70372P56330
3431B4062957J254551O87421O18622Q76767Q05777O61285P71709Q76502Q00912
3422C1416503O12126N34879N18242J98727K81426L19781O29413K33195J51921
3413C4896213J51053J78784k0392r8663J3583J15948N2642J38753J23086J62815
3403C5713822K22403M2661K10220J56795P51444M70518N81595N73176N33721R65725
3393D0222080Q29144R51727J420495J193579J265951J548281J230675J565930
$$ plain form
3459 9866020 10041104 10368705 10654267 10778712 10992898 11207699 11498144 12062426 12515433 12936361
3449 12936361 13337833 13502293 14018388 14386470 14752548 15022043 15796367 16670825 17003257
3440 17003257 17600596 18331577 19155033 19984544 20718684 21594475 22536255 23306627 24062957
3431 24062957 25317508 26004929 26623551 27500318 28306095 28967380 29739089 30615591 31416503
3422 31416503 32028629 32563508 33081750 33280477 33561903 33881684 34511097 34744292 34896213
3413 34896213 35047266 35226050 35205658 35106995 35120578 35236526 35289168 35427921 35551007 35713822
3403 35713822 35936225 35978886 36189106 36345901 37097345 37567863 38149458 38722634 39256355 40222080
3393 40222080 41051224 42002951 43423446 44617025 45882976 47431257 48661932 50227862
3385E0227862J777230J832095K082751K122127J813679J745889J791650J907112
3377F5300395K139288J717476J978118J646576J322479J554153J371600J257288
3369G8287373Q41274J62828J08592l1591n71711n96480n70474j026613j031621
3360G5571577j015768j306722j375760j416687j730989j512990j412088j433046
3352F4367527j575492j344620j218861r72173j329243j175564q15808r81174j465092
3343E3489500j269405r56122j126835p43826q80976p53348o71815k45623q729
3334D6832821q7175o6354N45426L68783L20212O20017J112000J205828R83938
3325E1835496J216122J402604J707475J932661J833562J679604K024497K071508
$$ plain form
3385 50227862 52005092 53837187 55919938 58042065 59855744 61601633 63393283 65300395
3377 65300395 67439683 69157159 71135277 72781853 74104332 75658485 77030085 78287373
3369 78287373 79128647 79291475 79400067 79368476 78796765 78200285 77629811 76603198 75571577
3360 75571577 74555809 73249087 71873327 70456640 68725651 67212661 65800573 64367527
3352 64367527 62792035 61447415 60228554 59256381 57927138 56751574 55935766 54954592 53489500
3343 53489500 52220095 51263973 50137138 49393312 48512336 47758988 47087173 46841550 46832821
3334 46832821 46745646 46679292 47224718 47593501 47913713 48533730 49645730 50851558 51835496
3325 51835496 53051618 54454222 56161697 58094358 59927920 61607524 63632021 65703529
3317F5703529J964960J890368J991035J944002J335552J421711J373327J473871
3309G9098355J290294J664196J593994J913537J763825J820105K049829K069430
3301I3263565K264644K323867K397492K433701K604983K753415K955285L159078
3293A14156030L345188L563953L593875L652984L143461L401688K600675K308611
3285A39766465J540133R38964N17684k62655l72278q02249j123098j411122j819883
3276A36971961k149017k491197k993310l175601l564130m185415m484888m821240
3268A09107163n062582m842376m742211m611386m525736m053419l526277l374651
3260G4368525l236386k786726k864902k387260k036606j965501k007579j725838
$$ plain form
3317 65703529 67668489 69558857 71549892 73493894 74829446 76251157 77624484 79098355
3309 79098355 80388649 82052845 83646839 85560376 87324201 89144306 91194135 93263565
3301 93263565 95528209 97852076 100249568 102683269 105288252 108041667 110996952 114156030
3293 114156030 117501218 121065171 124659046 128312030 131455491 134857179 137457854 139766465
3285 139766465 141306598 142245562 142763246 142500591 142128313 141326064 140202966 138791844 136971961
3276 136971961 134822944 132331747 129338437 126162836 122598706 118413291 113928403 109107163
3268 109107163 104044581 99202205 94459994 89848608 85322872 81269453 77743176 74368525
3260 74368525 71132139 68345413 65480511 63093251 61056645 59091144 57083565 55357727
3252E5357727j647659j454574j561131j400634j452022j422627j376141j334086
3244D3708853j242385j313627j575996j294535j153911j206699j399767j157782
3236C3364151j213342j039970j305875j059295j237895r39843q57761r81568r88183
3227B3740419q91833o18776q28705n47812q45130r30931n92940o09263o43753
3218A7231276n83371k65918j73505m77848m74954j93398m06093n06738k64661
3209A3884790k92903l92913l27952l49797k91364k77768k43294j36415j19299
3200A1453085k28045k17379l11242m4697l37756k88613m20l37596Q2667k72478
3190I497526j91702L4793p3289k77129k42640j83989k68979K90168J29510k28454
$$ plain form
3252 55357727 53710068 52255494 50694363 49293729 47841707 46419080 45042939 43708853
3244 43708853 42466468 41152841 39576845 38282310 37128399 35921700 34521933 33364151
3236 33364151 32150809 31110839 29804964 28745669 27507774 26567931 25710170 24728602 23740419
3227 23740419 22848586 22229810 21401105 20853293 20008163 19077232 18484292 17875029 17231276
3218 17231276 16647905 16381987 16208482 15730634 15255680 15062282 14656189 14149451 13884790
3209 13884790 13591887 13198974 12871022 12521225 12229861 11952093 11708799 11572384 11453085
3200 11453085 11225040 11007661 10696419 10651722 10313966 10025353 10024933 9687337 9770004 9497526
3190 9497526 9305824 9340617 9267328 8990199 8747559 8563570 8294591 8584759 8714269 8485815
3180H485815j24733l14644M2084j4750k04696j29357k02921p9731q7207m8909
3170G320951J56966J84184k43851j98231K56641m5055k52669o4196J27604K8269
3160G270613J31155j80922K24184P4382k39304k61883J61405K92061J66697k3942
3150G614446J38048q0373k33157J98304L8871k31834J5975j04230J4864N3571
3140G424485k00963L4797j55198P8231q1161j75979K5372m2494m2227M3143J55866
3129G063872K4382j37399K2754K47341k83100J98045J24570j77364J41028M9143
3119G273272J15124J23623l08903L1823O4957M2035j94451M4577O0885j78739
3109G074203L54500O0842Q5468J73850j29187K06411K14716J40427J74663J49768
$$ plain form
3180 8485815 8361082 8046438 8088522 8073772 7869076 7739719 7536798 7457067 7369860 7320951
3170 7320951 7477917 7662101 7418250 7220019 7476660 7431605 7178936 7114740 7242344 7270613
3160 7270613 7401768 7220846 7445030 7519412 7280108 7018225 7179630 7471691 7638388 7614446
3150 7614446 7752494 7672121 7438964 7637268 7676139 7444305 7460280 7356050 7370914 7424485
3140 7424485 7223522 7258319 7103121 7181352 7100191 6924212 6949584 6907090 6864863 6908006 7063872
3129 7063872 7088254 6950855 6973609 7220950 6937850 7135895 7260465 7083101 7224129 7273272
3119 7273272 7388396 7512019 7203116 7234939 7299896 7341931 7147480 7192057 7252942 7074203
3109 7074203 7428703 7489545 7575013 7748863 7619676 7826087 8040803 8181230 8355893 8505661
3099H505661K75519K24060J7924J14117M20585L83739M34920L71120M82816M60094
3089A1690555N80376K39727J72463l87729l28049l98616n10395l30794m87056
3080A0240482o61395n97487o76620l14516l68280n57071j78492k43110m32645
3071F210866j70017L6325l92633Q8605k13344k34899j15080j51238k44843n4172
3061D759570R8093j85495q7749l47489m1963p7703o2604J32542o7196j41356j10326
3050C868324R2873j16152k20215J18048J24781r3659k06708J59470p4597R3502
3040C745667k98883l4709k4038P3556L72762l3443j63806Q0404r4240j66451J59482
3029C616301j25376K2335M277o8551k7932K754Q6437q9469N2955L1489P6953n4171
$$ plain form
3099 8505661 8781180 9005240 9023164 9137281 9557866 9941605 10376525 10747645 11230461 11690555
3089 11690555 12270931 12510658 12683121 12295392 11967343 11568727 11058332 10727538 10240482
3080 10240482 9579087 8981600 8304980 7990464 7622184 7065113 6886621 6643511 6210866
3071 6210866 6040849 6077174 5684541 5773146 5559802 5324903 5209823 5058585 4813742 4759570
3061 4759570 4857663 4672168 4584419 4236930 4194967 4117264 4054660 4187202 4120006 3978650 3868324
3050 3868324 3961197 3845045 3624830 3742878 3867659 3774000 3567292 3726762 3652165 3745667
3040 3745667 3446784 3412075 3388037 3461593 3834355 3800912 3637106 3717510 3623270 3456819 3616301
3029 3616301 3490925 3513260 3517537 3448986 3421054 3423808 3510245 3420776 3473731 3505220 3582173 3528002
3017C528002j04804O0049j63985R6414K10124l40871P1980Q7578J05584k01492
3007C348579J41333J15611l93793K6442J9927j7344K53254j42101k72053j45175
2997B934680K220J78387n8847j58024j03381J28331J09549N1697r7078K76281
2987C263815J06089K8940l64737Q6096L60122p5983m0772r0059j2868L03869k43252
2976C321260J80210N0340L421O4866p9684K7115K03063J63676l8437n904r2716
2965C797210M2007J37315j16266R7671L34879J59951j19141R0574J98942N5622
2955D678764K07219K71007L48422J58000K00832P4592p1098Q4965J06329J50967
2945F209999K72554K23504L21649N22300M52834M48194M29583M09766P75210P60611
$$ plain form
3017 3528002 3423198 3483247 3319262 3415676 3625800 3284929 3356909 3444487 3550071 3348579
3007 3348579 3489912 3605523 3211730 3238172 3258099 3240755 3494009 3351908 3079855 2934680
2997 2934680 2936900 3115287 3056440 2898416 2795035 2923366 3032915 3084612 2987534 3263815
2987 3263815 3369904 3398844 3034107 3120203 3480325 3404342 3363570 3273511 3260643 3564512 3321260
2976 3321260 3501470 3551810 3555231 3620097 3540413 3567528 3770591 3934267 3895830 3889926 3797210
2965 3797210 3839217 3976532 3860266 3957937 4292816 4452767 4333626 4424200 4623142 4678764
2955 4678764 4885983 5156990 5505412 5663412 5864244 5938836 5867738 5952703 6059032 6209999
2945 6209999 6482553 6706057 7027706 7550006 8002840 8451034 8880617 9290383 10065593 10826204
2935A0826204O45765R60553J088513J298029J260300J554105J655102J640568
2927B0929139J544376J286208O98617J21832n18567j080400q62333j331349j405535
2918A9381988j034886p22282n45103j19570q368r4755q9056J11825J55180O54710
2908A7689683P85960Q89131J336142J529717J547192J745302K218236K356478
2900C0097841K675471K903733K939936K572332J830733M06052j542787k513361
2892C9369950l226931l324481l075472k607341j984510j657388j671939r94816
2884B0827072r02819p82985j97406l89972q6247P077j76581K65126N32924L57421
2874A9453610P48662J007929J142741O87011J189614J245733R37563N60337q1771
$$ plain form
2935 10826204 11471969 12432522 13521035 14819064 16079364 17633469 19288571 20929139
2927 20929139 22473515 23759723 24458340 24580172 24061605 22981205 22118872 20787523 19381988
2918 19381988 18347102 17624820 17079717 16960147 16951779 16857024 16767968 16879793 17034973 17689683
2908 17689683 18475643 19364774 20700916 22230633 23777825 25523127 27741363 30097841
2900 30097841 32773312 35677045 38616981 41189313 43020046 43426098 41883311 39369950
2892 39369950 36143019 32818538 29743066 27135725 25151215 23493827 21821888 20827072
2884 20827072 19924253 19141268 18943862 18553890 18467643 18474720 18298139 18563265 19096189 19453610
2874 19453610 20202272 21210201 22352942 23039953 24229567 25475300 26412863 26973200 26891429
2865B6891429m39007p99510j486475j911128j462191j678873j753627j333827
2857A6026791p11748p79798m96437n58648n26169j76487n71262P8512Q1211m83738
2847A1882227J3535K05355K23877J72154Q3811L38719M35384N03777L98381K83623
2837A4540843J32491j08128l90596k79401m39799m57505o62812k60862l11756
2828A1762475j22749j87938p84884o44846n59589l01371j82252l0755j86729j2640
2818H748722O4619j4011m1395n6369r059L73340J39910L8328L19589K49934J26013
2807I939621m0226J33221n4819j48196o2282k57816l14409n00971j63815j83673
2797H346635l75342k72947k78764l61638k39952k68127m07614j05142j37090k19841
$$ plain form
2865 26891429 26452422 25652912 24166437 22255309 20793118 19114245 17360618 16026791
2857 16026791 15315043 14535245 14038808 13480160 12953991 12777504 12206242 12284754 12365965 11882227
2847 11882227 11895762 12101117 12324994 12497148 12580959 12919678 13355062 13858839 14257220 14540843
2837 14540843 14673334 14565206 14174610 13895209 13455410 12997905 12335093 12074231 11762475
2828 11762475 11639726 11451788 10666904 10022058 9462469 9161098 8978846 8948091 8761362 8748722
2818 8748722 8813341 8799330 8757935 8701566 8692507 9065847 9205757 9244085 9563674 9813608 9939621
2807 9939621 9899395 10032616 9977797 9829601 9767319 9509503 9195094 8694123 8530308 8346635
2797 8346635 7971293 7698346 7419582 7057944 6817992 6549865 6142251 6037109 5900019 5680178
2787E680178j24371k96897q2089R2301J34174k64807p1926k7892j77933l37839
2777D522899k30786k71625j79270n7813j18496R6609p4391j8019j90119J78239
2767C657228o790m06714O2063k04314J02908M15935l25168j29849p3871k3661
2757C067767R2474j03560k07226j40528K52978p8052j06427r4668l08681J7902
2747B391979J42975k0712o9540l0820j64158k09731o3858L8609j7821j01848k6474
2736A868601J86438N2351j63014r0765p2575J13697j21369j55713J84084l6790
2726A764945j56573J01842m9305J9864j20036k30099L0395k03826N7107q3395
2716A130919k79346K43447J73854k8273k6242k24053j72323o4741J35029O1537
$$ plain form
2787 5680178 5555807 5258910 5176821 5269122 5403296 5138489 5066563 5038671 4860738 4522899
2777 4522899 4292113 4020488 3841218 3783405 3664909 3761518 3687127 3669108 3478989 3657228
2767 3657228 3650438 3243724 3305787 3101473 3204381 3620316 3295148 3165299 3091428 3067767
2757 3067767 3160241 3056681 2849455 2708927 2961905 2883853 2777426 2682758 2374077 2391979
2747 2391979 2534954 2514242 2444702 2413882 2249724 2039993 1976135 2014744 1996923 1895075 1868601
2736 1868601 2055039 2107390 1944376 1853611 1781036 1894733 1773364 1617651 1801735 1764945
2726 1764945 1608372 1710214 1660909 1680773 1560737 1330638 1361033 1157207 1214314 1130919
2716 1130919 851573 1095020 1268874 1240601 1214359 990306 817983 753242 888271 949808
2706I49808N574k24215M8441N7854J35884q7587j14874j13496j66883K26107m7351
2695F69262o6115Q1605L04948j70991k2409M0062j80646J16988l19993l6183J56936
2684E73464J36419j02324j62771k04227k5057J91782K15507K1952J12340r0367
2674F66718q576j77856K9353j67813J06532j13775j75646q6727J36027K67521
2664D75758k0344J24123r4405J87754k48231k3062m4417j67318m6898n6229j23862
2653c7131K37402J496Q5987L2396O505Q2552J903L2152k86575r5243R222j20658
2641d9992Q4515M08784J67934j58279k98013r1401M77765p8887m3630j38519L03140
2630E83417j72729j58605J23485l0294o4720k3924p4367K8593o6947R753r4404
$$ plain form
2706 949808 955382 731167 779608 837462 973346 885759 770885 657389 490506 716613 669262
2695 669262 603147 684752 989700 818709 796300 836362 655716 772704 452711 416528 573464
2684 573464 709883 607559 444788 240561 215504 407286 622793 644745 757085 666718
2674 666718 658142 480286 509639 341826 448358 334583 158937 72210 208237 475758
2664 475758 455414 579537 485132 672886 424655 401593 357176 189858 142960 86731 -37131
2653 -37131 200271 201767 287754 320150 326655 409207 411110 443262 156687 61444 70666 -49992
2641 -49992 34523 443307 611241 452962 154949 63548 541313 462426 418796 280277 583417
2630 583417 410688 252083 375568 345274 280554 256630 182263 210856 143909 153662 59258
2619E9258j24300J20455N4233j164l7054m044K20576j19194r5162L03647L357
2608C80608J09342M7356j08970j71912O4364q213M8882j67572K66836l35036m1173
2597H4512J53257j05897l8039J56079K4042j01795J59807j24801j44131K25314
2587B88348K2225k16684L76900j57128j35542M2236r420L6996J9319K55027J22113
2576F44390l36522M975N9013k55066l7670K15237p7220o7432L43487L5640J4453
2565E43285J38116k408l3955j83795K66547o699J6198K48606m5635J62553j45415
2554I57398J73163M623J06006J17060j61150j43064j6425P5797J15797J61447
2544A390652P599k69389N5855J12368J04383J30926J13029j8835M9910J28235
$$ plain form
2619 59258 -65042 55413 109646 108482 71428 67384 287960 168766 73604 377251 380608
2608 380608 489950 537306 428336 256424 320788 312575 361457 193885 460721 125685 84512
2597 84512 237769 131872 93833 249912 273954 172159 331966 207165 63034 288348
2587 288348 310573 93889 470789 313661 178119 220355 210935 247931 267250 522277 644390
2576 644390 307868 312843 371856 116790 79120 294357 217137 149705 493192 528832 543285
2565 543285 681401 678993 645038 461243 727790 721091 737289 985895 940260 1102813 957398
2554 957398 1130561 1135184 1241190 1358250 1197100 1054036 1037611 1113408 1229205 1390652
2544 1390652 1398251 1128862 1184717 1297085 1401468 1532394 1645423 1626588 1676498 1804733
2534A804733p578M3421K73241O2766O9475K9548L9382l8642K15868J16501r4998
2523B513717M6569p1437J09418K43022K4219k28361l2838j11488K28917j64558
2513B557180O6162k398N6851J80680l19628M2046L49329L26325j99467l66139
2503B690941J89982J55981O4554J24509L32813J34099r5709N5651o1593j36857
2493C454371L2809j12745J853k33875k17042K9231j01766J52689j0841j80888
2483B813796j07703j42921k08776L8578M45429p3659l6864k41462j69605o8976
2473B247837P0975R2571l81229L54459L24372l2984p0758J68730J07758J14197
2463B995928p0002k23080r3813l15595k37964l37498Q9390Q6175j12003k35323
$$ plain form
2534 1804733 1797155 1840576 2113817 2176583 2246058 2275606 2314988 2276346 2492214 2608715 2513717
2523 2513717 2560286 2488849 2598267 2841289 2865508 2637147 2604309 2492821 2721738 2557180
2513 2557180 2623342 2620944 2677795 2858475 2538847 2580893 2930222 3256547 3057080 2690941
2503 2690941 2880923 3036904 3101458 3225967 3558780 3692879 3597170 3652821 3591228 3454371
2493 3454371 3487180 3374435 3376288 3142413 2925371 2954602 2852836 3005525 2994684 2813796
2483 2813796 2706093 2563172 2354396 2392974 2838403 2764744 2727880 2486418 2316813 2247837
2473 2247837 2318812 2411383 2030154 2384613 2708985 2676001 2605243 2773973 2881731 2995928
2463 2995928 2925926 2702846 2609033 2293438 2055474 1717976 1807366 1893541 1781538 1546215
2453A546215j29419j19616P3017j51557J42370J64620j21775p483j26492l1255
2443A238625j10476k60901j13245j5655j27363K98034j40144Q7185q9251J08968
2433H75777k15468k000K01124q4586N6470k25357n2581R4957k59629L75372K8796
2422G92875l92478Q6219k16103m3688J02040j52544k3929J57914o9812n9648J05828
2411B86674j41998L4646J13778O3729r6701p2602j23439j59813o480l50319K50045
2400b02480J5278m2607K30524l0953j192L31940j19426n6719k12554n0384J57857
2389A9284j02935o4746R1530O3629k98243m3487m8082J81909M3582J44459M9530
2378C6430q3677J96355m6022k1716l0853O2257k46071J15399J6087k53433J8687
$$ plain form
2453 1546215 1416796 1297180 1370197 1218640 1361010 1525630 1403855 1396372 1269880 1238625
2443 1238625 1128149 867248 754003 738348 610985 909019 768875 856060 766809 875777
2433 875777 660309 658309 859433 774847 831317 605960 553379 648336 388707 764079 792875
2422 792875 400397 486616 270513 226825 328865 176321 152392 310306 240494 180846 286674
2411 286674 144676 179322 293100 356829 260128 187526 64087 -95726 -102206 -452525 -202480
2400 -202480 -187202 -229809 715 -30238 -31430 300510 181084 124365 -88189 -138573 19284
2389 19284 -83651 -148397 -56867 6762 -291481 -334968 -383050 -201141 -157559 -13100 36430
2378 36430 -47247 149108 103086 81370 50517 112774 -133297 -17898 -1811 -255244 -236557
2367b36557l5222k30652J14357J53307q8251Q3393l24153J84153R1530o7818K6948
2356c28965Q2984l9233P8365J55386m4760j59620m3566J33965K11767p8740l35550
2345c67967n8104J54924J92509K12986j03232k44667P1163P3557j11856l4924
2335b15611l02121M90227j9852k35568O6644j73325J80996j03086l1602J29422
2325b13876q2686l17713K37549J05353J30723n4516R932j59550J79107l6608j5839
2314b18124R5462j6272J3534K33470K27245j38858k34508j8942J06824j27767
2304g7936Q1038k860K40764l0063J05844k14932m2775N7788k23373O2879j44434
2293a88060L5494j4285J54467N1409r8658k25588J17773K76965j61055j03314
$$ plain form
2367 -236557 -271779 -502431 -388074 -234767 -323018 -239625 -563778 -379625 -288095 -355913 -328965
2356 -328965 -245981 -285214 -206849 -51463 -96223 -255843 -299409 -165444 46323 -32417 -367967
2345 -367967 -426071 -271147 -78638 134348 31116 -213551 -142388 -68831 -180687 -215611
2335 -215611 -517732 -27505 -47357 -282925 -216281 -389606 -208610 -311696 -343298 -213876
2325 -213876 -296562 -614275 -376726 -271373 -140650 -195166 -185234 -344784 -165677 -202285 -218124
2314 -218124 -122662 -138934 -125400 108070 335315 196457 -38051 -56993 49831 -77936
2304 -77936 3102 242 241006 210943 316787 101855 59080 116868 -106505 -43626 -188060
2293 -188060 -152566 -166851 -12384 39025 -59633 -285221 -167448 109517 -51538 -154852
2283a54852k25015J96161J97614j34176M0308j0267R5431K7279k10314J38217
2273c9614J8558N3544o9293O8375j3647Q2092K2199p7358p1337k16659J79831
2262f3309j5229Q2832p2118j77688j29822K00707J47286Q9515J73708j58946j81207
2251a04271J43851j48858l1525m6982O3647R652J06786J32726l5356L01p6174
2240A3797k7128r8430j79857J97265K1794J2395L2745K9148j30859K81950r0943
2229F1877k02617R3986K3258j59501J90509J49172k22900J13093J26909j04434
2219F9352k30675J18021j29063j12689K5442J26774J89336M3389k20920J15355
2209e678j27223J06264K15199r9452j14341J67125o5243K37092j75552r8613J02801
$$ plain form
2283 -154852 -379867 -183706 13908 -120268 -79960 -90227 5204 32483 -177831 -39614
2273 -39614 -21056 32488 -36805 31570 17923 100015 122214 44856 -26481 -243140 -63309
2262 -63309 -78538 4294 -67824 -245512 -375334 -174627 -27341 62174 235882 76936 -104271
2251 -104271 39580 -109278 -140803 -187785 -124138 -114486 -7700 125026 89670 89971 13797
2240 13797 -13331 -111761 -291618 -94353 -72559 -60164 -27419 1729 -129130 152820 61877
2229 61877 -140740 -46754 -23496 -182997 7512 156684 -66216 46877 173786 69352
2219 69352 -161323 -43302 -172365 -285054 -259612 -132838 56498 99887 -121033 -5678
2209 -5678 -132901 -26637 188562 89110 -25231 141894 76651 313743 138191 39578 142379
2198A42379j38584r5035J87929M7368j58154P7930J4034P5629j68901J43281J49057
2187B76933k03864j7202O9742K25998q5269J45018k12766r7860K71237J46020
2177E17987k81817Q16j35105K49041M1359j36772L42658R3330j23685j16451j04367
2166C46994J5437j41111j0644L17843L7100l4966k72323j0582J95639l4066j86350
2155B22971j74559K96098P5995O6044J87022j48284j82253J89177p628J8927K34880
2144G78390n7788j58467L2595R9958J96359r6288j05342J05688l0198O3602M2148
2133H70657K36890R323K2709R7450K29413q7977j9520j79973J51655K62669K4677
2122A617973J40613J16362l5409J26437Q5770j48263l177L18054l9182Q5061n0589
$$ plain form
2198 142379 3795 -91240 96689 144057 -14097 63833 77867 153496 -15405 127876 276933
2187 276933 73069 55867 125609 351607 266338 411356 198590 100730 371967 517987
2177 517987 236170 236986 101881 350922 392281 255509 598167 691497 567812 451361 346994
2166 346994 362431 221320 210676 528519 565619 530653 258330 247748 443387 409321 222971
2155 222971 48412 344510 420505 486549 673571 525287 343034 532211 524583 543510 778390
2144 778390 720602 562135 594730 694688 891047 794759 689417 795105 764907 828509 870657
2133 870657 1107547 1116870 1139579 1237029 1466442 1378465 1358945 1178972 1330627 1593296 1617973
2122 1617973 1758586 1874948 1839539 1965976 2051746 1903483 1900306 2218360 2179178 2264239 2213650
2111B213650K28378K45213j62761k51423M12531Q3860p2194O5439J1644l4798
2101B739539j4073L45670L43950k41238K61130K64351J98239M5778K25881L67114
2091D536341P9479M63531K29944K17504M80842K61502K99266M29319P25297M12580
2081H135605N68578N92002R07242R21099Q14582J100868J643544J589507J104548
2072A7377575J606316K029702K422749L183029L947856N004564N559349O751394
2064D7882534Q719443J1155872J3445385J2242647L400824j1680076j9194319
2057F5972310j5839546j0147162o914039m863748l859782k681305j919252j762343
2049A7985133j194619p70956j018481j178668j242429j182547j171890r22993
$$ plain form
2111 2213650 2442028 2687241 2524480 2273057 2685588 2769448 2697254 2762693 2774337 2739539
2101 2739539 2725466 3071136 3415086 3173848 3434978 3699329 3897568 3943346 4169227 4536341
2091 4536341 4615820 5079351 5309295 5526799 6007641 6269143 6568409 6997728 7723025 8135605
2081 8135605 8704183 9296185 10203427 11124526 11939108 13039976 14683520 16273027 17377575
2072 17377575 18983891 21013593 23436342 26619371 30567227 35571791 41131140 47882534
2064 47882534 56601977 67757849 81203234 93445881 96846705 85166629 65972310
2057 65972310 50132764 39985602 33071563 28207815 24348033 21666728 19747476 17985133
2049 17985133 16790514 16019558 15001077 13822409 12579980 11397433 10225543 9302550
2041I302550o77478o19669m06914m75326m89144j90329l22400k42457l24627m5398
2031E508808j65670l06002k69214K4691k99474l03441l81430j62198r5209j02685
2021C448176k06703k11322M3481n9081l45562q6835j79159l02753q1152K09598
2011B228688m4404o5235n3472j15265r705Q0251Q849k12106r7758K2914k06442
2000A536315j07492J85034J25374q0725j9594j57939J98258O0109k59941N7190
1990A536589k69789j47603J28264j0799j8699r2747j86745J90285p6533j38717
1980I13506K7861K11625J3221j75192K41674k998j39198j55122k84702j4378J55763
1969G92060N4746j25108k07993Q8308k0851l29674K74733J03115l0406k4435P5412
$$ plain form
2041 9302550 8625072 8005403 7598489 7123163 6634019 6443690 6121290 5878833 5554206 5508808
2031 5508808 5343138 5037136 4767922 4792613 4493139 4189698 3808268 3646070 3550861 3448176
2021 3448176 3241473 3030151 3073632 3014551 2668989 2582154 2402995 2100242 2019090 2228688
2011 2228688 2184284 2119049 2065577 1950312 1940607 2020858 2029707 1817601 1719843 1742757 1536315
2000 1536315 1428823 1613857 1739231 1658506 1638912 1480973 1679231 1739340 1479399 1536589
1990 1536589 1266800 1119197 1247461 1236662 1217963 1125216 938471 1128756 1052223 913506
1980 913506 941367 1152992 1166213 991021 1232695 1229697 1090499 935377 650675 636297 792060
1969 792060 846806 721698 513705 602013 581162 251488 526221 629336 598930 574495 649907
1958F49907j1660r7347j11234K7322k7672r3665J56190r3875k03984J24291J15067
1947D33340m8982j28115j31191K57161j21276n7278j2219R1714p2962j30014L32967
1936D13145j23877j59264n9168L20885q2334J6797n458j42993j72032J30163J43816
1925B79680J47132l6717j80564l16394Q2800N9842j31860O4746O8875J259Q6535
1914A25334n5433N8844j520q7897j28811J70135Q6583j07964J55024L8822Q7935
1903C41052j57266j53490l8289j01322M5537J27528k44034L7643K16001j1086
1893F2274N9060q2030j5766j7601q2088J23328n1742j91184J6738J32317J18529
1882G1835R0802j89360N2637P5053j93955J5726p084m1361J23245j67337J21382
$$ plain form
1958 649907 638247 540900 429666 456988 429316 335651 491841 397966 193982 318273 433340
1947 433340 384358 256243 125052 382213 260937 203659 191440 283154 210192 80178 413145
1936 413145 289268 130004 70836 391721 309387 326184 320726 177733 5701 135864 279680
1925 279680 426812 390095 209531 -106863 -24063 35779 -96081 -31335 37540 38799 125334
1914 125334 69901 128745 127225 39328 -89483 80652 167235 59271 214295 253117 341052
1903 341052 183786 30296 -7993 -109315 -63778 63750 -180284 -142641 73360 62274
1893 62274 121334 39304 23538 5937 -76151 47177 -4565 -195749 -179011 -46694 71835
1882 71835 162637 -26723 25914 100967 -92988 -77262 -84346 -125707 -2462 -169799 -48417
1871d8417Q4081r0377j19104O9233r574J08451O8776o4457J48014P9643j16717
1860A09552L5739J02332l14370k58981M6860K30900m1083J15088j23699M5257
1850e2405P8968j28065M2795K8142j62721J14253J02830k14319p1079j8991o0109
1839c40701J77120n7132J78121K24382j85027n1930o9211L9110L8580o7299N7869
1828e6118P5596p7569K34145n0459J20405q1325P5358N5412j48559m2871J74794
1817B78809J45069j60775j27314J37366j57087l439k0697k15255k26221J89631
1807a59913Q5927J59576j16351l266J65453k4585K4202k50577r8753K62748J34141
1796A78602j43396l2922J00930J47915j55456p8975n5316k81415n2561L05571
$$ plain form
1871 -48417 35664 -54713 -173817 -104584 -114158 -5707 63069 -1388 146626 226269 109552
1860 109552 145291 247623 -66747 -325728 -278868 -47968 -89051 26037 -97662 -52405
1850 -52405 26563 -101502 -58707 -30565 -193286 -79033 23797 -190522 -261601 -280592 -340701
1839 -340701 -163581 -220713 -42592 181790 -3237 -55167 -124378 -85268 -46688 -113987 -56118
1828 -56118 19478 -58091 176054 125595 246000 164675 240033 295445 146886 104015 278809
1817 278809 423878 263103 135789 273155 116068 112629 91932 -123323 -349544 -159913
1807 -159913 -73986 85590 -30761 -34027 131426 106841 131043 -119534 -218287 44461 178602
1796 178602 35206 2284 103214 251129 95673 16698 -38618 -320033 -372594 -67023
1786f7023J35875k24558l12230L7946K52060P0762J29045O6747k76693O2340N0176
1775g5553k3813J16378j18205m447J67588r6609j11161j63396P2908J51633n8309
1764a42986K8917O2656K2122m0725o0490J11785j28349N1005Q0800r0768n1787
1753a57820J30663J33633k65777m5723J41751R0088k0467q0434l76501M8126L75187
1742b7274N9863j04790p6413P6474j76921J1592J45484J85345j46838r62M491
1731d9949j81613j50020K40077Q3122k9626J13135Q035J44553j98838L983j59726
1720a76867j87856J24990J49124R3177J6603R0229j30852j61965q6986J59107
1710a11296P4700J77347l7304j80211l6854r1767k475J05597l3800j69155K60072
$$ plain form
1786 -67023 68852 -155706 -467936 -429990 -177930 -107168 21877 88624 -188069 -125729 -75553
1775 -75553 -99366 17012 -101193 -105640 61948 -34661 -145822 -309218 -236310 -84677 -142986
1764 -142986 -114069 -51413 -29291 -70016 -130506 -18721 -147070 -96065 -15265 -106033 -157820
1753 -157820 -27157 106476 -159301 -205024 -63273 26815 6348 -74086 -450587 -402461 -27274
1742 -27274 32589 -72201 -148614 -72140 -249061 -237469 -91985 93360 -53478 -54440 -49949
1731 -49949 -231562 -381582 -141505 -58383 -88009 25126 33161 177714 -21124 -17141 -176867
1720 -176867 -364723 -239733 -90609 2568 19171 109400 -21452 -183417 -270403 -111296
1710 -111296 -36596 140751 103447 -76764 -113618 -205385 -207860 -102263 -136063 -305218 -45146
1699d5146K8938N6014l54873j96514L02438J13660R7294o9017J69427L203k0827
1688H4597m03505j01218L05366R7188o5209k43562n9847j4544o3421J47401J88976
1677a27778k7738j88797J51773j87881K96380J82255Q393J7771r409K8105p3902
1666F9172p8519j79694J65269M5145j25964l37562K82881J85589o3629j37467
1656a74779K66651J53939k54049j64266J36225l4281k9774j81864m1658J69814
1646a54042K37766k45444j02257k2498o2594J44724N2083J02449k3047J19279
1636D6419k60230L3442j98195K57269J40642l02368Q3385n5029K00930P9934O6326
1625I2525R1710j21305n3046q9234p3051j00653J6201J09531K11189j88414P8535
$$ plain form
1699 -45146 -16208 39806 -315067 -511581 -209143 -95483 1811 -67206 102221 105424 84597
1688 84597 -318908 -420126 -114760 -17572 -82781 -326343 -386190 -400734 -464155 -316754 -127778
1677 -127778 -155516 -344313 -192540 -380421 -84041 98214 106607 124378 114969 143074 69172
1666 69172 -9347 -189041 -23772 21373 -104591 -442153 -159272 26317 -37312 -174779
1656 -174779 91872 245811 -8238 -172504 -36279 -70560 -100334 -282198 -323856 -154042
1646 -154042 83724 -161720 -263977 -286475 -349069 -204345 -152262 -49813 -72860 46419
1636 46419 -213811 -180369 -378564 -121295 19347 -283021 -199636 -254665 -53735 26199 92525
1625 92525 184235 62930 9884 -79350 -152401 -253054 -236853 -127322 83867 -104547 -26012
1614b6012R8420j04917J48138l08607M8244m9831l8754M6660o721j36384K08966
1603a20798q8009l2964J8178j32238J39275j1603l3287J13320J48486k55467p393
1592b62500M3440K18614r4968p3803J42711k09442M6923L4120P1242j9714L9553
1581f3824j68914j86772m305L18554N307J4781J23587l81653L1698o1912J51004
1570b22449k9646K1628N5920n0624J42585q3941j38084J50766j4027n5228J05996
1559a17104M0358j93706j32761R3956L20143k2737N9213q8340k850J90249l41135
1548a94714M0904R400m6983J06585m2874L6482k07992R3330O2903O1859j57111
1537b38211n0019j3012J07221O0823q6542J95890j32248n3799K76766J50603l93351
$$ plain form
1614 -26012 72408 -32509 115629 -192978 -144734 -194565 -233319 -186659 -193380 -329764 -120798
1603 -120798 -208807 -241771 -223593 -355831 -216556 -228159 -261446 -148126 360 -255107 -262500
1592 -262500 -219060 -446 -95414 -169217 -26506 -235948 -189025 -154905 -83663 -103377 -63824
1581 -63824 -232738 -419510 -423815 -105261 -99954 -85173 38414 -343239 -311541 -373453 -222449
1570 -222449 -252095 -230467 -174547 -225171 -82586 -166527 -304611 -153845 -167872 -223100 -117104
1559 -117104 -76746 -270452 -403213 -309257 10886 -11851 47362 -40978 -43828 146421 -194714
1548 -194714 -153810 -144410 -191393 -84808 -127682 -91200 -299192 -205862 -142959 -81100 -238211
1537 -238211 -288230 -301242 -194021 -133198 -219740 -23850 -156098 -209897 66869 217472 -175879
1526a75879J26177m1945M978n0105j05616J66320K67082l19893M7092K7435J5913
1515c8441j97558j86329J52910Q8606L25070j62668o7015J41044j08551o2296
1505a15228l5758J16406j51881l35287K99012L29280K54314l6269l94697j4129
1495h4237J1676J5954O3812k24272j22381L98631m5840R3167J0m96915J83536
1484b06859j20863P1661J34034j44243J85324N1112Q0991k11915j88488J44028
1474b05218L0494K9611J43692O9922j79223N1524l0458J43224J10069j90595j58533
1463a85491K1934q8326K77125K9889m7754n8293j06276Q0884O6394K038Q442K14009
1451B14575J4471k00203j43168K8753O2463J09440m5471j86635k1528J06584j99303
$$ plain form
1526 -175879 -49702 -91647 -86669 -136774 -242390 -76070 191012 -128881 -81789 -54354 -38441
1515 -38441 -235999 -422328 -269418 -180812 144258 -18410 -85425 55619 -52932 -115228
1505 -115228 -150986 -34580 -186461 -521748 -222736 106544 360858 324589 -70108 -84237
1495 -84237 -72561 -56607 7205 -217067 -339448 59183 13343 106510 106520 -390395 -206859
1484 -206859 -327722 -256061 -122027 -266270 -80946 -29834 51157 -160758 -349246 -205218
1474 -205218 -174724 -145113 -1421 68501 -110722 -59198 -89656 53568 163637 -26958 -185491
1463 -185491 -163557 -251883 25242 55131 7377 -50916 -157192 -76308 -9914 -7876 566 214575
1451 214575 229046 28843 -114325 -85572 -23109 86331 40860 -145775 -167303 -60719 -260022
1440b60022K60145J36454j67442j17432O3516K4264N3012o1853m409J84914j58378
1429d7231o6122m1870p4910l7597L27087L7749n2260P2206k07611k88372L69044
1418i887p5770M4936j16892K01029N7089j88002k24921k1693J86292p6829P5213
1407a49435K0094R3057j13464j06682P0154N2085J1004K0920P5471q1867j50662
1396b59325Q3475J5324N0712m3976j6824N9836j43058J96555Q0755j48061q5650
1385b10237J27543k05319l5021J10160m448O6788j73170M1960M7760J51845O8347
1374a3792L1523k99103J81858L7091o3738R317j0265K476Q5052J18970O3930j43397
1362g8J9145n6215J29947P487j30270n4128r198j88092k0003J08540J85655k03830
$$ plain form
1440 -260022 123 136577 -30865 -148297 -84781 -60517 -7505 -69358 -73767 111147 -47231
1429 -47231 -113353 -155223 -230133 -267730 59357 97106 44846 117052 -90559 -378931 -9887
1418 -9887 -85657 -40721 -157613 43416 100505 -87497 -312418 -334111 -147819 -224648 -149435
1407 -149435 -129341 -36284 -149748 -256430 -186276 -134191 -123187 -102267 -26796 -108663 -259325
1396 -259325 -175850 -160526 -109814 -153790 -170614 -110778 -253836 -57281 23474 -124587 -210237
1385 -210237 -82694 -288013 -323034 -212874 -217322 -150534 -323704 -281744 -233984 -82139 -13792
1374 -13792 17731 -281372 -99514 -62423 -126161 -116844 -127109 -124633 -39581 79389 143319 -78
1362 -78 19067 -37148 92799 100286 -29984 -84112 -93310 -281402 -301405 -192865 -7210 -211040
1350b11040M1968M800k5734p4933K55094J02593k16045p2408P8608O6383l4720
1339h5434K03135l0574J3491k2431n4766k36565R9805K51393m4006M8450r4351
1328D8147j07782O2240k32633k53156K11346K35142J63097J69378l27228r3265
1318a24714P4601P3475n0696O1388j06365j46707K9138K12526k9281j65702K26060
1307E3723n8410j09480M4507n610O8753k52486J43034J46557P1413r5274p5472
1296f8745k38018J23683Q7350j33547p9658O5072o3715Q0288O3812P6528K10669
1285A23719k56162R6267j55194p6848J58573n2229n6082O1275j8623m1261J36998
1274g9567N62j31567J26738J27839N2182k21599L0325J04277r3833j39990R4210
$$ plain form
1350 -211040 -169072 -164272 -190006 -264939 -9845 92748 -123297 -195705 -117097 -50714 -85434
1339 -85434 117701 87127 100618 78187 23421 -213144 -113339 138054 94048 142498 48147
1328 48147 -59635 2605 -230028 -483184 -271838 -36696 126401 295779 -31449 -124714
1318 -124714 -50113 23362 -27334 34054 -72311 -219018 -189880 22646 -6635 -172337 53723
1307 53723 -4687 -114167 -69660 -75270 -6517 -259003 -115969 30588 102001 6727 -68745
1296 -68745 -306763 -183080 -95730 -229277 -308935 -243863 -307578 -227290 -163478 -86950 123719
1285 123719 -132443 -36176 -191370 -268218 -109645 -161874 -217956 -156681 -175304 -216565 -79567
1274 -79567 -79005 -210572 -83834 44005 96187 -125412 -95087 9190 -84643 -224633 -130423
1263a30423m0358n2916N2876l0573j40879J28406n4189j21768K11960r6031J05240
1252a68655J08481r0903J51600J01717k21350N9404K5269j96256J3200J70497
1242d6996J86314k9131k60221r9367M5589J51722O6825j85083K4699K3730N5451
1231f6468P7005j47270K09353J05199q3391j10677o6972J37797M5191J11117q6112
1220A24772k98659K18148N000K6853n39j4592Q1079j8035j43743l7603r6033J74275
1208B0923k19038J58169K87525j96182r0109N531k8129J28152J11006q4202j05924
1197a2278q2421N7232P9153k10817K7740J09830j17001J18461l8286J03945m1863
1186f305P3228O7224j58010j57572J80961j59998K01030m36R9922j14393P1378
$$ plain form
1263 -130423 -170781 -223697 -170821 -201394 -342273 -213867 -268056 -389824 -177864 -273895 -168655
1252 -168655 -60174 -151077 523 102240 -119110 -59706 -34437 -230693 -217493 -46996
1242 -46996 139318 110187 -150034 -249401 -203812 -52090 14735 -170348 -145649 -121919 -66468
1231 -66468 10537 -136733 72620 177819 94428 -16249 -83221 54576 99767 210884 124772
1220 124772 -173887 44261 49261 76114 75575 60983 142062 124027 -19716 -57319 -153352 20923
1208 20923 -198115 -39946 247579 51397 -38712 -33181 -61310 66842 177848 93646 -12278
1197 -12278 -94699 -37467 41686 -169131 -141391 -31561 -148562 -30101 -68387 35558 -6305
1186 -6305 66923 134147 -23863 -181435 -474 -160472 40558 40122 140044 25651 97029
1175I7029l8j74795k8170K6277J26527m4790J58022K48159M652l56164J64406
1164B21115J2464n5323P9672k61833J07445j42155j7421o9941J1370J2075R2368
1153a0164j18777R1965K42307m0374q747j5985k1293j41908J19491J74215l45328
1142g4598p2383K69215k90870J12628n8543J75145q6783Q9728M1148j07449j34613
1131a37375n5199J10803J58239N7101q7997j41347j67686j999J66975j8265N3917
1120f2833J49377k56385J76029J56018j76312l5255l7309O5734J66825M6580n8634
1109A33835j51475K4301J04838j06005j62940k690J67112J9600L82161j86083
1099B22654l08429p1432J6163k3225k6070k6442q5448J10615L8443M6826J7378
$$ plain form
1175 97029 96991 -77804 -105974 -79697 46830 2040 160062 408221 412873 56709 221115
1164 221115 233579 178256 257928 -3905 103540 -38615 -56036 -125977 -114607 -102532 -10164
1153 -10164 -128941 -36976 205331 164957 156210 140225 118932 -22976 96515 270730 -74598
1142 -74598 -146981 122234 -168636 -56008 -114551 60594 -26189 63539 104687 -2762 -137375
1131 -137375 -192574 -81771 76468 133569 45572 -95775 -263461 -265460 -98485 -116750 -62833
1120 -62833 86544 -169841 6188 162206 -14106 -49361 -86670 -20936 145889 192469 133835
1109 133835 -17640 6661 111499 5494 -157446 -160136 6976 26576 408737 222654
1099 222654 -85775 -157207 -141044 -164269 -190339 -216781 -302229 -191614 -153171 -106345 -88967
1088h8967J49377j41206R7524j65510J30010j72760m5741J60373j28810J97781
1078g929J12842j66825q1637J452M0429o7784k4212J53775R6401m9010j83630
1067a76128j89339J86557L86580J06851j15739q153r2920j79791K30796j16370
1057C2344R898K94783j43673j27447r7362R2634K6903j46919K6160r2570J7983
1046a07266J18525Q691l5248J83551O66m5070j16058Q3291N9483r1950j809J06824
1034A63630L8207j34028L9767K41201j35247r3544J6660o6279j9598k67192o107
1023b22530K86018p1629k2347K44300J2819j46900j25935K6635J93261r908J37945
1012C01729Q6073n61508J43885J01216R4950k38925N9044p0215J19133r7231j22574
$$ plain form
1088 -88967 60410 -80796 16728 -148782 -18772 -191532 -237273 -76900 -205710 -7929
1078 -7929 104913 -61912 -143549 -142097 -101668 -169452 -193664 -39889 56512 7502 -176128
1067 -176128 -365467 -178910 207670 314521 198782 190629 97709 -82082 148714 32344
1057 32344 42242 337025 193352 65905 -31457 61177 88080 -58839 -32679 -125249 -107266
1046 -107266 11259 19950 -15298 168253 168919 123849 7791 91082 150565 58615 56806 163630
1034 163630 201837 67809 107576 348777 213530 119986 136646 70367 50769 -216423 -222530
1023 -222530 63488 -8141 -30488 213812 226631 79731 -46204 -19569 173692 163784 301729
1012 301729 387802 -173706 -29821 71395 166345 -72580 -13536 -83751 35382 -61849 -184423
1001a84423L21325N5312l29795j82412M61594N4304j68351L304K18716J04762
991C54336N5437j62649k09282o6841J6873k06204J65571R6872J6038P695j22383
980e4537p1490K03586M8275R5713k1204o3130o2235j32359J39526j66110P9169
969d796J84248j11091J83834p8599K4470k210r85m9569J9968q0379j0835K8291
957A02347q1474L385K18055K7463o8151j45985k8877K2750k24244m2569J86890
946c0410J05910Q9361K02056j27250k13991K4925k1211p4495N8217j69109J96793
935D0796J00362J063J93034k98857j5615K35927n0595k57916L6634Q3001J84065
924B51899N2014j54753k45228p506q6668J62840J15196N1642n1196j03420P1695
$$ plain form
1001 -184423 136902 192214 -137581 -319993 141601 195905 27554 30858 249574 354336
991 354336 409773 247124 37842 -28999 -12126 -218330 -52759 44113 60151 67846 -54537
980 -54537 -126027 77559 125834 221547 200343 137213 74978 -57381 82145 -83965 -4796
969 -4796 179452 68361 252195 173596 198066 195856 194871 145302 165270 84891 74056 102347
957 102347 20873 24258 242313 269776 201625 55640 26763 49513 -174731 -217300 -30410
946 -30410 75500 164861 366917 239667 25676 50601 29390 -45105 13112 -155997 40796
935 40796 141158 142221 335255 36398 20783 256710 206115 -51801 -15167 67834 251899
924 251899 303913 149160 -96068 -103574 -190242 -27402 87794 139436 88240 -15180 56515
$$ [...]
##END NTUPLES=NMR SPECTRUM
##END=
