##TITLE=1H_CA-8912-1
 CDCl3, 8 sc, 
 5.08.2021
##JCAMPDX= 6.0         $$ Bruker NMR JCAMP-DX V2.0
##DATA TYPE= NMR SPECTRUM
##DATA CLASS= NTUPLES
##ORIGIN= UXNMR, Bruker Analytische Messtechnik GmbH
##OWNER= root
$$ XWIN-NMR		Version 3.5
$$ Thu Aug  5 08:42:50 2021 Russian Standard Time (UT+4h)  she@DPX200
##.OBSERVE FREQUENCY= 200.131506
##.OBSERVE NUCLEUS= ^1H
##.ACQUISITION MODE= SIMULTANEOUS
##.ACQUISITION SCHEME= undefined
##.AVERAGES= 8
##.DIGITISER RES= 18
##SPECTROMETER/DATA SYSTEM= spect
##.PULSE SEQUENCE= zg30
##.SOLVENT NAME= DMSO
##.SHIFT REFERENCE= (INTERNAL, DMSO, 0, 17.5277)
##AUDIT TRAIL= $$ (NUMBER, WHEN, WHO, WHERE, WHAT)
$$ ##TITLE= Audit trail, XWIN-NMR		Version 3.5
$$ ##JCAMPDX= 5.01
$$ ##ORIGIN= Bruker BioSpin GmbH
$$ ##OWNER= she
$$ F:/spectra/data/she/nmr/H-F/1/pdata/1/auditp.txt
$$ ##AUDIT TRAIL=  $$ (NUMBER, WHEN, WHO, WHERE, WHAT)
(   1,<2021-08-05 08:40:39.31 +0400>,<she>,<DPX200>,
      <created by zg, POWCHK disabled, PULCHK disabled
       configuration hash MD5:
       00 E9 B6 7A A2 85 ED C7 34 08 36 98 17 FE 4E 26
       data hash MD5: 16K
       46 9D E1 84 41 11 4F 0D 76 C4 CD 25 E7 F5 2C 9E>)
(   2,<2021-08-05 08:41:01.20 +0400>,<she>,<DPX200>,
      <Start of raw data processing
       efp BC_mod = 2 LB = 0.24 FT_mod = 6 PKNL = 1 PHC0 = -13356.05 PHC1 = 14.60099 SI = 16K 
       data hash MD5: 16K
       24 6D EE 44 B7 0B 41 A3 FE 20 2E A2 06 E9 5B 17>)
(   3,<2021-08-05 08:41:04.98 +0400>,<she>,<DPX200>,
      <abs ABSG = 5 
       data hash MD5: 16K
       49 90 FD 5E AC 98 7E 37 09 CD 06 1C E6 DF 5D B3>)
(   4,<2021-08-05 08:41:24.39 +0400>,<she>,<DPX200>,
      <pk PHC0 = -9.215433 PHC1 = 10.2 
       data hash MD5: 16K
       E0 B6 A0 44 ED 34 25 E8 D8 51 62 BA 02 B5 A9 AA>)
(   5,<2021-08-05 08:41:27.78 +0400>,<she>,<DPX200>,
      <abs ABSG = 5 
       data hash MD5: 16K
       3E 13 8F 0F A8 EC C7 27 1C 15 7C 12 63 4C 2D C6>)
(   6,<2021-08-05 08:41:58.98 +0400>,<she>,<DPX200>,
      <pk PHC0 = -1.070787 PHC1 = 0.4000077 
       data hash MD5: 16K
       58 07 82 3B 39 7A DF BE E2 00 5A E1 78 38 CD 88>)
(   7,<2021-08-05 08:42:02.42 +0400>,<she>,<DPX200>,
      <abs ABSG = 5 
       data hash MD5: 16K
       D8 E9 EE 5B 6E F9 5B 71 4B 00 F8 63 F2 FF 54 3E>)
$$ ##END=
$$ 
$$ hash MD5
$$ 47 F5 1E 52 FE E6 D0 D4 B7 82 D6 12 5D EC CB 58
##$RELAX= 
##$RELAX= 
##$RELAX= 
##$RELAX= 
##$RELAX= 
##$RELAX= 
$$ Bruker specific parameters
$$ --------------------------
##$DU= <F:/spectra>
##$EXPNO= 1
##$NAME= <H-F>
##$PROCNO= 1
##$TYPE= <nmr>
##$USER= <she>
##$AMP= (0..31)
100 100 100 100 100 100 100 100 100 100 100 100 100 100 100 100 100 100 
100 100 100 100 100 100 100 100 100 100 100 100 100 100 
##$AQSEQ= 0
##$AQ_mod= 1
##$AUNM= <au_zg>
##$AUTOPOS= <>
##$BF1= 200.13
##$BF2= 200.13
##$BF3= 200.13
##$BF4= 200.13
##$BF5= 200.13
##$BF6= 200.13
##$BF7= 200.13
##$BF8= 200.13
##$BYTORDA= 1
##$CFDGTYP= 0
##$CFRGTYP= 5
##$CHEMSTR= <none>
##$CNST= (0..31)
$$ [...]
##$SUBNAM3= <"">
##$SUBNAM4= <"">
##$SUBNAM5= <"">
##$SUBNAM6= <"">
##$SUBNAM7= <"">
##$SUBNAM8= <"">
##$SUBNAM9= <"">
##$SW= 20.0188882624521
##$SWIBOX= (0..15)
0 0 2 0 0 0 0 0 0 0 0 0 0 0 0 0 
##$SW_h= 4006.41025641026
##$TD= 16384
##$TD0= 1
##$TE= 0
##$TE2= 300
##$TE3= 300
##$TEG= 300
##$TL= (0..7)
0 120 120 120 120 120 120 120 
##$TP= (0..7)
150 150 150 150 150 150 150 150 
##$TP07= 0
##$TPNAME0= <>
##$TPNAME1= <>
##$TPNAME2= <>
##$TPNAME3= <>
##$TPNAME4= <>
##$TPNAME5= <>
##$TPNAME6= <>
##$TPNAME7= <>
##$TPOAL= (0..7)
0.5 0.5 0.5 0.5 0.5 0.5 0.5 0.5 
##$TPOFFS= (0..7)
0 0 0 0 0 0 0 0 
##$TUNHIN= 0
##$TUNHOUT= 0
##$TUNXOUT= 0
##$USERA1= <user>
##$USERA2= <user>
##$USERA3= <user>
##$USERA4= <user>
##$USERA5= <user>
##$V9= 5
##$VALIST= <valist>
##$VCLIST= <CCCCCCCCCCCCCCC>
##$VD= 0
##$VDLIST= <DDDDDDDDDDDDDDD>
##$VPLIST= <PPPPPPPPPPPPPPP>
##$VTLIST= <TTTTTTTTTTTTTTT>
##$WBST= 1024
##$WBSW= 4
##$XGAIN= (0..3)
0 0 0 0 
##$XL= 0
##$YL= 0
##$YMAX_a= 321873
##$YMIN_a= -525662
##$ZGOPTNS= <>
##$ZL1= 120
##$ZL2= 120
##$ZL3= 120
##$ZL4= 120
##$ABSF1= 17.48978
##$ABSF2= -2.529257
##$ABSG= 5
##$ABSL= 3
##$ALPHA= 0
##$AQORDER= 0
##$ASSFAC= 0
##$ASSFACI= 0
##$ASSFACX= 0
##$ASSWID= 0
##$AUNMP= <proc_1d>
##$AZFE= 0.1
##$AZFW= 0.1
##$BCFW= 0
##$BC_mod= 2
##$BYTORDP= 0
##$COROFFS= 0
##$CY= -3
##$DATMOD= 1
##$DC= 0
##$DFILT= <>
##$DTYPP= 0
##$F1P= 0
##$F2P= 0
##$FCOR= 1
##$FTSIZE= 16384
##$FT_mod= 6
##$GAMMA= 0
##$GB= 0
##$INTBC= 1
##$INTSCL= 1.334414e-10
##$ISEN= 128
##$LB= 0.24
##$LEV0= 0
##$LPBIN= 0
##$MAXI= 10000
##$MC2= 0
##$MEAN= 0
##$ME_mod= 0
##$MI= 1.114404
##$NCOEF= 0
##$NC_proc= -8
##$NLEV= 6
##$NOISF1= 3.799351
##$NOISF2= 2.8
##$NSP= 0
##$NTH_PI= 0
##$NZP= 0
##$OFFSET= 17.52766
##$PC= 1
##$PHC0= -13366.34
##$PHC1= 25.201
##$PH_mod= 1
##$PKNL= yes
##$PPARMOD= 0
##$PSCAL= 0
##$PSIGN= 0
##$REVERSE= no
##$SF= 200.130001395406
##$SI= 16384
##$SIGF1= 3
##$SIGF2= 2
##$SINO= 5.538805
##$SIOLD= 16384
##$SREGLST= <1H.CDCl3>
##$SSB= 0
##$STSI= 16384
##$STSR= 0
##$SW_p= 4006.41025641026
##$SYMM= 0
##$S_DEV= 0
##$TDeff= 16384
##$TDoff= 0
##$TI= <>
##$TILT= no
##$TM1= 0
##$TM2= 0
##$TOPLEV= 0
##$USERP1= <user>
##$USERP2= <user>
##$USERP3= <user>
##$USERP4= <user>
##$USERP5= <user>
##$WDW= 1
##$XDIM= 16384
##$YMAX_p= 514537704
##$YMIN_p= -1745316
$$ End of Bruker specific parameters
$$ ---------------------------------
##NTUPLES= NMR SPECTRUM
##VAR_NAME=  FREQUENCY,     SPECTRUM/REAL,   SPECTRUM/IMAG
##SYMBOL=    X,             R,               I
##VAR_TYPE=  INDEPENDENT,   DEPENDENT,       DEPENDENT
##VAR_FORM=  AFFN,          ASDF,            ASDF
##VAR_DIM=   16384,         16384,           16384
##UNITS=     HZ,            ARBITRARY UNITS, ARBITRARY UNITS
##FACTOR=    0.24454680195387, 1,            1
##FIRST=     3507.8106942809, 0,             0
##LAST=      -498.599562129365, 0,           0
##MIN=       -498.599562129365, -1745316,    0
##MAX=       3507.8106942809, 514537704,     0
$$ Real data points
##PAGE= N=1
##DATA TABLE= (X++(R..R)), XYDATA
$$ [...]
5968B405727j90677m90399j80221M34019P8167J04055k33110L72198K9294p4568
5958B254485k65596K06483n9795J50037j2934o01678K86532K54184l72393m6628
5948A792697J45702r4171K60684M46107J39362K4299k95269J70562O2188r5645
5938B556516K70086j25708M739o98284Q6169Q43738j4752l37816j61938K97943
5928B720693N8268l84071R7529P9260r9228J1871l27014J8070j63435K7420L03566
5917B342929L547J74626l32202L69556M37300j10401j12056k60953J59310L49316
5907C020972J83030l62050n11541J91533L85553k7724m57721J40933J44655n14055
5897B193585K47248j92793K99498L99239p9425k26117N0067l00004l3294N28926
$$ y = [2405727, 2215050, 1724651, 1544430, 1978449, 2056616, 2160671, 1927561, 2299759, 2329053, 2254485, 1988889, 2195372, 2135577, 2285614, 2272680, 1671002, 1957534, 2211718, 1839325, 1792697, 1938399, 1844228, 2104912, 2551019, 2690381, 2714680, 2419411, 2589973, 2652161, 2556516, 2826602, 2700894, 2705633, 2007349, 2093518, 2937256, 2922504, 2584688, 2422750, 2720693, 2778961, 2394890, 2492419, 2571679, 2472451, 2484322, 2157308, 2175378, 2011943, 2039363, 2342929, 2346476, 2521102, 2188900, 2558456, 2995756, 2885355, 2773299, 2512346, 2671656, 3020972, 3204002, 2841952, 2330411, 2521944, 2907497, 2879773, 2422052, 2562985, 2707640, 2193585, 2440833, 2248040, 2547538, 2946777, 2867352, 2641235, 2691302, 2391298, 2358004, 2886930]
5887B886930L784l5706K41468n56805L51186N2350k25441R7732k37109K88351
5877B866740J57798l86747O4741L27802K90927L86018n71555l29538K02503M19866
5867C428555Q7725p2432m5102p86712L77496K04878K14679Q2841m32614M36252
5857C495566J20734j87734l1897K73678n91827P3983O90383L19018q22711L9862
5847C379055q4841p9805p0546O6321l37309O1443L50864K70581J07615n569j70579
5836C487230L28558l12360J52076k54117L56365j04623K7912j24306k96110L94681
5826C655306N3829l16963L62447q6898l30331j7156k67619M02632O49439J91880
5816D296566O1792l69449p59979L82202P52455q9441l04180L3491k27262J42854
$$ y = [2886930, 2890714, 2855008, 3096476, 2539671, 2890857, 2943207, 2717766, 2815498, 2578389, 2866740, 3024538, 2637791, 2702532, 3030334, 3321261, 3707279, 3135724, 2806186, 3008689, 3428555, 3516280, 3443848, 3398746, 2612034, 2989530, 3194408, 3409087, 3491928, 3059314, 3495566, 3616300, 3428566, 3396669, 3670347, 3078520, 3152503, 3842886, 4161904, 3339193, 3379055, 3294214, 3214409, 3143863, 3210184, 2872875, 2934318, 3285182, 3555763, 3663378, 3657809, 3487230, 3815788, 3503428, 3655504, 3401387, 3757752, 3653129, 3681041, 3556735, 3260625, 3655306, 3709135, 3392172, 3754619, 3667721, 3337390, 3320234, 3052615, 3455247, 4104686, 4296566, 4358358, 3988909, 3228930, 3611132, 4363587, 4274146, 3969966, 4003457, 3776195, 3919049]
5806C919049K65891K6892n63652P09331K13417j12562k88641m4964j15132M3221
5796D052850K65119l13490J32145j94416M56481j27335L5354n8866j46970J92313
5786D293185J30615M22938o59848K95145L40763K60220J24982r4100j61235J59591
5776E112256l48775K55704m056J76949k07758k05814O2067L09238J04656k52243
5766E002224P71996L67637k60704k20168j93498L73087J60061M72893O1178k44257
5756F290449R2598J22910n03741M92616R0685K03006N8275l76704J2246K11618
5746F693958J50118k81305J39456L99621r79J17126L86292K94486K24688J68358
5736H291819P6177r6293N46496n9364r6729J28086P85406j90752K79247M60835
$$ y = [3919049, 4184940, 4211832, 3648180, 4357511, 4570928, 4458366, 4169725, 4124761, 4009629, 4052850, 4317969, 4004479, 4136624, 3942208, 4398689, 4271354, 4306708, 4247842, 4100872, 4293185, 4423800, 4846738, 4186890, 4482035, 4822798, 5083018, 5208000, 5113900, 4952665, 5112256, 4763481, 5019185, 5015129, 5192078, 4984320, 4778506, 4840573, 5149811, 5254467, 5002224, 5774220, 6141857, 5881153, 5660985, 5467487, 5840574, 6000635, 6473528, 6534706, 6290449, 6383047, 6505957, 6002216, 6494832, 6585517, 6788523, 6846798, 6470094, 6482340, 6693958, 6844076, 6562771, 6702227, 7101848, 7100869, 7217995, 7604287, 7898773, 8123461, 8291819, 8367996, 8271703, 8818199, 8758835, 8662106, 8790192, 9575598, 9384846, 9664093, 10124928]
5726A0124928k85024J92838k15002N57698R22998O3700K4230L55558M69740N45367
5716A2757031N5136O74200L3001l51805O60068N65022L33323L87882M21760L13947
5706A5849565O47289L19269L46667K41663M54707N28078N26479K17826O46073
5697A9777616Q44151N84357L51626O92022M12884P56883M84133P48035N29370
5688B5181077P74551N12404O86092K24546K55906P00402n5622J269958R41711
5679C0491025k20387L76746M83422L64080P06115P75570L39842n8949J109307
5670C4366771M89638M70473P37403r7281P24170J208527K96518O6215M00422J80688
5660C8843544K66814L94949L25139N56520M34619K28650J50898J19169j14454
$$ y = [10124928, 9839904, 10032742, 9817740, 10375438, 11298436, 11362136, 11386366, 11741924, 12211664, 12757031, 12812167, 13486367, 13519368, 13167563, 13827631, 14392653, 14725976, 15113858, 15535618, 15849565, 16496854, 16816123, 17162790, 17404453, 17859160, 18387238, 18913717, 19131543, 19777616, 20621767, 21206124, 21557750, 22249772, 22662656, 23419539, 23903672, 24651707, 25181077, 25955628, 26468032, 27154124, 27378670, 27634576, 28334978, 28279356, 29549314, 30491025, 30270638, 30647384, 31130806, 31494886, 32201001, 32976571, 33316413, 33257464, 34366771, 34856409, 35326882, 36064285, 35967004, 36691174, 37899701, 38196219, 38262434, 38662856, 38843544, 39110358, 39505307, 39830446, 40386966, 40821585, 41050235, 41201133, 41320302, 41205848]
5651D1205848P8130k69474j15162n7264N95299l61m23303P1472k67993l1853L17744
5640D1103083j23479o46168q3081n84119o22289k60031P3329k49094m71850q1618
5630C8054683J53607q38038m88344m75832j091806l13453m25289l88330j83195
5621C4004003k61993l54027j60740j063098r73965j91879k61775o96378q24591
5612B9215557m92650l20127m11699r65281n52033o85195o61406n60521l38568
5603B4228077m79030l71467k74037o02960J26719o74711r12646l98645J98925
5594B0840225l68626j077557K33750J1301o34276o55034m20526J96824n79858
5585A7546223l04723M0372k21144r25438j5090n25071L16117j15980j180949N1187
$$ y = [41205848, 41283978, 41014504, 40899342, 40842078, 41437377, 41437016, 41013713, 41085185, 40817192, 40785339, 41103083, 40979604, 40333436, 40250355, 39666236, 39043947, 38783916, 38857245, 38608151, 38136301, 38054683, 38208290, 37370252, 36881908, 36406076, 35314270, 35000817, 34575528, 34187198, 34004003, 33742010, 33387983, 33227243, 32164145, 31190180, 30998301, 30736526, 30040148, 29215557, 28722907, 28402780, 27991081, 27025800, 26473767, 25788572, 25127166, 24566645, 24228077, 23749047, 23377580, 23103543, 22500583, 22627302, 21952591, 21039945, 20641300, 20840225, 20471599, 19394042, 19627792, 19639093, 19004817, 18349783, 17929257, 18126081, 17546223, 17241500, 17281872, 17060728, 16135290, 16120200, 15595129, 15911246, 15795266, 14614317, 14665504]
5575A4665504K7106o67190k25838k81333M21659r7505k91235m9057j17428N8017
5565A3442700m79112M70943j10677l48009K0716k03617l21384J36383j99882K76347
5555A2684408m74197p4123K36416K63205k17071k24452m33781m3316N08671M50475
5545A2676235l92932n8275J50497J08479J04903j19127Q9342j53598k05551M9096
5535A2249069L42826M3717K04302J73473k22896m23004L10943L88131j62597j89067
5525A2714897J16422P18320k48254k08662K4678J89648j27048K9048j77152k62462
5515A2769435M81454M10169j37254m74905N36085k55662L81738M3246J65338J95346
5505A4114990l36174L47690N2197K07355L65066J4834K1884K5632M27805k52274
$$ y = [14665504, 14692610, 14025420, 13799582, 13518249, 13939908, 13842403, 13551168, 13502111, 13384683, 13442700, 12963588, 13434531, 13323854, 12975845, 12996561, 12792944, 12471560, 12607943, 12408061, 12684408, 12210211, 12136088, 12372504, 12635709, 12418638, 12194186, 11760405, 11717089, 12225760, 12676235, 12283303, 12225028, 12375525, 12484004, 12588907, 12469780, 12559122, 12405524, 12199973, 12249069, 12591895, 12635612, 12839914, 13013387, 12790491, 12367487, 12678430, 13066561, 12903964, 12714897, 12831319, 13549639, 13301385, 13092723, 13117401, 13307049, 13180001, 13209049, 13031897, 12769435, 13250889, 13661058, 13523804, 13048899, 13584984, 13329322, 13711060, 13754306, 13919644, 14114990, 13778816, 14126506, 14178703, 14386058, 14751124, 14765958, 14787842, 14813474, 15241279, 14989005]
5495A4989005m63618K55152N37230L74014j19072J93146L67458J55981Q3346K40457
5485A6613099j52392k74929M24928j2397m5896L13994O71563K65567j11513l79747
5475A7312277Q02297O62988J06447M38014L48311J56801J94694P62612L50436
5466B1134877L80797N0069M74411O77027P24635L30911L94804N40510N58836L51458
5456B5618335L41765K55351P27767K84390M99368P57430N53658O82753N19884
5447C0240701Q54969P24841M97042N22172N89994O00008R20515K14192Q79866
5438C6044300P62158L52444P87221L39237J0690J206678P07009M23154L08799
5429D0941690P77975J08270K73982O49708N76311M53325M59922P80234L71723
$$ y = [14989005, 14525387, 14780539, 15317769, 15691783, 15572711, 15765857, 16133315, 16289296, 16372642, 16613099, 16460707, 16185778, 16610706, 16598309, 16552413, 16866407, 17537970, 17803537, 17692024, 17312277, 18114574, 18777562, 18884009, 19322023, 19670334, 19827135, 20021829, 20784441, 21134877, 21515674, 21565743, 22040154, 22717181, 23441816, 23772727, 24167531, 24708041, 25266877, 25618335, 25960100, 26215451, 26943218, 27227608, 27726976, 28484406, 29038064, 29720817, 30240701, 31095670, 31820511, 32317553, 32839725, 33429719, 34029727, 34950242, 35164434, 36044300, 36806458, 37158902, 37946123, 38285360, 38296050, 39502728, 40209737, 40632891, 40941690, 41719665, 41827935, 42101917, 42751625, 43327936, 43781261, 44241183, 45021417, 45393140]
5420D5393140N33745J7913n08174N08975K66811j00623L18474L86084m4522K84662
5410D7056485M08277K99303J02255O18976O2221K75677K04503L97015N46960K0288
5400D9991960M88836M23818K55768j94076J46810m65321m00942n93733j42434
5391D9510686P55422P948j31944p7049O2271K78082n84903O12561J1848K94474
5381E0739396n39721m97741l07941k32570L02743Q4058l33321r1264M33397o2817
5371D9494219j68270N3927n83015r5518M29898L4507l00132P37483J15035j90409
5361D9527725k81476J10323O42011J64116j67287L41132L3365K2612M31793Q44346
5351E1668660L04585j39615p8543M76481M25061M27406J018496K83057l74228
$$ y = [45393140, 45926885, 45944798, 45436624, 45945599, 46212410, 46111787, 46430261, 46816345, 46771823, 47056485, 47464762, 47764065, 47866320, 48485296, 48547517, 48823194, 49027697, 49424712, 49971672, 49991960, 50480796, 50904614, 51160382, 50966306, 51113116, 50647795, 50246853, 49653120, 49510686, 50266108, 50274056, 50142112, 50065063, 50127334, 50405416, 49820513, 50433074, 50444922, 50739396, 50199675, 49701934, 49393993, 49161423, 49464166, 49548224, 49214903, 49123639, 49557036, 49494219, 49325949, 49379876, 48796861, 48701343, 49131241, 49165748, 48865616, 49603099, 49718134, 49527725, 49246249, 49356572, 49998583, 50162699, 49995412, 50336544, 50369909, 50392521, 50824314, 51668660, 51973245, 51833630, 51755087, 52231568, 52656629, 53084035, 54102531, 54385588, 54011360]
5342E4011360O53752O19632p51800N25385O77209R74835L2415K00357O60896Q5117
5332E7689158O21796N81311K86677J67096P98670L38305M45005L62729O42049
5323F1932796N11891l20183K92062J082599J31132j43367R65927O97040L34958
5314F5484855J88918L48794R3449O12846M4626L33808K63446m21696N4736O25624
5304F7629406J53730J61143K84591L4817k93377L76270K06710L92353J48246K62299
5294F9356188j36010k00268l64438q5666L2364j82956K6532j86701j67231n778
5284F8086036j05370P6595j78087k97654o06342j44575o5682n81581q8628j73044
5274F5921668j10870n60285m92269k784l41546j16986k87117p92326j57396j27446
$$ y = [54011360, 54665112, 55284744, 54532944, 55058329, 55735538, 56710373, 56742788, 56943145, 57604041, 57689158, 58310954, 58892265, 59178942, 59346038, 60144708, 60483013, 60928018, 61290747, 61932796, 62444687, 62124504, 62416566, 63499165, 63630297, 63486930, 64452857, 65149897, 65484855, 65673773, 66022567, 66116016, 66728862, 66773488, 67107296, 67370742, 66949046, 67003782, 67629406, 67783136, 67944279, 68228870, 68263687, 67970310, 68346580, 68553290, 68945643, 69093889, 69356188, 69220178, 69019910, 68655472, 68569806, 68602170, 68419214, 68445746, 68259045, 68091814, 68086036, 67980666, 68057261, 67879174, 67581520, 66975178, 66830603, 66764921, 66183340, 66094712, 65921668, 65810798, 65250513, 64758244, 64755460, 64413914, 64296928, 64009811, 63217485, 63060089, 62932643]
5264F2932643j2309n09924o11660j20018J9188j71079m53088q78629p00731P6567
5254E9570960m5143o9279K62743o09926p76815K70447j24994r6278m72829m0823
5244E7868063l41669k7828J77361l78845p1486j16433K90286Q701n3718m35016
5234E6919416k213K28543K4251o190q191K97225K81113K88140L92521J0100q357
5223E8416358K06707L26319M43476J78760P43109M37188m11424R60397Q91545
5214F2192435Q77165N53745Q10112P01066O12807J420437J059582N82065R58642
5205F9768056J089716J421163J478494P21502J732999J314959J521440K061017
5197H1109346J416419J705073J428114J440794K483398J900328J527397J681088
$$ y = [62932643, 62920334, 62410410, 61798750, 61678732, 61697920, 61526841, 61073753, 60195124, 59494393, 59570960, 59525817, 59456538, 59719281, 59109355, 58332540, 58602987, 58477993, 58381715, 57908886, 57868063, 57526394, 57498566, 57675927, 57297082, 57225596, 57109163, 57399449, 57408150, 57354432, 56919416, 56917203, 57145746, 57169997, 57163807, 57155616, 57452841, 57733954, 58022094, 58414615, 58424715, 58416358, 58623065, 58949384, 59392860, 59571620, 60314729, 60751917, 60340493, 61300890, 62192435, 63069600, 63623345, 64433457, 65134523, 65747330, 67167767, 68227349, 68809414, 69768056, 70857772, 72278935, 73757429, 74478931, 76211930, 77526889, 79048329, 81109346, 82525765, 84230838, 85658952, 87099746, 89583144, 91483472, 93010869, 94691957]
5189I4691957J562302J710539J020759J543220J576182J095373Q41782J029135
5181A05071249M80705K86747O29035M44629N82287o76M07146O20386L85322J006820
5171A09913650O67450P36937N91932O59144J049107J090887J046132J297785J016160
5162A18069184O32873O63604Q91634J365252L85052J169046M74895J66785N03581
5153A24321906M76078k949n30137p2236J23427p7424n28202l33154j58210P33
5143A23219832l81876l90918n05592m68562k08879P3314o96406n24977n56273
5134A19559663k24639j73614k88822k01025l07308r8241l72472n91481o16832
5125A16685229K71961J49235j85735M16050J22949N16790L74082O08304M75764
$$ y = [94691957, 96254259, 97964798, 98985557, 100528777, 102104959, 103200332, 104042114, 105071249, 105551954, 105838701, 106467736, 106912365, 107494652, 107493976, 107901122, 108521508, 108906830, 109913650, 110581100, 111318037, 111909969, 112569113, 113618220, 114709107, 115755239, 117053024, 118069184, 118702057, 119365661, 120257295, 121622547, 122007599, 123176645, 123651540, 123818325, 124321906, 124797984, 124795035, 124264898, 124192662, 124316089, 124238665, 123710463, 123377309, 123219099, 123219832, 122837956, 122447038, 121941446, 121472884, 121264005, 121337319, 120640913, 120115936, 119559663, 119335024, 119161410, 118872588, 118671563, 118364255, 118266014, 117893542, 117302061, 116685229, 116957190, 117106425, 116920690, 117336740, 117459689, 117976479, 118350561, 118958865, 119434629]
5116A19434629O84419N54082j3190m97324K96658M14940l66882m2798K90879j92197
5106A20563216j00692L81667J9131J29604L27920P13696O93014J102263J332086
5097A25161905J547424J836847K021660K339023K180080K330300L298820L355182
5089A44071241L136381L654065L667914L020539K832316J724743J229312N93588
5081A63930099Q11448J261114J412681J276956J351695J850747J353225N40427
5073A73788392J18748l55148m37498k65432Q9149L66001M62227L70724k48020
5064A73889143o69873q61378o58354j788499r42662m87262l02375J22560J95327
5055A68496627J38767J59935m5420p61991j594619k011733k304481k396563j533142
$$ y = [119434629, 120119048, 120673130, 120659940, 120162616, 120459274, 120874214, 120507332, 120464534, 120755413, 120563216, 120462524, 120844191, 120863322, 120992926, 121320846, 122034542, 122727556, 123829819, 125161905, 126709329, 128546176, 130567836, 132906859, 135086939, 137417239, 140716059, 144071241, 147207622, 150861687, 154529601, 157550140, 160382456, 162107199, 163336511, 163930099, 164741547, 166002661, 167415342, 168692298, 170043993, 171894740, 173247965, 173788392, 173907140, 173551992, 173114494, 172849062, 172938211, 173304212, 173766439, 174137163, 173889143, 173219270, 172357892, 171699538, 169911039, 168968377, 168481115, 168178740, 168301300, 168496627, 168635394, 168795329, 168749909, 167987918, 166393299, 164381566, 162077085, 159680522, 158147380]
5046A58147380j925904j085613j030334q29023n26020l87271n3159M36766J28111
5037A52874933O52255K5302M39326P18630O33161Q72066Q29150Q50788J074627
5028A58970238P52408J018965Q61673J73381N08738Q00657J048203J547238J340503
5019A67022004R57810O97842J202637J640373J483349J455033J576239J011334
5011A77046621J509704J574503J728679J243169J486591K376661Q63686J064523
5003A88894137J665188J510824J248230J348539J915122J714366J351422J292370
4995B00940198J593160K028532J606762K256559J940245J698914J926637J853339
4987B15844346J953823K168934K404428K308757J756479K304809K353442J844672
$$ y = [158147380, 156221476, 155135863, 154105529, 153276506, 152750486, 152363215, 152310056, 152746822, 152874933, 153527188, 153552490, 153991816, 154710446, 155343607, 156215673, 157044823, 157895611, 158970238, 159722646, 160741611, 161603284, 161776665, 162285403, 163086060, 164134263, 165681501, 167022004, 167979814, 168677656, 169880293, 171520666, 173004015, 174459048, 176035287, 177046621, 178556325, 180130828, 181859507, 183102676, 184589267, 186965928, 187829614, 188894137, 190559325, 192070149, 193318379, 194666918, 196582040, 198296406, 199647828, 200940198, 202533358, 204561890, 206168652, 208425211, 210365456, 212064370, 213991007, 215844346, 217798169, 219967103, 222371531, 224680288, 226436767, 228741576, 231095018, 232939690]
4979B32939690K259434K361200J854755K374973K338189K691291K432744K316166
4971B51568442K462235K139162K498854K684310K225889K475568K317612K957739
4963B71329811K401945K732721K230352K239322K645769K648930L187899K569706
4955B91986455K315528K678702K664278K935258K733419K441639K977677K315308
4947C13048264K697578K554736K417613K486406K441339K481705K575776K686433
4939C33389850K614250K740269K750578K296995K859169J806800K222592L002360
4931C53682863K103673K296214K097265K374386K350544K300842K029028J444585
4923C70679400J886962K144578J848700K234946J574902J741250J469089J727094
$$ y = [232939690, 235199124, 237560324, 239415079, 241790052, 244128241, 246819532, 249252276, 251568442, 254030677, 256169839, 258668693, 261353003, 263578892, 266054460, 268372072, 271329811, 273731756, 276464477, 278694829, 280934151, 283579920, 286228850, 289416749, 291986455, 294301983, 296980685, 299644963, 302580221, 305313640, 307755279, 310732956, 313048264, 315745842, 318300578, 320718191, 323204597, 325645936, 328127641, 330703417, 333389850, 336004100, 338744369, 341494947, 343791942, 346651111, 348457911, 350680503, 353682863, 355786536, 358082750, 360180015, 362554401, 364904945, 367205787, 369234815, 370679400, 372566362, 374710940, 376559640, 378794586, 380369488, 382110738, 383579827, 385306921]
4915C85306921J568842J409344J307895J158746J078535J410870N90618J138690
4907C94970461J291234R71668Q88990O47976R59399k49844Q3398K34351K70581
4898D00068214K27763p0888k46747l34390o0962j23167J24021m85837j094904
4889C98003103o58366r15686j033721p16232r02467j006083j181261j357691j467503
4880C88764093r94936j352137j977806j131719j745288j611012k003086j764388
4872C76183721k132127k080079k026130k268000k271552j984225j832336k461520
4864C59127752k554887k477159j974254k389953k641101k255330k731853k829030
4856C39274185k528007k250422k702784k577660k180852k689876l333882k743584
$$ y = [385306921, 386875763, 388285107, 389593002, 390751748, 391830283, 393241153, 393831771, 394970461, 396261695, 397233363, 398122353, 398770329, 399729728, 399479884, 399563282, 399797633, 400068214, 400295977, 400225089, 399978342, 399643952, 399582990, 399459823, 399583844, 399098007, 398003103, 397344737, 396429051, 395395330, 394679098, 393776631, 392770548, 391589287, 390231596, 388764093, 387769157, 386417020, 384439214, 383307495, 381562207, 379951195, 377948109, 376183721, 374051594, 371971515, 369945385, 367677385, 365405833, 363421608, 361589272, 359127752, 356572865, 354095706, 352121452, 349731499, 347090398, 344835068, 342103215, 339274185, 336746178, 334495756, 331792972, 329215312, 327034460, 324344584, 321010702, 318267118]
4848C18267118k508426k301934k977385k231612l039273k907619k668907k435997
4840B97195965k692837k492133k835396l067703k919367k871649k336959k955239
4832B75024682k435465l248939k655706k184415k906436k686878k176331k454408
4824B54276104k269002k908402k328419j927195k863671k296119k360225k647179
4816B34675892k404807k915507j670632k641550k698423k101367j964518j991060
4808B16288028k761236k464932k430614k150243k463911k288418k048959k125802
4800A97553913j811423k045062j607015k343100k056618j728020k145710j888398
4792A81928567j677450j888596k329813j747256j397127k123825k088080j533014
$$ y = [318267118, 315758692, 313456758, 310479373, 308247761, 305208488, 302300869, 299631962, 297195965, 294503128, 292010995, 289175599, 286107896, 283188529, 280316880, 277979921, 275024682, 272589217, 269340278, 266684572, 264500157, 261593721, 258906843, 256730512, 254276104, 252007102, 249098700, 246770281, 244843086, 241979415, 239683296, 237323071, 234675892, 232271085, 229355578, 227684946, 225043396, 222344973, 220243606, 218279088, 216288028, 213526792, 211061860, 208631246, 206481003, 204017092, 201728674, 199679715, 197553913, 195742490, 193697428, 192090413, 189747313, 187690695, 185962675, 183816965, 181928567, 180251117, 178362521, 176032708, 174285452, 172888325, 170764500, 168676420, 167143406]
4784A67143406j682156j486530j847585j273839j707906j859115j613193j658922
4776A54014160j818924j122624j579292k024215j575751j307300j621852j513596
4768A41450606j124544j506559j516686j197364j462898j328942j565949j366860
4760A30380804j134837j012003j011048j618232j453165j397701j181077r12986
4752A20659755j014080j413943p10554j496316j441188r50636l90596j295573
4744A11946869j519440j215609j412866n71261o59234j181739r05197j135076
4736A03346447r69712r80674j048443o66105o71305j175102j186750m11061r89616
4727I5247679j075293p90209j218896q81689p80307m40499j037190j445414j63627
$$ y = [167143406, 165461250, 163974720, 162127135, 160853296, 159145390, 157286275, 155673082, 154014160, 152195236, 151072612, 149493320, 147469105, 145893354, 144586054, 142964202, 141450606, 140326062, 138819503, 137302817, 136105453, 134642555, 133313613, 131747664, 130380804, 129245967, 128233964, 127222916, 125604684, 124151519, 122753818, 121572741, 120659755, 119645675, 118231732, 117521178, 116024862, 114583674, 113633038, 113242442, 111946869, 110427429, 109211820, 107798954, 107227693, 106568459, 105386720, 104481523, 103346447, 102376735, 101396061, 100347618, 99681513, 99010208, 97835106, 96648356, 96237295, 95247679, 94172386, 93382177, 92163281, 91281592, 90501285, 90060786, 89023596, 87578182, 87414555]
4718H7414555m85984r43296o06172p81059q72117m24719n73939j213818n64047
4709H0949404n78630o52945n17088n15940j330672m98294o70768l0292o91855
4700G5462920j361056q45k05605o39201n87202o38893q43305l88230r55815l26926
4690F9515842m04646k50969n73737n39421k13919q01225k55780q37196Q5622j16043
4680F5608528j236544l4709r6166m20526m87341m36868j49584p22440n47917p5776
4670F1400657k85106m39107o68697l21154q8006M07354m92554m03649n37066n56342
4660E8016330l142J94098l89558j96256l59780o53312J71424j33037L40571l40332
4650E6647006l57597J05419k47245J94626M5024l34181o03687L48314K16077Q6081
$$ y = [87414555, 86928571, 85985275, 85379103, 84598044, 83725927, 83301208, 82727269, 81513451, 80949404, 80370774, 79717829, 79200741, 78684801, 77354129, 76855835, 76185067, 76154775, 75462920, 74101864, 74101019, 73895414, 73256213, 72669011, 72030118, 71186813, 70798583, 69842768, 69515842, 69111196, 68860227, 68286490, 67747069, 67533150, 66731925, 66476145, 65638949, 65724571, 65608528, 64371984, 64337275, 64241109, 63820583, 63333242, 62896374, 62746790, 62024350, 61476433, 61400657, 61115551, 60676444, 60007747, 59686593, 59598587, 60005941, 59513387, 59109738, 58572672, 58016330, 58013188, 58207286, 57817728, 57621472, 57261692, 56608380, 56779804, 56646767, 56987338, 56647006, 56289409, 56394828, 56147583, 56342209, 56387233, 56053052, 55449365, 55797679, 56013756, 56099837]
4640E6099837N8091M190M69904j63368j07491j68678J32178J96555P11990L62634
4630E7595842L79860Q81774j4920M6009L45413Q82772N69374Q60762N47952O62754
4620F2757592R63786Q56527J098009Q47049J194106J386578J014441P41891J223223
4611G2083202J521898J106191J717614J076270Q08871J831142J163806P27153
4603H2036147J051853Q55351K040493J881510J709069K244957K582192K485460
4595I6887032K954655L130789K785810K831982L230803L991027M013541M152699
4587A23978338L937719L652852J986874O38776q09766l001481l105838k945047
4579A24332427k826994k256559j274378n5345N55278J167064K196560L005635
$$ y = [56099837, 56157928, 56162118, 56632022, 56468654, 56361163, 56192485, 56324663, 56521218, 57233208, 57595842, 57975702, 58857476, 58842556, 58888565, 59233978, 60116750, 60686124, 61546886, 62094838, 62757592, 63721378, 64577905, 65675914, 66522963, 67717069, 69103647, 70118088, 70859979, 72083202, 73605100, 74711291, 76428905, 77505175, 78314046, 80145188, 81308994, 82036147, 83088000, 83943351, 85983844, 87865354, 89574423, 91819380, 94401572, 96887032, 99841687, 102972476, 105758286, 108590268, 111821071, 115812098, 119825639, 123978338, 127916057, 131568909, 133555783, 134194559, 133384793, 130383312, 127277474, 124332427, 121505433, 119248874, 117974496, 117919151, 118474429, 119641493, 121838053, 124843688]
4571A24843688L087117M025233M863036O360833P573898Q212155R082279R896615
4563A77944854R883086J0547421J1588307J2820208J3852634J3996575J2883255
4556B63516340R717429M823763j605442p966987j2362129j5493760j5663962j3720562
4548B11244690j1700985q712018p483933n951184m786307m214708k999008j679671
4540A63716876l14734R71345J731678L127598M583747M769665N899216P321238
4532A91806629Q222853Q906144J0193299J0952680J1969722J0655455O795927
4525B59502709J432365m637017j0087576j5638791j8554548j7158603j5137008
4518A79721531j2974233j0476401q950386q062811o790162n687272m482853l971274
$$ y = [124843688, 127930805, 131956038, 136819074, 143179907, 150753805, 158965960, 168048239, 177944854, 187827940, 198375361, 209963668, 222783876, 236636510, 250633085, 263516340, 273233769, 278057532, 276452090, 268485103, 256122974, 240629214, 224965252, 211244690, 199543705, 190831687, 183347754, 177396570, 172610263, 168395555, 165396547, 163716876, 163402142, 164373487, 166105165, 169232763, 173816510, 178586175, 184485391, 191806629, 200029482, 208935626, 219128925, 230081605, 242051327, 252706782, 259502709, 260935074, 256298057, 246210481, 230571690, 212017142, 194858539, 179721531, 166747298, 156270897, 147320511, 139257700, 132467538, 126780266, 122297413, 118326139]
4510A18326139k938287k730132j599718j110148p52388n03292n3812J090422J491372
4501A11220156J596869J649925K613907K558103J501502L52522j142962k819500
4493A17530522m446897o188588o846518o068917n030557m510209m915503m609409
4485G4913924l451349l203024k364958k695434k380071k152535j967067k132873
4477E4566613j763859j388794j503663j518156j470458q98705j308830j214136
4469D3500012r70209q13692q98855q77064m44559l64478q20360p44063k26098
4460C7340634q01332m26314O3096m16716q36702p15721r29809m20965m59691m62662
4450C1933818o2708j7674n6195q32583n53063j79783L8106O5255m32831M1098
$$ y = [118326139, 115387852, 112657720, 111058002, 109947854, 109195466, 108692174, 108638362, 109728784, 111220156, 112817025, 114466950, 117080857, 119638960, 121140462, 121492984, 120350022, 117530522, 113083625, 106895037, 100048519, 93979602, 88949045, 84438836, 79523333, 74913924, 71462575, 68259551, 65894593, 63199159, 60819088, 58666553, 56699486, 54566613, 52802754, 51413960, 49910297, 48392141, 46921683, 46022978, 44714148, 43500012, 42529803, 41716111, 40817256, 39940192, 39495633, 39131155, 38310795, 37566732, 37340634, 36539302, 36112988, 36176084, 35759368, 34922666, 34206945, 33277136, 32856171, 32396480, 31933818, 31871110, 31853436, 31797241, 30964658, 30411595, 30231812, 30269918, 30335173, 29902342, 29943440]
4440B9943440k79722r53645L8424k72336j95138j45994M26402O6502j42611n46116
4430B7939206m4270j54682k46114J88034l27109N06643j23766N13030N81866m569
4420B8828269j921j471O83725P83871L79511P03340Q47984P93761L90022N03905
4410C3910996P95463J227104N32502R11591M85005O43250K35270l70411m62684
4401C7908086M9025o47840r45164p86802q65173k38555m06611q63174q49357n97372
4391C1757063n68710j60202k771l00311o37141k66666J17146k76047j7786J96396
4381B9840971J15329P98242M66046J25498L65805K85390N81958L96265P81837
4372C3757341J491259M70671O43881O95677R04483M07914j56165k36184J2984
$$ y = [29943440, 29663718, 28710073, 28748497, 28476161, 28281023, 28135029, 28561431, 28627933, 28485322, 27939206, 27894936, 27740254, 27494140, 27682174, 27355065, 27861708, 27737942, 28250972, 28832838, 28828269, 28826348, 28824877, 29508602, 30292473, 30671984, 31375324, 32223308, 33017069, 33407091, 33910996, 34706459, 35933563, 36466065, 37377656, 37862661, 38505911, 38741181, 38370770, 37908086, 37957111, 37309271, 36364107, 35577305, 34712132, 34473577, 34066966, 33203792, 32354435, 31757063, 31188353, 31028151, 31025380, 30725069, 30087928, 29821262, 29938408, 29662361, 29644575, 29840971, 29956300, 30754542, 31220588, 31346086, 31711891, 31997281, 32579239, 32975504, 33757341, 35248600, 35719271, 36363152, 37058829, 37963312, 38371226, 38215061, 37978877, 37991861]
4363C7991861J7103n60191n42545k33021n01683m04660q7763l41970j09610o17944
4353C4609577o94072n16449r01263q59677n79665r09199j190547p44614r58707
4344B7255384o00910q24583p85339o95803o9595p11463m98948o71283l21135j60972
4334B1915353k80755j46326m22749L77664j05564j49828J70121K14868P59682
4325B2332466l4j29882M15208N28408M94993J19636J42529K19584M6791q22357
4315B3347342j81320O53302o97336p97534o90289n02988j059839o06615n47252
4306A8917471j164838m28963p07234n85718o95045m74752L71812k48651m17113
4297A4566969r9216J45231l35143q95759K54519P5394m57451n71789l14031m48060
$$ y = [37991861, 38008964, 37448773, 36906228, 36673207, 36171524, 35766864, 35679101, 35337131, 35227521, 34609577, 33915505, 33399056, 32497793, 31638116, 31058451, 30149252, 28958705, 28214091, 27255384, 26654474, 25829891, 25044552, 24348749, 24279154, 23567691, 23068743, 22397460, 22076325, 21915353, 21634598, 21488272, 21065523, 21443187, 21337623, 21187795, 21357916, 21572784, 22332466, 22332432, 22202550, 22617758, 23146166, 23641159, 23760795, 23903324, 24122908, 24169699, 23347342, 23166022, 23819324, 23121988, 22324454, 21634165, 21131177, 20071338, 19464723, 18917471, 17752633, 17323670, 16616436, 16030718, 15335673, 14860921, 15232733, 14984082, 14566969, 14467753, 14612984, 14277841, 13382082, 13636601, 13711995, 13254544, 12682755, 12368724, 11920664]
4287A1920664j00038m31218L8884j3278j50860j15585l24651k73398J35639J27461
4277A0813620o59073j97805M15957j64030k38664m89948K80791j46688l5720M33737
4267A0012177j28952K6420o0988q3390J42991o257o45062J8593J49587M23090
4257I848209o33114j88742l73247L57617K29748l39083J05014l43615R9846k07870
4247H554763j77114k0965l0132l46528J51113j01497J74752K5177p4013M95935
4237H651491n79l32717j13379J11924o7766M97200k14949j82969K20821n57570
4227H011507j75489o2169J47376n948j27791p05476n1572J04948J05502P5621
4217G316509k20091J89042l13201l9074O5870l45100J72917l8054N2793j96024
$$ y = [11920664, 11820626, 11389408, 11428292, 11415014, 11264154, 11148569, 10823918, 10550520, 10686159, 10813620, 10154547, 9956742, 10372699, 10208669, 9970005, 9480057, 9760848, 9614160, 9578440, 10012177, 9883225, 9909645, 9848657, 9765267, 9908258, 9902001, 9256939, 9275532, 9425119, 9848209, 9215095, 9026353, 8653106, 9010723, 9240471, 8901388, 9006402, 8662787, 8762633, 8554763, 8377649, 8356684, 8326552, 7980024, 8131137, 8029640, 8204392, 8229569, 8155556, 8651491, 8650912, 8318195, 8204816, 8316740, 8248974, 8746174, 8531225, 8348256, 8569077, 8011507, 7836018, 7773849, 7921225, 7915277, 7787486, 7082010, 7030438, 7135386, 7240888, 7316509, 7096418, 7285460, 6972259, 6933185, 6999055, 6653955, 6826872, 6788818, 6841611, 6645587]
4207F645587K10667J70728p6713j59033J57375J24395J46618K72904l44142p3850
4197G074536J68547N15814l60355j14702n436j95826l72574k91906k3205L47313
4187F742206L14972K68843r2219m54556j82264j08429K23920K37523K75611k37675
4177F987932N969K64251k6604L85345K9547l03937q1533J65028K34904K22950
4167G883852j75744N99409j25602K94246L13946m8081q1499K8426M94431M51043
4157I634427K03024k74405N87055L61932k21323R0570J58176L34751L52224O0751
4147A1287182L73339J44208N37306L54935N10970N4442K52097O38242O60723K98966
4137A5112410J26888K35784J021911J074256O67005M02027Q39690N57052Q72489
$$ y = [6645587, 6856254, 7026982, 6950269, 6791236, 6948611, 7073006, 7219624, 7492528, 7148386, 7074536, 7243083, 7758897, 7398542, 7283840, 7278404, 7082578, 6710004, 6418098, 6394893, 6742206, 7057178, 7326021, 7233802, 6779246, 6596982, 6488553, 6712473, 6949996, 7225607, 6987932, 6993901, 7258152, 7231548, 7616893, 7646440, 7342503, 7260970, 7425998, 7660902, 7883852, 7708108, 8307517, 8181915, 8476161, 8790107, 8742026, 8660527, 8688953, 9183384, 9634427, 9837451, 9563046, 10150101, 10512033, 10290710, 10381280, 10539456, 10874207, 11226431, 11287182, 11660521, 11804729, 12342035, 12696970, 13207940, 13262382, 13514479, 14152721, 14813444, 15112410, 15239298, 15475082, 16496993, 17571249, 18238254, 18640281, 19479971, 20037023, 20909512]
4128B0909512J347859Q84299J295949J446526J487821J950653J863258J914589
4120C3100466K408860K603024L139616L315714L926238L723986M643802M028282
4112F0889988L480456L823129L714284L656835M678401M186847L448130L133318
4104I1011388K508859K160289J743769J522298K031720J317312Q29923j85443
4096A02940115j713875k358904k468684k587983k860017k014469k923790l708293
4088H2304100l862711m334262m513835l929031l229959l587087l470102l542918
4080E1834195l763881l737858k827001l106777k528347j995662k120476j421753
4072C0332440j450609j600957j301805j101356j188522j075551p90661m60920
$$ y = [20909512, 22257371, 23141670, 24437619, 25884145, 27371966, 29322619, 31185877, 33100466, 35509326, 38112350, 41251966, 44567680, 48493918, 52217904, 56861706, 60889988, 64370444, 68193573, 71907857, 75564692, 80243093, 84429940, 87878070, 91011388, 93520247, 95680536, 97424305, 98946603, 100978323, 102295635, 103125558, 102940115, 101226240, 98867336, 96398652, 93810669, 90950652, 88936183, 86012393, 82304100, 78441389, 74107127, 69593292, 65664261, 62434302, 58847215, 55377113, 51834195, 48070314, 44332456, 41505455, 38398678, 35870331, 33874669, 31754193, 30332440, 28881831, 27280874, 25979069, 24877713, 23689191, 22613640, 21822979, 21362059]
4064B1362059p12767j015534l71934q64920j032707m18761m74762r4730o01140
4055A5774804m85781l56399l23540j83576k99603p78486L29510k25341l40561
4046A3111027k07501j36490j31075n11347o24106q9922o7484l42923l59813J45226
4036A0785592m14410m07303K14614n50302Q4411K54695l67509j88492j96649k75939
4026H938708m84480J29070N541o32424j79848J84215m20070r8161L34646O3297
4016G840494k92854k72786l58438j04118j1729k59317k07023j66665J42016k31155
4006F078425J274L9436l100m88557K14905J89416n15837k65870J93528k4114o6724
3995E352782p4447j73672K13056j37487L3841l79492J78898J32468m8057l34096
$$ y = [21362059, 20649292, 19633758, 19261824, 18396904, 17364197, 16945436, 16470674, 16375944, 15774804, 15289023, 14932624, 14609084, 14425508, 14125905, 13347419, 13676929, 13451588, 13111027, 12903526, 12767036, 12635961, 12124614, 11500508, 11410586, 11343102, 11000179, 10640366, 10785592, 10371182, 9963879, 10178493, 9628191, 9712602, 9967297, 9599788, 9411296, 9214647, 8938708, 8454228, 8583298, 8588839, 7956415, 7776567, 7960782, 7540712, 7442551, 7777197, 7840494, 7547640, 7274854, 6916416, 6812298, 6800569, 6541252, 6334229, 6167564, 6309580, 6078425, 6079699, 6119135, 6116035, 5627478, 5842383, 6031799, 5515962, 5250092, 5443620, 5419506, 5352782, 5278335, 5104663, 5317719, 5180232, 5214073, 4834581, 5013479, 5145947, 5097890, 4763794]
3985D763794P0131J72864J4288j28202l27426R3413J12368L2369k17312l48716
3975D237571R5062M44785l94863j20833O3891j00286K30184p606o88118P13407
3965D473194K41266l09865l31493J77371J10426K16700l90252K32149k67668n17227
3955C634601L90026L66421L81374o05614K81278J40231q8601j75228K24334K61246
3945D810068k24128R2396l93156n94769N69321J75302j0795l07329M71462k26288
3935D362084m23501K95581L95982L33414p1804P0814l06585M38443m89057J29096
3925D734467L8161K40735l02722m3196J4635l885J20915L8870l9457p8383l15070
3914D405070k03309P60354M03001l71473J11804O7962L54106m3441j63104p7620
$$ y = [4763794, 4833925, 5006789, 5021077, 4892875, 4565449, 4658862, 4771230, 4803599, 4586287, 4237571, 4332633, 4777418, 4382555, 4261722, 4325613, 4225327, 4455511, 4447905, 3759787, 4473194, 4714460, 4404595, 4073102, 4250473, 4360899, 4577599, 4187347, 4419496, 4151828, 3634601, 4024627, 4391048, 4772422, 4166808, 4448086, 4588317, 4499716, 4324488, 4548822, 4810068, 4585940, 4678336, 4285180, 3690411, 4259732, 4435034, 4424239, 4116910, 4588372, 4362084, 3938583, 4234164, 4630146, 4963560, 4891756, 4962570, 4655985, 5094428, 4605371, 4734467, 4772628, 5013363, 4710641, 4667445, 4682080, 4678195, 4799110, 4837980, 4798523, 4720140, 4405070, 4201761, 4962115, 5365116, 4993643, 5105447, 5173409, 5527515, 5484074, 5320970, 5243350]
3904E243350J96666N73909K5836n42494L48659K19206k32451L77238K47079l13075
3894F143923j20296L69826J61565L00011j58431O66822q1864l1347P76923N68165
3884H595297K15866k75754J82518o1256j78077M47704j46619O26747J13816m4820
3874I475422K48813L95900K62813L5012K73741K00293K70325P97830J76026N45748
3864A2681923Q7825K92840N64645L12752N56291L62580K71114K56438N65717N56757
3854A6508882K76981M85927R8892R25116O58034O4142O30667O18733R8120N78427
3844B0943921M73779R04330Q38329J013990O04142P09988J129133R76615J349150
3835B8943377O12071J344963Q08582J146121J249034J032002J959701J626829
$$ y = [5243350, 5440016, 6013925, 6039761, 5497267, 5845926, 6065132, 5832681, 6209919, 6456998, 6143923, 6023627, 6393453, 6555018, 6855029, 6696598, 7363420, 7281556, 7250209, 8027132, 8595297, 8811163, 8535409, 8717927, 8656671, 8478594, 8926298, 8779679, 9406426, 9520242, 9475422, 9724235, 10120135, 10382948, 10417960, 10691701, 10891994, 11162319, 11960149, 12136175, 12681923, 12769748, 13062588, 13627233, 13939985, 14496276, 14858856, 15129970, 15386408, 15952125, 16508882, 16785863, 17271790, 17370682, 18295798, 18953832, 19017974, 19648641, 20267374, 20365494, 20943921, 21417700, 22322030, 23160359, 24174349, 24778491, 25488479, 26617612, 27594227, 28943377, 29555448, 30900411, 31708993, 32855114, 34104148, 35136150, 37095851, 38722680]
3827C8722680J949322J766519J555344K028943J919264J809268K813695K234083
3819E4799118K472301K644723L031256L553282L441188L659457L963500M261541
3811H1826366L846460M341911M492967M595603N761698N197779N226947N258039
3803A20547770N684779O181944N922813O783332O674692O667144N705622O551431
3795A70719527O614058O501547O248638O035563N629896N762931N954052N650350
3787B19116562N541906N876636M941096N464207N336921M748391M628022M019725
3779B59673466L603476L344113L016054K604303J941494J731444J356145J128914
3771B78399409Q91233N45389n35934k305081l834945m799445o213275o375495
$$ y = [38722680, 40672002, 42438521, 43993865, 46022808, 47942072, 49751340, 52565035, 54799118, 57271419, 59916142, 62947398, 66500680, 69941868, 73601325, 77564825, 81826366, 85672826, 90014737, 94507704, 99103307, 104865005, 110062784, 115289731, 120547770, 126232549, 132414493, 138337306, 145120638, 151795330, 158462474, 164168096, 170719527, 177333585, 183835132, 190083770, 196119333, 201749229, 207512160, 213466212, 219116562, 224658468, 230535104, 235476200, 240940407, 246277328, 251025719, 255653741, 259673466, 263276942, 266621055, 269637109, 272241412, 274182906, 275914350, 277270495, 278399409, 279290642, 279836031, 279300097, 276995016, 273160071, 268360626, 262147351, 255771856]
3763B55771856o266837o640775o647222o059740o327100o206956o520480o539897
3755B04562849o605059o518525o487608o482967o335245o248890o560407o246255
3747A53077893n498768n669476n859477n730960n404459n355430m578249m947338
3739A10033736m311025m198783m315161m052820l843734l223155l083110l377204
3731G9628744l594208k460783k377258k568654k393544k235862k662503k371488
3723E8964444k166460k428774j031141j348922j712262k168742j332960j158093
3715D5617090j049692j003773r09159p74440q16712j340633r88520q27620p55044
3706C7151497n70558r63227m69401n94783j028010l10792q7441o80402n08523
$$ y = [255771856, 249505019, 242864244, 236217022, 230157282, 223830182, 217623226, 211102746, 204562849, 197957790, 191439265, 184951657, 178468690, 172133445, 165884555, 159324148, 153077893, 147579125, 141909649, 136050172, 130319212, 124914753, 119559323, 114981074, 110033736, 105722711, 101523928, 97208767, 93155947, 89312213, 86089058, 83005948, 79628744, 76034536, 73573753, 71196495, 68627841, 66234297, 63998435, 61335932, 58964444, 56797984, 54369210, 53338069, 51989147, 50276885, 48108143, 46775183, 45617090, 44567398, 43563625, 42654466, 41880026, 41063314, 39722681, 38734161, 37906541, 37151497, 36580939, 35617712, 35148311, 34553528, 33525518, 33214726, 33127285, 32446883, 31938360]
3697C1938360m5338p12695j02345m07599m06322m55931j23330J59518q8969k08057
3687B9547292J43203k73900m06719L67619k2538r4163l96255j90120l70701l9793
3677B8263925M05528Q51715K7168J23488J47978K62834J71380r6478M21957N45904
3667C1125399M77833M95038M17758M00434O01567Q38209Q40337Q63433N41501
3658C6601509Q89426P74392N66196J417683M15404P68258Q08208P30607J226429
3649D4198112O82752R04505J159218N86295J229577Q88303O31784M40793J226218
3640E1947557P05737J179677Q09480J019710J047911J205509J359274J414220
3632F0689075J564513J385406J609747J527360K015705K227436K309800K297655
$$ y = [31938360, 31893022, 31180327, 31077982, 30670383, 30264061, 29808130, 29684800, 29844318, 29755349, 29547292, 29690495, 29416595, 29009876, 29377495, 29354957, 29260794, 28864539, 28674419, 28303718, 28263925, 28669453, 29521168, 29548336, 29671824, 29819802, 30082636, 30254016, 30157538, 30579495, 31125399, 31603232, 32098270, 32516028, 32916462, 33518029, 34356238, 35196575, 36060008, 36601509, 37490935, 38265327, 38831523, 40249206, 40664610, 41432868, 42241076, 42971683, 44198112, 44880864, 45785369, 46944587, 47530882, 48760459, 49648762, 50280546, 50721339, 51947557, 52653294, 53832971, 54642451, 55662161, 56710072, 57915581, 59274855, 60689075, 62253588, 63638994, 65248741, 66776101, 68791806, 71019242, 73329042, 75626697]
3624G5626697K646728K402972L510271L573252M057906M075521M843608N033013
3616A05769968N008513N973484N906632O421619O612474P676134Q087125P083031
3608A58538980Q067191Q214327Q236817Q500324Q695474P878338P761671P085166
3600B22978288O818166N854672M677578M108181L421529K585266Q59575j25989
3592B51177266m56161j874537k326011k684973l837896n097254m876387n469966
3584B24554081n794804o959262p041072p296876p183485p285832p304742o686181
3576A69001827p195889o900675o506184o442644n982308n259949n390695m372656
3568A20950827m355683l362410m393118m197870k778714k835319k409930k492211
$$ y = [75626697, 78273425, 80676397, 84186668, 87759920, 91817826, 95893347, 100736955, 105769968, 110778481, 116751965, 122658597, 129080216, 135692690, 143368824, 151455949, 158538980, 166606171, 174820498, 183057315, 191557639, 200253113, 208131451, 215893122, 222978288, 229796454, 235651126, 240328704, 244436885, 247858414, 250443680, 251303255, 251177266, 250721105, 248846568, 246520557, 243835584, 239997688, 234900434, 230024047, 224554081, 218759277, 211800015, 204758943, 197462067, 190278582, 182992750, 175688008, 169001827, 161805938, 154905263, 148399079, 141956435, 135974127, 130714178, 125323483, 120950827, 116595144, 113232734, 108839616, 104641746, 101863032, 99027713, 96617783, 94125572]
3560I4125572j769342j901271j485478j355071j381521q47255r72926r15185l96705
3551H3100818n07667m12184l11576k1604j53916j34769q9310n91613L88907l1727
3541H1235359J53762J21506j7639l9734R56278P14884P21063O03313O81712K54400
3531H5384904P95400O52945J052063J528967J346851J474507J280609J737899
3523I5254145K404867K091829K232633K299272L289598K749406L384679M478564
3515A18184993M323796M946396N569354O113637O527508P550299P966792R335058
3507A70517833J0326547J1957408J2421910J3057650J4418545J5931051J7349558
3500B65980502J7474199J8392819J9349667J8786051J9325183J7884373J6239549
$$ y = [94125572, 92356230, 90454959, 88969481, 87614410, 86232889, 85385634, 84412708, 83497523, 83100818, 82593151, 82180967, 81869391, 81847787, 81693871, 81559102, 81469792, 80878179, 81267086, 81235359, 81389121, 81510627, 81492988, 81453254, 82409532, 83124416, 83845479, 84448792, 85130504, 85384904, 86180304, 86833249, 87885312, 89414279, 90761130, 92235637, 93516246, 95254145, 97659012, 99750841, 101983474, 104282746, 107572344, 110321750, 113706429, 118184993, 122508789, 127455185, 133024539, 139138176, 145665684, 153215983, 161182775, 170517833, 180844380, 192801788, 205223698, 218281348, 232699893, 248630944, 265980502, 283454701, 301847520, 321197187, 339983238, 359308421, 377192794, 393432343]
3493C93432343J4520143J1717028Q621914O306238L583920J200331q6129o31516
3485D38664272k417123l069382m002984n766875o662653r159551j1759357j3395999
3477C82430348j6192935j7293942j8162715j7987423j8897353j7687290j6854171
3470B59354519j5601246j3525670j2817564j1541404j0966641r383008r424988
3463A76093998q470356o704550o239971n934170n441644m994918m257673l527736
3455A30522980l388455l402495k856411k824319k243413j397572j210210j651856
3447A11548249j611680r52887o43133o13111k89089j17760j00901J82076K45965
3438A07647729K79322L81449J78184J068208O45496Q21141P71556J108155p725
$$ y = [393432343, 407952486, 419669514, 428291428, 434597666, 438181586, 439381917, 439295788, 438664272, 436247149, 433177767, 429174783, 423407908, 416745255, 407585704, 395826347, 382430348, 366237413, 348943471, 330780756, 312793333, 293895980, 276208690, 259354519, 243753273, 230227603, 217410039, 205868635, 194901994, 185518986, 176093998, 167623642, 160919092, 154679121, 148744951, 143303307, 138308389, 134050716, 130522980, 127134525, 123732030, 120875619, 118051300, 115807887, 114410315, 113200105, 111548249, 109936569, 108983682, 108340549, 107727438, 107438349, 107320589, 107219688, 107401764, 107647729, 107927051, 108308500, 108486684, 109554892, 110200388, 111021529, 111793085, 112901240, 112893515]
3429A12893515J160253J110136M52119Q89245J003209L64963K09062J001294J359498
3420A20443294O48043L79421O9437O03849O53767M22998J046335Q94708L44709
3411A25506561L94432J163737J108343J758837O98849J733229J979636K441726
3403A36785350K699082K603202L365620L242554M147938M892318N282488N281509
3395A68300061N759977O974782P515884P460119Q392690R204712R844574J0384410
3387B33837209J1026143J1823817J1814988J2614891J2930647J2943203J4256974
3380C21247872J3569339J3745617J4382001J4527667J4026362J3949816J3509100
3373D18957774J2544017J2344161J1498566J1027837J0286144R677289Q049584
$$ y = [112893515, 114053768, 115163904, 115616023, 116505268, 117508477, 117873440, 118082502, 119083796, 120443294, 121091337, 121470758, 121540195, 122144044, 122797811, 123220809, 124267144, 125161852, 125506561, 125900993, 127064730, 128173073, 129931910, 130630759, 132363988, 134343624, 136785350, 139484432, 142087634, 145453254, 148695808, 152843746, 157736064, 163018552, 168300061, 174060038, 181034820, 188550704, 196010823, 204403513, 213608225, 223452799, 233837209, 244863352, 256687169, 268502157, 281117048, 294047695, 306990898, 321247872, 334817211, 348562828, 362944829, 377472496, 391498858, 405448674, 418957774, 431501791, 443845952, 455344518, 466372355, 476658499, 486335788, 494385372]
3366D94385372O734655N014083L598455K640072J548436O16631j072146j937750
3358E11527808k733613m291002n095787o221347p695426r619491j0180834j0786920
3350D54903388j2096298j2591116j3119573j3970695j3930595j4538705j3649093
3343C61007313j4169012j3513590j3439673j2835087j3055891j3070189j1962853
3336B68961018j2036765j2222211j1815431j0740305j0049923r115649q779765
3329A94200969q123194o811098o204034o262673n677424n381656m357055l746845
3321A47636990l289221l354133l006860k606422k260257k443589k256829j887703
3313A26531976j902460j747526j155663k153099j988642j561254j543722j202641
$$ y = [494385372, 501120027, 506134110, 509732565, 512372637, 513921073, 514537704, 513465558, 511527808, 508794195, 504503193, 499407406, 493186059, 485490633, 475871142, 465690308, 454903388, 442807090, 430215974, 417096401, 403125706, 389195111, 374656406, 361007313, 346838301, 333324711, 319885038, 307049951, 293994060, 280923871, 268961018, 256924253, 244702042, 232886611, 222146306, 212096383, 202980734, 194200969, 186077775, 179266677, 173062643, 166799970, 161122546, 155740890, 151383835, 147636990, 144347769, 140993636, 137986776, 135380354, 133120097, 130676508, 128419679, 126531976, 124629516, 122881990, 121726327, 119573228, 117584586, 116023332, 114479610, 113276969]
3305A13276969j346142j480640j783381j875060j966349k201074k238882k100351
3297I8285090k377698k085676j728289k303752k630130k074263k097753k095024
3289H0892505j724256k656016k252502j900207j599612j774482k751196j511112
3281F4723122j739066k382196k690669k075357j532049j536448j671557j263148
3273D9832632j403551q45079j494361o42790j080138q62943n15586j355766j231790
3264D0400628p42119l88360r01537o78376m73531l92920m76011j20218j391556
3255C4836000p46259l57917j72433m14796o42398p52456q75685m04184p5494o93233
3245B9701145k49997p62221m06693m86325p71964j79255j85098n83772l02479
$$ y = [113276969, 111930827, 110450187, 108666806, 106791746, 104825397, 102624323, 100385441, 98285090, 95907392, 93821716, 92093427, 89789675, 87159545, 85085282, 82987529, 80892505, 79168249, 76512233, 74259731, 72359524, 70759912, 68985430, 66234234, 64723122, 62984056, 60601860, 57911191, 55835834, 54303785, 52767337, 51095780, 49832632, 48429081, 47584002, 46089641, 45446851, 44366713, 43503770, 42988184, 41632418, 40400628, 39658509, 39270149, 38368612, 37690236, 37216705, 36823785, 36347774, 36227556, 34836000, 34089741, 33731824, 33559391, 33144595, 32502197, 31749741, 30874056, 30469872, 30394378, 29701145, 29451148, 28688927, 28282234, 27795909, 27023945, 26844690, 26659592, 26075820, 25773341]
3236B5773341j06905j13149j59778l69427m29491p05640K51793j72176m17948
3227B3550620M7625l06498q7742m99315j62801n260p8274n42434m58149l87100
3217B1070672K0869l34816l31510j33239n95897l44362J45268o65443o13222j61932
3207A8056388o54135p8038K45624m89201o10192k7221p1233j60096k04945J95904
3197A6202855J33330p30202j45301J53757L57284l79771o25713K23375p24096
3188A4465518j76642m8537J45844m18344k33464O8101L86240j14893j98308J9532
3178A3895047n53705m78663R0245J71272k309J95640O5896K90216l25429m78895
3168A2869315L9165J2798J13397k39213L37026j45248K24718k26703J00603l3439
$$ y = [25773341, 25666436, 25553287, 25393509, 25024082, 24594591, 23888951, 24140744, 23968568, 23550620, 23598245, 23291747, 23204005, 22704690, 22541889, 22536629, 22458355, 21915921, 21457772, 21070672, 21091541, 20756725, 20425215, 20291976, 19696079, 19351717, 19496985, 18831542, 18218320, 18056388, 17402253, 17324215, 17569839, 17080638, 16470446, 16443225, 16371992, 16211896, 16006951, 16202855, 16336185, 15605983, 15460682, 15614439, 15971723, 15591952, 14966239, 15189614, 14465518, 14288876, 14240339, 14386183, 13967839, 13734375, 13802476, 14188716, 14073823, 13875515, 13895047, 13341342, 12862679, 12952924, 13124196, 13121887, 13317527, 13383423, 13673639, 13348210, 12869315, 12908480, 12921278, 13034675, 12795462, 13132488, 12987240, 13211958, 12985255, 13085858, 13052419]
3158A3052419l67552j77988J93524Q2302L86448l00170M78995K89313k6377j12196
3148A3498718k67028K92390j23069K42106k64856L8982N1409j97252K56668Q35790
3138A4363858J04173j22412K75127O36857n07647j03505N70075L79819p1026P95725
3128A6321044K4299r5962P36991K75651N7825q6127k8702L99890N51283O58651
3118A8814843N10239L25844L86956L11316K92589O78866N10959K04621Q00651
3109B2836884L97748M74442K67564O99126M20518J38879O48058R31645L68602
3100B7183466O07589M95821Q49085P19609N60949R42865Q89357J340288L54976
3091C3944005J060740M85253O60700Q13997J236699J510735J449435J557839J132118
$$ y = [13052419, 12684867, 12506879, 12700403, 12782705, 13169153, 12868983, 13347978, 13637291, 13610914, 13498718, 13231690, 13524080, 13401011, 13643117, 13378261, 13417243, 13468652, 13271400, 13528068, 14363858, 14468031, 14345619, 14620746, 15257603, 14749956, 14646451, 15216526, 15596345, 15525319, 16321044, 16345343, 16249381, 16986372, 17262023, 17319848, 17233721, 17205019, 17604909, 18156192, 18814843, 19325082, 19650926, 20037882, 20349198, 20641787, 21320653, 21831612, 22036233, 22836884, 23234632, 23709074, 23976638, 24675764, 25096282, 25235161, 25883219, 26814864, 27183466, 27791055, 28286876, 29135961, 29855570, 30416519, 31359384, 32248741, 33589029, 33944005, 35004745, 35489998, 36150698, 36964695, 38201394, 39712129, 41161564, 42719403, 43851521]
3082D3851521J282379J547717K089319J613855K260825J654654J829192K879852
3074E9009314K399351L192568L115252L317222L914761M339771M947281N834639
3066I0070159P061797Q214275Q858422R064467R991339J0881359J1055044J2280550
3058A67477412J3355760J4426135J6208166J6632299J5825125J1882806N328543
3051B61136246p76449p479584j2922544j4566886j4275626j2521780q997781o014890
3043A83580706m403339l077853j561186L22982K007985M010816N534791P765711
3035A94180613J0141399J2066073J4551998J5130036J6517536J8271439J9380346
3028C00239440K2405280K5709253K8599300K9836445K5138725J6392609M085153
$$ y = [43851521, 45133900, 46681617, 48770936, 50384791, 52645616, 54300270, 56129462, 59009314, 61408665, 64601233, 67716485, 71033707, 74948468, 79288239, 84235520, 90070159, 97131956, 105346231, 114204653, 123269120, 133260459, 144141818, 155196862, 167477412, 180833172, 195259307, 211467473, 228099772, 243924897, 255807703, 261136246, 260359797, 252880213, 239957669, 225390783, 211115157, 198593377, 189595596, 183580706, 179177367, 176099514, 174538328, 174861310, 176869295, 180880111, 186414902, 194180613, 204322012, 216388085, 230940083, 246070119, 262587655, 280859094, 300239440, 322644720, 348353973, 376953273, 406789718, 431928443, 448321052, 452406205]
3021D52406205j0170203k3502312l3841015l6161287l3030126k7365286k3073485
3014B65262491j9015644j5588026j2763284j0636466q492823o351886n486673
3007A86927689l608632j745411o17032O45572K105298K743789M101016N323352
2999A95875641O618758O931343Q500075J0543346J0455694P992109L450752j776533
2991B48591185p886193j4024863j7482927j8316022j7067430j4133911j2229101
2984A47450738j0757568q477258q635117p323462o227684o009835m846253m874378
2976I0299183m711722m172856l429915m029319l506942k919610k581424k505614
2968F2441781k315773j954483j942410j864082k099021j661857r12119j679255
$$ y = [452406205, 442236002, 418733690, 384892675, 348731388, 315701262, 288335976, 265262491, 246246847, 230658821, 217895537, 207259071, 198766248, 192414362, 186927689, 183319057, 181573646, 180956614, 181602186, 183707484, 186451273, 190552289, 195875641, 202494399, 209425742, 217925817, 228469163, 238924857, 246916966, 250367718, 248591185, 240704992, 226680129, 209197202, 190881180, 173813750, 159679839, 147450738, 136693170, 128215912, 119580795, 112257333, 106029649, 100019814, 95173561, 90299183, 85587461, 81414605, 77984690, 73955371, 70448429, 67528819, 64947395, 62441781, 60126008, 58171525, 56229115, 54365033, 52266012, 50604155, 49692036, 48012781]
2960D8012781j809146j605637j061513k43131r06872j663987m26566j030583j042479
2951C8222867j071153p83322l01168j052811p79344p34044j346336p75966j62791
2942C1215932n79494r47536n23604p81223j106925m42058o48200o18459k74797
2933B5293636m98429j166928r3202n82891q59265L3757m72871k88010o76230k51711
2923B0437856k83156p13138n80297k88140n4306j77985m3259j64788m42420l59696
2913A7330671R3096k98156m39897l98359n49750J23635j07564m51683n97203L51039
2903A5055829j48323n35469k95209q44744m93095L75575J89541p407j70546p42957
2893A2383195Q1304m06292k8139j85072l87579l60471J9624j07529r8711N1170
$$ y = [48012781, 46203635, 44597998, 43536485, 43293354, 42386482, 40722495, 40295929, 39265346, 38222867, 37151714, 36368392, 36067224, 35014413, 34235069, 33501025, 32154689, 31378723, 31215932, 30636438, 29688902, 29165298, 28384075, 27277150, 26835092, 26186892, 25568433, 25293636, 24795207, 23628279, 23535077, 22952186, 22092921, 22126678, 21653807, 21365797, 20689567, 20437856, 20154700, 19441562, 18861265, 18573125, 18518819, 18340834, 18297575, 18132787, 17690367, 17330671, 17423767, 17125611, 16685714, 16287355, 15737605, 15861240, 15753676, 15301993, 14704790, 15055829, 14907506, 14372037, 14076828, 13232084, 12738989, 13114564, 13304105, 13296698, 13126152, 12383195, 12464499, 12058207, 12030068, 11844996, 11457417, 11096946, 11116570, 11009041, 10910330, 10961500]
2883A0961500j24485q2328q771m12790j92321n5907J26025l81505O10683m04800
2873A0035301p3201l52990m98565l7416q6256k37420J9572M16499m9528l32n79941
2862H555723l6721K5077k62852l39108k065j30765O5798j98346l35892m21982
2852F918867M7917K29920M4110Q1061J8510l65352l62953P5925j78843P4088J51926
2841F735176m46086K44197q8653m95k5457m05098K00422o95526K58849Q6469m9522
2830E814276j31964j559J62937l21621J72970M82531n3446n68832J22908j09343
2820E568857l83974j50276M22309K74865M23033k04182k48944n70756l9671M97447
2810E588708l09102k12477N7976j57049M77854L9706j44830j82662K14361j94972
$$ y = [10961500, 10837015, 10754687, 10745916, 10333126, 10140805, 10084898, 10210923, 9829418, 10440101, 10035301, 9962100, 9609110, 9110545, 9073129, 8986873, 8749453, 8769025, 9185524, 9135996, 9135664, 8555723, 8519002, 8544079, 8281227, 7942119, 7940054, 7809289, 7875087, 7676741, 7340849, 6918867, 6966784, 7196704, 7240814, 7321875, 7340385, 6975033, 6612080, 6688005, 6509162, 6583250, 6735176, 6289090, 6533287, 6444634, 6444139, 6418682, 6013584, 6214006, 5518480, 5777329, 5863798, 5814276, 5682312, 5680753, 5843690, 5522069, 5695039, 6177570, 6124124, 5555292, 5678200, 5568857, 5184883, 5034607, 5456916, 5731781, 6154814, 5950632, 5701688, 5130932, 5091261, 5588708, 5279606, 5067129, 5125105, 4968056, 5445910, 5485616, 5340786, 5158124, 5372485, 5177513]
2800E177513L36148N84247m15663k27617L64146K42175o3157j22146L46208J48690
2790F370544N3645k30458J2362J57256k58137m62946N57172K8352L4596n06544
2780E755842k44369K97540K41419J29851L72607Q0249k40091n2375J86304L47194
2770F874171k92005L53744j19505L11557O00739J35650j69394O5877N6840O1379
2760G879053l79696M12864J25094m68187k32288l00722n88958J40457J78889K63792
2750G030298k32998M87400j01999J08483p7576j57883M520K15256k12848m68569
2740F594084j24117l26912Q5398J46486L2476J61658l02934n44133K06818L85248
2730F314072l33083l67532L7483j30970l8062r5931j91430K94717o17797m62666
$$ y = [5177513, 5513661, 6097908, 5682245, 5454628, 5818774, 6060949, 5997792, 5875646, 6221854, 6370544, 6424189, 6193731, 6206093, 6363349, 6105212, 5642266, 6199438, 6227790, 6262386, 5755842, 5511473, 5809013, 6050432, 6180283, 6552890, 6633139, 6393048, 6340673, 6526977, 6874171, 6582166, 6935910, 6816405, 7127962, 7728701, 7864351, 7694957, 7760834, 7817674, 7879053, 7499357, 7912221, 8037315, 7569128, 7336840, 7036118, 6447160, 6587617, 6766506, 7030298, 6797300, 7284700, 7182701, 7291184, 7213608, 7055725, 7060245, 7275501, 7062653, 6594084, 6469967, 6143055, 6228453, 6374939, 6407415, 6569073, 6266139, 5722006, 5928824, 6314072, 5980989, 5613457, 5650940, 5519970, 5481908, 5385977, 5194547, 5489264, 4871467, 4408801]
2720D408801M76681J90078j9248o9283n16192n4345L4044n3168O2264p57552K37652
2709C939732j55517j25450O3739M976j40258O5111j05208j83824N5064M2763k16408
2698C244720M8799k95583l0367j43428J89644J49061J03163o2368N6497O7457
2688C327595p57832n44931J42785J99345o6475J14774J11964R9749P5282m70484
2678B231772j85182L73107L4999l22449n95911K55854K13625o5219J15201k55875
2668A799922j8076L76865j49932P5746J3677j46753P3151M3632j45466j29089
2658A793677L88681K02291k90945p25333L51938J10989l15719l86389R5092P25465
2648A949747k95273o1247m59586K84693K00528n9235k87206K29785K10358j38023
$$ y = [4408801, 4885482, 5075560, 5056312, 4987029, 4470837, 4416492, 4450536, 4397368, 4459632, 3702080, 3939732, 3784215, 3658765, 3722504, 3727480, 3587222, 3652333, 3547125, 3363301, 3418365, 3461128, 3244720, 3293519, 2997936, 2967569, 2824141, 3013785, 3162846, 3266009, 3203641, 3260138, 3327595, 2569763, 2024832, 2167617, 2366962, 2300487, 2415261, 2527225, 2626974, 2702256, 2231772, 2046590, 2419697, 2454696, 2132247, 1536336, 1792190, 2005815, 1940596, 2055797, 1799922, 1781846, 2158711, 2008779, 2084525, 2098202, 1951449, 2024600, 2068232, 1922766, 1793677, 2182358, 2384649, 2093704, 1368371, 1720309, 1831298, 1515579, 1129190, 1224282, 1949747, 1654474, 1593227, 1133641, 1418334, 1618862, 1559627, 1272421, 1502206, 1712564, 1574541]
2638A574541Q7356P5262j54865K5357o2130k07291r6694P9534L07549r691j8848
2627A600080j25351K67706N573l38629R6627J08861k9930j40525j42753k9271
2617A272388K98138m43568j62220L84848j50239J13812J08340k09845o18202j72917
2607D20535L48643L38307J54086j93666p0368J22789N14732l4030j59765N4913
2597A496176k67018J06386k53563L32142k31073l04652L29365J16949l25957l92134
2587F06621K55361j43209m14359K95175j83473L50008N71825j44397K54986l72753
2577A075785J64238J6388l13728O1868j82751K93663J56838o44140p769M76461
2567A096853l54825K47355J73179Q4815k858m14863J6680k01538K93886J90814
$$ y = [1574541, 1661897, 1737159, 1582294, 1607651, 1545521, 1338230, 1241536, 1321070, 1628619, 1618928, 1600080, 1474729, 1742435, 1748008, 1409379, 1506006, 1614867, 1584937, 1444412, 1301659, 1272388, 1570526, 1126958, 964738, 1349586, 1199347, 1313159, 1421499, 1211654, 593452, 420535, 769178, 1107485, 1261571, 1067905, 997537, 1120326, 1635058, 1601028, 1441263, 1496176, 1229158, 1335544, 1081981, 1414123, 1183050, 878398, 1207763, 1324712, 998755, 606621, 861982, 718773, 304414, 599589, 416116, 766124, 1337949, 1193552, 1448538, 1075785, 1240023, 1256411, 942683, 1004551, 821800, 1115463, 1272301, 628161, 620392, 1096853, 742028, 989383, 1162562, 1247377, 1244519, 829656, 846336, 644798, 938684, 1129498]
2557A129498J15771Q5260m52265j05700K2016K68484k77494M90114n01589k49487
2547E24608M79874M07j04731J42719R7715k5812K41270k6637k77910k75243o5199
2536G11061J97410J77400m14616J34092j94071K5984l0541K0247n5575l10901
2526B60490K58959J16238R9801l40624Q6951L97517L13615l85002n60758j88039
2516E9148N44983J42486k69662K25027j63422j42989J45231l629K2291m95717
2506F3747M74927K16512p25864J07273Q0178J81971L7332n19600j42181p2834
2496b98539J58041P29421l90302j29226O2239L58745j11205l93095j14691l11151
2486d39763O00585l4743m3163Q9354M09961K37837l32062J77487k97750l53737
$$ y = [1129498, 1245269, 1330529, 878264, 772564, 794580, 1063064, 785570, 1275684, 774095, 524608, 1004482, 1004889, 900158, 1042877, 1140592, 1114780, 1356050, 1329413, 1051503, 776260, 711061, 908471, 1085871, 671255, 805347, 611276, 637260, 606719, 626966, 571391, 260490, 519449, 635687, 735488, 394864, 481815, 879332, 1192947, 807945, 247187, 59148, 604131, 746617, 476955, 701982, 538560, 395571, 540802, 537173, 559464, 63747, 538674, 755186, 29322, 136595, 216773, 398744, 436076, -83524, -225705, -298539, -140498, 588923, 198621, 69395, 131634, 490379, 379174, -13921, -128612, -439763, 160822, 126079, 82916, 172270, 582231, 820068, 488006, 665493, 367743, 14006]
2476A4006P3803L46522J85880L60864m64298m4429n55440m7646N37028k8692m3656
2465C33942J76800j80818J74315j44363j56901l68767J13470Q1981M19786n2178
2455C97267L54623L62664p24737k40047J97881j17774K7953K07633k09360J68651
2445D24754J83645l62141N7185J65406N8249j85846l63085N31414o4382m57683
2435a2484J16993M78074j40111K22688j89879P5480J77006l41690J05464o0589
2425D30952l98596M7835j83761L88704J8610l4168j74577m47241R3384K90858
2415C2000k64930J26874K80047R5580L02294k06854j48460K5741J60408j47848
2405B54852o58R438O5711o7784j87261N6595J4469J54026L66275k01064M3545
$$ y = [14006, 87809, 434331, 620211, 981075, 516777, 472348, -83092, -130738, 406290, 377598, 333942, 510742, 329924, 504239, 359876, 202975, -165792, -52322, 29659, 449445, 397267, 751890, 1114554, 389817, 149770, 347651, 229877, 257830, 465463, 256103, 424754, 608399, 246258, 303443, 468849, 527098, 341252, -21833, 509581, 445199, -12484, 104509, 582583, 442472, 665160, 475281, 550761, 727767, 386077, 491541, 430952, 32356, 80191, -103570, 285134, 303744, 269576, 94999, -352242, -258858, 32000, -232930, -106056, 173991, 269571, 571865, 365011, 216551, 242292, 402700, 254852, 254194, 263632, 329343, 261559, 74298, 130893, 145362, 299388, 665663, 464599, 508144]
2394E08144q1440j33627p6279m29530M935J37103J19388K54672L75509l18374
2384C60501p10361m004N0647M51772l7951j9785l2054R5482j08116m58938J1536
2373d01271n8321O58831O7625j88597K20589m2318j15856J45126J61413l35390
2363A11831j12223J20907l04028J00714j31192M94136L67966K13490p54126o72138
2353e64663L61036K3112j89367J42694M04087k45574Q475k05702l26332P85012
2343A92778j04919j84169k79200L95837P59677p8161r14173l3826n2900M27929
2333A28873m00685p0118P00717o38727O07017N33352l10487m06176k63277L73355
2323B53844j69643K28768j40068l87180J56315L44819P788l74450k71666J65586
$$ y = [508144, 426704, 293077, 216798, -212732, -207797, -70694, 48694, 303366, 678875, 360501, -349860, -353864, -303217, 148555, 110604, 90819, 58765, 154247, 46131, -412807, -401271, -459592, 199239, 266864, 78267, 298856, 256538, 140682, 285808, 447221, 111831, -392, 120515, -183513, -82799, -213991, 280145, 648111, 861601, 107475, -564663, -203627, -180515, -369882, -227188, 176899, -68675, -60200, -265902, -592234, 192778, 87859, -96310, -375510, 20327, 780004, 701843, -212330, -246156, -299056, 128873, -271812, -341930, 358787, -279940, 327077, 860429, 549942, 143766, -119511, 253844, 84201, 312969, 172901, -214279, -57964, 286855, 294643, -79807, -351473, -185887]
2313a85887K04674L5631j45023q5626j68064p2519J80006j23420P6795L79162
2303I5729j13766m4894L815L4865Q22566k66283l0431k65292k48787k59272P87058
2292E15308q6947l05894q4165k46299l9054n806o6791L84929L73975Q489l65983
2281H1762R5445J62525j7050P5395m12792M82207J31016m02817j97643J55508
2271A53556l72789K4635M02766K11834Q3775l87977j42134N6453k29076k38673
2261d37630J66405L65974r9287k4191J85999J53660N3893l86255R5322l27322
2251b53432L68947j67148l65075q3869J94961k22906j5712j57043K38851K53529
2241b08897J26175L05526m31653j30511M77372k75790p0203k95798M9957N03984
$$ y = [-185887, 18787, 54418, -90605, -176231, -344295, -416814, -236808, -360228, -283433, 95729, -18037, -62931, -59116, -24251, 798315, 532032, 501601, 236309, -12478, -271750, 515308, 428361, 122467, 38302, -207997, -247051, -252857, -319648, 65281, 439256, 447745, 81762, 177207, 339732, 322682, 398077, -14715, 467492, 598508, 195691, -1952, 153556, -219233, -194598, 208168, 420002, 503777, 115800, -26334, 30119, -198957, -437630, -271225, 94749, -4538, -28729, 157270, 310930, 364823, -21432, 73890, -253432, 115515, -51633, -416708, -500577, -305616, -528522, -544234, -701277, -462426, -208897, -82722, 222804, -208849, -339360, 138012, -137778, -207981, -503779, -453822, 50162]
2231E0162j64073l57839M41217K08881p9700m6589L12459j22434j26091m17223
2221c01230P7801L63243P5385L22620n03352N63809j72894j53935j32129m35080
2211b95762K61339l01889n2009J10566M98958l2222j68322j50684K39094O2751
2201A71820k461J2690n65775K04875K19393j53273o8929l8008p01385P90762j28407
2190b58698J17836j27145j67933j38654K64354L54967O8255l07957l30929R8735
2180d27169K46788R3223L310l66317k98298N74592P4109N41393L33211k51018
2170E23824n33962J41515M38165m60866n31993P87L48293K14814K52178m1381
2160C51374L19516k00150k94029o61654J10326P92k56284l4752L47514J99104
$$ y = [50162, -113911, -471750, -30533, 178348, 98648, 52059, 364518, 242084, 115993, -301230, -223429, 139814, 215199, 537819, 34467, 598276, 425382, 271447, 139318, -295762, -34423, -336312, -388321, -277755, 221203, 188981, 20659, -130025, 109069, 171820, 169359, 182049, -383726, -178851, 40542, -112731, -181660, -219668, -921053, -130291, -258698, -140862, -268007, -435940, -574594, -310240, 44727, 112982, -194975, -525904, -427169, -180381, -87158, -83848, -450165, -748463, -173871, -99762, 441631, 774842, 523824, -10138, 131377, 569542, 108676, -423317, -422530, -74237, 140577, 392755, 351374, 670890, 470740, 176711, -484943, -374617, -373825, -630109, -664861, -317347, -118243]
2150a18243O1043j41924j7288r384j65442N94835m48057j88530O23543J0535k85062
2139h3974l50262L81679K57935l93008p16453P35251k16768j29850j05907J65846
2129d55511L79123m44167N49348K39430q3927p6416j67703j02248k25836M4768
2119c43139N1556K77118P5299k21110l3366L57848q2563j81669j23582P4876n0214
2108a98946q4919N66220j14087m15098J11132L00305n48879j49707j71821Q8019
2098f17781K53833K89208o0473j71706J18423j26931n0834j04737L44051L810
2088a23137J47302N7034m60209j50361K0653L10924j58297K11478K94150O9210
2078B18747L58629j52259l23376k45871K65114J64283o81492M80283n8194M88517
$$ y = [-118243, -57200, -199124, -216412, -225796, -391238, 203597, -244460, -432990, 190553, 201088, -83974, -434236, -52557, 205378, -187630, -904083, -168832, -385600, -515450, -621357, -455511, -76388, -520555, 28793, 268223, 184296, 107880, -59823, -162071, -387907, -343139, -291583, -14465, 60834, -160276, -193642, 164206, 81643, -100026, -223608, -148732, -198946, -283865, 282355, 168268, -246830, -135698, 164607, -384272, -533979, -705800, -617781, -363948, -74740, -135213, -306919, -188496, -315427, -366261, -470998, -126947, -123137, 24165, 81199, -379010, -529371, -508718, -197794, -356091, -144613, 149537, 218747, 577376, 425117, 101741, -144130, 120984, 285267, -396225, 84058, 25864, 514381]
2068E14381j18991l69007k20529K37847r251J67577L1253j32916j11907N07951
2058D96408J04836L84424j04959l1044J24443j00107K38629L60205m90274L42522
2048A325083N06865M12963R1261M6557o7253p3224N30660P85523K8435N67876
2038D154746J78157k06601k50968l40264l51299n09224n38325q69117R1468M46309
2028A804882J40902m04378j51697k55325J01863j78425o05619j85892J54352L74050
2018G94713K92434m85989l5406M4781R523k55652j71005J46769J18214m0693J92327
2007F10016o82961M18479K25693N2781k72036m44595N68445K1612r4523J72122
1997E75033m75033J03534J72243j3068l78521j21608k4500K99914k54931q2915
$$ y = [514381, 395390, 26383, -194146, 43701, 34450, 202027, 233280, 100364, -11543, 496408, 601244, 985668, 880709, 849665, 974108, 874001, 1112630, 1472835, 982561, 1325083, 1831948, 2244911, 2336172, 2382729, 2315476, 2242252, 2772912, 3558435, 3586870, 4154746, 4332903, 4126302, 3875334, 3535070, 3183771, 2674547, 2136222, 1267105, 1358573, 1804882, 1945784, 1541406, 1389709, 1134384, 1236247, 1057822, 452203, 266311, 420663, 794713, 1087147, 601158, 565752, 610533, 620056, 364404, 193399, 340168, 458382, 417689, 610016, -72945, 345534, 571227, 624008, 351972, -92623, 475822, 497434, 402911, 575033, 100000, 203534, 375777, 362709, -15812, -137420, -161920, 137994, -116937, -199852]
1987a99852q0620o1092J32199O14234m8953j49606K16303n57015m75095N46243
1977f3254j25296J19825L72894L0568k39922j16919K17520K73409k88496o46836
1967d66507J22712k44947K68040K9337J84707K56147J74130j51103m23372j34394
1957c85250l4668R1577K22350K81639m78439J11605L30832m03589N78556k11147
1947A03466k8707J21371l55280J60821j76834M0424j8002O0298K68035o0877l38706
1936b23991K34950j70823l61111J82576N17002L3356k11129m413J43245J96191
1926C35853k16656K248p7557m44421J81600K30036l91222k04770r616O77056m92000
1915d09449n1556J93977l03013K36488M82996m51315J22369L37120m19777L16054
$$ y = [-199852, -280472, -341564, -209365, 404869, 355916, 206310, 422613, -134402, -609497, -63254, -188550, -68725, 304169, 334737, 94815, -22104, 195416, 468825, 180329, -466507, -343795, -588742, -320702, -291365, -106658, 149489, 323619, 172516, -250856, -385250, -419918, -328341, -105991, 175648, -302791, -191186, 139646, -263943, 314613, 103466, 74759, 196130, -159150, 1671, -175163, -134739, -152741, -92443, 175592, 114715, -223991, 10959, -159864, -520975, -338399, 178603, 211959, 830, -3583, 139662, 335853, 119197, 121445, 43888, -400533, -218933, 11103, -380119, -584889, -594505, 82551, -409449, -461005, -267028, -570041, -333553, 149443, -301872, -179503, 157617, -262160, 53894]
1905E3894J67587j30020l98277M02706J96145J63622j50405m4175J82225j49970
1895B93332k78199L8265j16188n10503N73507j52012m1660L54851k02088L26122
1885B85427r3914k29870J54418K46890j74073n41953k80234N6419n6188k43270
1875h76348L08209L26117l87329j62562J26777K14898L27298J28258l23509N07815
1865A89624L37651o05473N5728J33929j19063k4253k10790j83281K80697o720
1855a51951K61239r2001j26002o5413k77669M4553J30091l39062J38828m68510
1845i45897L53535P8144J36654M32119j84685k13869N2709K35675j55013k59414
1835d70042k85337M1084q3534j13739J88112M81749j51870k48877J05126J89399
$$ y = [53894, 221481, 91461, -306816, 95890, 292035, 455657, 305252, 261077, 443302, 293332, 15133, 53398, -62790, -573293, 214, -151798, -193458, 161393, -40695, 285427, 191513, -38357, 116061, 362951, 188878, -353075, -633309, -576890, -633078, -876348, -568139, -242022, -629351, -791913, -665136, -450238, -122940, 5318, -318191, 189624, 527275, -78198, -22470, 111459, -7604, -31857, -242647, -425928, -145231, -151951, 109288, 17287, -108715, -174128, -451797, -407244, -277153, -616215, -477387, -945897, -592362, -514218, -377564, 54555, -130130, -343999, -291290, -55615, -210628, -470042, -755379, -714295, -797829, -911568, -723456, -241707, -393577, -642454, -537328, -347929]
1825c47929p9556K39343l728j58231K4176j28702q8141k14514K75171L95743J01190
1814A4822n17680K36043J67853n01269j54960M41415j85537K96689K94365j46771
1804e5030k46996n9801j93518j07417L09832K67010j16457l8436K01889l06858
1794c45782K7816j37657K19657j1236o2905o790j65743K61307n0342J52551J27084
1783G960k82053K1308o5354k69777N0747j39181l9217L0993J04660O1379J56805
1772c61730J04835j74271o0412m38290M00386Q02746j25757q35875J96892L42080
1762a49396j75835k81863J44647k63124l937N17334j30973k62070k96739O57820
1752b44136K7075l71596L24511J28235L01390q2129m7340k72766M9315k67571
$$ y = [-347929, -427485, -188142, -191870, -350101, -325925, -454627, -542768, -757282, -482111, -86368, 14822, -502858, -266815, -98962, -600231, -755191, -313776, -499313, -202624, 91741, -55030, -302026, -361827, -555345, -662762, -352930, -85920, -202377, -240813, -38924, -345782, -317966, -455623, -235966, -247202, -310107, -316897, -482640, -221333, -271675, -119124, 7960, -274093, -252785, -318139, -587916, -537169, -676350, -715567, -684574, -579914, -518535, -361730, -256895, -431166, -491578, -929868, -529482, 273264, 147507, -688368, -491476, -149396, -325231, -607094, -462447, -725571, -729508, -212174, -343147, -605217, -901956, -244136, -217061, -588657, -264146, -135911, 165479, 83350, 36010, -236756, -187441, -455012]
1742d55012k60291k31482j41201j49812J71085N98075M87050L73320j46525o09489
1732c64282J04785M10592k70241k52247J22590j48612M02168j97441j64532J80997
1722a76223m08471j1651O35034k38195j69058j22100J44844r3699j18991j29593
1712f88103J64242K90030j54242k03069j03386N37732J56597q1304k05649k84287
1702e71439r1219L26007k19352m01580L34956O9469O9976L3125K58012q2127P7927
1691a96245j10726l5008k51806L23579K21737J02123j1238q23902M26492j24062
1681d79056J4595k29598J44440q4393J25924K01298n01939K51429o3003k66891
1671h87194N55969K6208L86248k13125p7378j53782l42439Q4521N08947K14264
$$ y = [-455012, -715303, -946785, -1087986, -1237798, -1066713, -468638, 18412, 391732, 245207, -364282, -259497, 151095, -119146, -371393, -248803, -397415, 4753, -192688, -357220, -176223, -584694, -596345, 38689, -199506, -368564, -490664, -345820, -439519, -558510, -688103, -523861, -233831, -388073, -591142, -694528, -156796, -199, -81503, -287152, -571439, -662658, -336651, -556003, -957583, -622627, -553158, -483182, -450057, -192045, -274172, -196245, -306971, -341979, -593785, -270206, -48469, 53654, 42416, -781486, -354994, -479056, -464461, -694059, -549619, -634012, -508088, -306790, -808729, -557300, -620303, -887194, -331225, -305017, 81231, -131894, -209272, -363054, -705493, -620972, -112025, 102239]
1661A02239J25861m70978l42603O32702L33571n16676k53935K62837K03298o36840
1651e60524j69881N51105m6537M1551l37779j04013K57640p64k02013m5895k48717
1640h65827l4610J11971j35099j89103L30327L24320K97489J60898l05392n7374
1630c62400J61879K05588l90562o3353n45026J46220M87253m52062J58916K90146
1620c63401k88548Q0044N08460k30066m0827l67876K02777L37777n1257K48437
1610C5520l84555M9642Q1338J38240l68476K02512k0192L87567Q6621k35835l66282
1599c93900j84143K65302m2297M54698k54948L08349k34038m33583K87773p8247
1589c05034k1325l0808J67465k44186J29251J59717M46752N0190n53566k16483
$$ y = [102239, 228100, -242878, -585481, 47221, 380792, -135884, -389819, -126982, 76316, -560524, -730405, -179300, -225837, -184286, -522065, -626078, -368438, -369202, -571215, -617110, -865827, -900437, -788466, -923565, -1112668, -782341, -458021, -160532, 366, -305026, -362400, -200521, 5067, -385495, -448848, -993874, -847654, -360401, -812463, -653547, -363401, -651949, -571905, -63445, -293511, -334338, -702214, -499437, -161660, -212917, 35520, -349035, -299393, -218055, -79815, -448291, -245779, -265971, 121596, 208217, -27618, -393900, -578043, -312741, -355038, 99660, -155288, 153061, -80977, -514560, -226787, -305034, -326359, -357167, -189702, -433888, -304637, -144920, 301832, 352022, -201544, -418027]
1579d18027l81608L96762M12019m65662k5047J78538Q9968M8570l35458r0168
1569e90113k33036L59903N35545j46585k63009K14010K93988p3928n94377o2958
1559e60560m09290L76870M68851J00057j6167k63889J70968j04457L76188k27969
1549h9398k89983J69260l44335R1599N23105K48385K7823l68946m84437K19226
1539b97701j98503L19897l17548K45914K71568l0876n29337J15221K18440j40098
1529c43023M16100R4224j08416k89152j3606l48202L1958K26630l97808L12802
1519d18493k04032N74308k9766l67066O0015p7065N27823o68385J8905M7253L8019
1508d98484J56571m57830J00999N20768N7135l96083m277K21848j61182k2161
$$ y = [-418027, -799635, -402873, 9146, -456516, -481563, -303025, -213057, -164487, -499945, -590113, -823149, -463246, 72299, -74286, -337295, -123285, 170703, 96775, -497602, -560560, -969850, -592980, -124129, -24072, -40239, -304128, -133160, -237617, 138571, -89398, -379381, -210121, -554456, -462857, 60248, 308633, 336456, -32490, -516927, -297701, -496204, -176307, -493855, -247941, 23627, -7249, -536586, -421365, -202925, -343023, 73077, 167301, 58885, -230267, -243873, -592075, -560117, -333487, -731295, -418493, -622525, -48217, -77983, -445049, -385034, -462099, 65724, -602661, -583756, -536503, -498484, -341913, -799743, -698744, -177976, -120841, -516924, -521201, -299353, -460535, -482696]
1498d82696m4531L79114l93546j63576r0948M05272L77060k68758J63332k40599
1488c59876J25073j55593k17682k5686j43393K70787L94167J41113k46723K24455
1478F642Q5273n26466j34445j06918K14930L77777K0970j66179k9086p9611J93729
1467a43384K24364k21597o5620M17027m65938J29455J6385j78576J72264k82711
1457c98331L69919n17183L05281k25933m2185L89746l91818n14042M34506P36474
1447A46434K2585O603l10414o84506N18613O27453K1148n64458j88291M49798
1437D4965J5810M9374m34722j00004r6019l81484M71289J91910o196K29278m12606
1426d28405L22315K15773q4598K6303j96944K82748n4859p1813n17262J49865
$$ y = [-482696, -527227, -148113, -541659, -705235, -796183, -390911, -13851, -282609, -119277, -359876, -234803, -390396, -608078, -633764, -777157, -506370, -112203, 28910, -217813, 6642, 91915, -434551, -568996, -675914, -460984, -83207, -62237, -228416, -257502, -337113, -143384, 80980, -140617, -206237, 210790, -255148, -125693, -109308, -287884, -115620, -398331, -28412, -545595, -240314, -466247, -508432, -118686, -510504, -1024546, -590040, 146434, 169019, 175622, -134792, -819298, -300685, 326768, 347916, -216542, -404833, 44965, 60775, 110149, -324573, -424577, -520596, -902080, -430791, -238881, -245077, -15799, -428405, -106090, 109683, 25085, 51388, -145556, 137192, 82333, 10520, -506742, -356877]
1416c56877N19827p0230K09695r280l23293l09954J16814j06411k74493M34799
1406a69403J85430j99723Q8722j55671l02338N5239N17884j40880m15480O7878
1396d68342L45488P9950j35356k49793j99053L97645J66338l4684l16194o9310
1386d83311j62123j21324J78467l49570P11422L48758l76034l41727K84523K38621
1376g2298k11897J51884M3343P6100j07981R0867m0048N2973j77899K56573J19146
1365A80763j48768j80631J11120n59487j91663O3142l38172M84408M05909j53910
1355c27289m7786K24356K07184k63039M4376P80092k67011j67005O4537j39288
1345A09127j97829l88393q7879J49819R8038K65243n54037j83764M12468N80758
$$ y = [-356877, 162950, 92720, 302415, 293135, -30158, -340112, -223298, -329709, -604202, -169403, 16027, -183696, -94974, -250645, -552983, -497744, 20140, -120740, -536220, -468342, -122854, -42904, -178260, -428053, -627106, -229461, -63123, -97807, -414001, -483311, -645434, -766758, -588291, -937861, -226439, 122319, -253715, -595442, -310919, -72298, -284195, -132311, -88968, -12868, -120849, -29982, -70030, -17057, -194956, 61617, 180763, 31995, -148636, -37516, -597003, -788666, -725524, -1063696, -579288, -173379, -327289, -375075, -150719, 56465, -206574, -162198, 617894, 350883, 183878, 248415, 109127, -88702, -477095, -564974, -415155, -317117, -51874, -605911, -789675, -377207, 203551]
1335B03551l13166k55504n2156M56668k64110M7846j73744J4398N6690k68160
1325e47687J8264N0787R3463k38083N4324K43494K42552p581J27108l44668k52908
1314e60935M76310j59465n00378q6089k04387O00629M52763Q0703k75014J10259
1304f5604o9019j67869J25190j41137q2877m08127K12660K15867Q1346l6457O465
1293c29562N62826m34128m17759L45452M22541o9669j90161n69830K76125L18468
1283h5697K17015k05484n59846l51196N17527K98093j16366J06299J55293J69925
1273A45563j61252n40076q5084l82052J85931Q63718j64321M0359l2884Q1226
1263d8872j13041Q359l99545L75032k95612P4962j01023k18263J14157L05128
$$ y = [203551, -109615, -365119, -417275, 39393, -224717, -176871, -350615, -336217, -279527, -547687, -529423, -478636, -385173, -623256, -568932, -325438, -82886, -90467, 36641, -308027, -560935, -84625, -244090, -744468, -830557, -1034944, -434315, 18448, 99151, -175863, -65604, -134623, -302492, -177302, -318439, -401316, -809443, -596783, -380916, -299570, -336027, -329562, 233264, -200864, -618623, -273171, 149370, 79701, -110460, -680290, -404165, -85697, 131318, -74166, -634012, -985208, -467681, -169588, -285954, -179655, -24362, 145563, -15689, -555765, -640849, -1022901, -836970, 26748, -137573, -97214, -130098, -48872, -161913, -153554, -553099, -178067, -473679, -398717, -499740, -718003, -603846, -298718]
1253b98718q5255j0896q992J73555K92534J09193j00888m44613K64321n9473J33126
1242c6106j16452k4694l63124N95467p2584J5871k47019m66297K54516j62307
1232f22729K18376K59684K82346J643j0795j57505l99248J37874K08297j04698
1222a86755j81208J36767l29495K64371P5377J0206j16014N4222M71987j23170
1212G6288q4488l74662j61734J25647K25395K45428n31477k56176L37264o930
1202d05445j61937K54819K22123K4025l9747J7420k27174l9366k74360M38423
1192a91219J75496k23819m57269J29367J23477j92692N50388m71076L34840j45891
1182c68398K68435n718J14019o5789M13369n3201j81693m4778L788l15014j04130
$$ y = [-298718, -383973, -394869, -403861, -230306, 62228, 171421, 70533, -374080, -109759, -169232, -36106, -152558, -177252, -540376, 55091, -17493, -1622, -248641, -714938, -460422, -622729, -404353, -144669, 137677, 139320, 128525, -28980, -428228, -290354, -82057, -186755, -367963, -231196, -560691, -296320, -220943, -210737, -326751, -272529, 199458, 76288, -8200, -382862, -544596, -418949, -193554, 51874, -479603, -735779, -398515, -405445, -567382, -312563, -90440, -66415, -106162, -88742, -315916, -355282, -629642, -191219, -15723, -239542, -696811, -567444, -443967, -636659, -86271, -557347, -222507, -368398, -99963, -105681, 8338, -57451, 355918, 302717, 121024, 76246, 80034, -234980, -339110]
1171c39110M19452j01882k24510k55723K05383k49973L27704R6344l12315R7508
1161c37122K34942j00566K73280m00110K25448K77924o1650M08920m70554k84033
1151b33521J59863J0027j35196J69890k25269N69360l08219P0591k46680k53113
1141d22267L55800r3766l6329N53740K18543m69668k87278K76360K59266m08309
1131e3908k22932L69894R9170k68652L38202L45116k74525l15852N28239l64008
1121A80744O72239j91284m81433j92276l7334L79318k40037l26403K50625L77249
1111C91408q0228n54896j89020K90113q1973J48149j90272N603j7196l1354k37554
1100e47220k47499K97062M71065k70615k88004L610L07430L14483m2959P2167
$$ y = [-339110, 80342, -21540, -246050, -501773, -296390, -546363, -218659, -122315, -434630, -337122, -102180, -202746, 70534, -329576, -104128, 173796, 112146, 521066, 50512, -233521, -73658, -63631, -198827, -28937, -254206, 315154, 6935, 77526, -169154, -422267, -66467, -160233, -196562, 357178, 575721, 106053, -181225, 95135, 354401, -53908, -276840, 93054, 192224, -76428, 261774, 606890, 332365, 16513, 544752, 180744, 852983, 661699, 180266, -12010, -49344, 329974, 89937, -236466, 14159, 391408, 311180, -243716, -432736, -142623, -224596, -76447, -266719, -261116, -278312, -309666, -547220, -794719, -497657, -26592, -297207, -585211, -581601, -274171, 40312, -2647, 69520]
1090F9520l65603J83611J10400j50223K67647j92296k69719O8143L26546k35133
1080a87107m2732K16658k28158L19056O81769n98177n67767L25091J20978Q3066
1070A22677o5318J18446m3925l6163l1754k52848J68924M12919k46976m37o7611
1059G7934M44702k59191k73525O3371M75291j24785j14377l5013M07987l71646
1049B90748m41431m39357L02074j6936j62573L6911L19230k9233J90901J31358
1039A81692j50321l5033k26974j27215k29546N51535l68699K75917R8595j56639
1029a86688J05739r7113J24256J07153l5223j05803k0415K51200l94756p7647
1019c29297J15120m14020K07745Q42340k53743j35125n44071P0970L36123L58826
$$ y = [69520, -296083, -112472, -2072, -152295, 115352, -76944, -346663, -278520, 48026, -187107, -229839, -13181, -241339, 77717, 759486, 161309, -406458, -81367, 39611, 122677, 57359, 175805, 131880, 95717, 63963, -188885, -19961, 392958, 145982, 145545, 77934, 522636, 263445, -10080, 53291, 528582, 403797, 289420, 254407, 662394, 290748, -150683, -590040, -287966, -304902, -467475, -430564, -111334, -140567, 50334, 181692, 31371, -3662, -230636, -357851, -587397, -35862, -404561, -128644, -30049, -186688, -80949, -178062, -53806, 53347, 18124, -87679, -108094, 143106, -251650, -329297, -214177, -628197, -420452, 421888, 168145, 33020, -511051, -440081, -103958, 254868]
1009B54868j96430j1002k61308L91343k01093K08823m3644l42211K08585L6100
999D4031m11777q5836L9488K30821J07639O9435K92675j60385j0460J59215j39794
988A35052m33854l0443O4938J11138k81292O3715J45153k50050J07592L06078
978f1973J09760j91357q0437p0845r9829K04575P446l12599K32770N968J34284
967a22237O8677O8014l02996M96823R7473p28267j06270J7541K29007M83892k23003
956b1346j42865J90416j96985L69823j24186j30609j40235J43171L84909k56265
946G5828j39676J74096k95127M77035j29544n6104O2512m0601j81764j73392K40530
935A3793k9190L8341J08574j02440J46433J33415j06669j02394O37723l28353
$$ y = [254868, 58438, 47436, -213872, 177471, -23622, 185201, 141557, -200654, 7931, 44031, -367746, -453582, -414094, -183273, -75634, -6199, 286476, 126091, 115631, 274846, 135052, -298802, -329245, -264307, -153169, -434461, -370746, -225593, -475643, -368051, -61973, 47787, -143570, -224007, -294852, -394681, -190106, -182660, -495259, -262489, -256521, -122237, -53560, 14454, -288542, 208281, 305754, -422513, -528783, -511242, -282235, 201657, -21346, -164211, 26205, -170780, 199043, 74857, -55752, -195987, -52816, 332093, 75828, -63848, 110248, -184879, 292156, 162612, 106508, 169020, 128419, -53345, -226737, 13793, -15397, 22944, 131518, 29078, 175511, 308926, 202257, 99863, 737586, 409233]
925D09233l7232m90972m4219j87574j39310K51776J14951j61946J63820M27978
915C06505k10629l90712j02124k1359K76660K43622j09007o5663K05892J35060
905B68245K37961l9337r03086M17708M25129k61401k77470L64592j83606J4719
895F3454K73193J52254M94477m67049k42226K58260M7964q0891l4371k72059l46900
884a53894L63121p05135J60623L40784j29527M62849K9554o1378l26586m53007
874d72596K70691L14038m90789N41463L70965n12713P8142k59914l2652l5341
864b28706m5954k54579k6385M9956P1744L27488j80591K81280P9453Q5334q9746
853F9294J43122r0762j7597M0877K44448o49737L39631O81186k36558l22086J08040
$$ y = [409233, 372001, -118971, -163190, -350764, -490074, -238298, -123347, -285293, -121473, 306505, 95876, -294836, -396960, -418319, -141659, 101963, -7044, -72707, 133185, 268245, 506206, 466869, -436217, -18509, 406620, 145219, -132251, 232341, 48735, 63454, 336647, 488901, 983378, 516329, 274103, 532363, 580327, 499436, 465065, 193006, -153894, 209227, -495908, -335285, 5499, -124028, 338821, 368375, 306997, -19589, -472596, -201905, 112133, -378656, 162807, 533772, 21059, 99201, -160713, -193365, -228706, -274660, -529239, -555624, -505668, -433924, -106436, -287027, -5747, 73706, 159040, 69294, 212416, 121654, 104057, 144934, 389382, -260355, 79276, 760462, 523904, 201818, 309858]
842C09858l56747k73932L34714Q5063J74349k13517k76566L47694K51715m83441
832a00810K63848J82090l94711j81539M0092J99254k44300p2377N70433L9144
822C01124m48569J28587K10070J54470l90119J39530K46362M19596P577l84216
812C84412p2999k65499j43794m04565L20046J12770J29503R2838L78026M35030
802I65768j46917j014494J72960l06605j40084k61106M44699M61298p8237J79963
792B77245m9777k59370L45038L2601K09604j55481R6208k00194k18090o8434L11727
781C21077K64359m10022j22875K09360m91145o8864o7318Q1486R9289J67782L94599
770C77728m74198j05362L89326J05524K67270l22153K45238j00141j64182k30626
$$ y = [309858, -46889, -320821, 13893, 98956, 273305, 59788, -216778, 130916, 382631, -100810, 163038, 345128, -49583, -231122, -191030, 8224, -236076, -308453, 261980, 301124, -147445, -18858, 191212, 345682, -44437, 95093, 341455, 761051, 768628, 384412, 311413, 45914, -97880, -502445, -182399, -69629, 59874, 152712, 530738, 965768, 818851, -195643, -22683, -329288, -469372, -730478, -285779, 175519, 97282, 277245, 227468, -31902, 313136, 345737, 555341, 399860, 496068, 295874, 77784, 9350, 321077, 585436, 175414, 52539, 261899, -229246, -298110, -365428, -283942, -184653, -16871, 377728, -96470, -201832, 187494, 293018, 560288, 238135, 483373, 383232, 219050, -11576]
760a1576J27747K66858l86888K18918o5276j11229k99495K22137m5385L21450
750B37261l00723L5408L6780K92471L30644m7354l39542k57149m35633L75469
740g2368J95428P6210P3319J09873m14003N4045k74970k26121L71592M49998J63603
729E06606k7845j94309k37139j9545J37757L04514k51764j87697J90325j9160
719B01743J67061m08j73618K08753k12560J2187K68542m23096R0927k63741M96281
708C72071q9503k47051k65237m8708r3543N24241L11208m20518K13879k15014
698D1825P0601k02168j64409J44427K459J38828M13444n01619Q0149r3347L17899
687B48089n49720L32769k28237L43307K34035j81052N1005j5039L52142N9781
$$ y = [-11576, 116171, 383029, -3859, 215059, 149783, 38554, -260941, -38804, -84189, 237261, -63462, -28054, 8726, 301197, 631841, 584487, 244945, -12204, -447837, -72368, 123060, 199270, 272589, 382462, -31541, 22504, -252466, -478587, -106995, 343003, 506606, 478761, 284452, 47313, 27768, 165525, 470039, 218275, 30578, 220903, 201743, 368804, 368396, 194778, 403531, 190971, 203158, 471700, 48604, 139531, -124210, 372071, 282568, 35517, -229720, -278428, -371971, 152270, 463478, 42960, 256839, 41825, 112426, -89742, -254151, -109724, -107265, 31563, 445007, -56612, 23537, -69810, 248089, -301631, 31138, -197099, 146208, 380243, 199191, 250196, 235157, 587299, 647080]
677F47080k36803R6745j05796o43111R00024m02806n10867M07222K48558l16967
667H3279O2378J80779k6995o43336j55287K24045K5485n6385M35016K33050k8670
656C33359k57508l05927K8359M24271l6781m0114R3617R2288M90230k0747r01215
645a00168J05649J78182l27068J6235J33851j95990J41778P42600o7704l66790
635B60575o76389K98596L08377n0880j68692Q9962j12104j4254K72579Q9603K57342
624E54715r5800n55349O7647J60851o0183J37111j49757J11171N5369j34566M6051
613A37260N1256J53379p3093r2372O0043R7949k82596O951j25344l7502J69069
602F5000R1452Q5334k33069N6467p1197M24035j99816k22634K04749O6478J06686
$$ y = [647080, 410277, 507022, 401226, -241885, 658139, 255333, -255534, 151688, 400246, 83279, 145657, 326436, 299441, -343895, -499182, -275137, -249652, -306037, 128979, 362029, 333359, 75851, -230076, -201717, 222554, 185773, 145659, 239276, 331564, 821794, 801047, -100168, 5481, 183663, -143405, -127170, 6681, -189309, -47531, 695069, 627365, 260575, -415814, -117218, 191159, 140279, -28413, 61549, -50555, -64809, 207770, 297373, 554715, 458915, -96434, -28787, 132064, 71881, 208992, 59235, 170406, 225775, 91209, 137260, 188516, 341895, 268802, 176430, 236473, 334422, 51826, 58777, -66567, -104069, 65000, 156452, 241786, 8717, 65184, -6013, 418022, 218206, -4428, 200321, 266799, 373485]
591C73485m57234J58614L77701K21107N267q2086o48011K51586O7762j34347j10929
580B2915M260K24383M08612M1040n90434K77611j17885l17473K90773j59320J98991
569B83473K16560k15835k80525j36740K18675Q1892J92133K82921o09169J04722
559A38107M66160l4272k18124r1648L02100k61671O6842J19700j5075m55571Q9295
548A05843J58775J56938N2888j63531J47020K87545l11455l04454j88724L2360
538b6795J07323m68029L29355O35303Q3676K14255L31560o76139j39804l31042
528E9663J20427j58154j94841M80802R0679k3371M6144j13009j58915N47014J91008
517H87447j09712m0999j74755n65611o57804L20276J44391N24377K98305j63834
$$ y = [373485, -83749, 74865, 452566, 673673, 678940, 596854, -51157, 200429, 268191, 133844, 22915, 27175, 251558, 660170, 701210, 110776, 388387, 270502, -46971, 243802, 84482, 283473, 500033, 284198, 3673, -133067, 85608, 167500, 359633, 642554, 33385, 138107, 604267, 569995, 351871, 260223, 562323, 300652, 367494, 487194, 472119, 16548, 105843, 264618, 421556, 474444, 310913, 457933, 745478, 434023, 129569, -59155, -26795, 80528, -387501, -58146, 577157, 660833, 875088, 1206648, 530509, 390705, 59663, 180090, 21936, -172905, 307897, 398576, 375205, 421349, 308340, 149425, 696439, 887447, 777735, 736736, 561981, -3630, -661434, -341158, -196767, 327610, 625915, 462081]
507D62081r403L2605p434L70598K3922l57329k67483J23830K71124k81082j9511
496C41918m8547M34092m252R3139k84586L03646J13973j52289p03866o513J70895
485B57610J38785J0563j11611p7253k65046J82508J68963J48915j69697j10848
$$ y = [462081, 452678, 485283, 477849, 848447, 872369, 515040, 247557, 371387, 642511, 361429, 341918, 293371, 727463, 723211, 816350, 531764, 835410, 949383, 797094, 93228, 86715, 257610, 396395, 406958, 295347, 218094, -46952, 135556, 304519, 453434, 283737, 172889]
$$ [...]
##END NTUPLES=NMR SPECTRUM
##END=
