##TITLE=1H_CA-8911-2
 CD3CN, 8 sc, 
 4.08.2021
##JCAMPDX= 6.0         $$ Bruker NMR JCAMP-DX V2.0
##DATA TYPE= NMR SPECTRUM
##DATA CLASS= NTUPLES
##ORIGIN= UXNMR, Bruker Analytische Messtechnik GmbH
##OWNER= root
$$ XWIN-NMR		Version 3.5
$$ Wed Aug  4 09:25:44 2021 Russian Standard Time (UT+4h)  she@DPX200
##.OBSERVE FREQUENCY= 200.131506
##.OBSERVE NUCLEUS= ^1H
##.ACQUISITION MODE= SIMULTANEOUS
##.ACQUISITION SCHEME= undefined
##.AVERAGES= 8
##.DIGITISER RES= 18
##SPECTROMETER/DATA SYSTEM= spect
##.PULSE SEQUENCE= zg30
##.SOLVENT NAME= CD3CN
##.SHIFT REFERENCE= (INTERNAL, CD3CN, 0, 17.4971)
##AUDIT TRAIL= $$ (NUMBER, WHEN, WHO, WHERE, WHAT)
$$ ##TITLE= Audit trail, XWIN-NMR		Version 3.5
$$ ##JCAMPDX= 5.01
$$ ##ORIGIN= Bruker BioSpin GmbH
$$ ##OWNER= she
$$ F:/spectra/data/she/nmr/H-F/1/pdata/1/auditp.txt
$$ ##AUDIT TRAIL=  $$ (NUMBER, WHEN, WHO, WHERE, WHAT)
(   1,<2021-08-04 09:24:41.50 +0400>,<she>,<DPX200>,
      <created by zg, POWCHK disabled, PULCHK disabled
       configuration hash MD5:
       00 E9 B6 7A A2 85 ED C7 34 08 36 98 17 FE 4E 26
       data hash MD5: 16K
       3E FC 96 F8 E9 71 54 E9 88 EB BF 1F 3B 3D 87 B1>)
(   2,<2021-08-04 09:24:43.89 +0400>,<she>,<DPX200>,
      <Start of raw data processing
       efp BC_mod = 2 LB = 0.24 FT_mod = 6 PKNL = 1 PHC0 = -13357.75 PHC1 = 15.80099 SI = 16K 
       data hash MD5: 16K
       6D A2 D9 C1 34 6E AE 2B 82 01 81 F5 36 5E 0B 4C>)
(   3,<2021-08-04 09:24:59.34 +0400>,<she>,<DPX200>,
      <pk PHC0 = -1.828368 PHC1 = -2.4 
       data hash MD5: 16K
       DA 8E 71 03 FE 42 F3 32 96 15 30 08 12 6B EC D1>)
(   4,<2021-08-04 09:25:02.28 +0400>,<she>,<DPX200>,
      <abs ABSG = 5 
       data hash MD5: 16K
       CE DC B0 43 DC 37 A7 9D 34 79 D1 37 52 E1 A6 F6>)
$$ ##END=
$$ 
$$ hash MD5
$$ C4 FA 46 E1 09 C2 5B 31 19 A6 3B 87 91 97 91 B0
##$RELAX= 
##$RELAX= 
##$RELAX= 
##$RELAX= 
##$RELAX= 
##$RELAX= 
$$ Bruker specific parameters
$$ --------------------------
##$DU= <F:/spectra>
##$EXPNO= 1
##$NAME= <H-F>
##$PROCNO= 1
##$TYPE= <nmr>
##$USER= <she>
##$AMP= (0..31)
100 100 100 100 100 100 100 100 100 100 100 100 100 100 100 100 100 100 
100 100 100 100 100 100 100 100 100 100 100 100 100 100 
##$AQSEQ= 0
##$AQ_mod= 1
##$AUNM= <au_zg>
##$AUTOPOS= <>
##$BF1= 200.13
##$BF2= 200.13
##$BF3= 200.13
##$BF4= 200.13
##$BF5= 200.13
##$BF6= 200.13
##$BF7= 200.13
##$BF8= 200.13
##$BYTORDA= 1
##$CFDGTYP= 0
##$CFRGTYP= 5
##$CHEMSTR= <none>
##$CNST= (0..31)
1 1 145 1 1 1 1 1 1 1 1 1 1 1 1 1 1 1 1 1 1 1 1 1 1 1 1 1 1 1 1 1 
##$CPDPRG= <>
##$CPDPRG1= <>
##$CPDPRG2= <>
##$CPDPRG3= <>
##$CPDPRG4= <mlev>
##$CPDPRG5= <mlev>
##$CPDPRG6= <mlev>
##$CPDPRG7= <mlev>
##$CPDPRG8= <mlev>
##$CPDPRGB= <>
##$CPDPRGT= <>
##$D= (0..31)
0 1.2 0 0 0 0 0 0 0 0.06 0 0.03 0 0 0 0 0.0002 0 0 0 0 0 0 0 0 0 0 0 0 
0 0 0 
##$DATE= 1628054680
##$DBL= (0..7)
120 120 120 120 120 120 120 120 
##$DBP= (0..7)
150 150 150 150 150 150 150 150 
##$DBP07= 0
##$DBPNAM0= <>
##$DBPNAM1= <>
##$DBPNAM2= <>
##$DBPNAM3= <>
##$DBPNAM4= <>
$$ [...]
##$SUBNAM3= <"">
##$SUBNAM4= <"">
##$SUBNAM5= <"">
##$SUBNAM6= <"">
##$SUBNAM7= <"">
##$SUBNAM8= <"">
##$SUBNAM9= <"">
##$SW= 20.0188882624521
##$SWIBOX= (0..15)
0 0 2 0 0 0 0 0 0 0 0 0 0 0 0 0 
##$SW_h= 4006.41025641026
##$TD= 16384
##$TD0= 1
##$TE= 0
##$TE2= 300
##$TE3= 300
##$TEG= 300
##$TL= (0..7)
0 120 120 120 120 120 120 120 
##$TP= (0..7)
150 150 150 150 150 150 150 150 
##$TP07= 0
##$TPNAME0= <>
##$TPNAME1= <>
##$TPNAME2= <>
##$TPNAME3= <>
##$TPNAME4= <>
##$TPNAME5= <>
##$TPNAME6= <>
##$TPNAME7= <>
##$TPOAL= (0..7)
0.5 0.5 0.5 0.5 0.5 0.5 0.5 0.5 
##$TPOFFS= (0..7)
0 0 0 0 0 0 0 0 
##$TUNHIN= 0
##$TUNHOUT= 0
##$TUNXOUT= 0
##$USERA1= <user>
##$USERA2= <user>
##$USERA3= <user>
##$USERA4= <user>
##$USERA5= <user>
##$V9= 5
##$VALIST= <valist>
##$VCLIST= <CCCCCCCCCCCCCCC>
##$VD= 0
##$VDLIST= <DDDDDDDDDDDDDDD>
##$VPLIST= <PPPPPPPPPPPPPPP>
##$VTLIST= <TTTTTTTTTTTTTTT>
##$WBST= 1024
##$WBSW= 4
##$XGAIN= (0..3)
0 0 0 0 
##$XL= 0
##$YL= 0
##$YMAX_a= 93075
##$YMIN_a= -181200
##$ZGOPTNS= <>
##$ZL1= 120
##$ZL2= 120
##$ZL3= 120
##$ZL4= 120
##$ABSF1= 17.49711
##$ABSF2= -2.521927
##$ABSG= 5
##$ABSL= 3
##$ALPHA= 0
##$AQORDER= 0
##$ASSFAC= 0
##$ASSFACI= 0
##$ASSFACX= 0
##$ASSWID= 0
##$AUNMP= <proc_1d>
##$AZFE= 0.1
##$AZFW= 0.1
##$BCFW= 0
##$BC_mod= 2
##$BYTORDP= 0
##$COROFFS= 0
##$CY= -3
##$DATMOD= 1
##$DC= 0
##$DFILT= <>
##$DTYPP= 0
##$F1P= 0
##$F2P= 0
##$FCOR= 1
##$FTSIZE= 16384
##$FT_mod= 6
##$GAMMA= 0
##$GB= 0
##$INTBC= 1
##$INTSCL= 1.334414e-10
##$ISEN= 128
##$LB= 0.24
##$LEV0= 0
##$LPBIN= 0
##$MAXI= 10000
##$MC2= 0
##$MEAN= 0
##$ME_mod= 0
##$MI= 1.114404
##$NCOEF= 0
##$NC_proc= -8
##$NLEV= 6
##$NOISF1= 3.799351
##$NOISF2= 2.8
##$NSP= 0
##$NTH_PI= 0
##$NZP= 0
##$OFFSET= 17.49711
##$PC= 1
##$PHC0= -13359.58
##$PHC1= 13.40099
##$PH_mod= 1
##$PKNL= yes
##$PPARMOD= 0
##$PSCAL= 0
##$PSIGN= 0
##$REVERSE= no
##$SF= 200.130007508913
##$SI= 16384
##$SIGF1= 3
##$SIGF2= 2
##$SINO= 5.538805
##$SIOLD= 16384
##$SREGLST= <1H.CDCl3>
##$SSB= 0
##$STSI= 16384
##$STSR= 0
##$SW_p= 4006.41025641026
##$SYMM= 0
##$S_DEV= 0
##$TDeff= 16384
##$TDoff= 0
##$TI= <>
##$TILT= no
##$TM1= 0
##$TM2= 0
##$TOPLEV= 0
##$USERP1= <user>
##$USERP2= <user>
##$USERP3= <user>
##$USERP4= <user>
##$USERP5= <user>
##$WDW= 1
##$XDIM= 16384
##$YMAX_p= 358379092
##$YMIN_p= -1096631
$$ End of Bruker specific parameters
$$ ---------------------------------
##NTUPLES= NMR SPECTRUM
##VAR_NAME=  FREQUENCY,     SPECTRUM/REAL,   SPECTRUM/IMAG
##SYMBOL=    X,             R,               I
##VAR_TYPE=  INDEPENDENT,   DEPENDENT,       DEPENDENT
##VAR_FORM=  AFFN,          ASDF,            ASDF
##VAR_DIM=   16384,         16384,           16384
##UNITS=     HZ,            ARBITRARY UNITS, ARBITRARY UNITS
##FACTOR=    0.24454680195387, 1,            1
##FIRST=     3501.69682909622, 0,            0
##LAST=      -504.713427314036, 0,           0
##MIN=       -504.713427314036, -1096631,    0
##MAX=       3501.69682909622, 358379092,    0
$$ Real data points
##PAGE= N=1
##DATA TABLE= (X++(R..R)), XYDATA
$$ [...]
9467 729665 523687 475717 515372 721944 923519 801714 550407 161382 277302 177075
9457 177075 377556 356654 387782 342609 754559 831389 335045 120488 371024 60008
9447 60008 -37642 455543 653827 219667 523432 275567 391427 -30848 -256640 -263989
9437 -263989 277050 -108438 241631 374089 94448 25023 155109 221537 -48565 -178350
9427 -178350 203407 602350 727098 771799 415847 68176 440165 598287 604062 430386
9417 430386 215340 413947 632071 858015 827394 628540 692122 488181 35506 80778
9407 80778 277726 584327 289182 250021 -61106 274918 528340 915159 551797 171152
9397 171152 235898 154608 90989 106858 439993 783555 870698 300317 229424 -57378 -7477
9386 -7477 247818 192313 233873 -191780 180813 330423 270440 138458 709305 674750 399194
9375 399194 601972 424232 279056 230219 332853 233338 265391 484823 734621 314020
9365 314020 576854 510076 51457 595319 796372 722240 574655 643783 723082 806185 772642
9354 772642 887816 545208 575188 377089 562861 356931 852359 586860 747332 162929
9344 162929 156581 126551 374314 557712 137893 42097 -17898 398771 366768 916621 995383
9333 995383 1076770 463943 210503 98786 137260 -135401 3727 358340 147779 -13962
9323 -13962 265340 328507 270385 -74320 -147759 -168278 99605 379837 385459 271123 369361
9312 369361 266260 -38725 357371 361948 -226505 -209873 -317214 -452141 -320463 -409619
9302 -409619 -68485 -48611 -74735 45391 271901 451245 287290 419444 439083 -75236
9292 -75236 31602 600398 380378 241501 471872 667701 299889 404421 552805 266636
9282 266636 281644 435105 -124989 -99717 814245 729902 802460 846213 825981 460639 268604
9271 268604 443462 243204 129726 -67912 113409 54930 -75267 -105657 533668 862726
9261 862726 296621 487113 633462 15978 76324 307612 247362 501091 596812 511303
9251 511303 121060 120096 281772 178849 592739 983783 870567 154920 157446 117404 176740
9240 176740 114335 403082 693181 137855 100620 311785 36959 175564 585510 384350
9230 384350 430194 123424 337929 253525 192234 350309 362816 -6683 -55611 -125176 227347
9219 227347 569013 707877 894330 582460 185329 606523 455050 445600 661392 338276
9209 338276 23013 150968 294840 452102 245034 -132542 -523380 -461733 -111163 -24117
9199 -24117 84584 -321161 144910 -153901 -238896 -342652 234289 -407241 -45639 129754
9189 129754 -327578 -492671 -280465 -519376 -214232 431283 738437 576472 232089 309729
9179 309729 592417 456888 384775 -32954 93077 235011 37553 59195 -347146 320898
9169 320898 212904 476074 858934 627239 359066 334606 -96303 34352 103097 437530
9159 437530 512036 656422 481654 22295 346658 639742 373103 177524 213968 414111
9149 414111 984180 1226807 804320 427931 449156 468571 494162 364627 697302 587301
9139 587301 -336298 68908 31832 38225 165209 377658 480077 468521 531434 275719 -126297
9128 -126297 -553665 -262691 -72575 -374471 -65398 84762 178983 149119 214479 253348
9118 253348 334894 416708 -140663 -75729 88887 -121362 -349477 -73131 122510 -46564
9108 -46564 -86233 395746 521756 286535 259254 262028 450728 -247398 -254823 181750 476136
9097 476136 257740 111246 -67190 241274 251136 425471 826912 701789 580043 181880
9087 181880 -113221 367284 540961 444159 451189 349974 488052 439730 361463 266475 -183093
9076 -183093 -202960 126343 153065 206324 257067 157394 101512 -1671 127549 -19774 -188005
9065 -188005 -220257 158262 367172 539633 577443 754256 536608 325078 -41570 -124175
9055 -124175 -261658 -704459 -58006 -119439 273166 84574 176444 -142734 -27967 62454
9045 62454 -118134 447428 600366 -113098 131821 -4294 -10208 225572 415723 433590
9035 433590 755577 304362 546696 1160633 748106 341283 -111984 39209 626949 597172
9025 597172 664895 132934 6757 61876 277187 504566 106367 97882 207611 552029
9015 552029 562259 87791 -95170 292711 603126 479270 596302 263524 350458 483434
9005 483434 675035 386434 -198567 182706 219534 92626 -143456 -74625 -99990 -24755
8995 -24755 222161 506923 743071 811302 828843 881608 870610 374300 478627 191015 297559
8984 297559 517674 281532 485295 289996 -82491 49400 430544 764189 652342 355620
8974 355620 660349 484863 172128 127520 230496 167470 373491 656702 695753 -10253
8964 -10253 82266 653890 909566 1132669 1556585 1153286 860984 654771 723565 1055407
8954 1055407 878632 643542 185305 96489 153756 82082 370401 111486 572485 246069
8944 246069 472782 428974 543437 390940 850664 638707 726744 848643 842217 688493
8934 688493 614284 214243 329687 754944 617909 303188 114683 629352 672667 620088
8924 620088 107724 478294 210954 540611 418798 -81327 188277 631539 614950 650971
8914 650971 539133 705265 958541 620532 142787 524470 245311 654223 590099 731816
8904 731816 770234 1003032 1073577 1061204 632991 722837 823337 512554 237615 757645
8894 757645 1238317 939560 903390 595384 827986 995230 1058879 1133387 1180039 598418
8884 598418 700474 896967 712297 548090 640883 670106 466336 992535 1158298 698214
8874 698214 520397 384942 221477 149366 979576 986289 966441 676286 705438 832393 796512
8863 796512 707173 464606 468245 723377 826233 557840 649300 925313 582897 583190 618224
8852 618224 602934 755691 600537 702819 443819 866571 1123438 1027121 1094593 867779
8842 867779 870271 673049 971142 463604 206711 539501 572867 709436 896491 944665
8832 944665 821125 593040 638755 874746 891410 868208 990463 942010 488220 1080208
8822 1080208 722348 725528 645026 674241 668666 824792 1071777 1080130 936008 857691 1362198
8811 1362198 1800479 977768 415196 439142 614786 1171738 889998 567414 550534 764402
8801 764402 639120 429899 610181 1197848 834535 215949 1100611 644514 875437 1398687
8791 1398687 968133 1036165 796057 670152 1037373 1289673 1319113 817178 775048 902646
8781 902646 1423535 1506328 549599 946780 836890 693312 440647 678183 945912 1016269
8771 1016269 1069255 860061 1219184 1783113 1613173 1167075 843204 893858 1090785 800174
8761 800174 753106 708893 601913 1272164 1424757 1278786 1227700 1158162 1449718 1419979 992890
8750 992890 780264 1204439 1026435 967177 1099542 1220478 1281622 1194863 1314888 1088084
8740 1088084 1093300 1220088 1294365 1007271 1082530 1279616 1008481 1174972 1410035 1282689
8730 1282689 1507373 1058778 1236792 1220173 1344314 1671663 1513919 1582790 1203432 1164311
8720 1164311 1032213 1181193 1244267 1350727 1726452 1320395 1101847 1195847 982326 1414966
8710 1414966 1296359 1318579 1527353 1708301 1650712 1400165 1410392 1535479 1321507 873947
8700 873947 1059241 1458216 1320042 1613626 1938564 1704452 1727018 1578375 1369461 1262720
8690 1262720 1817690 2280284 2626913 2061004 1850972 1967807 1669907 1809124 1795028 2228599
8680 2228599 2160338 1984140 2013858 1771730 2007755 2295270 2530157 2253332 2527357 2682082
8670 2682082 2617921 2567562 2349400 1935428 1733817 1470277 2096072 2599377 2159114 2148966
8660 2148966 2517303 2484256 2351850 2184604 2416193 2231374 2056404 2313758 1932738 2347961
8650 2347961 2198366 2111539 2436046 2250327 1588339 1864877 2463661 2819364 2491110 2333496
8640 2333496 2644559 2905909 3058573 3284110 2986270 3161201 2972959 3027853 3341196 3137569
8630 3137569 2506104 2704027 2290225 1876158 2544137 2640422 3194570 2513921 2659532 3117993
8620 3117993 2931615 2942614 2799482 2921930 2643147 2538902 2767025 3256049 3061544 2361360
8610 2361360 2579125 2528244 3002455 2929701 2846592 2525741 2481691 2496804 3162013 3427498
8600 3427498 3732566 3785869 3101116 3265347 3437087 2956098 2698697 2796191 2474308 3442887
8590 3442887 3756904 3770730 3301425 3095713 3360890 3416063 2868769 2888631 2933200 3131347
8580 3131347 2992287 2805040 3053502 3055989 2953507 3055717 3015411 3139726 3191200 2935134
8570 2935134 3143258 3256916 3723023 3351677 3030630 3390571 3497868 3407460 3506624 3331825
8560 3331825 3142196 3178754 3041961 2952862 3100540 2749725 2767938 2848972 2967225 3408098
8550 3408098 3073644 3035402 3437388 3852656 3408269 3212720 3091246 2615200 2700242 2623172
8540 2623172 3354033 3189092 2834573 2772995 2717398 2684999 2884041 2802015 2873970 2720965
8530 2720965 2527733 2708566 2331221 2456864 2628620 2674501 2449342 2740378 2409165 2474778
8520 2474778 2506579 2669928 2811267 2510485 2495957 2754905 2986495 2855545 2989602 2847349
8510 2847349 2958928 3138662 3292858 3121080 2649001 2511602 2796476 3136053 3167360 3492519
8500 3492519 3353731 3211589 3692598 3997989 3801953 3648206 3585174 3252755 3402000 3586707
8490 3586707 3420414 3418654 3955792 3887164 3663143 3266976 3119170 3071466 3488778 4089830
8480 4089830 4140782 4041743 3842401 3834946 4076527 4365661 3674926 3815260 3687659 3721516
8470 3721516 3813436 3744860 3944778 4156566 4003597 3593663 3761918 3536195 3601764 4021410
8460 4021410 4304706 3989418 4056157 4475097 4848446 4916425 4346245 4391919 4926310 4435245
8450 4435245 4103161 4091420 4032541 4468166 4670063 4473599 4813672 4811363 5017716 4974063
8440 4974063 4993161 4948455 4861374 4639251 4592183 4674058 4942987 4731691 4868494 4876651 5066282
8429 5066282 5227867 4738636 5004223 4948867 5006082 4830850 5578700 5612028 5441031 5433888
8419 5433888 5587216 6045855 6039320 5881850 5747521 6277327 6400881 6371207 6505450 6095027
8409 6095027 6613856 6343233 6513413 6337112 6058379 6421499 6890005 7015960 6592074 6685212
8399 6685212 7578909 7574190 7177211 7415633 8031739 7974311 8072704 8496471 8771982 9515166
8389 9515166 9406981 9736974 9716273 9702412 9882073 10785306 10912218 11198458 11065769 11237652
8379 11237652 11827502 12101565 12745706 12373658 12450423 12775406 12385986 12848489 12952606 12951162
8369 12951162 13458241 13445327 13189323 13559191 13647047 14196408 14868158 14620838 14616764 14539087
8359 14539087 14627431 14954000 15092146 15093663 15406628 15485921 15864787 16284298 16443439 16273900
8349 16273900 16685373 17702767 17942893 18049217 17824124 18157678 18611405 18235663 18577110
8340 18577110 18425231 18503216 18568213 18842087 18660567 18864361 19039101 18940496 18655530 19145543
8330 19145543 19370663 19424623 19775210 20462963 21076086 21406617 21947935 22611774 22832977 23348855
8320 23348855 24183603 24490560 24918096 25654390 26532497 26784755 27371688 28606816 29865699
8311 29865699 30610452 31913644 32955299 34304382 35757003 37490525 39219806 40527221
8303 40527221 41502156 42937432 44139307 45685600 46366247 47565204 48921750 50317521
8295 50317521 51399431 52509873 53350263 52992883 53446943 53495877 52632073 52066039 51143195
8286 51143195 50578669 50159413 48963729 48824133 48330645 47099573 46605517 46341853 46568870
8277 46568870 46506795 46574698 47691872 48607027 50040573 52151412 55493235 59682694 65305362
8268 65305362 70924580 71627058 69107025 65762344 61987689 58389598 55449660 53900120
8260 53900120 52625961 51839191 52326034 53378746 54364208 55370997 56251411 57525401 58692280
8251 58692280 59613885 60265997 61504791 62839839 64133468 65930753 67552567 70087484
8243 70087484 72800751 74398911 76509623 77314449 76825719 75239170 72869872 70882106
8235 70882106 69279868 68310742 68202871 67983969 68415150 68555183 66979653 64032171 60893126
8226 60893126 57205472 53397849 50279894 47731509 45467039 44199535 43043667 41629405
8218 41629405 41057933 41247458 40905425 40896901 40732572 40633950 41307948 41595393 42410106 42670350
8208 42670350 43540256 45015896 46456552 47439607 47702682 46637328 44561309 42494163 40492891
8199 40492891 38980381 37290577 35322311 34334738 32653863 31933889 30627939 35559270
8191 35559270 35706620 32752735 33154322 32586614 33073315 33008289 33237786 33495329 34429017
8182 34429017 35149273 36097584 36706421 38097838 39006817 40527232 42071344 43578122 45307091
8173 45307091 47634697 49866454 51968571 54924045 57773750 60631120 64576417 69468488
8165 69468488 75114633 80208282 86336965 92825892 99514742 105056888 108531774 109810512
8157 109810512 109774646 108272765 106718469 105839004 105091184 104723632 103777357 102903963 101327138
8148 101327138 98665588 95718961 92283878 88458193 84076038 79387777 74874661 71484474
8140 71484474 68329646 65599149 64234010 63186206 62545324 61922950 61908476 61170150 61783144
8131 61783144 62529919 63940242 65629827 67864353 70964929 75596116 80667580 84713610
8123 84713610 87524426 88296713 87722096 87310847 88150709 90332734 92962267 95011514 95269544
8114 95269544 92184481 87212584 81366797 74999535 69247013 64693521 61044904 58786415
8106 58786415 57053812 55313804 53725085 53070648 52737615 52659085 53357969 53789885 54886916
8097 54886916 56032446 57229036 58741435 60789648 63024849 65550484 68617113 71730024
8089 71730024 75670709 79596416 83798768 87072299 89188872 91798506 95672590 100131004
8081 100131004 104493400 107224925 106763025 102031522 95101522 86935964 79069058 71965012
8073 71965012 66284801 61334967 57315400 54088368 51924147 49846687 48270814 47175068
8065 47175068 45396118 44852985 44547800 44414459 44003020 44069882 44267570 44329313 43975683 43344386
8055 43344386 43440526 43028435 42722932 42173406 41384450 41498833 41073099 40261691 39793706 39325834
8045 39325834 38471914 37942012 37526409 37214474 36784864 36322999 35570381 34921244 34478118
8036 34478118 34346603 33818597 33929473 34063138 34063753 35055857 34859221 35156802 35736098 36227086
8026 36227086 36913086 37177339 37978286 38434969 39213219 39918522 39608859 39554633 39523612 39449450
8016 39449450 39515580 39163703 39528150 40048428 40272942 40541921 40238838 40357127 40184741 39457102
8006 39457102 38767610 38514492 38031383 37761015 36893675 35734032 34970046 34447015 33594032
7997 33594032 32621497 32262286 30898681 30183677 29849477 29211457 29163541 29085751 28900114 29274294
7987 29274294 28943951 28651491 28456277 28648480 28736857 29386947 29066104 29131581 29867066 30479231
7977 30479231 30870596 30510367 31223000 31165225 31188496 31120041 30801152 30628336 30333467 30160033
7967 30160033 29985292 29952216 29921400 29796623 30194975 29912789 29291438 29238501 29145260 28841113
7957 28841113 28879320 29577996 29687900 30645480 31826800 32715325 33740666 34843749 36226912
7948 36226912 37608664 38741277 40208021 41720974 42223385 42547455 42525097 42520963 42127368
7939 42127368 42160995 42926632 42938991 42694824 42960972 42549994 41646337 40389398 39508298 38756020
7929 38756020 37908954 36539281 35620381 35312744 35076217 34776513 35096549 35538057 35853171
7920 35853171 36353567 37238043 38566632 39447839 40739246 42086587 43198556 44159293 45004601
7911 45004601 45723214 46206046 46412568 46403814 46786686 46987665 46618642 46533606 46216444 45733500
7901 45733500 45235729 44353897 42892023 42023285 41186243 40218360 38856360 37389475 36100580
7892 36100580 34998741 34332641 33575271 32669156 32446700 32360690 31997125 31790065 31427698
7883 31427698 31438955 32236495 32919485 32754033 32027889 31902364 32435909 32401359 32439529 31929451
7873 31929451 31463270 31386591 31696662 31583154 31583874 31058919 30646678 30850918 30898241 30195316
7863 30195316 29493556 29624246 29552386 29614831 30236010 30610137 30992140 31338028 31546425 32706181
7853 32706181 33933214 35662716 36483320 38041428 39408843 41797751 44058639 46983002
7845 46983002 48836558 52709908 56997310 57914679 59078627 60056579 61431575 61832133 61929811
7836 61929811 61621037 61291560 61194772 61395036 61138007 60609933 59685855 58901173 57805949
7827 57805949 55727036 53059314 50961466 49065275 47192556 45749484 44514996 43086315
7819 43086315 42096031 41415746 41020420 41126108 41389849 41938083 42873952 44028559 45306903
7810 45306903 46439695 48266280 49786122 51747780 52831408 53767551 55245476 56318558
7802 56318558 56798375 56901927 56231103 55221977 54532309 53385983 52623170 51993222 50812474
7793 50812474 49245276 46710583 44132535 41545025 38897892 36513683 34236851 31867114
7785 31867114 29663384 28325871 27223997 26369017 25363774 24741740 24242143 23508904 22488698
7776 22488698 22285442 22631592 22675948 22348704 22086456 21726039 21371585 20817285 20258985 19882781
7766 19882781 19449238 19069187 18328737 17350555 16206478 15175260 14944472 14890589 14354439
7757 14354439 13635297 13650260 13090257 12747903 12908877 12982969 12891471 12934719 12883865 12232911
7747 12232911 12133216 12350603 12740815 13326956 13535950 13362633 13354120 13619169 13480935 13205266
7737 13205266 12868844 12326446 11485006 11301903 10849361 10274691 9819529 9031857 9262130
7728 9262130 8919016 8876877 8796538 8114536 8110438 7806577 8177333 8123162 8259906 8146038
7718 8146038 7527044 7888744 7770268 8063041 7996326 7719022 7902878 8179395 8309402 8089435
7708 8089435 8059312 7948489 8632669 8035105 7372400 7509351 7095377 6664746 7036355 6945913
7698 6945913 6581363 5971713 5951568 5880815 5836142 6112462 6102972 6087225 6180017 5269718 4776330
7687 4776330 4962715 5024328 5130148 4980699 5582059 5659121 5598258 5251292 5531451 5584382
7677 5584382 4992447 4888523 5472820 5036189 5003594 5502502 5049690 5167811 5256778 5023657
7667 5023657 5065082 4783419 4807086 4964519 5117317 4768663 4430904 4314696 4692317 4978443
7657 4978443 5006209 4911810 4133543 4354631 4362270 4344630 4452152 4814431 4522769 4104578
7647 4104578 4332705 4289747 4203658 3805859 3934269 3837536 3376108 3170636 3637560 4080808
7637 4080808 4041104 3622074 3477975 2722661 3583906 3379788 3442841 3436723 3439159 3333756 3909693
7626 3909693 3673894 3609108 3460917 3181920 3177424 2927195 3336538 3451954 3402011 2974077
7616 2974077 2824354 2625813 2368402 2342613 2669232 3173849 3335766 3356740 3648151 3207031
7606 3207031 3046938 2783206 2826180 2459776 2734010 3164423 2601678 2346546 2603242 2504989
7596 2504989 1991204 2004856 2632122 3134249 2999881 2751066 2513777 2541804 2682020 2552140
7586 2552140 2493921 2228572 2238127 2010003 2222810 2559352 2294350 1930097 2079630 2094241
7576 2094241 2227343 2104548 2260559 2145658 2335691 2308459 1911502 1922328 2312710 2210570
7566 2210570 2563677 2124194 1814602 1241030 1553144 1790156 1672934 1379569 1574277 1605601
7556 1605601 1550070 2060230 2205640 1939053 2272492 2064584 1996235 1590152 1235477 1612320
7546 1612320 1874596 2507700 2070596 1727596 1911424 1667068 1720631 2572820 2069531 1869432
7536 1869432 1671861 1232713 1352346 1383830 1256169 1446645 1573609 1553024 1249268 1121718
7526 1121718 949669 1366427 1458945 1743228 1397178 1169431 1332824 1378111 1691704 1814899
7516 1814899 1633830 1553493 1442682 708056 279413 884451 1394776 1103252 1343010 1635781
7506 1635781 1314337 1403457 1536168 1520671 1528712 1126187 1523478 1903224 1607313 1715370
7496 1715370 1832558 1575906 1125581 1258023 1609435 1083167 869536 1153786 698784 1009505
7486 1009505 733205 774173 1143248 1506733 1084026 671474 852653 1340985 1311076 1307599
7476 1307599 1166553 1011867 1442440 1613815 1718131 965857 955687 1497951 1510289 1491246
7466 1491246 1211981 1298659 1445665 1430906 1294329 1303133 1108527 713252 876936 1017477
7456 1017477 1061943 583590 1075928 1046354 1233109 1248815 887256 1420440 1556638 1307583
7446 1307583 1301265 1311225 909687 1329203 1228078 502715 817776 462366 544734 1079923
7436 1079923 1120899 1369911 539355 599012 799255 1116704 781886 665984 931790 627327
7426 627327 806710 640274 651200 561392 441051 309711 368802 299298 381114 457214 858209
7415 858209 904335 790509 945802 949304 1300614 1227884 1340353 1215491 920917 982181 993431
7404 993431 1396622 1166245 987816 1016320 928433 818487 812358 1454199 1469457 889686 1020487
7393 1020487 889754 1034756 1073057 1263841 1619800 1332080 899856 929382 808224 777202
7383 777202 884907 1295251 1452942 1142037 1053941 944006 850673 1015657 1004040 1022953
7373 1022953 463855 330099 708037 572653 1064263 1225634 1295648 721498 564203 1318014
7363 1318014 1293880 1346907 1239875 542291 1053344 1535700 1133969 983356 1238081 1574519
7353 1574519 1357316 1099228 1359268 1377903 994155 1221012 1428619 1435738 1316677 1220405
7343 1220405 997125 1365805 1801333 1341694 1412101 2086982 2050742 2065943 1615890 1732100
7333 1732100 1792031 1556669 1765374 1554201 1459305 1603025 1445340 1508194 1754495 1490506
7323 1490506 1945534 2317319 2071957 1872461 2043663 1080987 1384701 1601908 1792418 1762973
7313 1762973 2073570 1548068 1849300 2038698 1752901 2170384 1587938 1763637 2174905 2499397
7303 2499397 2124741 2645872 2963431 2545909 2315111 2444591 2667360 2755020 2556300 2628144
7293 2628144 2875422 2159868 2457043 2767645 2859339 3315169 3111878 3003162 3077572 3068237
7283 3068237 3227926 3214583 3354167 3569374 3821720 3883648 3489301 3765682 3329444 3049020
7273 3049020 3043760 3775275 3821223 4053816 4548064 4535387 4261173 4309983 4342825 4310708 4339353
7262 4339353 4579137 4663822 4538140 5073391 5365045 5146758 5173377 5506275 5246844 4891362
7252 4891362 5304744 5409017 5175568 5619487 5724245 6377104 6275860 6141793 6358361 6124821
7242 6124821 6395959 7154337 6904299 7046014 7388983 7421046 8228433 7799025 7800043 7947252
7232 7947252 7863000 8490335 8389972 8263438 8395167 8626575 9172383 9214616 9045102 9231624
7222 9231624 9520771 9857777 10230786 9683822 10056112 10490940 10516254 10463943 10456543 10889999
7212 10889999 11165719 10946952 11300998 11238197 10658907 10966582 10971509 11197705 11120164 11022664
7202 11022664 10914489 10927862 10720486 10557191 10706092 10673232 10164146 10232174 10092480 10017540
7192 10017540 9870395 9868736 9487625 9637445 10007312 9700783 8593828 8964633 9234619 9081833
7182 9081833 8779406 8283543 7997887 7473895 7507177 7326924 7735432 7526713 7651082 7719740
7172 7719740 7224937 6426905 6751110 6574538 6501758 6839155 6522692 5911822 6043303 6184097
7162 6184097 6169065 6091925 5297610 5176548 5490536 6099295 5498014 5077340 5124741 5378297
7152 5378297 5346533 4899286 4696636 4431791 4391133 4508869 4264049 4039334 3892463 3572599
7142 3572599 3592129 3925561 3686036 3630365 3860148 3611204 3187561 3175691 3483158 3282812
7132 3282812 3529283 3732617 3529621 3554410 3390111 3272694 3206071 2827893 2472961 2625257
7122 2625257 2819282 2671217 2601508 2506985 2423278 2066117 2363897 1938951 2620032 3112327
7112 3112327 2678344 2253608 2265048 2644395 2545097 2370451 2203145 2480453 2349456 2117163
7102 2117163 2354834 2288976 2067551 1717124 2278302 2405836 2560022 2348563 1841306 2519054
7092 2519054 2542113 2153122 1686376 2044566 1965592 1983529 1853011 1614765 1833016 2333244
7082 2333244 2092060 2128057 1720894 1332224 1613122 1830904 2560366 2098307 1602434 1683497
7072 1683497 1853627 1231599 1616967 1042701 1030546 1719848 1687270 1287811 1451843 1497568
7062 1497568 1330387 1486962 1516018 1355026 1343329 1486114 1572442 1943585 1547962 1430482
7052 1430482 1215451 1120077 1192215 1482829 983674 1267771 1475933 1573738 1512425 1400192
7042 1400192 1776522 1276252 1088204 1551273 1715987 1527686 1582110 1525417 1347818 1429505
7032 1429505 828759 1144826 975094 1215901 1440088 1247005 1119028 1501622 1538245 1506125
7022 1506125 1902142 2095247 1702465 2269735 2042121 1837030 1702382 1652396 1870779 1310690
7012 1310690 1797283 1467544 1823775 1644455 1795056 1778632 1778143 2312380 2452478 2890334
7002 2890334 2897730 2837170 2571856 2048199 1591582 1687991 1521685 1372962 1650609 1778940
6992 1778940 1396320 979795 951526 1358330 1963988 1843271 2171964 2232565 2289883 2847111
6982 2847111 3275654 3080725 2684072 2572062 2302043 2242307 2218310 1845918 2033087 2139678
6972 2139678 2201787 1857424 2306794 1810940 1585214 1737728 1827323 2112592 2703468 3077133
6962 3077133 3531363 3503742 3308747 3329683 3287049 2734908 2883449 3053299 2672572 3156995
6952 3156995 2610061 2268297 2420790 2149454 1775152 1979813 2210617 2542786 2162013 2405418
6942 2405418 2076734 1865842 1841879 2054385 1747480 2277441 2631536 2397892 3208075 3583949
6932 3583949 2910049 2436022 2585886 2877305 2361976 1931573 2261455 2152312 2482099 2478138
6922 2478138 2147558 1612279 1609653 1662089 1807114 2586846 2941259 2845867 2615053 2753292
6912 2753292 2727469 2568641 3754663 3803396 3268862 3135367 3060989 2823525 2662556 2545502
6902 2545502 2593714 2296899 2022526 1982257 1936965 2087696 1991174 2363484 2286509 2273553 2480145
6891 2480145 2642962 3021560 2980241 2707890 2459489 2193985 1947314 1912169 1834475 1743044
6881 1743044 1529714 1172398 1468584 1401597 1521156 1690446 1569173 1728788 2095614 2045204
6871 2045204 2161525 2343623 2238884 1624260 1845966 1727932 1367642 1148707 1118592 1282119
6861 1282119 1397761 1640846 1596807 1304395 1153115 854481 969380 1258764 1193747 1481658
6851 1481658 1153391 1266992 1207741 1231262 1021759 1157799 1200118 966189 1420576 1920568
6841 1920568 1742379 1534945 1628046 1404016 1243781 1223996 1510707 1458210 1206861 1137215
6831 1137215 959937 1366246 1161939 624925 953904 896842 762449 923528 835552 1123959
6821 1123959 982751 854383 950471 1052812 929195 737719 37928 14025 157147 73290
6811 73290 345008 641295 937898 1054431 458777 350381 728295 714409 564140 677594
6801 677594 1128847 899128 1003271 969501 1087346 931211 821845 1005885 759291 642134
6791 642134 349606 717993 907111 1008469 517624 40989 400192 480283 691936 690706
6781 690706 613890 369640 434030 645527 229443 -49850 515097 753254 726212 538640
6771 538640 536960 714280 692312 453925 449685 521378 623046 444819 725753 342400 347221
6760 347221 703927 1227862 995161 478070 768406 658397 567333 659995 1073892 1331724
6750 1331724 1408134 1218720 905045 761441 1042566 1454998 999778 673239 153900 -33494
6740 -33494 193012 163216 632802 1087487 1269322 837604 632579 575351 521544 1092130
6730 1092130 1191702 1149041 841119 596783 609795 880425 1067327 762813 347100 1052695
6720 1052695 1342091 1119246 1297107 1342640 1484680 1123616 609144 567702 775417 453332
6710 453332 873994 1191561 1324444 665321 387287 154510 460850 834366 867198 921121
6700 921121 883264 710398 548089 462248 640290 649883 712104 386370 462082 539671 187701
6689 187701 -37111 426703 888180 1059851 869753 961097 1306993 1108124 691941 726660
6679 726660 817759 754160 491882 455741 616469 874467 1365166 1305987 603151 713932
6669 713932 745972 513597 948738 702813 803208 571004 507419 1056963 1225985 1217002
6659 1217002 1471109 1516480 1338686 1483347 1411476 789334 1280222 1624855 1469420 851420
6649 851420 1088537 1019130 1308244 1316335 1639817 1374983 1214156 1413193 1045255 1034082
6639 1034082 1647077 1508906 1230461 1669316 1845844 2515592 2669581 2275281 2714063 2722036
6629 2722036 2264482 2418905 3106980 3373333 3393763 3463294 3964686 4042479 4292684 4399454
6619 4399454 4099834 4216400 3831383 3557349 3422037 3313470 3149084 3015120 2863901 2417372
6609 2417372 2090330 2947630 2836963 2635117 2551383 2471718 2444762 2441391 2400745 2149127 1782342
6598 1782342 2156654 1964611 2145240 2364413 2545796 2349320 2047173 1556645 1619768 1832077
6588 1832077 1846409 2201434 2670845 1959400 2038463 1724085 1380038 1641408 1493619 1585578
6578 1585578 1818130 1911520 1729785 2008610 1743360 1681487 1608338 1969930 1631407 1731063
6568 1731063 1830237 1673889 1514441 1125841 904356 777983 1324651 1244031 818032 891468
6558 891468 1050751 874009 893177 1150071 1296783 1343532 1012982 1510091 1346139 887740
6548 887740 572851 882243 917833 1179120 1331619 1351006 1223609 1343662 1327442 1277226
6538 1277226 1341663 1101790 1474070 1670594 1032945 916089 952440 942181 771742 1075116
6528 1075116 1209314 1354120 1356204 1037702 744281 585641 796391 776058 1059351 1345305
6518 1345305 1671112 1134901 1322032 1464789 1483205 993636 1094163 1445189 1369255 1692135
6508 1692135 1709436 1555548 1379504 1376503 1370558 1419944 1647979 1471204 1465150 1504057 1613098
6497 1613098 1872344 2054532 1661619 1395147 1187077 1548503 1265364 1858949 1767409 1218311
6487 1218311 1478719 1318902 1515841 1720698 1823382 1804639 1527554 1359299 1538198 1575915
6477 1575915 1664140 1414989 1340529 1245884 1648569 1681345 1826564 2164582 2018752 1827688
6467 1827688 1731865 1270686 1366000 1614684 1700262 1593465 1769932 1822865 2142832 2045672
6457 2045672 2054246 1820508 1718153 1755268 1600406 1972713 2163835 2039859 1750403 1633439
6447 1633439 1837413 1998644 2107747 1798521 1818199 2415196 2612300 2697046 2660979 2510320
6437 2510320 2207194 2451460 2270638 2151128 2392565 2301758 1925015 1765658 2283229 2060312
6427 2060312 2217113 2486925 2322868 2069019 2319240 2593865 2856238 3048215 2849903 2638590
6417 2638590 2940613 2658506 2503385 2667285 2709514 3064803 2866027 3017272 3772758 4199761
6407 4199761 3499218 3419436 3575950 3914283 3974585 3664620 3850974 4199853 4368866 4258917
6397 4258917 4368218 4735420 4771310 5142368 4970809 5237487 5639100 6064992 5878747 6043754
6387 6043754 6431871 6851410 7219862 7771147 8192863 8654440 8690621 9306614 9778999 10359235
6377 10359235 10698302 10522545 10716582 10472239 9299365 9086283 8824943 9267659 9402007
6368 9402007 9189803 8658620 7780524 7561859 7418717 7663651 7473309 7099508 6833589 6601210
6358 6601210 6306544 6108545 5923797 5632026 5366165 5415975 4991114 5442123 5140309 5605270
6348 5605270 5277385 5506605 5549996 5050774 5113132 4833459 5185993 5258385 4640149 4792153
6338 4792153 5047573 5142599 4830017 5465279 5506221 5863203 6074794 6198705 6250580 6433874
6328 6433874 6920877 7261450 7150311 6891055 7473617 7369157 7512644 8014718 8191298 8427384
6318 8427384 8526938 8380587 9003843 9652297 10322674 10681925 11005133 11584838 11848031 12987028
6308 12987028 13384655 13696534 13585712 13367319 13212710 12770379 12263598 11970137 11862193
6299 11862193 11750110 11337133 10794060 10504425 9648538 9325587 9468597 8879288 8552677
6290 8552677 8370515 7580550 7557920 7190823 6627862 6665830 6365053 5954793 6073807 6315370
6280 6315370 6106098 5738693 5965712 5413914 5164760 5081264 5122383 5187015 5354701 5590725
6270 5590725 5600384 5435522 5349824 5070886 5424092 5566674 5316406 5055902 4798802 4701929
6260 4701929 5114428 5242655 4876566 4972446 4821911 5098895 5477717 5444647 5195914 5369937
6250 5369937 5750217 6014217 6233113 5732000 6164550 6454784 6354119 6480526 6739686 6789870
6240 6789870 6925883 7051673 7282785 7442888 8036537 8600329 9112477 9175778 9722704 10462645
6230 10462645 9993540 10080930 10683973 11282746 11781767 11594699 11632167 12241476 12228510 12389926
6220 12389926 12899615 13209924 13394970 13814578 13743501 13626844 13630985 13901256 14209051 14800445
6210 14800445 15380999 15586207 15995090 16780654 16454314 16858491 16933001 16520248 16474822 16330415
6200 16330415 15666928 15664864 15667421 15288402 14945819 15390832 16034400 16237698 16262727 16274448
6190 16274448 16869637 17123062 17867916 18240666 19582558 20001841 20865506 22033510 22789520
6181 22789520 24315502 25797840 27350325 29430513 31125675 33303348 35395612 37821571
6173 37821571 40011125 42324155 45028952 47172088 48997748 49274140 48702154 46488862
6165 46488862 43125010 39693269 36339038 33612336 31055830 28185410 25404501 23512801
6157 23512801 21933042 20378951 19283497 18151256 17640819 16581794 15754970 14897780 14249001
6148 14249001 14019289 13460301 12771009 12282234 12005212 11700271 11164822 10916788 10739588
6139 10739588 10027420 9537896 9468910 9213094 9124953 8851218 8780420 9028496 8581230 8087367
6129 8087367 8494911 8171396 8048265 8747972 8335867 8079644 8186910 8059452 8053707 7690528
6119 7690528 7608750 7967148 7514747 7435244 7429662 7151273 7086485 6763454 6908889 6638276
6109 6638276 6461379 6354302 6601596 6543560 6367614 6180551 5850223 5935032 6079826 6229994
6099 6229994 6285482 5821149 6063940 6130511 5709370 5505525 5712209 5824276 5557852 5556252
6089 5556252 5789329 5421972 4719310 4543391 4211455 4867432 5144823 5273603 5229257 5007285
6079 5007285 5005024 5354688 5672840 5215699 5046022 5264813 5294877 5612092 5821068 6306994
6069 6306994 6282277 6791753 6848211 7050567 7736688 7862798 8227822 7841655 7673177 7011309
6059 7011309 6251823 5704955 5457113 4970943 4770614 5061710 5146906 4714811 4718779 4344740
6049 4344740 4339067 4651049 4376054 4460114 3948048 4156606 4263180 4437480 4695723 4489544
6039 4489544 4439292 4174075 4139129 4663253 4222958 4439329 4490483 4079867 4082041 4572294
6029 4572294 4679958 4767374 4983978 4776097 4578384 4258473 4417520 5185608 4894090 4743977
6019 4743977 4370032 4418883 4155387 4298458 3947650 3971345 3867426 3561155 3811028 3882685
6009 3882685 3651500 3447331 3924081 3616480 3563968 3016835 3051707 3038837 3135747 3550746
5999 3550746 3571315 3231080 3467073 3538333 3108140 3042062 3167047 3250081 3253032 3141142 3559134
5988 3559134 3368957 3319439 2892192 2766448 2790687 3234607 3634683 3371077 4031939 3651621
5978 3651621 3201287 3335375 3356323 3716089 3435230 3488356 3045747 3099115 2661477 2348219
5968 2348219 2653621 3011078 2947494 3131134 3387264 3371874 3030649 3190632 2856770 2987526
5958 2987526 3078340 2967687 2933793 2746201 3442180 3419381 3495600 3479311 3390916 3245180 3269493
5947 3269493 3110575 3283433 3258393 3226300 3016470 3145691 3409915 3228725 3283615 3154742
5937 3154742 3577324 3596409 3143254 3124269 2859936 3286876 3228329 3213593 3328050 3668908
5927 3668908 3523741 3408194 2887259 3328908 3891853 3667829 3699681 3505814 3352780 3175663
5917 3175663 3071832 2861281 3128689 3526007 3254011 3283816 3142453 3100326 3532670 3516359
5907 3516359 3180623 3185863 3441492 3591242 2928014 2997163 3094700 3016210 3281631 3544341
5897 3544341 3792658 3503164 3541468 3553948 3495806 3429967 3491510 3905462 3774623 3588452
5887 3588452 4013037 4432179 4149311 4385239 4579868 4463663 5130972 5220400 5513591 5527553
5877 5527553 5289398 5704951 6416140 6661304 6766680 6642532 7042153 7229420 7151010 6474814
5867 6474814 6573280 6752934 6534348 6255897 6389325 6327401 6479301 6849430 7758418 7194045
5857 7194045 6378228 6104964 5939985 5621036 5377624 5448296 4690588 4690753 4524529 4397477
5847 4397477 4561759 4908244 4589796 4712438 4259672 4102468 4520030 3740165 3524638 3296209
5837 3296209 3404002 3449696 3172959 3786593 3720978 3495638 3008642 3214168 2984082 3165187
5827 3165187 3246520 2860171 3086223 3234856 3264049 2771588 2778092 2826805 2955212 3041482 2870659
5816 2870659 2350271 2600518 3464934 3304947 2827456 2498783 2914171 2955469 2747590 2351430
5806 2351430 2592386 2833865 2820164 2722159 2980901 3289134 2519083 2330402 2519273 2387556
5796 2387556 2603805 2746458 2773269 2784515 2541964 2663039 2868558 3220818 3220246 3312593 3111966
5785 3111966 3191966 3087649 3208726 3019519 2887457 2739990 2570869 2952259 2895658 2768266
5775 2768266 2722377 2715355 2775316 2836534 2770424 3092231 2970679 3064345 3160288 2734106 2714140
5764 2714140 2864392 2621373 2561177 2594096 2597112 2583188 2963421 3040733 2836572 2450774 2557353
5753 2557353 2924035 2832527 2870417 2900852 2303739 2955005 2572120 2630240 2550380 2349787
5743 2349787 2486583 2258817 2060755 1800659 2188048 2387259 2214834 1998055 2411463 2264718
5733 2264718 2268361 2360632 2389989 2367110 2382159 1977762 2323559 2657915 2768735 2642972 2403092
5722 2403092 2192887 2494648 2823127 2715714 2558127 2310924 2319605 2529277 2702075 2775640
5712 2775640 2673245 2282088 2607539 2665901 2418433 2818309 3028807 3219866 3134446 2957420
5702 2957420 2575470 2612113 2716368 2740702 2654460 2696995 2931736 2710223 2472111 2564588
5692 2564588 2975618 3177385 3253479 3597409 3137118 3432796 3264681 3516052 3160865 3054016
5682 3054016 3407724 4141467 3993277 3603754 4067436 3970746 4025452 3737210 3923613 3762541
5672 3762541 4201974 4777753 4944266 4869861 4807568 5003410 5256086 5199672 5429884 5545812
5662 5545812 5594191 5718564 6405265 6569819 6593156 6925610 7169919 6932171 6809239 6919775
5652 6919775 6942180 6849699 6681580 6115964 6159354 6414973 5791782 5404949 5673878 5535016
5642 5535016 5226677 5614525 5947994 5801261 5467688 5061876 5169115 5702075 5579607 5850597
5632 5850597 6037528 5871524 5718600 5667132 5782352 5837705 6099460 6149962 6066921 6322330
5622 6322330 6742259 6839485 6784254 6738707 6914599 6757000 6834280 7502741 7935745 7873316
5612 7873316 7707589 8017720 8324267 8836399 8803375 9263247 9955651 10048329 10377875 10090088
5602 10090088 10704885 11673619 12252655 12822379 13263555 12725137 11748786 11422070 11061829
5593 11061829 10767666 9933482 9736379 9779945 10095602 10123012 10099773 10213411 9817270 10268776
5583 10268776 10167997 9898755 10440444 10358442 10141189 10147714 9926411 9902113 9932789 9896031
5573 9896031 9777112 10142527 10214903 9736908 9800164 10236063 10349148 10939087 11548870 12093123
5563 12093123 12393161 12812352 13328133 13916432 14601678 15120324 15956590 17262028 18263384
5554 18263384 19530812 20660633 22093346 23757408 25390951 27707211 30393076 33585497
5546 33585497 37184097 41443134 46652085 53297132 61318132 68442977 70914470 66447521
5538 66447521 58903170 51456511 43980899 37618188 32749269 29274641 26265494 24228347
5530 24228347 22386503 20771670 19093095 17759833 16872508 16332462 16169247 15207479 14448315
5521 14448315 14422194 13826949 13051210 12595767 12643615 12186332 12054194 12148013 11418358 11289728
5511 11289728 11141903 10865516 10764722 10156402 9639011 9615257 9657323 9587629 9693829 9883265
5501 9883265 9412703 9163004 8588191 8422201 8147195 8365658 8506668 8257255 8580920 7978260
5491 7978260 7830656 8154232 8148277 8243281 8348658 8125767 8327927 7595268 7251735 7726681
5481 7726681 7978297 8088336 8166262 7680337 7621494 7378648 7148329 7744786 7613463 7406040
5471 7406040 7547807 7328915 7188713 7458359 7936037 7854354 7413512 7500730 7326621 7222052
5461 7222052 7478560 7800201 7763060 7791181 8135389 7708040 7433228 7277717 7235506 7329667
5451 7329667 7475665 7394473 7397617 6815968 6179497 6471348 6402698 7075142 7386447 7112059
5441 7112059 7263899 7592101 7182663 7301277 7858100 7772667 8099141 8136399 8597404 8418995
5431 8418995 8672790 8878554 8777718 9168556 9143271 9295612 9702647 9591150 10261734 11642194
5421 11642194 12612667 12072296 11762608 11673643 11257631 10899999 10388135 10225489 10328240 10596057
5411 10596057 10272911 10260801 10148006 10119975 9940611 10559402 10674542 11176599 10864783 10950769
5401 10950769 10552323 10100229 10423638 10719172 11047103 11029887 11201788 11380574 11606914 11842001
5391 11842001 11896396 12284480 12423105 12656622 13155648 13608586 14140488 15178187 15988756
5382 15988756 16882376 17321572 16825167 16909697 17391523 18697371 19695510 20009280 20146145
5373 20146145 19568245 18177407 18011030 18246056 18053957 17855843 17917724 17257636 16719822
5364 16719822 17315631 17652262 17381848 16769500 16678456 16663157 16473948 16966712 18108176 18205277
5354 18205277 17501658 16710331 15831166 15246471 14634014 14916185 14868785 14286773 14024333 13324152
5344 13324152 12995116 12676691 12320779 12023371 11725250 11427753 10992364 10843323 10487361
5335 10487361 10083885 9897321 9987162 9867926 10027130 9595260 9534488 9830927 9538651 9850341
5325 9850341 9610966 9455239 9442951 9416203 9603791 9965605 10188731 10226824 10384116 10400803
5315 10400803 10870192 10865094 10529146 10518305 10605182 10824463 11207474 11306479 11812691 12441799
5305 12441799 12676043 12817672 12861649 13188541 13538680 14149799 13819476 13441246 13090314 13249519
5295 13249519 13172993 13016165 12389262 12312619 12254062 12059695 12508579 12338056 11935979 11678652
5285 11678652 11653117 11141787 11602196 11261044 10819262 10579650 10809021 11049075 10525561 10630023
5275 10630023 10862779 10565944 10258364 10279352 11013923 10636386 10098652 9754837 9650247 9734032
5265 9734032 9192381 9632874 9672530 9750496 10056307 9323164 9279335 9015225 9266445 8798720
5255 8798720 9038920 9245326 9353886 9657320 9815368 9673633 9377551 9743964 9898949 9885958
5245 9885958 10064180 10240866 9872333 9229576 8850188 9072949 8928250 8709547 8467762 8482482
5235 8482482 8105377 8449886 8407737 8425308 8529995 8589306 8917170 8195484 8139537 8032567
5225 8032567 8006894 8470086 8002209 8134504 8401742 8191380 8261600 7903125 7868053 8229582
5215 8229582 7816489 8029668 7912287 6924927 7024347 7132300 7388103 7365074 7028579 6848172
5205 6848172 6560192 6441096 6541343 7058187 6848591 6322419 6336538 6259227 6839411 6893341
5195 6893341 6494557 6784316 7035301 6677699 6537475 6671852 6681615 6441280 6176243 6351920
5185 6351920 6075628 5952925 6040434 5999907 5781379 5953101 5742747 6047497 6016088 5676415
5175 5676415 5906357 5797475 5446832 5687551 5631154 5245439 5059916 5662197 5775495 5466740
5165 5466740 5212308 5164580 5168968 5721220 5247029 5497710 5426126 5741689 5636208 5816101
5155 5816101 5990610 5913608 5971917 5787697 5541300 5179186 5456883 5715209 6197609 5206784
5145 5206784 4991228 5443539 5640991 5796009 5606802 5400812 5525073 5808365 6229833 5967998
5135 5967998 6109395 5975552 5686432 5988444 5890344 5392631 6228956 6219213 5691622 5626606
5125 5626606 5474811 5291714 5063881 5107217 5422332 5504412 5863381 5848503 5881952 6603843
5115 6603843 6416672 6118741 6135503 6573503 6327259 6118943 6093752 6489802 6308244 5791345
5105 5791345 5886095 6041510 6086002 6266199 6001970 5939314 5927346 5662948 6128115 6272056
5095 6272056 6388850 5671327 5868686 6220932 6634745 6368123 6181855 6305581 6307781 6223139
5085 6223139 6610843 6701565 6652100 6706173 6721668 6212650 6515237 6843171 6773290 6648338
5075 6648338 6601794 6503152 6508079 6930304 6535286 6584706 6710376 6728188 6873671 7143782 6934892
5064 6934892 7242005 7403082 7330520 7385563 7302230 7377277 7591483 7802250 7808651 7758922 7512650
5053 7512650 7597379 7873501 7905047 8176175 8513355 8452072 8415825 8244901 8043290 8180908
5043 8180908 8348035 8561941 8398801 8254468 8392994 7952456 7848341 7907056 8189717 8126475
5033 8126475 8352320 8367294 8485139 8057790 8120404 8381184 8182633 8555043 8846866 8831684
5023 8831684 9154169 9281660 8807403 9335666 9489581 9897979 10234585 9997268 10220300 10742936
5013 10742936 10966666 11196051 10822989 11296075 11844124 12378227 12341940 13023065 13766386 14510532
5003 14510532 15467921 16181132 17236123 18436255 20123825 21008369 21471621 22775532 23646827
4994 23646827 24309111 25605213 26379870 26525844 25830470 24880993 24305190 23432196 22751123
4985 22751123 22525911 21587178 20048750 19011686 18139062 17451134 16502378 16180044 15827232
4976 15827232 15459794 15829159 16314136 16320063 15912744 15748127 16232384 16716439 16984475 17423384
4966 17423384 18045562 18464260 19080716 19273913 19942388 19206217 19065275 18735443 18145106
4957 18145106 18060985 17337485 17270720 17012755 16338363 15440670 15069714 14916265 15357821 14744993
4947 14744993 14342355 13875475 13572998 14029153 13882821 14038534 13884187 13616008 13723322
4938 13723322 13831012 14161630 14227948 14616899 15557890 15305744 14397381 14570206 14912226 15079888
4928 15079888 14353278 14165810 14452043 14183808 13940145 14144583 13620605 13249001 13292915 13237674
4918 13237674 13203992 13414920 13229636 13270191 13337689 13372566 12922786 13908616 14230783 14217591
4908 14217591 14716314 14574379 15174950 14973898 15168659 15391503 15702255 15487504 15623593
4899 15623593 15778877 15604271 15189422 14610016 14497772 14182605 14326374 13828091 13772156 14114349
4889 14114349 13705080 13366381 13491923 13735654 13479894 13081195 13170092 13136834 13267471 13129110
4879 13129110 13348747 13281980 13292614 13947907 14107639 14264591 13876834 13630240 13943067 13878338
4869 13878338 13892839 13561266 13048412 13252155 13335784 13124943 12970797 13060722 12776911 13284711
4859 13284711 13204026 13165561 13521408 13836564 13674627 13537451 13470938 13211252 12983488 13430540
4849 13430540 13323784 13872521 14333179 14158622 14263980 13776965 13653728 13592244 13952410 14270655
4839 14270655 14447215 14294681 14450351 14514043 14462677 14856602 15535447 15119859 15037553 15177890
4829 15177890 15366804 15463397 15647621 15547635 15819212 15983833 15972258 16183572 16059919 16166030
4819 16166030 16466803 16756726 16960827 16960231 17023656 17517239 17433754 17465645 17859330 18064182
4809 18064182 18676048 18744409 19010734 18682500 18829893 18942238 19747093 19818030 20056697 20118817
4799 20118817 20030372 20475682 20403247 21002023 21370916 21730332 21664929 21615249 21688192 22169919
4789 22169919 22249868 22303220 22205223 22824255 23197912 23523625 23651070 24262613 24450989 24721320
4779 24721320 24842820 25512767 25966425 26451486 26107481 26794517 27357839 27857775 29043619
4770 29043619 29158464 29323580 29556877 30399332 30996287 31110395 31197612 31588197 32100217 32453604
4760 32453604 33042898 33475541 33165143 33597214 34369572 34596901 34960837 35705731 36357299
4751 36357299 36490788 36668871 36846081 37912994 38405834 39042491 39821631 40216316 40867802
4742 40867802 41566566 42082747 43308360 43601422 44157954 45072316 46089668 46187111 46476638
4733 46476638 46930362 47106580 48294596 48607539 49001396 49062134 49441848 49816436 50577933
4724 50577933 51193992 51927491 52109623 52498666 53405114 54074703 54963171 55761077 56216334
4715 56216334 57134132 58331292 59122089 59884816 60864212 61421167 62144908 62273386 62651456
4706 62651456 63355357 64098475 64150143 64870502 65097644 65371758 65602105 66241158 66822024 67434255
4696 67434255 67523162 67832207 68257452 68555446 68608890 68883752 69576373 70175158 70442779 70705018
4686 70705018 71197817 71692245 72011428 71923535 72016529 72277506 72552667 71955042 71967037 72166016
4676 72166016 71800158 71554278 71486901 71088085 70791460 70238353 69893374 69340124 68435651 68139297
4666 68139297 67736633 67354193 67010395 66882195 66563648 66006648 65363581 65232279 64992481
4657 64992481 64423074 63920979 63140132 62715504 62120694 61522503 61214582 60808054 59910130
4648 59910130 59038105 58539673 58116043 57437396 56624798 55703468 55174534 54057984 53242787
4639 53242787 52664714 52389299 51892995 51038366 50290249 49789440 49411280 48840226 48078917
4630 48078917 47656963 46880628 46332956 45668708 44824117 44155936 44000042 43835032 42839628
4621 42839628 42188219 42009100 41572244 41253756 40449907 39664144 39131110 38992313 38354863
4612 38354863 38141614 37815974 37264341 37060507 36771271 36545850 36315590 35999627 35332960
4603 35332960 35038518 34792812 34745771 34449653 33752681 33562109 33247219 33245637 33106020 32290055
4593 32290055 31407029 31178406 31586870 31501839 31432686 31132363 31074462 30767025 31035062 31120816
4583 31120816 30785985 30069929 30018025 29616457 28779008 29098364 29172391 28245990 28110572 28328765
4573 28328765 28034208 27639517 27808407 27717028 27504742 27433729 27409311 27458993 26537651 26364270
4563 26364270 26320897 26123351 26379950 25893879 26068598 25946410 25969950 26111757 26416425 26185283
4553 26185283 25907506 26172430 26067104 26168721 26475085 27111077 27293810 27413193 26873290
4544 26873290 27430807 27501300 28203432 28725389 28751753 28859835 29144835 29101065 29982927 30708323
4534 30708323 30670883 30628508 30967881 31176116 31609411 31815246 32307437 32785535 33197583 34019717
4524 34019717 34716023 35811215 36901922 37627538 38095967 39562429 40346859 41627837 42769907
4515 42769907 44203418 45806633 47571608 48905433 50990668 53741533 56737839 59727086
4507 59727086 63366577 67324693 72113075 76974110 81311186 85493668 89729743 95686983
4499 95686983 102839389 111675111 122467219 131666013 135934906 133101083 125510310 116741994
4491 116741994 108640472 101642444 95863458 91918603 89811768 88510501 88288304 89100001
4483 89100001 90218961 91982501 94264945 96955513 100546913 104978860 109976914 115656838
4475 115656838 122922401 131254697 140963617 151935394 164716716 179005694 195387877
4468 195387877 214076516 234806481 258079870 284919127 312637191 338792171 356522982
4461 356522982 358379092 344902255 319430392 288621903 257299259 228439504 202428454
4454 202428454 180924016 163174210 148571954 136715755 126797083 117458360 110076253
4447 110076253 103280099 98012869 93007191 88466119 83619477 79530959 76137682 72486371
4439 72486371 69736640 66887496 65313121 63167564 60856268 58662055 57517347 55920887
4431 55920887 54315779 52958037 51529751 50518295 48838684 47147311 46033694 45144216
4423 45144216 43628583 42947507 42599614 42059353 41376637 40774979 40246155 39816035 38966445
4414 38966445 38152109 37150525 36302574 35692334 35002525 34644111 34563760 33499118 33214414
4405 33214414 33344425 33336258 33048283 32353020 32175444 32016900 32020199 31880137 31535159 31558989
4395 31558989 31744884 31649253 31144036 31373063 30953482 30916802 31300994 31187710 30676098 30163350
4385 30163350 30486109 30686348 30125652 29516047 29397838 29134129 29072340 28752201 29086673 29021725
4375 29021725 28936704 28611831 28305643 28210116 28785148 29040370 29269323 29211324 29168213 29304828
4365 29304828 29291125 29241613 28562157 28372374 27518220 26414713 26286965 25977667 25433823 25148445
4355 25148445 24735949 24334114 24047735 23877805 24081898 24396299 24768572 25286064 25459237
4346 25459237 26589144 27610301 28557673 29431682 29787226 30325181 30093993 29522053 28793425
4337 28793425 27921352 27089530 26085557 25296254 25684774 25042809 24579423 24852120 25880447
4328 25880447 26320727 26931999 27615462 28704410 29081030 28446702 28102872 27367600 26511465
4319 26511465 25593721 24259754 23594649 23026488 22060197 21474397 21491317 21515937 21402434 20943881
4309 20943881 20397440 20181029 19862201 19717791 19679847 19433962 19031507 18560803 17961858 17692066
4299 17692066 17179508 16288927 16008203 16161289 15864992 15476902 14996001 15039251 14694737 14369185
4289 14369185 14317826 13789723 13938569 13625518 13299074 13140445 12736750 12296670 12255511 12476970
4279 12476970 12143924 11892647 11102448 10897322 10810225 10873222 11060408 11225044 10683766 10565954
4269 10565954 10718892 10473903 10422437 10260428 10577221 10601366 10620586 10280255 10193022 10079981
4259 10079981 10175523 10514545 10361991 10104282 9919569 9906415 9785434 9694561 9874570 9860942
4249 9860942 9599205 9968812 9872132 9756122 9553182 10352436 9884416 9547762 9845047 10101525
4239 10101525 10173894 10159105 9542164 9420799 9526976 9434352 9120209 9555942 9395560 9003634
4229 9003634 9492022 9152079 8900285 8872514 8712627 8837097 8767687 9176865 9782211 9944816
4219 9944816 9604963 9559945 9321648 9202984 9782459 9790723 9708685 9863265 10298891 9827748
4209 9827748 9444408 9769487 9469113 9054126 8929922 8813863 8855249 8866496 8860736 8798080
4199 8798080 8894567 8731962 8905049 8778548 8760471 9028840 9191383 9306192 9268029 9573454
4189 9573454 9797038 9655007 9898464 9976132 10217996 9958040 10434929 10978762 10992024 11021767
4179 11021767 10794521 10570875 10335375 9741965 10146653 9867173 9810284 9776675 10011401 9880664
4169 9880664 9585560 9843771 9802782 9784436 9432713 9124843 9215770 9104308 9315379 9194629
4159 9194629 9549670 10091132 10024645 9730980 9598546 9819577 9704869 9538381 9963994 9447612
4149 9447612 9973718 10290694 9733415 10136121 10220222 10240346 10074491 10048160 10112652 10359391
4139 10359391 10511994 10916574 10668306 10545786 10592117 10869402 10670807 10865123 10807992 11009527
4129 11009527 11068726 10976274 11221593 10683816 10642978 11773997 12113647 12029905 11908222 11940953
4119 11940953 12419377 12968654 13485952 13415039 13841088 13731816 14249922 15401100 15964733
4110 15964733 16849962 17477654 18430670 19595636 20890294 22603454 24484782 26585910 28392914
4101 28392914 30232935 32279897 34938170 39133736 43503840 47461397 50259006 48617764
4093 48617764 44302414 39437372 35443448 31972964 29112129 27249740 26115617 25383226
4085 25383226 24443990 23417970 22958142 22301158 22173927 22492871 22333004 23126038 23309670
4076 23309670 23962747 24805051 25828740 26780243 26180902 25160060 24108727 22311432 20877241
4067 20877241 19547178 18316062 17123990 16530760 15432994 14504527 14282300 14167200 13965439
4058 13965439 13818803 13272984 12341894 11705743 12158536 11953728 11281023 11070648 10709161
4049 10709161 10680340 10917764 10617734 10664471 10423393 9899332 10024871 10176655 10286028 10255462
4039 10255462 10173887 9931346 9719515 9385966 9282494 8972628 8724450 8628429 8264653 8246143
4029 8246143 8043411 8407463 8744260 8500320 8659255 8345429 8182639 8251458 8496776 8235974
4019 8235974 8631439 8883066 8765160 8835244 9064855 9221790 8826146 8881752 8909728 8351434
4009 8351434 8718414 8518659 8650305 8665531 8432282 8536143 8199157 8474245 8232337 7948383
3999 7948383 8245520 8270218 8085902 7988949 8438404 8311701 8502461 8264980 8022913 8688501
3989 8688501 8887287 8953069 8736949 8503958 8160683 8510383 8446352 8424511 8698907 8460116
3979 8460116 8436335 7955209 8045023 8761086 8573217 8489293 9040347 9746095 9757570 9868460
3969 9868460 9542253 9658762 9250114 9271619 9456591 9483518 9424127 9376866 9120674 9502771
3959 9502771 9811579 9575470 10099901 9652799 9933961 10180229 9851711 9565291 9503429 9927430
3949 9927430 10445497 9617718 9961697 10219986 10373777 10778316 10700692 10856469 10818056 10551671
3939 10551671 10825565 10591171 10637325 10734465 10591137 10798752 10753056 10407362 10383959 10490227
3929 10490227 10465403 10636317 10525798 10577989 11018255 11344195 11792125 11869849 11317465 11017803
3919 11017803 11124346 11555475 11484843 11482187 11155414 11154503 11607976 11761308 12173801 12536689
3909 12536689 12519873 12765228 12968060 12883483 12898932 12785831 12261822 11973899 12196385 11784857
3899 11784857 11037495 10930210 11291880 11727498 11722185 11479678 11449646 11419829 11281844 11144541
3889 11144541 11391616 11901115 12377973 12455003 12439115 12734914 12689158 12559052 12572422 12240687
3879 12240687 12644129 12832604 13100824 13226863 13018742 13054110 13503542 13289380 13698097 13876057
3869 13876057 14040377 14054414 13810561 14310309 14690340 15058637 14916278 15345822 16273064 16934743
3859 16934743 17615058 18384338 18762604 19575468 20721828 21724775 22654340 23630717 24220501
3850 24220501 24433513 24239755 24403154 24385748 24151219 24046489 23624181 23325256 22868064 21956302
3840 21956302 21628360 21618788 21374347 20813582 20651642 20345545 20375563 20389444 20711236 20292956
3830 20292956 20765881 20930238 21528258 21707910 22290934 22162897 22324434 22417239 22912292 22723225
3820 22723225 22744528 22820806 23264627 23677295 24495085 24903012 25401637 25810450 26028500 26705839
3810 26705839 27823960 29088053 30073238 31154531 32474603 33938537 35957633 37613800
3802 37613800 39429722 41670458 43801965 46337698 48949472 52736479 56137777 61002254
3794 61002254 66401763 72761422 80302305 87968188 97116583 107959782 120450788 134368669
3786 134368669 151075251 172936506 202422384 243519911 299517235 351270137 329876765
3779 329876765 280316610 237944434 190957548 156481330 131957197 114285807 101011853
3772 101011853 91769948 83411056 77258222 71921336 67892846 63384654 60295347 58252923
3764 58252923 55474895 52691911 50514368 49010717 47466687 45479235 43933313 42745492
3756 42745492 41977976 40364653 39873591 39232226 38205846 37678213 37483321 36636642 35703960
3747 35703960 35247128 34709471 34448144 34382990 33454776 32759876 32361524 31982202 31521567 31493898
3737 31493898 30848069 30621791 30763988 30543355 30238487 30429206 30176376 30040815 30672233
3728 30672233 30465359 30063072 30386293 30648261 30758405 30921747 30675391 30747695 30870373 31294059
3718 31294059 31224651 30948561 30978014 31127477 31414854 31380664 31535803 31419836 31646688 31944525
3708 31944525 32234125 32414877 33035963 33572162 33424868 33834490 34522352 35105382 35381848
3699 35381848 36247906 36922344 37621155 38365440 39109482 40472145 41908582 43625127 45674853
3690 45674853 48069069 50283912 53485804 57126068 60308033 63934218 69446687 76465006
3682 76465006 85237704 95547362 107173668 109917319 107494505 106049706 104997847 105711453
3674 105711453 109805959 117377871 129877350 146556254 164528952 167932464 159324363 152333051
3666 152333051 145144544 141446981 143173662 150550777 164456475 184496064 207800902 210559170
3658 210559170 192324549 175190194 158046981 144380956 136864679 135331560 138814020
3651 138814020 147228683 159282914 159910212 146119395 132244045 118315142 106396739
3644 106396739 98495624 94274590 93202744 94964951 98831356 97804599 89041483 80321549
3636 80321549 71789270 63296316 56978687 52550988 48734283 45790014 43488801 41467256
3628 41467256 39305045 37218779 35508447 33604219 32247287 31142905 29923963 29058632
3620 29058632 27700217 26967583 25613004 24628759 23800497 23039508 22390179 21852417 20966090
3611 20966090 20715590 19560632 19113928 18860976 18294658 17241453 16982081 16750389 16106407
3602 16106407 15880183 15506958 15213448 14456956 14040221 13645108 13563283 12789088 12674538 13208658
3592 13208658 12833716 12067918 12167863 11633679 11265647 10975506 10625174 10636030 11046274 10906966
3582 10906966 10666242 10361480 10273148 10025403 9959702 9747835 9724066 9464292 9604306 9299618
3572 9299618 8525863 8858449 9013163 8933937 8832777 8818276 8674358 7974020 7934959 8217254
3562 8217254 8347932 8017193 7783849 7389756 6901064 6917683 7161165 6981996 6929066 6534085
3552 6534085 6351669 6606282 6178594 6514072 6706063 6035842 6278479 5929377 5555447 5401514
3542 5401514 5694323 6247555 6053496 5626893 6134853 6621646 6581634 5847792 5495754 5747957
3532 5747957 5780421 5443546 5509150 5192211 5792373 6001117 5976748 6372035 6281538 6280356 5960109
3521 5960109 6268896 6436036 6097172 5566488 5288683 5188448 5474280 5358734 5342589 5466773
3511 5466773 5082136 4917340 5016178 4799205 5551991 5840316 5135448 5100506 5260928 5007079
3501 5007079 4754707 4865909 4952492 4555966 4871277 5013971 4286746 4504374 5301447 5352720
3491 5352720 5048641 4508655 4827662 5251862 4379236 3978242 4059033 4005452 4368883 4394168
3481 4394168 4828639 5141473 5069818 4948140 5034786 4927104 5226648 5279344 4754389 4906315
3471 4906315 5474694 5509566 5544753 5351976 5109664 5309338 4988719 5420904 5403749 5507496
3461 5507496 5668954 5673583 5824848 6037304 6186545 6451813 6103535 5783452 6007193 5904422
3451 5904422 6193464 6513710 6693345 6456232 6637205 6819668 6807473 7608623 7522664 7500820
3441 7500820 7854586 7828963 7852753 7486731 7282249 7548554 7465788 7528180 7768633 7574119
3431 7574119 8093598 7940931 7936440 8051158 8350765 8260643 8173881 8538649 8316359 7896869
3421 7896869 8181586 8835791 8717909 8826331 9068861 9122016 9337120 9233980 9426445 9806716
3411 9806716 10334937 10250982 10436329 11046373 11682254 11823944 11991279 12457160 13174376 13062771
3401 13062771 13340984 13277647 13002679 13518881 13665845 14001385 14600683 14754531 14828835 15215713
3391 15215713 15839911 16104747 15605613 15634345 15769728 15985378 16326869 16294216 16014731 16011703
3381 16011703 16500355 16792546 16679832 16164894 16209027 16380725 16349006 16793861 16990483 17110412
3371 17110412 17256493 17536806 17003313 17400776 17678213 17723669 18057323 18517086 18473338 18890754
3361 18890754 19193925 18762517 18808801 18824905 18638363 18661877 18916606 19138775 18831855 18593561
3351 18593561 18422260 18440516 18362492 17744954 16905791 16636973 16004386 15589166 15894114 16407522
3341 16407522 16020094 15748542 15492979 15558727 15571259 15562427 15747820 15818870 16164079 16405306
3331 16405306 16764104 17546728 17977914 18188151 19197748 19345656 19309051 19362768 19382294 19533791
3321 19533791 19904639 19923327 19030415 19284248 19631860 19482827 19017140 18879229 18799028 18267848
3311 18267848 18063062 18037675 17970765 17334192 16520943 16000179 15420446 14985486 14533438 13920292
3301 13920292 13316925 13547264 13871711 13807673 13611099 13204617 13051729 12838185 12566738 12415527
3291 12415527 12448473 12548042 12533185 12455872 12389020 12332587 12735513 12371522 12087381 12525409
3281 12525409 13067482 12405495 12650227 12715915 12845584 12476349 12392467 12452138 12510431 13012888
3271 13012888 12942970 13023995 12921695 12651765 12440128 12541223 12485155 12366849 12577797 13392666
3261 13392666 13561207 13393682 13286813 13304751 13926961 13743528 13842333 14072738 14129080 14310351
3251 14310351 14819242 14807127 15198405 15533163 15628609 16450171 17019437 16934512 16958785 16758090
3241 16758090 17602020 17565602 17400746 17762150 17739028 17787282 17448344 17184096 17648359 17588216
3231 17588216 17441450 17098289 17139339 16720221 16223352 16093728 15816266 15275393 14796438 14634405
3221 14634405 14575447 14742938 14282291 14037055 13379432 13617569 13251021 13380764 13078329 12931983
3211 12931983 12733048 12530225 11820597 12110905 12353696 11858502 11290077 11819482 12008370
3202 12008370 11931841 11859959 12134555 12419638 12660093 12808067 12603555 13121932 13585413 14002115
3192 14002115 14075945 14218755 14432646 14422704 14380450 14527326 14549997 14225752 14131257 14385608
3182 14385608 14149488 14144078 14397623 14380857 14609876 14579731 14839496 14611512 14057169 13743494
3172 13743494 13627273 13629120 13367603 13117747 12876430 13046517 12813215 13095678 13831080 13281025
3162 13281025 13129631 13018902 13279398 13206599 13349390 13862561 13618912 14031660 13991402 14167247
3152 14167247 14396340 14651570 14954884 15036893 15240468 15291021 15750744 16244480 16621837 17142092
3142 17142092 17007461 16967078 17443370 17839397 17884596 18634422 18875357 19024544 19724238 19741995
3132 19741995 20305464 20598397 21109117 21364344 21492559 22335200 23393705 23926311 24342077
3123 24342077 25270839 25923643 26913866 27312529 28014967 28568469 29761225 30783221 31972875
3114 31972875 32523387 33652432 35343710 36264941 38203516 40241262 42127626 44218388
3106 44218388 46435506 49541503 51742028 54475855 57545780 60347780 63375020 67297749
3098 67297749 71019855 73722237 75237425 76279045 76506472 75870757 75229675 74141106 73272065
3089 73272065 72392906 71984840 72777765 73491868 73631454 73245971 73247367 72780531 71771798 71050169
3079 71050169 69899295 68394844 67192500 66796976 66989983 67467007 68131135 68513040 68403301
3070 68403301 68485761 68452193 67499597 65754978 64104917 63129523 62282443 61453736 60270282
3061 60270282 59446482 58234251 57348284 56415074 54818394 53879962 52279532 51195009 50198204
3052 50198204 49629959 48583501 48246578 47127400 46689541 46246566 46074490 45267503 44986196
3043 44986196 44765312 44088408 43211695 42765671 42444867 41676026 40348863 38887643 38792079
3034 38792079 37954396 36917978 36549459 36146833 35461726 35297388 34911892 34356678 34850300
3025 34850300 34349173 33606523 33690838 34018922 33473045 33523728 34014278 33770730 33758917 33313752
3015 33313752 33570112 33352885 32465403 32209675 31628872 31482725 31372117 31099116 30648027
3006 30648027 30763662 30242548 30154108 29775498 29515951 29304908 28556329 28604487 28162190 28125272
2996 28125272 28033806 27627147 27224768 27380218 26980060 27083872 27590853 27821773 28669994 29414998
2986 29414998 29726091 30589517 31760641 33082643 35035514 34867596 32458619 30938688 28985910
2977 28985910 27426525 25828597 24831970 24336370 23936781 23538422 24047161 24091763 23917439
2968 23917439 24324108 24653100 24582084 24733249 25085920 25427912 26101214 27593831 28641104
2959 28641104 30136739 32432911 34994159 35066709 33345890 31922522 30061656 28850540
2951 28850540 28082968 27896946 27561762 27362850 27300381 27434688 27380556 27459714 27663620 27056416
2941 27056416 26786775 26892273 26644121 26182039 25692835 25594825 26013630 25912784 26073468 26118094
2931 26118094 26116509 25421218 24830558 24820193 24716802 24419774 23747804 22913571 22446417 21647620
2921 21647620 21449519 20857342 20831055 20102610 19401324 19326542 19263980 19052283 18566092 18611566
2911 18611566 18108235 17630018 17569372 17403801 17218224 17312581 16829838 16448775 16051206 15965438
2901 15965438 15661050 15258562 15144631 15405536 14914446 15227533 14432124 14195020 14258888 14143999
2891 14143999 14118020 13970343 13872780 13994735 14008408 13831394 13726540 14133893 13707452 13765608
2881 13765608 13493279 13075723 13083231 12952424 13473154 13056244 12233581 12231896 12042259 12266979
2871 12266979 12452805 12024515 11813480 11850089 11150073 11563567 11549403 10996137 10814845 10899846
2861 10899846 10977185 10913982 10983803 11350475 11125377 11106293 11180132 11084767 11074957 10503879 10096198
2850 10096198 10291961 10636590 10412500 9892745 9686197 10274955 10635382 10417346 9503957
2841 9503957 9375263 9368214 9422184 9528158 9345263 8724261 8676638 8801658 8602544 8230190
2831 8230190 8554794 8284247 8432774 8116275 7989421 8353536 8517512 8573479 8176558 8132842
2821 8132842 8365620 8135072 8185633 8092726 8287086 7822450 7826024 7905545 8012158 8091073 8275590
2810 8275590 8449551 8033200 8034893 8257179 8111990 8031391 8274162 8136623 8544595 8603648
2800 8603648 8178522 8136515 8311266 8194523 8381436 8525510 8676456 8823422 9371135 9158638
2790 9158638 9066921 8673293 8317970 8612439 8797867 8734955 8983854 9217025 9410036 9625660
2780 9625660 9784774 9766115 9543430 9655428 9689351 9838981 9701081 9624158 9613167 9912701
2770 9912701 10410760 10255054 10040511 9883009 10613968 10751161 10654703 10592745 10764049 10982029
2760 10982029 10941756 11260292 11481019 11934618 12327278 12728506 12962451 13391622 13611674 13973273
2750 13973273 14097679 14231974 14739916 15124102 15754120 16486942 16871157 18049479 18787090
2741 18787090 19645175 20496634 21652509 23241020 24789463 25898948 27744560 29799358
2733 29799358 32587078 35420654 38448748 42008578 45408495 47743725 48850265 48731574
2725 48731574 47469794 45953750 45227842 45547325 45893899 47443243 49297772 51186711 52371503
2716 52371503 53987079 55587907 57518437 59525352 61593447 62883524 62955091 62537736 61153864
2707 61153864 58956142 56245691 54665459 53108514 52232718 51341441 50073227 49121025 48559567
2698 48559567 47263723 45845377 44688551 42755015 41659641 40335792 38726859 37199449
2690 37199449 36145810 34504385 33216434 31787742 30177787 28839465 28307582 26850818
2682 26850818 26061767 26030758 25630983 24899008 24248012 23245897 22681808 22457033 22113764
2673 22113764 21301825 20745370 21039212 20816942 20574295 20250205 20784076 20519416 20886921
2664 20886921 20976284 21090985 20749671 20133753 19543926 18965177 18458136 18073491 17545223 16916485
2654 16916485 16415113 16203550 16476275 15420066 14821844 14945731 14740444 14032818 13865743
2645 13865743 13530674 12954116 12445918 12272538 12151796 11572307 11771184 11535345 11507743 11608600
2635 11608600 11600159 11581214 10999703 10944036 10524361 9661382 9535027 9340276 9046326 9086418
2625 9086418 8501756 8602385 8750198 8301831 8036743 7919671 7816546 7831148 7810116 7109352
2615 7109352 7064058 7612112 7223019 6480987 6242491 6075827 6199923 6422069 5777000 5528452
2605 5528452 5562133 5226435 5352237 5522935 5289047 5447775 5502318 5417005 4912925 4892455
2595 4892455 4959835 4851401 4703333 4483019 4163368 4194235 4167957 4263891 4906508 4891338
2585 4891338 4518005 4012227 4128942 4527692 4294478 4456879 4365968 3859763 4030542 4333235
2575 4333235 3903783 3744816 3617162 3311829 3481571 3134880 2975548 3261931 3047211 3347544
2565 3347544 3420371 2745287 2664438 2379795 2771091 2951709 3338882 2987404 3192873 3314074
2555 3314074 2983883 2557573 3006750 2888425 2855260 2791002 2498907 2237094 2266969 2848204
2545 2848204 2908284 2779695 2030304 2232299 2812397 2457697 2033334 2265579 2386398 2436828
2535 2436828 2151548 2123361 1929299 2427750 2767507 2024185 2261840 2047949 1911041 2008421
2525 2008421 2214984 2370029 2333077 2388798 2315236 1702555 1938276 1890267 1675497 1826745
2515 1826745 1943597 1841834 1906896 1641121 1780732 2072918 2322056 2130302 1659820 1678435
2505 1678435 1632675 1685408 1562849 1865241 1565052 1763058 1792629 2191803 2247092 2369602
2495 2369602 2256659 2463135 2040830 1838994 1541140 2011739 2326540 1954523 2164549 1858864
2485 1858864 1948489 2071410 1850415 1382313 1178528 1256162 1571345 1939168 1776078 1324019
2475 1324019 1491825 1417250 1467094 1606152 1161644 1238159 1202462 1266504 775417 587528
2465 587528 1051040 1041456 1214416 1204014 859355 926077 1560799 1482747 1183020 1493068 1516239
2454 1516239 1370557 1024166 692546 587101 1064039 1426890 1587822 992554 1337289 1036936
2444 1036936 702988 857945 876843 1005552 1174241 879672 1093934 1110375 632408 1002774
2434 1002774 509600 461110 582884 718631 1079150 914147 416129 397705 451880 703160
2424 703160 610978 -152964 631437 638519 666060 941446 738872 610008 565621 614628 758670
2413 758670 981126 1159795 1446002 932107 965035 577005 487301 503878 833925 511394
2403 511394 496576 542563 697115 997753 853396 326284 178576 131643 262734 246169
2393 246169 779831 646645 211761 256198 691673 643311 987958 611950 418551 599572
2383 599572 654438 624658 694380 823142 705098 845171 571903 586143 1008529 554136
2373 554136 527569 819602 850692 1153501 572890 375498 485901 544964 145271 203487
2363 203487 369867 373078 179357 272742 143851 343680 237383 165372 431105 136643
2353 136643 387924 88189 616083 841995 629512 917999 544223 389514 312211 808890
2343 808890 549162 238101 300937 181441 2429 319654 381195 884977 468223 506475
2333 506475 524835 933051 769620 204946 340198 537372 160501 155286 338044 607854
2323 607854 362652 156255 257204 235707 415082 507956 731206 424116 699037 654680
2313 654680 1022703 1093492 845664 664511 604897 976978 1137340 849875 816212 656349
2303 656349 612594 352822 519960 504074 763631 498120 168001 218371 136148 321312
2293 321312 460594 464592 514567 408284 291548 585072 586608 294181 273832 -41158 3229
2282 3229 281279 296260 421184 -32991 -429907 52473 836997 727979 724092 691538 356494
2271 356494 100997 -97705 399184 419655 289801 343316 260973 347031 734134 517782
2261 517782 686696 510913 387502 -43154 609314 822972 145373 524782 307436 566666
2251 566666 337687 436176 290443 -36107 184722 616046 386218 666228 788969 495625
2241 495625 282725 -148110 182943 783841 374641 89360 102199 459063 134950 441384
2231 441384 753800 664390 352787 225315 31702 87092 469781 85661 27094 310260
2221 310260 428028 405107 529582 582470 770280 50162 105442 392707 265727 113790
2211 113790 60622 291390 119669 -7499 155323 430167 261448 194204 275365 224951
2201 224951 921522 1153513 844000 313023 367298 494911 475530 461086 237693 -123196
2191 -123196 -1025 64773 163408 129069 347603 468798 263600 495418 915876 485083
2181 485083 277441 325846 538541 855097 754028 693466 192939 414960 448915 233069
2171 233069 315547 208142 277026 -165785 -144192 310665 287527 299841 713824 556232 601369
2160 601369 977423 865190 908993 759313 686226 458950 619541 194379 298113 699361
2150 699361 807036 587845 236865 359571 686356 1047539 698586 891252 629850 723581
2140 723581 985427 1227194 1283451 836402 913846 1151889 560450 470593 648599 814401
2130 814401 1284455 1524295 1827688 1078874 1091254 930395 1355477 1070387 805525 702922
2120 702922 831521 1010504 912868 1152700 1220184 1092172 1088264 971987 1171950 1657833
2110 1657833 1834723 1410308 1516241 1668310 1558506 1384691 1422107 1785549 1807362 1471437
2100 1471437 1240191 1239690 1302868 1537577 1665943 1582296 1546964 1966533 2025945 1933728 2379412
2089 2379412 2654014 2635582 2612835 2580557 3479333 3665150 4042194 4140461 4819015 5708559
2079 5708559 5995378 6176546 6144479 6889303 7818333 8818020 9526171 10704485 12129392
2070 12129392 13684330 15797456 19229955 23437154 28335765 27432445 23268102 20248306
2062 20248306 16566769 13123388 10733894 9816438 8309729 7753951 7257390 6506603 5930508
2053 5930508 5468057 4785581 4443825 3781641 3858889 4052783 3935937 3197390 2989678 2596356
2043 2596356 2316304 1973596 2358665 2120446 2284360 2088277 1667834 1904140 1874120 1813787
2033 1813787 1795376 1811052 1656523 1568116 1340566 1117829 1021204 1383437 1624647 1570432
2023 1570432 1490036 1253757 1402001 1504505 1287614 1051780 959119 1124730 839960 659133
2013 659133 257829 204500 501986 633327 1003641 891408 986053 1065663 1086777 1024787 800445
2002 800445 466490 19286 352587 349743 639731 629226 330253 460173 603718 268232
1992 268232 351997 570102 564104 630324 360672 622041 712165 594158 742504 293199 -163477
1981 -163477 -264143 395343 -25612 403346 628141 418098 142982 337318 327473 277747
1971 277747 534317 922301 724966 515819 533912 271909 619820 625073 620179 480093 439446
1960 439446 799907 340708 611802 583247 710170 562333 228823 -242039 -134721 441435
1950 441435 407200 250727 497190 469270 243011 606888 689372 290302 491872 1077964
1940 1077964 528362 239401 453359 291176 314437 27268 317013 557748 340190 193864
1930 193864 131783 510351 94522 61407 451231 286375 -75284 251691 10983 69763
1920 69763 213227 188169 38572 94587 559822 610075 939348 389749 -191669 33091
1910 33091 180455 957526 617829 540567 760652 417932 -161613 223126 524467 74598
1900 74598 -3718 493811 108794 -162349 202700 -156908 199098 400835 64399 -109641
1890 -109641 205171 440709 -44827 128020 -267773 -83668 13259 -80744 29433 -10533
1880 -10533 -221968 547304 56535 62103 470691 3479 124477 325357 -112224 -45145
1870 -45145 251043 277243 408494 306250 659991 458274 657727 277428 241474 610039
1860 610039 342908 417491 -5694 -397300 206521 334584 452933 243550 334413 69338
1850 69338 -185327 185680 224831 -150147 -167499 81937 151768 557870 564955 671301 291415
1839 291415 -61461 -394217 -141772 -44575 -60509 68149 -18722 65784 160780 272493 318823
1828 318823 176353 40961 574857 514012 511126 672499 299566 194533 388403 192022
1818 192022 421058 108089 473207 893351 806003 278219 347459 426805 283156 -66622
1808 -66622 200394 572458 485334 498055 597168 278711 -70296 -347782 -334439 -36441 -129715
1797 -129715 74985 102249 86054 -108302 -48943 289339 284127 448800 -14705 209049 455050
1786 455050 -14923 -24145 80920 -61973 220816 193423 296484 576004 498592 393301
1776 393301 -463297 -83629 -15977 -186615 376027 648737 653668 380495 328852 330112 23995
1765 23995 -164658 32890 553745 265210 52869 160465 288112 544638 767651 308364
1755 308364 234394 629017 444999 564134 491446 60680 476307 255132 249716 408718
1745 408718 231781 176719 370924 290273 6358 -409990 -233413 60288 321021 326264
1735 326264 -199782 -543088 -228597 188853 189164 426476 268431 235275 -30852 73821
1725 73821 275489 492881 188418 26226 296633 363797 137182 176671 206392 8676
1715 8676 220179 -273417 -280911 -514668 -557365 -174318 75421 21660 381304 823371 759876
1704 759876 404826 182304 336164 -16220 280609 202555 327915 -165442 40614 -117544
1694 -117544 -213456 464060 54296 -470435 -451899 99400 153780 -186357 -224067 -392532
1684 -392532 208599 -4224 -67698 -246341 -227113 364235 -3917 -155105 19653 289132
1674 289132 29557 418662 182036 -321775 -435377 -172757 -103051 -37829 -97419 277168
1664 277168 241553 309774 433198 394751 625846 637499 559895 812214 454823 10982 14358
1653 14358 79896 736125 431668 200916 81590 -31542 524338 622559 163199 222863
1643 222863 21883 38691 -154446 -117158 58532 422 -113405 -114164 -443736 -254242 -175940
1632 -175940 -271145 12251 349329 66323 -254580 -106718 -416815 -411262 -331939 -280280 -131492
1621 -131492 -293535 -15537 -159356 -739201 -151900 347123 365218 245978 431325 383256
1611 383256 341830 469495 472497 377178 99528 -206712 -239939 -175118 -270326 -355208 -448236
1600 -448236 45439 427902 -47381 -860574 -338581 274815 -358929 151246 280705 316562
1590 316562 171893 -54714 -51494 -527809 -587175 -296790 12936 220287 -405896 347156
1580 347156 -182531 -235283 -216168 -99742 -127734 -50816 -114313 -284362 -259591 176222 515272
1569 515272 -21897 -387949 -482587 -227631 -6354 365010 343018 142619 -69006 -261561
1559 -261561 -35214 214084 -150550 33912 147560 190293 197784 367663 -72649 -82112 -159602
1548 -159602 -20556 -130934 -280514 -174929 -66768 238646 109089 -70395 36548 332672
1538 332672 136568 306424 714587 179966 362132 254804 67403 -45283 86058 180335
1528 180335 377178 -429255 -370238 -28276 76699 -41726 -6266 -203365 -34581 189576
1518 189576 64380 -207615 -259553 -369527 -639534 -168699 -77350 38083 42508 -456988
1508 -456988 -482664 -96056 22421 -119425 -121033 -204402 -190282 -284458 -77752 282333 250958
1497 250958 204652 288382 852033 548615 707273 352594 474037 515859 103934 852912
1487 852912 325593 -119560 -294211 185571 -142924 -216657 144277 67369 78034 18799
1477 18799 18492 17946 1164 -185402 86088 335484 118427 315698 424970 439713 362963
1466 362963 17906 -97669 -237303 243622 324947 414293 318689 420814 432283 280658
1456 280658 -269029 -152268 -46243 48144 -195486 -124282 83026 256926 428573 -9016
1446 -9016 -240864 -79506 -380952 6436 74716 56682 -181533 -106406 -213895 -28693 155320
1435 155320 39773 23616 369545 -56470 2077 365678 287916 352658 -87825 -84600 -285726
1424 -285726 -54922 303218 -55443 -155883 216563 270710 268472 304728 232586 140565 -63159
1413 -63159 -291794 -251819 -169961 478518 538939 41402 -273536 202306 99682 109301 -280864
1402 -280864 -334446 93962 -40004 102715 188439 60575 -69678 420075 360502 354821 586588
1391 586588 839919 -176698 -58842 113147 200956 65213 -403734 -176260 -135591 -295077
1381 -295077 -325701 239996 407432 245893 -333965 -52812 -94696 90544 540030 403582
1371 403582 136164 -40764 -47645 54686 108667 -338663 -444925 -6973 304627 614193
1361 614193 402782 237914 361701 347007 187489 828360 304897 -33648 -58366 -197705
1351 -197705 -11795 -124549 60963 169535 -265300 -288589 -23646 27396 301120 311029
1341 311029 23558 83534 324762 329190 -27259 -57390 -136093 198236 429020 230291 443398
1330 443398 605792 246806 -17674 147593 536978 165192 126663 -120680 -21744 205841
1320 205841 -42911 -76199 -147430 -35283 425341 137416 121136 -83127 -204435 -68502
1310 -68502 -184100 -287833 -254831 -128838 -416225 -231851 -263133 -33994 -337170 25219
1300 25219 238811 284687 -335157 -334171 -11365 -305946 -232566 149946 96225 298598 196873
1289 196873 182637 -238747 -375515 -141429 210199 199918 20767 -28783 196217 -116721
1279 -116721 -441483 108729 111305 414324 52656 -145599 -192650 -210077 -431483 -290998
1269 -290998 -419142 -601016 -542616 200064 43379 -382682 24580 -260154 -391761 107242
1259 107242 130772 -360647 -489280 -620089 -247869 303250 175866 123831 246191 324956
1249 324956 50687 -264943 110758 -5649 27685 315034 168908 -14259 114501 474540
1239 474540 381943 10528 -73730 -239150 170040 321344 -53685 -185208 -140920 78998
1229 78998 117540 -316607 -56255 90528 -151437 -328112 42883 295397 75440 -121706
1219 -121706 -14671 -68264 -569863 -1006832 -696743 -286575 -312275 289157 -92202 -18698
1209 -18698 501245 244959 -37149 -481523 -503900 -246336 -278077 -4452 -40548 -326401
1199 -326401 -672210 -179783 -29660 165772 -63249 241756 293424 173994 88025 -139651
1189 -139651 -256239 -118251 235134 3985 -105633 -464406 -219319 120441 288484 277927
1179 277927 65931 -20061 61231 -604796 -49062 1328 -72126 66476 286060 247032 65891
1168 65891 -332195 -81931 -363223 -334904 -36538 -497148 -289211 -135581 -457778 -429756
1158 -429756 -333786 -501753 -248135 -333747 -297692 -344143 97178 -66766 301805 441287
1148 441287 -322959 -74149 116717 -182838 -575362 90301 504101 176764 274954 311428
1138 311428 310538 241175 -223830 -379393 -45686 -190702 -258357 336169 145237 164091 124745
1127 124745 13493 119477 -30923 46545 -65806 -254286 -209586 263930 301067 134908
1117 134908 -30042 -230294 -236840 -262156 -368719 118049 173507 -71091 -101877 -182807 -320384
1106 -320384 -397058 -122607 -131181 -239384 -19978 -25049 -267112 -211138 -628125 -568391 -72914
1095 -72914 -303760 -381558 -248117 -105241 -45491 445606 160620 -53519 -444072 -155662
1085 -155662 -47944 -448537 -469864 124955 274633 440294 252379 119523 -46520 91227
1075 91227 176488 127535 -74922 -196591 341367 421558 -33827 144597 31121 105178 -217188
1064 -217188 20538 479418 127326 142367 -356146 -16222 184777 109970 -216472 -72817
1054 -72817 -419086 -148054 164913 -19928 -15362 -153369 153500 -66854 -367450 -542126
1044 -542126 25882 -54548 -212988 303654 46155 164723 121378 392504 578076 553208
1034 553208 751131 672494 191948 213337 461472 420595 -74020 8696 -354088 -417767 -112571
1023 -112571 387236 451154 8675 -1969 194651 -44776 -91610 209077 152395 438245
1013 438245 200229 -222092 78657 -397254 -547688 225784 203519 -335001 -537683 -185742
1003 -185742 -207892 -237976 244718 176714 181849 366945 404960 349614 -48958 47471 -138048
992 -138048 344346 1251967 954931 618629 444427 248025 191888 -211102 10521 -22975
982 -22975 81075 407497 62462 -213799 58061 260947 -539083 -303639 -256267 -504567
972 -504567 -10251 -142400 -248764 147578 -6440 -201067 -582004 -125866 -315246 -447725
962 -447725 -507688 -541452 -185223 56896 346051 77696 -132539 -369114 -57831 167567
952 167567 -63359 -3947 -345652 85134 -316392 -855088 -458531 -37408 -243634 -126668
942 -126668 58715 21733 -417792 -320119 -400936 -929398 -251084 -494362 -446906 -253988 -486531
931 -486531 -426700 77904 -55155 -503310 -183621 47992 -319569 -422471 265867 205819
921 205819 -424174 -612802 -194321 429176 -23062 407173 328624 240499 26614 31529 -342303
910 -342303 137386 154345 79208 48142 -112685 -317178 -25503 -48404 18175 8682 -410976
899 -410976 -302038 -8018 -317289 -337158 -114109 -320392 -286261 -273352 -591088 -591478 -177712
888 -177712 -81430 -164031 -70964 -219251 -469723 -54977 -23269 6129 55870 617211 566987
877 566987 210019 265613 86835 329511 398097 -74083 -33748 -306392 -45331 50151 63542
866 63542 342535 -21614 -296489 -229917 -178320 -315041 -148006 -119736 -35038 27912 -424201
855 -424201 -323649 -338040 -410125 -215323 -332342 -105259 36532 -360870 -118300 -115874 -231297
844 -231297 2573 -177371 -651084 -475246 -261249 31955 -108347 265701 537942 -89145
834 -89145 -345964 -106397 -123669 -156311 335529 556618 60881 -239774 -380883 -503354
824 -503354 -467330 -408729 -499792 -117192 -101496 -364153 -135071 -276664 211790 -44822 -323684
813 -323684 -246065 263632 209967 -191635 93819 225544 -183183 -147017 53519 -239051
803 -239051 -321281 -54134 9474 121930 -184593 -313893 -238351 -23416 122954 92009 60064
792 60064 -232962 -208565 43360 50986 132875 161269 -249164 -628889 -400597 -32778 -530913
781 -530913 -456239 -551308 -523894 -340441 -442000 -612742 141892 159949 -299106 -592240 -357334
770 -357334 -47257 -255587 -591937 -459870 -304131 -245049 -319410 -8928 -243828 -349954
760 -349954 -206478 -516077 -483830 -75284 -456533 -537148 -592203 -470025 -160237 77125
750 77125 162776 -121638 -243931 111564 -57252 -310336 -439385 -693283 -564549 -325096
740 -325096 -126772 -492684 -632158 -354021 263603 -321439 -347094 57342 41706 -284218
730 -284218 -295383 366883 403250 25940 -14183 -26240 398684 301388 161196 -386446 -278841
719 -278841 56131 -14284 -33003 79687 234711 -37699 -71711 34991 -170457 -34524
709 -34524 -51284 -321509 -456136 247506 474368 38237 -81544 -365251 18082 -32951
699 -32951 32937 88717 -125592 -202592 -669392 -930684 -453622 221048 -153968 -469345 -517058
688 -517058 -344937 -62939 -66953 -306461 -528192 -168065 479308 109044 -348463 -510541
678 -510541 -209486 -270096 -258675 -651897 -349391 -471622 -43037 227753 -292167 74798
668 74798 -191470 257 -28430 -369079 -412535 -367418 -307122 -474636 -272159 144158 62157
657 62157 -285349 -111232 64997 -142062 -286571 -342351 -93618 290959 -125380 -183009
647 -183009 -28375 -45029 -31177 -402501 -327407 -290157 -692371 -567153 -357262 269012 99600
636 99600 -144674 112911 70484 293694 -310239 -252025 -123331 182750 377256 484566
626 484566 43413 -6829 -107974 -532492 -411010 -308182 -206378 -129007 -46075 -69848 329002
615 329002 225173 -74728 355178 -153059 460661 355410 324377 -255351 -85882 197472
605 197472 -166735 -276141 -495427 -261512 -193081 -215206 -89093 -105786 -221896 -578193
595 -578193 -420778 -335907 -484492 -63812 -57473 60217 150429 -176170 -378354 -515466 -304359
584 -304359 -676754 -549994 -39219 -415806 -596613 -118400 449396 39469 -154585 148481
574 148481 503046 414828 -69461 152403 451729 -30035 -453618 -130241 21678 83525
564 83525 143064 49280 632916 108943 -360486 -354479 -153517 49259 -214404 -359740 -251291
553 -251291 -34707 -7633 -302695 217298 -75193 -131656 223534 208102 505420 445314 -105110
542 -105110 -94631 -466353 -300127 -75485 -22191 -94685 -143653 -172614 -350950 240239 205471
531 205471 100247 15221 320055 313105 246390 -327219 -277120 80699 347520 145248 276020
520 276020 664638 -3665 10920 -66687 447586 561177 -7779 -488707 -289724 -193536
510 -193536 -460483 -109445 71190 -278062 137113 407387 377250 -93887 -59576 -390846
500 -390846 -316318 -16252 367512 99901 -143345 -7108 28593 166159 172293 119176 82057
489 82057 60364 132501 354779 48021 170572 419720 183885 19256 285582 -140174
479 -140174 -416033 -354469 -391277 -583270 -254309 -627317 -325108 4678 50431 -51382
469 -51382 -104986 12270 188185 223527 -114036 -17202 147401 366570 416630 -171923 -69889
458 -69889 132165 447857 -134027 -600533 -382855 -105369 139030 51531 -489041 -540064
448 -540064 -156225 -364127 -282338 -92487 -229909 28441 -17963 -372942 -528764 -641407
438 -641407 -230235 -100084 -82302 107289 -381451 -217199 48666 -85893 -201490 -10429
428 -10429 138723 425007 302603 -354685 -447064 -432201 -405816 -303298 -184582 -548355 -702407
417 -702407 -709324 -683244 -799832 -387511 -203216 275850 -125972 19819 -136900 -19753
407 -19753 -379605 -465454 -379623 -137467 279117 318696 454448 454585 -28853 -236936 150569
396 150569 -44169 175267 -125077 -196764 -397023 -177543 24579 -430639 -110037 6711
386 6711 -602748 -573149 -256599 233396 -127321 -427587 -611239 -357487 -131732 -226210 -156668
375 -156668 -279299 -436817 -547499 -468565 250553 519757 377300 203449 -47757 32731
365 32731 134962 -151591 -135438 -180216 9627 -152126 -338138 -282747 -487226 -341240 -102747
354 -102747 -52288 -305062 88615 -200010 -195096 -10134 -138071 -159540 -60755 -170382 246513
343 246513 334406 358376 95402 -169989 28521 451912 887474 378859 37204 -86596
333 -86596 -118994 -84443 -75800 129104 57242 139694 78766 -101825 248154 -146987 -236230
322 -236230 -189773 -7730 6633 -453334 -217656 198844 187837 -216281 -219482 -184481 1713
311 1713 -141937 -102698 -182419 -196439 -91228 -378946 -93981 92802 -125510 -360061 -414887
300 -414887 -170596 -240689 -588052 -446071 -79953 499710 264854 359911 -182112 -39791
290 -39791 -94308 -165645 263412 537423 360513 -73134 136910 -70896 -488258 -249027
280 -249027 -421405 -182095 -56441 -169578 -50792 -238981 -268215 -629150 -485009 -188888
270 -188888 -24679 -4668 -43511 397936 69345 60991 286451 11165 -156298 -345401 -308504
259 -308504 -538457 -194751 -174095 -468315 -514583 -58637 242652 181164 -377008 -718055
249 -718055 -429368 -678655 -823817 -628725 -447463 -76820 132275 27121 331444 622413
239 622413 213185 425572 299674 24098 -291962 -33799 -169812 76740 36295 -13446
229 -13446 -231382 -758269 -340829 -377527 -516737 -291409 -164769 82068 374537 610280
219 610280 348637 206232 -127925 -13290 72354 125723 161193 -287221 -254346 87021 163527
208 163527 71509 -79402 -58256 -67979 -45434 385468 154313 -259620 -467981 -164753 -23015
197 -23015 -151852 -337395 -336055 -245237 -280973 -409016 -138586 -174222 -281776 -89934 334928
186 334928 303714 185712 215201 90717 46636 436615 79463 268436 453576 125714
176 125714 186746 99177 -37113 101192 514078 302313 -58076 251511 38821 -86502
166 -86502 -50002 -317903 -369621 -21032 -207235 -243385 -51742 -58790 259451 218579 -386449
155 -386449 -247978 18803 80897 285448 174322 -17185 48491 -37694 -24189 140591 -62321
144 -62321 193971 -145958 -432540 -548301 -159034 202181 -255441 -228312 342713 -173060
134 -173060 -270616 66443 -157656 194315 -32987 -340456 -287093 -472850 91734 17313
124 17313 -191949 -357367 -261380 -299115 -479711 -414628 -42399 169373 74049 369339 240200
113 240200 -226558 -169729 -573360 -318099 -77671 174938 286475 -46309 -121324 -213819
103 -213819 -136681 -7954 203428 231630 -364069 -509764 66084 -200351 40182 340626
93 340626 -109202 -226879 42959 -185517 61541 4359 134797 -11136 312103 422034
83 422034 59916 -106629 -70393 -150749 14933 96088 23335 52932 35949 -32366 -52870
72 -52870 227630 105882 48349 -26446 -222960 -34683 -83209 -172952 -300907 -9240 -226240
61 -226240 44835 -9872 -146937 -295417 -393135 -202972 -156381 -121583 78107 -17784 233416
50 233416 270602 -79643 120618 -37879 -276746 -438951 -206006 -136773 58866 9808 -177264
39 -177264 -305936 159181 72658 -188912 17233 172908 227995 236538 25587 203881 203823
28 203823 423185 17638 5933 212086 -261836 -217647 61339 -45626 -112408 -213269 242458
17 242458 259671 314093 123123 8937 -213141 164504 249123 31891 213043 -135729 17196
6 17196 193977 -83007 -240514 -407457 -389627 -304055
0 -304055
$$ Imaginary data points
##PAGE= N=2
##DATA TABLE= (X++(I..I)), XYDATA
16383 -2142635 -1725291 -1417709 -1913575 -1650181 -1861735 -1944464 -1884006 -1809161 -1771536 -1817750
16373 -1817750 -1836848 -1678042 -1500726 -1358588 -1150073 -1304447 -1749518 -1683132 -1607325 -1817337
16363 -1817337 -1530128 -1179797 -1352121 -1503233 -1112432 -1065848 -1072688 -830942 -963021 -845270
16353 -845270 -1096422 -1119214 -1129985 -1415205 -1549259 -1122956 -1093278 -1150766 -897312 -469460
16343 -469460 -302974 -802472 -896980 -504432 -391606 -421715 -415393 -364124 -253243 -117327
16333 -117327 -239587 -19573 180169 -22215 6763 212239 390345 645531 379610 243163
16323 243163 199468 80051 276105 272850 304554 278884 24592 161843 513806 589987 443286
16312 443286 313803 463215 523833 1086030 881900 644243 883357 924910 959721 881379
16302 881379 693164 1033938 1097724 1058859 1271613 811393 631968 614504 813011 806826
16292 806826 754800 1183786 1309164 1407567 1725133 1615906 1610237 1755665 1462627 1418345
16282 1418345 1658866 1567290 1556178 1816459 1560819 1506817 1269586 1131772 1399431 1498493
16272 1498493 1478535 1849199 1522740 1463905 1275119 1144061 1447527 2000795 1777390 1564295
16262 1564295 1867649 1819014 2029629 2194583 2209544 2226665 2343771 1955675 1802941 1998125
16252 1998125 2517695 2621476 2308349 1848412 2027699 2359501 2367758 2511327 2473715 2301610
16242 2301610 2272468 2436560 2353797 2191120 2593166 2362285 2401576 2678729 2512457 2886573
16232 2886573 3145539 3066779 2658153 2582538 2654182 2693026 2587481 2541773 2323306 2721710
16222 2721710 2674034 3014319 2846525 2737592 3063142 2692140 2395220 2846975 2941517 2834470
16212 2834470 2750975 2434104 2731011 3207722 3532680 3357368 2706606 2294155 2996482 3293434
16202 3293434 3460349 3256017 3287879 3143099 3018989 3266284 2882429 2760391 2974407 3053473
16192 3053473 3192522 2989337 2959561 2713565 2989030 3219852 3091557 3415467 3006854 3093041
16182 3093041 3644456 3726946 3885188 3937586 3824465 3381894 3348744 3357498 3746456 3346610
16172 3346610 3167776 3807926 3847514 3628111 2957112 2955694 3136421 3641394 3856362 3649173
16162 3649173 3672727 3744415 3828399 3567178 3617359 3408266 3510075 3478759 3462492 3569227
16152 3569227 3358284 3670590 3406766 3301195 3674671 3580891 3596182 3783282 3622444 3277620
16142 3277620 3445347 2991979 3271478 3595860 4138079 4066546 3383380 3523616 3774180 3993365
16132 3993365 3808337 4112958 3722250 3700711 3425388 3389518 3488999 3650667 3955596 3961775
16122 3961775 3887165 3721687 3638273 3612730 3610671 3656426 3272395 3572541 3746461 3737237 3760324
16111 3760324 3778020 4016819 3875619 3731111 3693602 3649205 3767530 4145726 4004370 3832710
16101 3832710 3413161 3682334 3867698 4049073 3666621 3899650 4069748 3475551 3711042
16092 3711042 3844909 3653683 3480218 3377094 3472110 3676747 4015612 3680669 3625834 3728347
16082 3728347 3880031 4002938 3525739 3769634 3707024 4526974 4441167 4302922 3883999 3903427
16072 3903427 3668134 3508443 4037790 4247681 3844194 3807040 4128212 3636467 3155851 3071732
16062 3071732 3527821 3304246 3631483 3302110 3398723 3772992 3542401 3287334 3285272 3099657
16052 3099657 3585263 3349471 3529314 3482055 3695643 3670750 4015450 4367671 4238961 3648808
16042 3648808 3571485 3963157 3679712 3670119 3984659 4249185 4441951 4587266 4254193 3561323
16032 3561323 3677108 4076700 3637294 4351997 4090896 3635077 3766273 4146865 4133599 3836403
16022 3836403 4171676 4130366 3782958 3664861 3895708 3837422 3644064 4182230 4048078 4288523
16012 4288523 4246497 3591818 3581203 3966860 3963906 3856121 3653770 4076335 4029118 4103459
16002 4103459 3860910 3912949 3968155 4397231 4143825 3740368 3870911 3991998 3630347 3960148
15992 3960148 4023856 3785136 3429767 3421449 3870144 4004104 3676204 3969484 4245686 4045529
15982 4045529 4034350 3622877 4007218 3794125 3228580 3267878 3834438 3708064 3702770 3515088
15972 3515088 3557028 3699453 3839919 3669977 3793403 3580008 3557872 3528175 3829712 3569871
15962 3569871 3400065 3342001 3358224 3783885 4076284 4089852 3938449 3748498 3799516 3691324
15952 3691324 3619821 3725693 3883653 3762514 3391206 3822963 3678961 3868523 3746549 3430635
15942 3430635 3709169 4080609 4102101 3798343 3437905 3812763 3883741 3663608 4046540 3910502
15932 3910502 3807792 3955201 4008805 3388654 3540612 3478290 3483213 3685426 3636123 3442152
15922 3442152 3875940 3972508 4132621 4366093 4309728 4403574 4192562 4109283 3610647 3486118
15912 3486118 3443192 3907566 3802278 3621894 3984656 3664697 3727559 4278419 3873263 4102288
15902 4102288 3819850 3721061 3944196 4244173 4589642 4007275 3921638 3940848 3783025 3707609
15892 3707609 3942668 3836554 3830442 3923859 3815540 4096841 4231947 3939427 4204477 3956338
15882 3956338 3477552 3660810 3555587 3628457 3687330 3401730 3753581 3864659 3805888 3675641
15872 3675641 3943115 4283752 3998821 4024047 3764211 3822089 4381554 3978066 3551346 3372936
15862 3372936 3400886 3491470 3401588 3520569 3874455 3826221 4414923 4318558 3849873 3830329
15852 3830329 3525982 3940323 3870398 4322148 4356629 3968530 4191401 3959188 3858178 4221264
15842 4221264 3703954 3741475 3706560 3922251 4232141 4174125 4186091 3760514 3921359 4005372
15832 4005372 4146927 4126297 4249398 4154921 3315595 3744824 4186299 3867182 3893522 3737185
15822 3737185 3776883 3618726 3513112 3916613 4178196 4316711 3918447 3682480 3841214 3593993
15812 3593993 3444513 3656743 3952192 3988311 4218549 3923587 3794767 3889490 4438943 4658388
$$ [...]
##END NTUPLES=NMR SPECTRUM
##END=
