##TITLE=1H_CA-8910-3
 CDCl3, 8 sc, 
 4.08.2021
##JCAMPDX= 6.0         $$ Bruker NMR JCAMP-DX V2.0
##DATA TYPE= NMR SPECTRUM
##DATA CLASS= NTUPLES
##ORIGIN= UXNMR, Bruker Analytische Messtechnik GmbH
##OWNER= root
$$ XWIN-NMR		Version 3.5
$$ Wed Aug  4 08:33:44 2021 Russian Standard Time (UT+4h)  she@DPX200
##.OBSERVE FREQUENCY= 200.131506
##.OBSERVE NUCLEUS= ^1H
##.ACQUISITION MODE= SIMULTANEOUS
##.ACQUISITION SCHEME= undefined
##.AVERAGES= 8
##.DIGITISER RES= 18
##SPECTROMETER/DATA SYSTEM= spect
##.PULSE SEQUENCE= zg30
##.SOLVENT NAME= CDCl3
##.SHIFT REFERENCE= (INTERNAL, CDCl3, 0, 17.5057)
##AUDIT TRAIL= $$ (NUMBER, WHEN, WHO, WHERE, WHAT)
$$ ##TITLE= Audit trail, XWIN-NMR		Version 3.5
$$ ##JCAMPDX= 5.01
$$ ##ORIGIN= Bruker BioSpin GmbH
$$ ##OWNER= she
$$ F:/spectra/data/she/nmr/H-F/1/pdata/1/auditp.txt
$$ ##AUDIT TRAIL=  $$ (NUMBER, WHEN, WHO, WHERE, WHAT)
(   1,<2021-08-04 08:32:31.28 +0400>,<she>,<DPX200>,
      <created by zg, POWCHK disabled, PULCHK disabled
       configuration hash MD5:
       00 E9 B6 7A A2 85 ED C7 34 08 36 98 17 FE 4E 26
       data hash MD5: 16K
       EE 90 2B 7F 5D 20 C9 CA AE 8C 97 FA 5C BB 51 09>)
(   2,<2021-08-04 08:32:33.54 +0400>,<she>,<DPX200>,
      <Start of raw data processing
       efp BC_mod = 2 LB = 0.24 FT_mod = 6 PKNL = 1 PHC0 = -13432.14 PHC1 = 9.400991 SI = 16K 
       data hash MD5: 16K
       94 15 BB EC 00 4C 6F D9 2E 2C 0A 2E B7 2C FE E0>)
(   3,<2021-08-04 08:32:54.78 +0400>,<she>,<DPX200>,
      <pk PHC0 = -78.92893 PHC1 = 0.4 
       data hash MD5: 16K
       E5 56 0A 42 5C AA 79 C9 EC 9E C9 70 21 65 86 BD>)
(   4,<2021-08-04 08:32:58.12 +0400>,<she>,<DPX200>,
      <abs ABSG = 5 
       data hash MD5: 16K
       54 FC B7 2D 74 1C 0E FF DE 5F 4C 09 CA 2D 59 2A>)
$$ ##END=
$$ 
$$ hash MD5
$$ A5 63 9B 41 3A A6 1C C2 BB 96 43 19 E9 D0 DB 7B
##$RELAX= 
##$RELAX= 
##$RELAX= 
##$RELAX= 
##$RELAX= 
##$RELAX= 
$$ Bruker specific parameters
$$ --------------------------
##$DU= <F:/spectra>
##$EXPNO= 1
##$NAME= <H-F>
##$PROCNO= 1
##$TYPE= <nmr>
##$USER= <she>
##$AMP= (0..31)
100 100 100 100 100 100 100 100 100 100 100 100 100 100 100 100 100 100 
100 100 100 100 100 100 100 100 100 100 100 100 100 100 
##$AQSEQ= 0
##$AQ_mod= 1
##$AUNM= <au_zg>
##$AUTOPOS= <>
##$BF1= 200.13
##$BF2= 200.13
##$BF3= 200.13
##$BF4= 200.13
##$BF5= 200.13
##$BF6= 200.13
##$BF7= 200.13
##$BF8= 200.13
##$BYTORDA= 1
##$CFDGTYP= 0
##$CFRGTYP= 5
##$CHEMSTR= <none>
##$CNST= (0..31)
1 1 145 1 1 1 1 1 1 1 1 1 1 1 1 1 1 1 1 1 1 1 1 1 1 1 1 1 1 1 1 1 
##$CPDPRG= <>
##$CPDPRG1= <>
##$CPDPRG2= <>
##$CPDPRG3= <>
##$CPDPRG4= <mlev>
##$CPDPRG5= <mlev>
##$CPDPRG6= <mlev>
##$CPDPRG7= <mlev>
##$CPDPRG8= <mlev>
##$CPDPRGB= <>
##$CPDPRGT= <>
##$D= (0..31)
0 1.2 0 0 0 0 0 0 0 0.06 0 0.03 0 0 0 0 0.0002 0 0 0 0 0 0 0 0 0 0 0 0 
0 0 0 
##$DATE= 1628051550
##$DBL= (0..7)
120 120 120 120 120 120 120 120 
##$DBP= (0..7)
150 150 150 150 150 150 150 150 
##$DBP07= 0
##$DBPNAM0= <>
##$DBPNAM1= <>
##$DBPNAM2= <>
##$DBPNAM3= <>
##$DBPNAM4= <>
$$ [...]
##$SUBNAM3= <"">
##$SUBNAM4= <"">
##$SUBNAM5= <"">
##$SUBNAM6= <"">
##$SUBNAM7= <"">
##$SUBNAM8= <"">
##$SUBNAM9= <"">
##$SW= 20.0188882624521
##$SWIBOX= (0..15)
0 0 2 0 0 0 0 0 0 0 0 0 0 0 0 0 
##$SW_h= 4006.41025641026
##$TD= 16384
##$TD0= 1
##$TE= 0
##$TE2= 300
##$TE3= 300
##$TEG= 300
##$TL= (0..7)
0 120 120 120 120 120 120 120 
##$TP= (0..7)
150 150 150 150 150 150 150 150 
##$TP07= 0
##$TPNAME0= <>
##$TPNAME1= <>
##$TPNAME2= <>
##$TPNAME3= <>
##$TPNAME4= <>
##$TPNAME5= <>
##$TPNAME6= <>
##$TPNAME7= <>
##$TPOAL= (0..7)
0.5 0.5 0.5 0.5 0.5 0.5 0.5 0.5 
##$TPOFFS= (0..7)
0 0 0 0 0 0 0 0 
##$TUNHIN= 0
##$TUNHOUT= 0
##$TUNXOUT= 0
##$USERA1= <user>
##$USERA2= <user>
##$USERA3= <user>
##$USERA4= <user>
##$USERA5= <user>
##$V9= 5
##$VALIST= <valist>
##$VCLIST= <CCCCCCCCCCCCCCC>
##$VD= 0
##$VDLIST= <DDDDDDDDDDDDDDD>
##$VPLIST= <PPPPPPPPPPPPPPP>
##$VTLIST= <TTTTTTTTTTTTTTT>
##$WBST= 1024
##$WBSW= 4
##$XGAIN= (0..3)
0 0 0 0 
##$XL= 0
##$YL= 0
##$YMAX_a= 150416
##$YMIN_a= -200956
##$ZGOPTNS= <>
##$ZL1= 120
##$ZL2= 120
##$ZL3= 120
##$ZL4= 120
##$ABSF1= 17.60586
##$ABSF2= -2.413181
##$ABSG= 5
##$ABSL= 3
##$ALPHA= 0
##$AQORDER= 0
##$ASSFAC= 0
##$ASSFACI= 0
##$ASSFACX= 0
##$ASSWID= 0
##$AUNMP= <proc_1d>
##$AZFE= 0.1
##$AZFW= 0.1
##$BCFW= 0
##$BC_mod= 2
##$BYTORDP= 0
##$COROFFS= 0
##$CY= -3
##$DATMOD= 1
##$DC= 0
##$DFILT= <>
##$DTYPP= 0
##$F1P= 0
##$F2P= 0
##$FCOR= 1
##$FTSIZE= 16384
##$FT_mod= 6
##$GAMMA= 0
##$GB= 0
##$INTBC= 1
##$INTSCL= 1.334414e-10
##$ISEN= 128
##$LB= 0.24
##$LEV0= 0
##$LPBIN= 0
##$MAXI= 10000
##$MC2= 0
##$MEAN= 0
##$ME_mod= 0
##$MI= 1.114404
##$NCOEF= 0
##$NC_proc= -7
##$NLEV= 6
##$NOISF1= 3.799351
##$NOISF2= 2.8
##$NSP= 0
##$NTH_PI= 0
##$NZP= 0
##$OFFSET= 17.50566
##$PC= 1
##$PHC0= -13511.07
##$PHC1= 9.800991
##$PH_mod= 1
##$PKNL= yes
##$PPARMOD= 0
##$PSCAL= 0
##$PSIGN= 0
##$REVERSE= no
##$SF= 200.130005797138
##$SI= 16384
##$SIGF1= 3
##$SIGF2= 2
##$SINO= 5.538805
##$SIOLD= 16384
##$SREGLST= <1H.CDCl3>
##$SSB= 0
##$STSI= 16384
##$STSR= 0
##$SW_p= 4006.41025641026
##$SYMM= 0
##$S_DEV= 0
##$TDeff= 16384
##$TDoff= 0
##$TI= <>
##$TILT= no
##$TM1= 0
##$TM2= 0
##$TOPLEV= 0
##$USERP1= <user>
##$USERP2= <user>
##$USERP3= <user>
##$USERP4= <user>
##$USERP5= <user>
##$WDW= 1
##$XDIM= 16384
##$YMAX_p= 498110281
##$YMIN_p= -257934
$$ End of Bruker specific parameters
$$ ---------------------------------
##NTUPLES= NMR SPECTRUM
##VAR_NAME=  FREQUENCY,     SPECTRUM/REAL,   SPECTRUM/IMAG
##SYMBOL=    X,             R,               I
##VAR_TYPE=  INDEPENDENT,   DEPENDENT,       DEPENDENT
##VAR_FORM=  AFFN,          ASDF,            ASDF
##VAR_DIM=   16384,         16384,           16384
##UNITS=     HZ,            ARBITRARY UNITS, ARBITRARY UNITS
##FACTOR=    0.24454680195387, 1,            1
##FIRST=     3503.40765784487, 0,            0
##LAST=      -503.002598565386, 0,           0
##MIN=       -503.002598565386, -257934,     0
##MAX=       3503.40765784487, 498110281,    0
$$ Real data points
##PAGE= N=1
##DATA TABLE= (X++(R..R)), XYDATA
$$ [...]
$$ plain form
8510 11178911 11799782 12422515 13057210 13764720 14478832 15410933 16429958 17648656 19048049
8501 19048049 20672925 22611233 24833522 27510155 30415725 33410254 36529091 40083318
8493 40083318 44297629 48510314 52032318 54009139 55114183 56545066 58422207 59574500
8485 59574500 58854549 55976956 51616078 46922124 42858524 39614780 37248010 35628551
8477 35628551 34121894 32617314 31098693 29983462 29175744 28809369 28778089 29166730 29932119
8468 29932119 31145955 32770561 34853579 37493766 40631804 43947843 47335364 50665796
8460 50665796 53843283 56761554 59504708 62597593 65939259 68441633 69036421 68179521
8452 68179521 66534005 63755796 59382466 53330847 46626622 40673950 35862136 32273169
$$ packed form
8510A1178911O20871O22733O34695P07510P14112R32101J019025J218698J399393
8501A9048049J624876J938308K222289K676633K905570K994529L118837L554227
8493D0083318M214311M212685L522004J976821J105044J430883J877141J152293
8485E9574500p19951k877593m360878m693954m063600l243744k366770j619459
8477C5628551j506657j504580j518621j115231q07718l66375l1280L88641P65389
8468B9932119J213836J624606K083018K640187L138038L316039L387521L330432
8460E0665796L177487K918271K743154L092885L341666K502374N94788q56900
8452F8179521j645516k778209m373330o051619o704225n952672m811814l588967
$$ plain form
8444 32273169 29463727 27324335 25587044 24227303 22796827 21374086 20034235 18899904
8436 18899904 17769241 16886236 16026152 15286852 14609036 13957776 13476441 12997929 12670603
8427 12670603 12345297 12045272 11750176 11501435 11218763 11084749 10935743 10776776 10623015
8418 10623015 10407834 10351308 10306731 10186866 10139063 10065838 10018564 9982262 9894346 9820947 9865361
8407 9865361 9999779 9940482 9919718 10013077 10039183 10184274 10363729 10471475 10613232 10795932
8397 10795932 10936743 11089311 11329445 11578627 11806630 12133062 12552185 12953563 13508339
8388 13508339 14157313 14945952 15821227 16773413 17986835 19345378 20843263 22528346 24278258
8379 24278258 26047823 27934048 29792563 31543950 33000096 34269503 35162296 35863881
$$ packed form
8444C2273169k809442k139392j737291j359741j430476j422741j339851j134331
8436A8899904j130663q83005q60084p39300o77816o51260m81335m78512l27326
8427A2670603l25306l00025k95096k48741k82672j34014j49006j58967j53761
8418A0623015k15181n6526m4577j19865m7803p3225m7274l6302q7916p3399M4414
8407I865361J34418n9297k0764R3359K6106J45091J79455J07746J41757J82700
8397A0795932J40811J52568K40134K49182K28003L26432M19123M01378N54776
8388A3508339O48974P88639Q75275R52186J213422J358543J497885J685083J749912
8379B4278258J769565J886225J858515J751387J456146J269407Q92793P01585
$$ plain form
8371 35863881 36488777 36689916 36268225 35270874 33614225 31724351 29846141 28308602 26988324
8362 26988324 25944178 24976183 24316259 23788013 23352160 23063015 22966776 23130386 23541792
8353 23541792 24225417 25151832 26314730 27662774 29353670 31227821 33087453 34842739
8345 34842739 36546939 38286184 39926120 41583747 43136671 44331767 45131143 45077604 44365888
8336 44365888 42804070 40473017 37631822 34397647 31174852 28253622 25725416 23696965
8328 23696965 22088223 20702397 19513266 18472327 17635827 16887018 16047725 15213628 14603277
8319 14603277 14006095 13422254 13061238 12634556 12265490 11980437 11706493 11484222 11288312
8310 11288312 11054667 10844242 10654496 10550081 10418245 10284595 10120428 10064829 10039426 9960316
$$ packed form
8371C5863881O24896K01139m21691r97351j656649j889874j878210j537539j320278
8362B6988324j044146r67995o59924n28246m35853k89145r6239J63610M11406
8353B3541792O83625R26415J162898J348044J690896J874151J859632J755286
8345C4842739J704200J739245J639936J657627J552924J195096P99376n3539p11716
8336D4365888j561818k331053k841195l234175l222795k921230k528206k028451
8328B3696965j608742j385826j189131j040939q36500p48809q39293q34097o10351
8319A4603277n97182n83841l61016m26682l69066k85053k73944k22271j95910
8310A1288312k33645k10425j89746j04415j31836j33650j64167n5599k5403p9110
$$ plain form
8300 9960316 9845636 9734468 9606523 9506117 9479510 9503069 9479014 9533037 9578297 9580836 9582274
8289 9582274 9618557 9678348 9755315 9750694 9841881 9909126 9938598 10095114 10157477 10163303 10221127 10287509
8277 10287509 10364159 10441023 10565376 10618155 10698289 10840034 10961950 11108427 11239707 11374621
8267 11374621 11605362 11862573 12001215 12173017 12344275 12560054 12690014 12897410 13153341
8258 13153341 13401752 13650589 13894382 14192903 14532879 14732501 15142631 15517743 15858960
8249 15858960 16194844 16615304 17128448 17570440 18081535 18590006 19120060 19677116 20290948
8240 20290948 20876918 21603784 22399352 23206680 24134350 25142709 26332424 27629643 29096197
8231 29096197 30700478 32474375 34501789 36719017 39498370 42645960 46402908 50828286
$$ packed form
8300I960316j14680j11168j27945j00406k6607K3559k4055N4023M5260K539J438
8289I582274L6283N9791P6967m621R1187O7245K9472J56516O2363N826N7824O6382
8277A0287509P6650P6864J24353N2779Q0134J41745J21916J46477J31280J34914
8267A1374621K30741K57211J38642J71802J71258K15779J29960K07396K55931
8258A3153341K48411K48837K43793K98521L39976J99622M10130L75112L41217
8249A5858960L35884M20460N13144M41992N11095N08471N30054N57056O13832
8240B0290948N85970P26866P95568Q07328R27670J008359J189715J297219J466554
8231B9096197J604281J773897K027414K217228K779353L147590L756948M425378
$$ plain form
8223 50828286 55853308 61461237 67059905 71954479 75334222 76880868 77862383 79689570
8215 79689570 82929991 87245354 91226626 92804724 91204858 87400375 82586754 77933955
8207 77933955 74192956 71944576 70912866 70503713 70262348 70003704 69724957 69977932 71214153
8198 71214153 73170976 76140121 80190960 85430974 91876151 99861962 107367914 115681211
8190 115681211 124593564 132406352 139620949 146963825 155178340 163903300 172078011 177854142
8182 177854142 180987498 181771496 180713502 177066693 170326092 159290055 145014126 130383816
8174 130383816 117760429 108003877 100852113 95769722 92399607 89811400 87618222 85431744
8166 85431744 83294378 81785931 80998436 81033816 81926016 83757837 86470265 90254676 95207439
$$ packed form
8223E0828286N025022N607929N598668M894574L379743J546646R81515J827187
8215G9689570L240421M315363L981272J578098j599866l804483m813621m652799
8207G7933955l740999k248380j031710m09153k41365k58644k78747K52975J236221
8198G1214153J956823K969145M050839N240014O445177P985811P505952Q313297
8190A15681211Q912353P812788P214597P342876Q214515Q724960Q174711N776131
8182A77854142L133356P83998j057994l646809o740601j1036037j4275929j4630310
8174A30383816j2623387r756552p151764n082391l370115k588207k193178k186478
8166H5431744k137366j508447p87495L5380Q92200J831821K712428L784411M952763
$$ plain form
8157 95207439 100766760 106425003 111505224 115521740 118675561 121697451 125071333 127599037
8149 127599037 127260297 123522524 118177625 113012791 108910924 105942281 103749446 101863337
8141 101863337 100381977 99114802 97814738 96470143 95720820 95680761 96593113 98667488 101780740
8132 101780740 105901960 110637535 115759146 121534689 128667394 137379143 147667425 158860937
8124 158860937 169768383 179214998 186587292 190343087 188997500 183240684 176236646 170210074
8116 170210074 166164159 163743438 161713335 158691878 154114593 147948612 140523836 132556765
8108 132556765 124624687 117627794 111935737 107556242 104351215 102121311 100620558 99689523
8100 99689523 99656616 100611375 102694163 105767215 109086532 112292031 115675932 119923851 125390069
$$ packed form
8157I5207439N559321N658243N080221M016516L153821L021890L373882K527704
8149A27599037l38740l737773n344899n164834m101867k968643k192835j886109
8141A01863337j481360j267175j300064j344595p49323m0059R12352K074375L113252
8132A01780740M121220M735575N121611N775543P132705Q711749J0288282J1193512
8124A58860937J0907446R446615P372294L755795j345587n756816p004038o026572
8116A70210074m045915k420721k030103l021457m577285o165981p424776p967071
8108A32556765p932078o996893n692057m379495l205027k229904j500753r31035
8100I9689523l2907R54759K082788L073052L319317L205499L383901M247919N466218
$$ plain form
8091 125390069 131588697 137186894 140753821 141968734 141827448 141288667 140807951 140690594 141191039
8082 141191039 141514594 140693168 138042796 133620338 127845879 121346055 115034388 109679056
8074 109679056 104998104 100580953 96378162 92782921 90174383 88630050 88257450 88817146
8066 88817146 90332246 92605543 94859553 96371732 97211207 98374678 100482970 103514183
8058 103514183 106883783 108826000 108272353 106357362 104380505 103107631 102612758 102452801
8050 102452801 102085281 101395535 100648401 99615058 97745811 94823742 91233846 88067653
8042 88067653 85999979 85296013 85474759 85900457 86156737 86603441 87607689 89185844 91512106
8033 91512106 94605689 98495260 102406697 105484163 106973294 106148312 102248616 96234584
$$ packed form
8091A25390069O198628N598197L566927J214913j41286n38781m80716j17357N00445
8082A41191039L23555q21426k650372m422458n774459o499824o311667n355332
8074A09679056m680952m417151m202791l595241k608538j544333l72600N59696
8066H8817146J515100K273297K254010J512179Q39475J163471K108292L031213
8058A03514183L369600J942217n53647j914991j976857j272874m94873j59957
8050A02452801l67520o89746p47134j033343j869247k922069l589896l166193
8042H8067653k067674p03966J78746M25698K56280M46704J004248J578155K326262
8033I1512106L093583L889571L911437L077466J489131q24982l899696o014032
$$ plain form
8025 96234584 89841386 83973016 79219389 75610531 73343114 72394720 72665698 73970225
8017 73970225 76018398 78527955 81612252 85853925 91788886 100029857 111037572 124819086
8009 124819086 131976235 123289856 109831514 98578152 89123308 82580872 78237231 75660290
8001 75660290 73889467 71801969 68716913 64765788 60441216 56526183 53099166 50056373
7993 50056373 47201881 44413845 41613808 39104927 36766281 34666429 32843503 31391948
7985 31391948 30017267 28786776 27752157 26925904 26278032 25763135 25390338 25087974 24864286
7976 24864286 24850311 24740859 24570959 24412337 24278713 24159853 23964333 23489867 23008209 22464144
7966 22464144 21921015 21308677 20796370 20304587 19850457 19499537 19148182 18871377 18586915
$$ packed form
8025I6234584o393198n868370m753627l608858k267417r48394K70978J304527
8017G3970225K048173K509557L084297M241673N934961Q240971J1007715J3781514
8009A24819086P157149q686379j3458342j1253362r454844o542436m343641k576941
8001G5660290j770823k087498l085056l951125m324572l915033l427017l042793
7993E0056373k854492k788036k800037k508881k338646k099852j822926j451555
7985C1391948j374681j230491j034619q26253o47872n14897l72797l02364k23688
7976B4864286j3975j09452j69900j58622j33624j18860j95520m74466m81658n44065
7966B2464144n43129o12338n12307m91783m54130l50920l51355k76805k84462
$$ plain form
7957 18586915 18314445 18191730 18051848 17969870 17947742 17846309 17894538 17953304 18040430 18286378
7947 18286378 18610413 19035337 19735437 20645880 21704351 23049896 24686325 26470057 28149766
7938 28149766 29454630 30512877 31601731 32724006 33407635 33125862 31978965 30633904
7930 30633904 29394277 28113998 26486965 24596328 22888456 21386212 20376779 19559071
7922 19559071 19092476 18848912 18815941 18949978 19187672 19575478 20239819 21127686 22170438
7913 22170438 23521156 25167635 26574374 27861672 29161937 30742043 32693140 34826463
7905 34826463 36733706 37633492 37173478 35252908 32472994 29313246 26470268 24403926
7897 24403926 22763615 21330093 19895502 18493798 17142811 15979567 15009611 14228654
$$ packed form
7957A8586915k72470j22715j39882q1978k2128j01433M8229N8766Q7126K45948
7947A8286378L24035M24924P00100R10443J058471J345545J636429J783732J679709
7938B8149766J304864J058247J088854J122275O83629k81773j146897j345061
7930C0633904j239627j280279j627033j890637j707872j502244j009433q17708
7922A9559071m66595k43564l2971J34037K37694L87806O64341Q87867J042752
7913B2170438J350718J646479J406739J287298J300265J580106J951097K133323
7905C4826463J907243Q99786m60014j920570k779914l159748k842978k066342
7897B4403926j640311j433522j434591j401704j350987j163244r69956p80957
$$ plain form
7889 14228654 13735262 13454325 13280477 13077583 13040348 13142034 13407296 13810388 14348369 14965768
7879 14965768 15598597 16130017 16491255 16732862 17036662 17242632 17097886 16326444 15386797
7870 15386797 14356684 13415943 12414039 11404766 10335011 9419564 8656687 8028537 7516424
7861 7516424 7153179 6752345 6448141 6169272 5969947 5742014 5607585 5477241 5301294 5134875
7851 5134875 5079700 4985955 4848895 4719562 4667068 4540114 4488085 4309882 4173861 4289643
7841 4289643 4127254 4029426 3962154 3956577 3809494 3733248 3592503 3533882 3406490 3335880 3323670
7830 3323670 3269478 3227038 3082788 2997784 3047826 3022666 3017292 3016137 2994194 2931637 2904960 2847998
7818 2847998 2820539 2800217 2750216 2743608 2641437 2679661 2579060 2437181 2362770 2353799 2256962
$$ packed form
7889A4228654m93392k80937j73848k02894l7235J01686K65262M03092N37981O17399
7879A4965768O32829N31420L61238K41607L03800K05970j44746p71442r39647
7870A5386797j030113r40741j001904j009273j069755r15447p62877o28150n12113
7861G516424l63245m00834l04204k78869j99325k27933j34429j30344j75947j66419
7851E134875n5175r3745j37060j29333n2494j26954n2029j78203j36021J15782
7841D289643j62389r7828o7272n577j47083p6246j40745n8621j27392p0610j2210
7830C323670n4192m2440j44250q5004N0042k5160n374j155k1943o2557k6677n6962
7818B847998k7459k0322n0001o608j02171L8224j00601j41879p4411q971r6837
$$ plain form
7807 2256962 2220654 2236269 2149072 2154255 2121032 2090023 2072125 2085610 2047033 2007798 2095834 2139787
7795 2139787 2162881 2186883 2162339 2176099 2239438 2232586 2184290 2134868 2158723 2207788 2185064 2094780
7783 2094780 2129322 2142896 2105804 2060458 2038881 1956435 1860817 1776215 1676661 1664778 1544606
7772 1544606 1514990 1482718 1488669 1425345 1369396 1305226 1357889 1326184 1317161 1424985 1437262 1377397
7760 1377397 1350414 1390293 1316463 1293270 1398518 1457723 1431271 1460324 1511710 1451907 1427072
7749 1427072 1406103 1346133 1315436 1151552 1129191 1186974 1135132 1141381 1186412 1164532 1083181
7738 1083181 1074283 1086317 1081562 1065743 1066160 984525 972288 1062065 1037942 1011764 951394 921222
7726 921222 933090 959398 901700 853081 964457 909053 819348 855887 903368 858017 846683
$$ packed form
7807B256962l6308J5615q7197N183l3223l1009j7898J3485l8577l9235Q8036M3953
7795B139787K3094K4002k4544J3760O3339o852m8296m9422K3855M9065k2724r0284
7783B094780L4542J3574l7092m5346k1577q2446r5618q4602r9554j1883j20172
7772A544606k9616l2272N951o3324n5949o4170N2663l1705r023J07824J2277n9865
7760A377397k6983L9879p3830k3193J05248N9205k6452K9053N1386n9803k4835
7749A427072k0969n9970l0697j63884k2361N7783n1842O249M5031k1880q1351
7738A083181q898J2034m755j5819M17q1635j2237Q9777k4123k6178o0370l0172
7726I21222J1868K6308n7698m8619J11376n5404q9705L6539M7481m5351j1334
$$ plain form
7715 846683 849517 835653 779057 751380 830785 870414 861894 855198 839508 876215 888393 847264
7703 847264 820750 918727 923500 813494 787730 795313 742564 723165 643409 635241 615086 636680
7691 636680 647571 591195 564618 556092 525680 491277 490669 518301 483797 450689 428409 544157
7679 544157 542511 560528 566709 565451 541226 485971 523654 519695 531754 499305 607362 656180
7667 656180 582666 553755 525828 491239 449227 416705 439059 423985 334702 250933 368048
7656 368048 369163 382077 376644 369717 361748 324928 298561 304997 274958 225301 197752 234128 167179
7643 167179 186684 240416 270380 262483 299629 262813 233436 221461 195567 147750 192224 213389
7631 213389 250720 263485 235582 217989 215283 208755 228375 229702 209507 234541 276867 227173
$$ packed form
7715H46683K834j3864n6596k7677P9405L9629q520o696j5690L6707J2178m1129
7703H47264k6514R7977M773j10006k5764P583n2749j9399p9756q168k0155K1594
7691F36680J0891n6376k6577q526l0412l4403o08K7632l4504l3108k2280J15748
7679E44157j646J8017O181j258k4225n5255L7683l959J2059l2449J08057M8818
7667F56180p3514k8911k7927l4589m2012l2522K2354j5074q9283q3769J17115
7656C68048J115J2914n433o927p969l6820k6367O436l0039m9657k7549L6376o6949
7643A67179J9505N3732K9964p897L7146l6816k9377j1975k5894m7817M4474K1165
7631B13389L7331J2765k7903j7593k706o528J9620J327k0195K5034M2326m9694
$$ plain form
7619 227173 206105 211585 220933 248800 255067 281182 239762 265744 278843 244182 206628 210912
7607 210912 253491 257927 297052 299035 249813 234374 242919 287011 277752 162159 195692 278084
7595 278084 236411 227508 216171 284511 296826 281866 306038 296374 325212 365941 357352 361491
7583 361491 401523 496457 528803 542029 708453 813497 761349 688298 616709 557307 483699
7572 483699 465917 367103 390662 349351 289392 236282 255466 237582 226921 252966 301776 303968
7560 303968 235642 264324 190678 159651 80045 119745 227276 178350 193065 216730 203194
7549 203194 228556 306568 217046 227715 295971 344113 298687 223006 291974 312516 302560 229125
7537 229125 238149 204019 183807 148383 137440 118872 81382 126312 169421 183612 188942 204290
$$ packed form
7619B27173k1068N480R348K7867O267K6115m1420K5982J3099l4661l7554M284
7607B10912M2579M436L9125J983m9222j5439Q545M4092r259j15593L3533Q2392
7595B78084m1673q903j1337O8340J2315j4960K4172r664K8838M0729q589M139
7583C61491M0032R4934L2346J3226J66424J05044n2148p3051p1589n9402p3608
7572D83699j7782r8814K3559m1311n9959n3110J9184j7884j0661K6045M8810K192
7560C03968o8326K8682p3646l1027p9606L9700J07531m8926J4715K3665j3536
7549B03194K5362P8012q9522J0669O8256M8142m5426p5681O8968K0542r956p3435
7537B29125R024l4130k0212l5424j0943j8568l7490M4930M3109J4191N330J5348
$$ plain form
7525 204290 184449 125156 117287 173336 166981 113109 109861 181068 153369 129401 119379 108331
7513 108331 93365 62261 143739 212902 170746 165679 146975 118497 58775 73553 98929 95519
7501 95519 133587 125244 163306 120750 109734 153724 153151 164328 124391 142767 148966 75890 162556
7488 162556 191897 206196 223263 94851 130989 141145 158377 207413 220690 267562 303051
7477 303051 339307 289178 410941 530602 480082 567470 617458 780809 859141 807846 786129
7466 786129 720930 656932 593673 511687 533182 491561 405009 243396 233300 247098 200109
7455 200109 219554 196540 201817 166204 212145 164302 131053 173982 140746 106261 184085 137191
7443 137191 81638 -900 4478 37110 83687 91438 105992 76992 29665 29860 56202 60422 50934
$$ packed form
7525B04290j9841n9293p869N6049o355n3872l248P1207k7699k3968j0022j1048
7513A08331j4966l1104Q1478O9163m2156n067j8704k8478n9722J4778K5376l410
7501I5519L8068q343L8062m2556j1016M3990n73J1177l9937J8376O199p3076Q6666
7488A62556K9341J4299J7067j28412L6138J0156J7232M9036J3277M6872L5489
7477C03051L6256n0129J21763J19661n0520Q7388M9988J63351P8332n1295k1717
7466G86129o5199o3998o3259q1986K1495m1621q6552j61613j0096J3798m6989
7455B00109J9445k3014N277l5613M5941m7843l3249M2929l3236l4485P7824m6894
7443A37191n5553q2538N378L2632M6577P751J4554k9000m7327J95K6342M220r488
$$ plain form
7430 50934 -813 11988 19399 67629 98030 4780 -20432 11235 41238 108221 62367 -20450
7418 -20450 11145 7405 -61641 -7567 50330 -69052 -20419 -38948 -63075 -46483 -50781 -86088
7406 -86088 -10614 -9608 -59711 -29258 -5592 -28823 -2988 -31830 -71599 -75535 -4717 39184
7394 39184 25733 -8846 26309 -40028 47306 58631 35713 134965 81191 55762 41678 32661
7382 32661 -23282 -14250 1317 39499 1444 30003 -12354 69711 76920 82944 44934 -42994
7370 -42994 27108 -9805 -14807 27904 39223 67331 98186 -12739 -76514 1239 -43647 30943
7358 30943 -15860 -26299 -37672 11204 30429 27393 40366 102153 101208 128319 121426 108344 -5054
7345 -5054 -34808 56875 18630 27101 16870 27615 29491 106727 87370 112041 128991 111688
$$ packed form
7430E0934n1747J2801P411M8230L0401r3250k5212L1667L0003O6983m5854q2817
7418b0450L1595l740o9046N4074N7897j19382M8633j8529k4127J6592m298l5307
7406h6088P5474J006n0103L0453K3666k3231K5835k8842l9769l936P0818M3901
7394C9184j3451l4579L5155o6337Q7334J1325k2918R9252n3774k5429j4084r017
7382C2661n5943R032J5567L8182l8055K8559m2357Q2065P209O024l8010q7928
7370d2994P0102l6913n002M2711J1319K8108L0855j10925o3775P7753m4886P4590
7358C0943m6803j0439j1373M8876J9225l036J2973O1787r45K7111o893j3082j13398
7345e054k9754R1683l8245Q471j0231J0745J876P7236j9357K4671J6950j7303
$$ plain form
7333 111688 76679 57483 64245 181366 272670 209863 197787 180234 154230 76318 146378 200353
7321 200353 152196 179850 189871 221559 171184 88033 187257 206163 163829 187539 137557 157141
7309 157141 179618 136296 104067 106593 204644 186515 216425 304011 304037 240523 158740 216981
7297 216981 305967 268165 243590 275489 215054 310904 246762 309853 318874 401105 400442 400539 422312
7284 422312 530560 427730 384782 477093 512166 398933 410672 401256 367751 397786 426510
7273 426510 438003 366764 385463 322001 454572 525723 495483 477257 489108 493805 557363 516313
7261 516313 630199 654849 685264 747894 755019 714919 785021 813549 758552 775849 746805 784408
7249 784408 783304 858245 823028 861184 806535 737989 801232 794998 805954 852216 821136 801363
$$ packed form
7333A11688l5009j9196O762J17121R1304o2807j2076j7553k6004p7912P0060N3975
7321B00353m8157K7654J0021L1688n0375q3151R9224J8906m2334K3710m9982J9584
7309A57141K2477m3322l2229K526R8051j8129K9910Q7586K6o3514q1783N8241
7297B16981Q8986l7802k4575L1899o0435R5850o4142O3091R021Q2231o63R7K1773
7284D22312J08248j02830m2948R2311L5073j13233J1739r416l3505L0035K8724
7273D26510J1493p1239J8699o3462J32571P1151l0240j8226J1851M697O3558m1050
7261E16313J13886K4650L0415O2630P125m0100P0102K8528n4997J7297k9044L7603
7249G84408j104P4941l5217L8156n4649o8546O3243o234J0956M6262l1080j9773
$$ plain form
7237 801363 797961 812593 833812 895147 918704 955848 993320 925857 932884 989957 1092559 1108555
7225 1108555 986178 1025370 1035946 988519 1044895 1048500 1072629 1073877 1018689 1070419 1064264 1040507
7213 1040507 1045600 1089475 1060464 1042689 1172967 1138172 1127923 1197805 1211971 1219996 1337129
7202 1337129 1365512 1358518 1388043 1378953 1379868 1382545 1378663 1397238 1365195 1438018 1476605 1466465 1464433
7189 1464433 1621365 1655092 1595192 1682076 1760838 1784995 1839471 1919780 1976681 1982581 2018773
7178 2018773 2008604 2073486 2085726 2150585 2245649 2357467 2371727 2485491 2607549 2621683 2683031
7167 2683031 2765795 2865512 2920923 3080588 3225274 3303656 3324479 3395124 3482293 3558072 3687583
7156 3687583 3746281 3819642 3979420 4149500 4311504 4544558 4691772 4937046 5175339 5299994
$$ packed form
7237H01363l402J4632K1219O1335K3557L7144L7472o7463P027N7073J02602J5996
7225A108555j22377L9192J0576m7427N6376L605K4129J248n5188N1730o155k3757
7213A040507N093M3875k9011j7775J30278l4795j0249O9882J4166Q025J17133
7202A337129K8383o994K9525r090R15K677l882J8575l2043P2823L8587j0140k032
7189A464433J56932L3727n9900Q6884P8762K4157N4476Q0309N6901N900L6192
7178B018773j0169O4882J2240O4859R5064J11818J4260J13764J22058J4134O1348
7167B683031Q2764R9717N5411J59665J44686P8382K0823P0645Q7169P5779J29511
7156C687583N8698P3361J59778J70080J62004K33054J47214K45274K38293J24655
$$ plain form
7146 5299994 5449358 5623659 5866180 6136376 6244178 6467208 6692040 6869989 7057239 7284588
7136 7284588 7473826 7692216 8035631 8414198 8810591 9298606 9766330 10179255 10681082 11162012
7126 11162012 11771089 12348816 12932095 13516044 14222511 14935644 15739951 16533829 17475947
7117 17475947 18553167 19780467 21391044 23222469 25290735 27836898 30861327 34457620
7109 34457620 38727793 43646288 49544877 56279527 64203130 73620817 84974698 99072814
7101 99072814 115889211 134462648 151084910 160781028 159375611 146985775 127097976
7094 127097976 105468252 86393214 71260743 59939739 51593489 45138064 40101320
7087 40101320 36048246 32474350 29416254 26854963 24673617 22793292 21194989 19789585
$$ packed form
7146E299994J49364J74301K42521K70196J07802K23030K24832J77949J87250K27349
7136G284588J89238K18390L43415L78567L96393M88015M67724M12925N01827M80930
7126A1162012O09077N77727N83279N83949P06467P13133Q04307P93878R42118
7117A7475947J077220J227300J610577J831425K068266K546163L024429L596293
7109C4457620M270173M918495N898589O734650P923603R417687J1353881J4098116
7101I9072814J6816397J8573437J6622262R696118j405417j2389836j9887799
7094A27097976k1629724j9075038j5132471j1321004q346250o455425n036744
7087D0101320m053074l573896l058096k561291k181346j880325j598303j405404
$$ plain form
7079 19789585 18539496 17351642 16355399 15511481 14661945 13832810 13220819 12577869 12002269
7070 12002269 11553308 11094178 10726890 10337499 9949180 9555448 9168667 8897597 8576602
7061 8576602 8210630 7965833 7730343 7444238 7096653 6775452 6525244 6297169 6082245 5886471
7051 5886471 5679271 5519429 5325120 5112529 4985422 4815032 4666477 4522818 4417972 4388236
7041 4388236 4305969 4195639 4137399 4041217 3872069 3703865 3475991 3326450 3257149 3259391 3230553
7030 3230553 3162380 3151868 3034823 2964297 2907544 2781331 2734484 2667407 2555557 2546297 2515322
7019 2515322 2506855 2330239 2245630 2128726 2138921 2037735 1891513 1865778 1839771 1823176 1762662
7008 1762662 1765020 1793499 1786338 1768297 1669173 1537970 1473634 1445695 1477197 1446067 1355640 1331603
$$ packed form
7079A9789585j250089j187854r96243q43918q49536q29135o11991o42950n75600
7070A2002269m48961m59130l67288l89391l88319l93732l86781k71070l20995
7061H576602l65972k44797k35490k86105l47585l21201k50208k28075k14924j95774
7051E886471k07200j59842j94309k12591j27107j70390j48555j43659j04846k9736
7041D388236q2267j10330n8240r6182j69148j68204k27874j49541o9301K242k8838
7030C230553o8173j0512j17045p0526n6753j26213m6847o7077j11850r260l0975
7019B515322q467j76616q4609j16904J0195j01186j46222k5735k6007j6595o0514
7008A762662K358K8479p161j8041r9124j31203o4336k7939L1502l1130r0427k4037
$$ plain form
6996 1331603 1300488 1229374 1235022 1258111 1285729 1308825 1187078 1115060 1154978 1107822 1154769
6985 1154769 1193632 1125179 1110890 1031824 1001989 971662 984486 890388 903873 795375 752715
6974 752715 740078 705347 722162 662918 695374 605401 565536 548658 546411 540537 551012 536364
6962 536364 478468 420131 437965 409983 424700 402528 395734 494819 435289 413444 363618 384152
6950 384152 358403 287527 257138 238870 291510 241655 269567 231655 208778 132889 140024 113273
6938 113273 81223 101082 223311 279242 247546 184584 145489 130705 128595 101900 88536 132441
6926 132441 145852 186470 295174 316772 263998 142964 166041 176266 201766 239407 133761
6915 133761 107621 157737 260373 262936 168105 110132 129139 54642 54491 139492 163117 122394
$$ packed form
6996A331603l1115p1114N648K3089K7618K3096j21747p2018L9918m7156M6947
6985A154769L8863o8453j4289p9066k9835l0327J2824r4098J3485j08498m2660
6974G52715j2637l4731J6815n9244L2456q9973l9865j6878k247n874J0475j4648
6962E36364n7896n8337J7834k7982J4717k2172o794R9085n9530k1845m9826K0534
6950C84152k5749p0876l0389j8268N2640m9855K7912l7912k2877p5889P135k6751
6938A13273l2050J9859J22229N5931l1696o2962l9095j4784k110k6695j3364M3905
6926A32441J3411M0618J08704K1598n2774j21034K3077J0225K5500L7641j05646
6915A33761k6140N0116J02636K563r4831n7973J9007p4497j51Q5001K3625m0723
$$ plain form
6903 122394 217433 193857 143137 138954 125756 92995 26028 30495 -19373 19499 65462 45095
6891 45095 19647 -8695 -30126 -24686 -1131 693 -9915 -6867 -12801 -111329 -32598 -11962 -62870
6878 -62870 -42476 -21997 -18931 35281 74214 106398 52313 -6587 -74721 -45587 4523 -78362
6866 -78362 -128479 -126593 -83258 -57812 56450 -1974 -79455 -77108 -80775 -51775 67 -13679
6854 -13679 19768 20256 29286 -23206 -32651 25184 -23860 48298 -47813 -89899 -51990 -74723 -64281
6841 -64281 -49052 -66389 -48828 -35228 -54734 -26007 -67262 24715 -3210 -31541 -58832 -21140
6829 -21140 -12934 66779 73403 27722 61591 46963 -25591 -16062 17951 -94317 -100858 -151970
6817 -151970 -120419 -82515 -17877 -39078 -78576 -72381 -59934 -116652 -92208 -99666 -53801 3036
$$ packed form
6903A22394R5039k3576n0720m183j3198l2761o6967M467m9868L8872M5963k0367
6891D5095k5448k8342k1431N440K3555J824j0608L048n934r8528P8731K0636n0908
6878f2870K0394K0479L066N4212L8933L2184n4085n8900o8134K9134N0110q2885
6866g8362n0117J886M3335K5446J14262n8424p7481K347l667K9000N1842j3746
6854a3679L3447M88R030n2492r445N7835m9044P2158r6111m2086L7909k2733J0442
6841f4281J5229j7337J7561J3600j9506K8727m1255R1977k7925k8331k7291L7692
6829b1140Q206P9713O624m5681L3869j4628p2554R529L4013j12268o541n1112
6817a51970L1551L7904O4638k1201l9498O195J2447n6718K4444p458M5865N6837
$$ plain form
6805 3036 13589 8062 33005 17608 -21160 -37465 -29190 -58527 -39030 19113 -81295 -99039
6793 -99039 -88427 32763 -30792 -117997 -118755 -114353 -100821 -76321 -71522 -103727 -88654 -118452
6781 -118452 -42359 -39364 -49932 -93911 -108399 -70882 -40787 -80683 -130853 -74239 -66697 -7818
6769 -7818 -58515 -134178 -148455 -123919 -177647 -150301 -78281 51449 -47603 -82360 -37023 -95872
6757 -95872 -106109 -115384 -142775 -120706 -78432 -140003 -156829 -133937 -31959 11911 -58251 -67908
6745 -67908 -62222 -86333 -119221 -55950 7367 -40076 23260 60777 -14848 -19001 110758 212980
6733 212980 234449 226261 355585 364770 402390 484759 578069 666448 705184 749792 727446 612180
6721 612180 521068 420164 351186 244126 177294 147086 54324 140846 126331 66703 46100
$$ packed form
6805C036J0553n527K4943j5397l8768j6305Q275k9337J9497N8143j00408j7744
6793i9039J0612J21190o3555q7205p58M402J3532K4500M799l2205J5073k9798
6781a18452P6093K995j0568m3979j4488L7517L0095l9896n0170N6614P542N8879
6769g818n0697p5663j4277K4536n3728K7346P2020J29730r9052l4757M5337n8849
6757i5872j0237r275k7391K2069M2274o1571j6826K2892J01978M3870p0162r657
6745f7908N686k4111l2888O3271O3317m7443O3336L7517p5625m153J29759J02222
6733B12980K1469q188J29324R185L7620Q2369R3310Q8379L8736M4608k2346j15266
6721F12180r1112j00904o8978j07060o6832l0208r2762Q6522j4515n9628k0603
$$ plain form
6710 46100 24425 -9541 -19006 -11616 -48645 -7475 49578 38048 -16242 -57135 1852 -88098
6698 -88098 -113604 -61043 -29495 -20130 -20264 -33135 -56345 -34762 -38977 1302 -55725 -68394 -80638
6685 -80638 -42046 -48972 -30281 -137824 -166086 -124132 -143557 -26442 -123209 -164604 -67197 -98287
6673 -98287 -107705 -149016 -160985 -101873 -92477 -93609 -117505 -203094 -106153 -67929 -156434 -135033
6661 -135033 -44950 -36692 -19621 -69380 -98093 -101607 -146260 -164669 -144418 -88349 -145278 -83549
6649 -83549 -111487 -126907 -119269 -95086 -93052 -107368 -112937 -125744 -75924 -147519 -130148 -90573
6637 -90573 7620 69522 -361 -1960 -72420 -117830 -86067 -10909 -36504 -72498 -151682 -74180
6625 -74180 -640 -22815 -70509 -49480 -131296 -211598 -135304 -93360 -95964 -125246 -111428 -66494
$$ packed form
6710D6100k1675l3966r465P390l7029M1170N7053j1530n4290m0893N8987q9950
6698h8098k5506N2561L1548R365j34j2871k3210K1583m215M0279n7027j2669j2244
6685h0638L8592o926J8691j07543k8262M1954j9425J17115r6767m1395R7407l1090
6673i8287r418m1311j1969N9112R396j132k3896q5589R6941L8224q8505K1401
6661a35033R0083Q258J7071m9759k8713l514m4653j8409K0251N6069n6929O1729
6649h3549k7938j5420P638K4183K034j4316n569j2807M9820p1595J7371L9575
6637i0573R8193O1902o9883j599p0460m5410L1763P5158k5595l5994p9184P7502
6625g4180P3540k2175m7694K1029q1816q0302P6294M1944k604k9282J3818M4934
$$ plain form
6613 -66494 -84825 -36785 -45691 -107057 -33677 -77548 -65240 -102742 -48935 29075 9575 20975
6601 20975 -1567 -70089 -9287 46087 -25702 -40101 -34948 -45445 -69761 -74560 -18306 -40396
6589 -40396 -26365 38516 9913 -13219 21586 30003 6689 61546 119258 144129 138740 190479
6577 190479 204876 321500 367544 495188 591369 528349 581109 677658 792741 963608 1072595
6566 1072595 1238053 1367967 1518474 1632213 1694439 1794527 1729863 1702871 1601421 1497274
6556 1497274 1317449 1203513 1045532 903750 807455 645603 578450 506199 398567 337337
6546 337337 281769 206207 194862 290455 248577 165043 177041 229653 156229 118612 145681 68239
6534 68239 44844 -7040 -21981 -36799 2976 -48211 -6522 19718 -9820 -11926 397 38732
$$ packed form
6613f6494j8331M8040q906o1366P3380m3871J2308l7502N3807P8010j9500J1400
6601B0975k2542o8522O0802N5374p1789j4399N153j0497k4316m799N6254k2090
6589d0396J4031O4881k8603k3132L4805Q417k3314N4857N7712K4871n389N1739
6577A90479J4397J16624M6044J27644R6181o3020N2760R6549J15083J70867J08987
6566A072595J65458J29914J50507J13739O2226J00088o4664k6992j01450j04147
6556A497274j79825j13936j57981j41782r6295j61852o7153p2251j07632o1230
6546C37337n5568p5562j1345R5593m1878q3534J1998N2612p3424l7617K7069p7442
6534F8239k3395n1884j4941j4818L9775n1187M1689K6240k9538k106J2323L8335
$$ plain form
6522 38732 12587 72060 9515 29538 21021 -27725 -84826 -57085 -42090 -92344 -117729 -113445
6510 -113445 -82105 -46674 -93013 -44012 -94995 -78187 -11318 -90370 -103886 -143249 -164391 -148293
6498 -148293 -102846 -106127 -52811 -19649 41156 -64274 -44428 -54485 -32765 -41938 -97398 -35184
6486 -35184 -39703 -98573 -86039 -90642 -102020 -106672 -65996 -16656 -74172 -113816 -96710 -123264
6474 -123264 -115410 -62985 -83258 -59154 -64048 -54158 -51833 -90819 -92302 -97122 -111342 -94171 -257934
6461 -257934 -188520 -45545 -48771 -91111 -130068 -160359 -120261 -176211 -186165 -117649 -169774 -158141
6449 -158141 -175911 -111650 -120463 -103233 -127713 -137389 -118764 -133136 -196145 -218156 -142033 -121347
6437 -121347 -48709 -81824 -158429 -130336 -54159 -64375 -81227 -106669 -70037 -100089 -118719 -173706
$$ packed form
6522C8732k6145N9473o2545K0023q517m8746n7101K7741J4995n0254k5385M284
6510a13445L1340L5431m6339M9001n0983J6808O6869p9052j3516l9363k1142J6098
6498a48293M5447l281N3316L3162O0805j05430J9846j0057K1720r173n5460O2214
6486c5184m519n8870J2534m603j1378m652M0676M9340n7516l9644J7106k6554
6474a23264P854N2425k0273K4104m894R890K325l8986j483m820j4220J7171j63763
6461b57934O9414J42975l226m2340l8957l0291M0098n5950r954O8516n2125J1633
6449a58141j7770O4261q813J7230k4480r676J8625j4372o3009k2011P6123K0686
6437a21347P2638l3115p6605K8093P6177j0216j6852k5442L6632l0052j8630n4987
$$ plain form
6425 -173706 -186020 -87415 -84020 -63758 -42631 -118357 -75252 -19666 -113455 -38799 20715 50206
6413 50206 42615 -57141 -117686 -132785 -40450 -17686 -68468 -21802 13111 -68739 -82876 -64389
6401 -64389 -102774 -88134 -18094 -39374 -3193 -17977 -104941 -102908 -50858 -71317 -71817 -5076
6389 -5076 -43849 -72622 -81312 -94638 -138132 -105725 -50599 -75157 -56327 -61634 -73893 -3600
6377 -3600 -68067 -44858 -70167 -94322 -26125 -32479 -72339 -58809 -48251 -64296 -55115 -44983
6365 -44983 -28540 12755 -33975 -62638 6651 21367 18814 12541 10476 56263 26594 61815
6353 61815 57113 -32763 3273 17328 55392 32985 -45492 -24800 5760 8661 -8681 -8364 -6824
6340 -6824 -39936 -66842 -45055 -44809 -20445 -106752 -8349 94618 32292 103839 47838 -37789
$$ packed form
6425a73706j2314R8605L395K0262K1127p5726M3105N5586r3789P4656N9514K9491
6413E0206p591r9756o0545j5099R2335K2764n0782M6666L4913q1850j4137J8487
6401f4389l8385J4640P0040k1280L6181j4784q6964K033N2050k0459n00O6741
6389e076l8773k8773q690j3326m3494L2407N5126k4558J8830n307j2259P0293
6377c600o4467K3209k5309k4155O8197o354l9860J3530J0558j6045R181J0132
6365d4983J6443M1295m6730k8663O9289J4716k553o273k065M5787k9669L5221
6353F1815m702q9876L6036J4055L8064k2407p8477K0692L0560K901j7342L17J540
6340f824l3112k6906K1787K46K4364q6307R8403J02967o2326P1547n6001q5627
$$ plain form
6328 -37789 -5809 27607 65058 32403 29064 24637 24047 -8111 44968 49474 56605 47211 54650
6315 54650 140437 136565 200703 195242 123673 204502 148244 173719 185039 114585 167594 178532
6303 178532 172867 225473 291986 280587 281442 317097 364288 376082 461550 400189 437489 470748
6291 470748 577699 540765 588110 565340 661701 641539 667607 711806 777216 833646 929763
6280 929763 1049541 1131074 1202248 1318073 1515236 1649726 1783688 1964646 2190225 2400123
6270 2400123 2677306 2971983 3304921 3709764 4188004 4600543 5033493 5428377 5678015 5809211
6260 5809211 5870392 5675127 5376305 4906047 4419724 3876156 3451680 3083831 2703317 2419482
6250 2419482 2186878 1928373 1821072 1569213 1466040 1384547 1314810 1233190 1206010 1111109
$$ packed form
6328c7789L1980L3416L7451l2655l339m427n90l2158N3079M506P131r394P439
6315E4650Q5787l872O4138n461p1569Q0829n6258K5475J1320p0454N3009J0938
6303A78532n665N2606O6513j1399Q55L5655M7191J1794Q5468o1361L7300L3259
6291D70748J06951l6934M7345k2770R6361k0162K6068M4199O5410N6430R6117
6280I29763J19778Q1533P1174J15825J97163J34490J33962J80958K25579K09898
6270B400123K77183K94677L32938M04843M78240M12539M32950L94884K49638J31196
6260E809211O1181j95265k98822m70258m86323n43568m24476l67849l80514k83835
6250B419482k32604k58505j07301k51859j03173q1493o9737q1620k7180r4901
$$ plain form
6240 1111109 996983 928180 853417 839629 772333 718520 617724 613610 600198 515068 562991
6229 562991 546178 556101 472310 323711 335972 308122 292064 305047 322874 286448 224407 219560
6217 219560 130740 143229 208439 180316 172524 132541 227308 182686 183873 143383 146518 138127
6205 138127 180022 146280 202348 211364 161934 185016 105499 95084 66110 71706 130136 67963
6193 67963 21880 50273 73656 51308 94403 110033 121007 57057 125345 117023 78270 92950
6181 92950 25434 -46598 -46990 24015 20947 35333 97556 27630 -1291 -10462 -45463 10331 -24536
6168 -24536 -50061 -18581 10933 -39124 -28190 -63136 -96896 -57358 4167 -48337 4897 -64790
6156 -64790 -41001 -28303 88138 33718 -51876 6997 -15742 -71015 -75070 20272 -12775 31656
$$ packed form
6240A111109j14126o8803p4763j3788o7296n3813j00796m114j3412q5130M7923
6229E62991j6813R923q3791j48599J2261k7850j6058J2983J7827l6426o2041m847
6217B19560q8820J2489O5210k8123p792l9983R4767m4622J187m0490L135q391
6205A38127M1895l3742N6068R016m9430K3082p9517j0415k8974N596N8430o2173
6193F7963m6083K8393K3383k2348M3095J5630J0974o3950O8288q322l8753J4680
6181I2950o7516p2032l92P1005l068J4386O2223o9926k8921r171l5001N5794l4867
6168b4536k5525L1480K9514n0057J0934l4946l3760L9538O1525n2504N3234o9687
6156f4790K3789J2698J16441n4420q5594N8873k2739n5273m055R5342l3047M4431
$$ plain form
6144 31656 45403 -7992 -79313 -106001 -108665 16927 129349 56032 102214 40526 -31344 19223
6132 19223 -3471 -29601 -8736 -12962 -108900 -3552 3858 58170 75712 44820 -43062 -23323
6120 -23323 6599 -67805 -93787 -63950 -22911 -23595 -37781 -23584 -531 -55235 -42154 -15137
6108 -15137 -3784 -98501 -64966 -57961 -17719 -17116 -69180 -111001 -62203 -75557 -45288 -69915
6096 -69915 -85640 -38277 14721 44487 10830 2020 15271 16362 36605 57621 15158 -29489
6084 -29489 -58080 -98946 -109553 -59427 -84304 -121912 -98691 13278 -48217 10551 61934 -832
6072 -832 -6162 -55579 -62966 -8774 -5564 -77374 -15117 3981 -52111 -38396 -22622 -55076 -61035
6059 -61035 -66632 -103413 -40597 -55567 -101168 -111501 -43963 7215 13938 67767 34532 -1968
$$ packed form
6144C1656J3747n3395p1321k6688k664J25592J12422p3317M6182o1688p1870N0567
6132A9223k2694k6130K0865m226r5938J05348P410N4312J7542l0892q7882J9739
6120b3323K9922p4404k5982K9837M1039o84j4186J4197K3053n4704J3081K7017
6108a5137J1353r4717L3535P005M0242O03n2064m1821M8798j3354L0269k4627
6096f9915j5725M7363N2998K9766l3657q810J3251J091K0243K1016m2463m4647
6084b9489k8591m0866j0607N0126k4877l7608K3221J11969o1495N8768N1383o2766
6072h32n330m9417p387N4192L210p1810O2257J9098n6092J3715J5774l2454n959
6059f1035n597l6781O2816j4970m5601j0333O7538N1178O723N3829l3235l6500
$$ plain form
6047 -1968 -38517 -15854 -27337 -49490 2778 27064 56761 -29464 431 -18458 -22770 24105
6035 24105 33897 41239 5462 -19429 38188 71488 6211 -9030 29551 89252 146125 183418
6023 183418 155816 124199 187980 230663 149224 119614 213832 204702 244481 345463 414149 399420
6011 399420 404548 488262 499054 350519 250596 191225 212976 222448 120128 69947 84704 96266
5999 96266 180752 143664 168963 148536 192272 131388 115699 142412 -1388 44934 79778 104320
5987 104320 57955 119232 157478 161632 84965 61010 38453 60564 102604 143928 152101 192539
5975 192539 118433 127275 225732 204171 227381 215726 126985 98812 86950 138094 185895 176158
5963 176158 85627 123894 141867 179911 196084 125318 118014 160336 98124 81104 122778 170502
$$ packed form
6047a968l6549K2663j1483k2153N2268K4286K9697q6225K9895j8889m312M6875
6035B4105R792P342l5777k4891N7617L3300o5277j5241L8581N9701N6873L7293
6023A83418k7602l1617O3781M2683q1439k9610R4218r130L9779J00982O8686j4729
6011C99420N128Q3714J0792j48535r9923n9371K1751R472j02320n0181J4757J1562
5999I6266Q4486l7088K5299k0427M3736o0884j5689K6713j43800M6322L4844K4542
5987A04320m6365O1277L8246M154p6667k3955k2557K2111M2040M1324Q173M0438
5975A92539p4106Q842R8457k1561K3210j1655q8741k8173j1862N1144M7801r737
5963A76158r0531L8267J7973L8044J6173p0766p304M2322o2212j7020M1674M7724
$$ plain form
5951 170502 104738 118934 167306 131626 128938 90080 178197 127249 146873 207599 227739 263937
5939 263937 270167 271674 222273 155816 234688 240946 120484 199230 195037 148931 163263 206951
5927 206951 188879 221547 310252 306686 287976 232551 276121 277193 336289 337972 332074 325581 337195
5914 337195 323417 297162 283729 327210 393542 423106 342191 315704 349206 388056 356748 335695
5902 335695 334216 368609 415738 379647 452972 427750 380739 355330 386907 438880 396619 351051
5890 351051 324302 350998 310671 446098 349775 349905 377446 405760 503458 525738 489538 437534
5878 437534 457774 434636 442538 444331 486875 458657 506495 519780 516074 572965 612253 612105 648596
5865 648596 593464 598439 590188 652985 606004 574780 659577 667182 680953 659413 691310 745550
$$ packed form
5951A70502o5764J4196M8372l5680k688l8858Q8117n0948J9624O0726K0140L6198
5939B63937O230J507m9401o6457P8872O258j20462P8746m193m6106J4332M3688
5927B06951j8072L2668Q8705l566j8710n5425M3570J072N9096J683n898o493J1614
5914C37195j3778k6255j3433M3481O6332K9564q0915k6487L3502L8850l1308k1053
5902C35695j479L4393M7129l6091P3325k5222m7011k5409L1577N1973m2261m5568
5890C51051k6749K6696m0327J35427r6323J30K7541K8314R7698K2280l6200n2004
5878D37534K0240k3138P902J793M2544k8218M7838J3285l706N6891L9288j48L6491
5865F48596n5132M975q251O2797m6981l1224Q4797P605J3771k1540L1897N4240
$$ plain form
5853 745550 663198 654703 738746 756307 759754 847043 810285 826674 822292 823359 880525 865619
5841 865619 866312 900192 874860 908690 900987 909306 903126 939371 955329 917046 948689 968881 975516
5828 975516 928712 949409 1011474 936423 914065 929405 992413 1019763 974211 1053428 1060359 1050439
5816 1050439 1095291 1231290 1335260 1300783 1264674 1405543 1460539 1603354 1694308 1733340 1807261
5805 1807261 1828856 1895746 2076285 2192630 2362763 2581220 2801799 3071216 3092760 2931263
5795 2931263 2737835 2544318 2333672 2208935 2169632 1991633 1908639 1929650 1958971 1905177
5785 1905177 1920414 1981278 2082572 2064084 2144922 2218426 2156303 2195513 2284060 2318335 2409630
5774 2409630 2489480 2499268 2575905 2651751 2706690 2759459 2749276 2733527 2820960 2910279 3039321
$$ packed form
5853G45550q2352q495Q4043J7561L447Q7289l6758J6389m382J067N7166j4906
5841H65619O93L3880k5332L3830p703Q319o180L6245J5958l8283L1643K0192O635
5828I75516m6804K0697O2065p5051k2358J5340O3008K7350m5552P9217O931r920
5816A050439M4852J35999J03970l4477l6109J40869N4996J42815R0954L9032P3921
5805A807261K1595O6890J80539J16345J70133K18457K20579K69417K1544j61497
5795B931263j93428j93517k10646j24737l9303j77999q2994K1011K9321n3794
5785A905177J5237O0864J01294j8488Q0838P3504o2123L9210Q8547L4275R1295
5774B409630P9850R788P6637P5846N4939N2769j0183j5749Q7433Q9319J29042
$$ plain form
5763 3039321 3233481 3314278 3426607 3629139 3686550 3746809 3890823 4056928 4199860 4356341
5753 4356341 4465394 4557840 4698129 4873762 4943527 5068134 5279302 5505631 5663023 5929214
5743 5929214 6211561 6421537 6635515 6978770 7233355 7528874 7846884 8154478 8586909 8988288
5733 8988288 9378953 9877547 10417106 10884890 11388511 12094424 12774431 13545590 14494526 15484663
5723 15484663 16685639 18087317 19572664 21480144 23767234 26299501 29293887 32842867
5715 32842867 36929879 41653458 47002460 53225954 60456285 68586283 77539640 86238824
5707 86238824 91519443 90115555 82590051 72631383 62563274 53455687 45875001 39660675
5699 39660675 34734603 30816227 27518258 24782459 22579387 20641777 19051552 17648323
$$ packed form
5763C039321J94160Q0797J12329K02532N7411O0259J44014J66105J42932J56481
5753D356341J09053R2446J40289J75633O9765J24607K11168K26329J57392K66191
5743E929214K82347K09976K13978L43255K54585K95519L18010L07594M32431M01379
5733H988288L90665M98594N39559M67784N03621P05913O80007P71159R48936R90137
5723A5484663J200976J401678J485347J907480K287090K532267K994386L548980
5715C2842867M087012M723579N349002O223494P230331Q129998Q953357Q699184
5707H6238824N280619j403888p525504r958668j0068109r107587p580686o214326
5699C9660675m926072l918376l297969k735799k203072j937610j590225j403229
$$ plain form
5691 17648323 16535046 15432505 14515540 13744243 12950646 12229360 11593112 11053409 10613692
5682 10613692 10137096 9699927 9305972 9018276 8740507 8443991 8183310 7964068 7771397
5673 7771397 7531048 7309104 7144610 6968610 6769814 6690793 6578784 6419549 6360029 6346433
5663 6346433 6328890 6257391 6262257 6433359 6573468 6700329 6896603 6907537 6765841 6451300
5653 6451300 6139270 5898944 5645927 5417966 5251837 5124019 5134685 5025991 4824257 4791101
5643 4791101 4700483 4680786 4597543 4539152 4551890 4576672 4540180 4461826 4348750 4306116 4219717
5632 4219717 4223493 4262306 4225642 4276435 4173655 4074607 4027394 4035818 3992230 3961988 3944048 3951955
5620 3951955 3929289 3925977 3961920 3956401 4023682 4182530 4244085 4259467 4261157 4292320 4323042 4324569
$$ packed form
5691A7648323j113277j102541r16965p71297p93597p21286o36248n39703m39717
5682A0613692m76596m37169l93955k87696k77769k96516k60681k19242j92671
5673G771397k40349k21944j64494j76000j98796p9021j12009j59235n9520j3596
5663F346433j7543p1499M866J71102J40109J26861J96274J0934j41696l14541
5653F451300l12030k40326k53017k27961j66129j27818J0666j08694k01734l3156
5643D791101r0618j9697q3243n8391J2738K4782l6492p8354j13076m2634q6399
5632D219717L776L8813l6664N0793j02780r9048m7213Q424m3588l0242j7940P907
5620C951955k2666l312L5943n519O7281J58848O1555J5382J690L1163L0722J527
$$ plain form
5608 4324569 4403207 4463722 4499810 4571907 4589145 4825374 5048840 5251367 5656606 5916547
5598 5916547 5886174 5636577 5388841 5106414 5008842 4808079 4668290 4721960 4627130 4666807
5588 4666807 4770700 4703037 4647034 4574928 4567492 4478577 4620517 4657962 4660936 4804939 4834743
5577 4834743 4824739 4988043 5060434 5208232 5209142 5296694 5399729 5442251 5466180 5506866 5508884
5566 5508884 5547000 5720025 5845972 5946514 6161776 6397888 6474112 6693801 6917955 7098593
5556 7098593 7274916 7561533 7852679 8069348 8334203 8541354 8679760 8888614 9102139 9399015
5546 9399015 9713782 10075744 10335417 10631977 10878049 11130084 11527129 11928480 12266136 12624308
5536 12624308 12943432 13273076 13655995 14109843 14550467 14931127 15271277 15604978 15984896
$$ packed form
5608D324569P8638O0515L6088P2097J7238K36229K23466K02527M05239K59941
5598E916547l0373k49597k47736k82427r7572k00763j39789N3670r4830L9677
5588D666807J03893o7663n6003p2106p436q8915J41940L7445K974J44003K9804
5577D834743j0004J63304P2391J47798R10Q7552J03035M2522K3929M0686K018
5566E508884L8116J73025J25947J00542K15262K36112P6224K19689K24154J80638
5556G098593J76323K86617K91146K16669K64855K07151J38406K08854K13525K96876
5546I399015L14767L61962K59673K96560K46072K52035L97045M01351L37656L58172
5536A2624308L19124L29644L82919M53848M40624L80660L40150L33701L79918
$$ plain form
5527 15984896 16478226 17047409 17738550 18604910 19458467 20443092 21460703 22647715 23835449
5518 23835449 25262224 26690046 28089752 29302874 30288675 31159626 32034895 32912220 34106058
5509 34106058 35659121 37416896 39460591 41719389 44487282 47697320 51591795 56274138
5501 56274138 61935229 68511942 76345905 85400121 95936560 108306351 122892122 139617061
5493 139617061 159796042 184414649 215390085 253409891 297867889 339695954 356231552
5486 356231552 330927653 280063951 227915240 184047088 151292318 127424846 109727185
5479 109727185 96112518 85370135 76801233 69817928 63700515 58469003 54049428 50168851
5471 50168851 46767546 43810527 41099891 38644978 36373438 34432598 32741851 31222957
$$ packed form
5527A5984896M93330N69183O91141Q66360Q53557R84625J017611J187012J187734
5518B3835449J426775J427822J399706J213122R85801Q70951Q75269Q77325J193838
5509C4106058J553063J757775K043695K258798K767893L210038L894475M682343
5501E6274138N661091O576713P833963R054216J0536439J2369791J4585771J6724939
5493A39617061K0178981K4618607L0975436L8019806M4457998M1828065J6535598
5486C56231552k5303899n0863702n2148711m3868152l2754770k3867472j7697661
5479A09727185j3614667j0742383q568902o983305o117413n231512m419575l880577
5471E0168851l401305k957019k710636k454913k271540j940840j690747j518894
$$ plain form
5463 31222957 29756555 28436217 27244879 26281425 25522446 24857839 24132402 23284026 22315930
5454 22315930 21479256 20648743 19949982 19221857 18509408 17767325 17206719 16502151 15874629
5445 15874629 15382495 14817995 14361359 14158698 14053088 13958643 13886732 13653656 13161225 12628541
5435 12628541 12040626 11680347 11320780 10981380 10718512 10468407 10157870 9822577 9539573
5426 9539573 9268670 9009461 8627798 8422074 8205381 8081522 8069839 7897254 7781093 7670770
5416 7670770 7597720 7571692 7493900 7337052 7200993 7194174 7078305 6914032 6816761 6738667 6638384
5405 6638384 6539616 6411758 6389210 6369789 6428475 6341159 6268159 6276727 6175145 6069619 5965300
5394 5965300 5835697 5604719 5545406 5385343 5315062 5148451 5019373 5008237 4969595 4940815
$$ packed form
5463C1222957j466402j320338j191338r63454p58979o64607p25437q48376r68096
5454B2315930q36674q30513o98761p28125p12449p42083n60606p04568o27522
5445A5874629m92134n64500m56636k02661j05610r4445p1911k33076m92431n32684
5435A2628541n87915l60279l59567l39400k62868k50105l10537l35293k83004
5426I539573k70903k59209l81663k05724k16693j23859j1683j72585j16161j10323
5416G670770p3050k6028p7792j56848j36059o819j15869j64273r7271p8094j00283
5405F638384r8768j27858k2548j9421N8686q7316p3000Q568j01582j05526j04319
5394E965300j29603k30978n9313j60063p0281j66611j29078j1136l8642k8780
$$ plain form
5384 4940815 4915677 4964362 4964521 5019857 5047352 5084124 5116505 5122309 5164158 5266244 5360236 5375117
5372 5375117 5352064 5336783 5378130 5337382 5418700 5548579 5608372 5679469 5922119 6229206 6451937
5361 6451937 6790601 7242926 7740188 8179220 8661991 9367272 10265838 11271950 12602293
5352 12602293 14128122 15717037 16642523 16515929 15565994 14636185 13978719 13605965 13540530
5343 13540530 13522173 13582866 13805676 13887201 14008979 14396930 15061959 16127099 17553944 19608605
5333 19608605 22197698 25178925 27977203 28827169 26676344 22807764 19004252 15918868
5325 15918868 13603099 12106091 10992039 10094641 9502776 9111357 8811169 8494728 8143244
5316 8143244 7752010 7425845 7069676 6884909 6731920 6491232 6315135 6242037 6115179 6031537
$$ packed form
5384D940815k5138M8685J59N5336K7495L6772L2381N804M1849J02086R3992J4881
5372E375117k3053j5281M1347m0748Q1318J29879N9793P1097K42650L07087K22731
5361F451937L38664M52325M97262M39032M82771P05281Q98566J006112J330343
5352A2602293J525829J588915R25486j26594r49935r29809o57466l72754o5435
5343A3540530j8357O0693K22810Q1525J21778L87951O65029J065140J426845K054661
5333A9608605K589093K981227K798278Q49966k150825l868580l803512l085384
5325A5918868k315769j497008j114052q97398n91865l91419l00188l16441l51484
5316H143244l91234l26165l56169j84767j52989k40688j76097p3098j26858q3642
$$ plain form
5306 6031537 5960683 6121914 6246941 6532430 6960342 7442273 8066942 8575561 8446202 7663597
5296 7663597 6723379 5873386 5225374 4691680 4344966 3996678 3659213 3380460 3229713 3022909
5286 3022909 2838411 2718569 2667212 2603868 2528207 2479856 2393479 2355707 2220430 2180782 2133827
5275 2133827 2105463 1974946 1947633 1907753 1885689 1888424 1824630 1736069 1759120 1659435 1519166
5264 1519166 1527803 1438145 1358584 1355269 1446035 1337984 1262387 1203401 1180982 1198957 1190601 1146160
5252 1146160 1164302 1147530 1149410 1059889 1040817 1064397 1119960 1086812 1085307 1084015 1047017 1039653
5240 1039653 1062832 1060326 993941 956794 921304 920073 963551 987370 1002078 873894 932067 983459
5228 983459 887355 932491 964379 977236 904958 851787 898892 848577 830398 909730 969517 968112
$$ packed form
5306F031537p0854J61231J25027K85489M27912M81931O24669N08619j29359p82605
5296G663597r40218q49993o48012n33694l46714l48288l37465k78753j50747k06804
5286C022909j84498j19842n1357o3344p5661m8351q6377l7772j35277l9648m6955
5275B133827k8364j30517k7313l9880k2064K735o3794q8561K3051r9685j40269
5264A519166Q637q9658p9561l315R0766j08051p5597n8986k2419J7975q356m4441
5252A146160J8142j6772J880q9521j9072K3580N5563l3148j505j292l6998p364
5240A039653K3179k506o6385l7147l5490j231M3478K3819J4708j28184N8173N1392
5228I83459r6104M5136L1888J2857p2278n3171M7105n0315j8179P9332N9787j405
$$ plain form
5216 968112 931298 928341 907144 899907 818764 803785 818576 875043 959132 940252 871205 805908
5204 805908 833560 883509 858077 809406 818466 834052 860913 839298 884651 875196 891272 918282
5192 918282 880414 841693 852645 879665 919642 943586 965304 944592 992315 1136375 1186633
5181 1186633 1218062 1363869 1390705 1526732 1634529 1730487 2010220 2184601 2135156 2066286
5171 2066286 1835363 1575942 1373341 1195847 1038291 945288 884512 825976 746353 694952
5161 694952 640916 618156 623992 533263 651997 637532 598534 621961 632375 533988 530401 535767
5149 535767 467895 404489 483026 482527 459082 388498 435317 423658 377681 347769 329729 338752
5137 338752 334689 370769 314286 272356 246071 339590 307015 239576 395416 359227 326971 333227
$$ packed form
5216I68112l6814k957k1197p237q1143j4979J4791N6467Q4089j8880o9047o5297
5204H05908K7652M9949k5432m8671R060J5586K6861k1615M5353r455J6076K7010
5192I18282l7868l8721J0952K7020L9977K3944K1718k0712M7723J44060N0258
5181A186633L1429J45807K6836J36027J07797R5958K79733J74381m9445o8870
5171B066286k30923k59421k02601j77494j57556r3003o0776n8536p9623n1401
5161F94952n4036k2760N836r0729J18734j4465l8998K3427J0414r8387l587N366
5149E35767o7872o3406P8537m99k3445p0584M6819j1659m5977k9912j8040R023
5137C38752m063L6080n6483m1930k6285R3519l2575o7439J55840l6189l2256O256
$$ plain form
5125 333227 253076 283680 405005 355336 269189 278760 262776 287902 291457 344851 329619 308156
5113 308156 311902 295096 290351 225309 296668 338486 346152 309662 312920 286585 276082 250819
5101 250819 246440 293485 396575 385934 343524 369156 409916 409085 473017 432031 376701 339899
5089 339899 360140 343514 424231 529550 583578 608438 515486 584598 623854 645627 695523
5078 695523 770570 840520 864229 908029 1003731 919623 830143 725465 642208 577415 615295
5067 615295 570108 490982 423282 429673 409257 445156 479160 472335 446244 443754 396714 356530
5055 356530 355405 346490 379384 372907 398131 368004 332139 347028 387910 375265 445269 505763
5043 505763 444822 436391 432143 513765 539948 526096 570252 607288 558829 575050 482466 460084
$$ packed form
5125C33227q0151L0604J21325m9669q6147R571j5984K5126L555N3394j5232k1463
5113C08156L746j6806m745o5042P1359M1818P666l6490L258k6335j0503k5263
5101B50819m379M7045J03090j0641m2410K5632M0760q31O3932m0986n5330l6802
5089C39899K0241j6626Q0717J05319N4028K4860r2952O9112L9256K1773M9896
5078F95523P5047O9950K3709M3800R5702q4108q9480j04678q3257o4793L7880
5067F15295m5187p9126o7700O391k0416L5899L4004o825k6091k490m7040m0184
5055C56530j125q915L2894o477K5224l0127l5865J4889M0882j2645P0004O0494
5043E05763o0941q431m248Q1622K6183j3852M4156L7036m8459J6221r2584k2382
$$ plain form
5031 460084 499073 549348 521666 521268 566821 507465 533380 519706 508259 616232 579693 572143
5019 572143 578899 520347 556774 565426 555580 573181 571709 552005 542616 485917 466339 510515 508152
5006 508152 519997 524351 581390 549207 543770 521746 475275 493500 535022 565553 545035 610099
4994 610099 589117 514584 552167 639770 600900 650518 627161 595086 662178 649618 684995 749976
4982 749976 684529 680952 654135 635192 642343 639506 706159 723333 671749 713921 710065 784683
4970 784683 803576 863238 879473 866036 869037 919381 932793 968722 989128 957366 972967 1002513
4958 1002513 1012104 1033346 1009232 991297 1043278 1086519 1011633 1004859 1053133 1038226 1058979 999294
4946 999294 1025832 1081383 1101879 1069428 1074652 1103018 1083854 1137715 1136761 1058936 1050353 1086212
$$ packed form
5031D60084L8989N0275k7682l98M5553n9356K5915j3674j1447J07973l6539p550
5019E72143O756n8552L6427Q652r846J7601j472j9704r389n6699j9578M4176k363
5006E08152J1845M354N7039l2183n437k2024m6471J8225M1522L0531k0518O5064
4994F10099k0982p4533L7583Q7603l8870M9618k3357l2075O7092j2560L5377O4981
4982G49976o5447l577k6817j8943P151k837O6653J7174n1584M2172l856P4618
4970G84683J8893N9662J6235j3437L001N0344J3412L5929K0406l1762J5601K9546
4958A002513R591K1242k4114j7935N1981M3241p4886o774M8274j4907K0753n9685
4946I99294K6538N5551K0496l2451N224K8366j9164N3861r54p7825q583L5859
$$ plain form
4934 1086212 1143715 1156340 1210845 1212940 1222223 1325668 1342658 1327502 1333794 1303155 1293241 1257530
4922 1257530 1339234 1258487 1206018 1242175 1316768 1318774 1313756 1316732 1392412 1360555 1384958 1448341
4910 1448341 1400130 1441690 1493435 1574530 1626938 1633634 1672448 1652468 1671168 1692587 1679211 1688259
4898 1688259 1756248 1831963 1812401 1765025 1837462 1906814 1888047 2044676 2149830 2124037 2139212
4887 2139212 2238882 2300524 2373582 2352323 2390918 2435407 2483908 2559984 2608987 2672275 2799571
4876 2799571 2817553 2898230 2983186 3032638 3197872 3326740 3394816 3442919 3528087 3568859 3678183
4865 3678183 3799326 3816622 3992279 4057699 4085903 4244735 4427761 4730606 4963779 5065185
4855 5065185 5329020 5544170 5782022 5936390 6032760 6257654 6534126 6741325 6950731 7207082
$$ packed form
4934A086212N7503J2625N4505K095R283J03445J6990j5156O292l0639r914l5711
4922A257530Q1704q0747n2469L6157P4593K006n018K976P5680l1857K4403O3383
4910A448341m8211M1560N1745Q1095N2408O696L8814j9980J8700K1419j3376R048
4898A688259O7989P5715j9562m7376P2437O9352j8767J56629J05154k5793J5175
4887B139212R9670O1642P3058k1259L8595M4489M8501P6076M9003O3288J27296
4876B799571J7982Q0677Q4956M9452J65234J28868O8076M8103Q5168M0772J09324
4865C678183J21143J7296J75657O5420K8204J58832J83026L02845K33173J01406
4855E065185K63835K15150K37852J54368R6370K24894K76472K07199K09406K56351
$$ plain form
4845 7207082 7435917 7668160 7951895 8218154 8531413 8888124 9303697 9705936 10170533 10657429
4835 10657429 11147239 11696370 12199076 12818712 13405618 14079691 14675634 15352882 16166887
4826 16166887 17117022 18063976 19148593 20352202 21795489 23410328 25345138 27685979
4818 27685979 30364000 33434310 37079324 41359679 46325108 52112794 58769188 66587287
4810 66587287 75635731 85815923 96933235 108331821 118780325 127109442 131766048 132034348
4802 132034348 127959185 119907100 108734703 96186713 83657733 72127220 62229648
4795 62229648 54122403 47607946 42336252 38107071 34603677 31666799 29216812 27011629
4787 27011629 25097709 23457603 22049977 20862076 19805414 18888653 18059950 17319370 16582505
$$ packed form
4845G207082K28835K32243K83735K66259L13259L56711M15573M02239M64597M86896
4835A0657429M89810N49131N02706O19636N86906O74073N95943O77248Q14005
4826A6166887R50135R46954J084617J203609J443287J614839J934810K340841
4818B7685979K678021L070310L645014M280355M965429N787686O656394P818099
4810F6587287R048444J0180192J1117312J1398586J0448504Q329117M656606K68300
4802A32034348m075163q052085j1172397j2547990j2528980j1530513r897572
4795F2229648q107245o514457n271694m229181l503394k936878k449987k205183
4787B7011629j913920j640106j407626j187901j056662r16761q28703p40580p36865
$$ plain form
4778 16582505 16024358 15520921 15000290 14485237 14018627 13496461 12886251 12275835 11767513
4769 11767513 11213448 10722278 10301905 9855913 9377639 9047511 8786188 8467789 8222013
4760 8222013 7990512 7794761 7623251 7414278 7374481 7337069 7245362 7201504 7096359 7031931
4750 7031931 7000421 6937942 6876519 6804740 6580797 6385400 6241898 6016529 5766840 5541199
4740 5541199 5301849 5145853 4943704 4859105 4777589 4571400 4579470 4501110 4416362 4478782 4450718
4729 4450718 4294690 4275853 4314431 4276245 4251692 4116609 4036528 3923059 3827360 3783547 3724907
4718 3724907 3654967 3586116 3546989 3424343 3319446 3217341 3230630 3097176 3034456 3031342 3001509
4707 3001509 2909217 2802337 2886793 2798055 2723938 2715497 2741942 2571860 2491085 2507874 2502452
$$ packed form
4778A6582505n58147n03437n20631n15053m66610n22166o10210o10416n08322
4769A1767513n54065m91170m20373m45992m78274l30128k61323l18399k45776
4760H222013k31501j95751j71510k08973l9797l7412r1707m3858j05145o4428
4750G031931l1510o2479o1423p1779k23943j95397j43502k25369k49689k25641
4740E541199k39350j55996k02149q4599q1516k06189Q070p8360q4748O2420k8064
4729D450718j56028j8837L8578l8186k4553j35083q0081j13469r5699m3813n8640
4718C724907o9940o8851l9127j22646j04897j02105J3289j33454o2720l114k9833
4707C001509r2292j06880Q4456q8738p4117q441K6445j70082q0775J6789n422
$$ plain form
4696 2502452 2437415 2278136 2293467 2270627 2156995 2170802 2104678 2074998 2020676 1940516 1961983
4685 1961983 1896338 1799581 1774483 1784895 1792154 1752396 1644401 1544016 1549708 1544472 1467743 1521724
4673 1521724 1514747 1357633 1381102 1349078 1303694 1194060 1176435 1186121 1177892 1238846 1205643 1204260
4661 1204260 1109694 1075707 1033611 1028156 983540 896306 840444 833894 777606 804961 789009 730249
4649 730249 725482 653003 604404 634291 628273 597799 475986 501919 527567 506666 549440 562393
4637 562393 588102 570167 503237 513195 566975 631764 626848 599522 631418 603298 620694 582151
4625 582151 467723 400920 415610 388152 489124 566514 557085 494444 381064 326490 331024
4614 331024 319631 318345 272578 285830 375113 384386 351758 337840 289286 324730 374601 339189
$$ packed form
4696B502452o5037j59279J5331k2840j13632J3807o6124k9680n4322q0160K1467
4685A961983o5645r6757k5098J0412P259l9758j07995j00385N692n236p6729N3981
4673A521724o977j57114K3469l2024m5384j09634j7625R686q229O0954l3203j383
4661A204260r4566l3987m2096n455m4616q7234n5862o550n6288K7355j5952n8760
4649G30249m767p2479m8599K9887o018l0474j21813K5933K5648k0901M2774J2953
4637E62393K5709j7935o6930R958N3780O4789m916k7326L1896k8120J7396l8543
4625E82151j14428o6803J4690k7458J00972P7390r429o2641j13380n4574M534
4614C31024j1393j286m5767J3252Q9283R273l2628j3918m8554L5444M9871l5412
$$ plain form
4602 339189 238070 237061 310033 286338 247216 210190 236310 315217 364863 344924 260276 282111
4590 282111 287998 320456 377335 357290 370185 277952 296948 309446 286369 254260 248578 353633
4578 353633 295740 279509 261511 227344 198047 252031 281379 271644 274488 228035 253228 208757
4566 208757 224031 193325 160951 165190 218675 259721 236528 223415 246600 293147 337043 281026
4554 281026 357014 333895 280464 278787 247336 268213 335956 332369 344559 341738 328943 380667
4542 380667 398894 406472 446576 456931 466892 481588 502545 619419 725959 745426 746735 814233
4530 814233 857118 809779 835515 818929 729417 747639 603178 530088 506795 479004 420401
4519 420401 407370 369455 337697 361571 351421 317482 321747 284830 358833 309351 352383 424523
$$ packed form
4602C39189j01119j009P2972k3695l9122l7026K6120P8907M9646j9939q4648K1835
4590B82111N887L2458N6879k0045J2895r2233J8996J2498k3077l2109n682J05055
4578C53633n7893j6231j7998l4167k9297N3984K9348r735K844m6453K5193m4471
4566B08757J5274l0706l2374M239N3485M1046k3193j3113K3185M6547M3896n6017
4554B81026P5988k3119n3431j677l1451K0877O7743l587J2190k821j2795N1724
4542C80667J8227P578M0104J0355R961J4696K0957J16874J06540J9467J309O7498
4530H14233M2885m7339K5736j6586q9512J8222j44461p3090k3293k7791n8603
4519D20401j3031l7915l1758K3874j0150l3939M265l6917P4003m9482M3032P2140
$$ plain form
4507 424523 315882 347201 402873 389158 383555 347635 289566 354673 422851 445664 370524 246962
4495 246962 253340 219323 220252 214339 134610 185869 150645 176009 266747 199946 198454 214157 206357
4482 206357 234580 275618 292095 233761 274733 270338 146486 222844 282250 273460 185755 181493
4470 181493 187855 214482 118935 152085 231458 161568 154292 255928 294603 266861 197888 130774
4458 130774 135368 100846 185686 165078 194073 205861 237913 179385 169152 227288 254854 234594
4446 234594 223260 228236 203736 165331 145506 83251 138030 154293 156056 125436 178145 160743
4434 160743 247683 213132 239512 224935 319007 228232 218506 287372 239505 259401 247974 275406
4422 275406 305337 348807 342433 357486 328838 320609 341666 366538 301090 274246 230735 172736
$$ packed form
4507D24523j08641L1319N5672j3715n603l5920n8069O5107O8178K2813p5140j23562
4495B46962O378l4017R29n913p9729N1259l5224K5364R0738o6801j492J5703p800
4482B06357K8223M1038J6477n8334M0972m395j23852P6358N9406q790q7705m262
4470A81493O362K6627r5547L3150P9373o9890p276J01636L8675k7742o8973o7114
4458A30774M594l4522Q4840k0608K8995J1788L2052n8528j0233N8136K7566k0260
4446B34594j1334M976k4500l8405j9825o2255N4779J6263J763l0620N2709j7402
4434A60743Q6940l4551K6380j4577R4072r0775r726O8866m7867J9896j1427K7432
4422B75406K9931M3470o374J5053k8648q229K1057K4872o5448k6844m3511n7999
$$ plain form
4410 172736 162259 198862 177399 186124 153858 145880 168899 150868 188827 278267 208999 175818
4398 175818 178431 237389 223002 269833 291345 249122 223810 250605 193428 204366 230709 268893
4386 268893 288131 198118 193747 257014 255301 330831 379198 306004 280011 208493 261119 265626
4374 265626 164956 225665 270187 225730 235980 226037 203853 284237 330352 364793 338330 317708
4362 317708 353165 328468 332542 362810 320571 338054 320478 360052 234093 196817 305615
4351 305615 228310 243713 275029 264388 293105 247244 241251 199603 278611 321369 307182 321780
4339 321780 288055 383308 468591 365751 275023 337680 337000 306005 313259 304135 361904 340073
4327 340073 412024 365851 371496 374522 378799 433366 460882 472241 440668 434493 484914 423207
$$ packed form
4410A72736j0477L6603k1463Q725l2266p978K3019j8031L7959Q9440o9268l3181
4398A75818K613N8958j4387M6831K1512m2223k5312K6795n7177J0938K6343L8184
4386B68893J9238r0013m371O3267j713P5530M8367p3194k5993p1518N2626M507
4374B65626j00670O0709M4522m4457J0250r943k2184Q0384M6115L4441k6463k0622
4362C17708L5457k4697M074L0268m2239J7483j7576L9574j25959l7276J08798
4351C05615p7305J5403L1316j0641K8717m5861n993m1648P9008M2758j4187J4598
4339C21780l3725R5253Q5283j02840r0728O2657o80l0995P254r124N7769k1831
4327C40073P1951m6173N645L026M277N4567K7516J1359l1573o175N0421o1707
$$ plain form
4315 423207 352798 453372 484529 593516 620564 557615 585110 633351 614772 619981 605236
4304 605236 701656 827568 928411 1119473 1136527 1188023 1198758 1185579 1168157 894059 867852
4293 867852 769173 762733 747588 757833 707532 697407 688576 660936 548762 607333 605776 632169
4281 632169 564126 545084 576486 562536 578228 506596 549877 623690 626105 629142 660132 613948
4269 613948 638108 669761 610698 611383 710753 736005 682072 680818 620864 706335 702301 685002
4257 685002 715999 722197 692347 646311 657904 653707 749267 711389 742510 732562 847020 855064
4245 855064 794356 728161 718741 766012 785668 807372 788621 849109 938909 920368 872730 881721
4233 881721 937759 995802 1016655 951068 1027112 1101342 1111494 1139577 1171387 1216096 1162263 1137827
$$ packed form
4315D23207p0409J00574L1157J08987K7048o2949K7495M8241j8579N209j4745
4304F05236R6420J25912J00843J91062J7054N1496J0735j3179j7422k74098k6207
4293H67852r8679o440j5145J0245n0301j0125q831k7640j12174N8571j557K6393
4281F32169o8043j9042L1402j3950J5692p1632M3281P3813K415L037L0990m6184
4269F13948K4160L1653n9063O85R9370K5252n3933j254n9954Q5471m034j7299
4257F85002L0997O198k9850m6036J1593m197R5560l7878L1121r948J14458Q044
4245H55064o0708o6195r420M7271J9656K1704j8751O0488Q9800j8541m7638Q991
4233H81721N6038N8043K0853o5587P6044P4230J0152K8083L1810M4709n3833k4436
$$ plain form
4221 1137827 1248392 1322172 1285217 1351329 1393839 1384283 1494245 1587716 1652369 1746405 1761440
4210 1761440 1951834 2003874 2140561 2405676 2595652 2852595 3175572 3547970 3946703 4168466
4200 4168466 4174052 3980944 3681635 3395102 3145307 2949518 2770725 2620935 2589878 2596605
4190 2596605 2499690 2373573 2397913 2431075 2346835 2403157 2447999 2534247 2506454 2630835 2704941
4179 2704941 2726483 2713292 2670789 2734790 2852041 2870670 2930526 2977079 3039272 3182355 3190863
4168 3190863 3262247 3361851 3448928 3596079 3647232 3870795 4051562 4202421 4474242 4676138
4158 4676138 4962510 5370010 5773018 6241853 6835753 7557580 8201845 8784538 9034070 9136199
4148 9136199 9127257 8982993 8760625 8215721 7566847 7048442 6591353 6138488 5924524 5822782
$$ packed form
4221A137827J10565P3780l6955O6112M2510r556J09962R3471O4653R4036J5035
4210A761440J90394N2040J36687K65115J89976K56943L22977L72398L98733K21763
4200D168466N586j93108k99309k86533k49795j95789j78793j49790l1057O727
4190B596605r6915j26117K4340L3162q4240N6322M4842Q6248k7793J24381P4106
4179B704941K1542j3191m2503O4001J17251J8629N9856M6553O2193J43083Q508
4168C190863P1384R9604Q7077J47151N1153K23563J80767J50859K71821K01896
4158D676138K86372M07500M03008M68835N93900P21827O44265N82693K49532J02129
4148I136199q942j44264k22368n44904o48874n18405m57089m52865k13964j01742
$$ plain form
4138 5822782 5818159 5801927 5863734 6047332 6307901 6605125 6925226 7262416 7292708 7060316
4128 7060316 6612644 6220846 5753459 5498285 5381490 5171641 5159168 5148505 5072631 5040160
4118 5040160 5057670 5002554 5080517 5101299 5104640 5132503 5140368 5181099 5358088 5471767 5631260
4107 5631260 5690336 5729646 6002724 6152002 6228939 6483327 6606251 6704448 6743191 6825091 6912935
4096 6912935 6929860 6966482 7098034 7328623 7604327 7778874 7908087 8153502 8271999 8417434
4086 8417434 8663341 8916733 9173090 9357118 9590388 9927446 10146400 10283773 10532497 10857145
4076 10857145 11057851 11311348 11639325 12000161 12468223 12930899 13268646 13766081 14358790
4067 14358790 14970948 15520867 16146842 16823270 17477758 18185239 18842777 19683061 20620602
$$ packed form
4138E822782m623j6232O1807J83598K60569K97224L20101L37190L0292k32392
4128G060316m47672l91798m67387k55174j16795k09849j2473j0663p5874l2471
4118E040160J7510n5116P7963K0782L341K7863P865M0731J76989J13679J59493
4107E631260N9076L9310K73078J49278P6937K54388J22924R8197L8743Q1900Q7844
4096F912935J6925L6622J31552K30589K75704J74547J29213K45415J18497J45435
4086H417434K45907K53392K56357J84028K33270L37058K18954J37373K48724L24648
4076A0857145K00706K53497L27977L60836M68062M62676L37747M97435N92709
4067A4358790O12158N49919O25975O76428O54488P07481O57538Q40284R37541
$$ plain form
4058 20620602 21606252 22596448 23681960 24897415 26189502 27749803 29691183 31984064
4050 31984064 34556361 37633856 41164243 45242915 50054000 55723659 62407620 70114550
4042 70114550 79203136 89839227 102623578 117751320 133764951 146974273 152761752
4035 152761752 147348649 132264694 112890088 94474414 79866374 68840729 60402131
4028 60402131 53769001 48533165 44254075 40741131 37957936 35487581 33416051 31631265
4020 31631265 30098146 28699054 27477535 26405789 25546878 24824394 24144228 23579851 23040694
4011 23040694 22650386 22336821 22082591 21960060 21804922 21633299 21458417 21251945 21137129
4002 21137129 20981521 20850337 20798466 20765359 20797964 20956791 21240535 21643609 22062912 22477707
$$ packed form
4058B0620602R85650R90196J085512J215455J292087J560301J941380K292881
4050C1984064K572297L077495L530387M078672M811085N669659O683961P706930
4042G0114550R088586J0636091J2784351J5127742J6013631J3209322N787479
4035A52761752n413103j5083955j9374606j8415674j4608040j1025645q438598
4028F0402131o633130n235836m279090l512944k783195k470355k071530j784786
4020C1631265j533119j399092j221519j071746q58911p22484o80166n64377n39157
4011B3040694l90308l13565k54230j22531j55138j71623j74882k06472j14816
4002B1137129j55608j31184n1871l3107L2605J58827K83744M03074M19303M14795
$$ plain form
3992 22477707 22831087 23159333 23495337 24004091 24443866 24909343 25469461 25979611 26351799
3983 26351799 26707996 27208640 27714022 28271789 28994846 29782354 30725073 31744798 32822995
3974 32822995 33982298 35308108 36613973 37991744 39512574 41182918 43026303 44931165
3966 44931165 46870613 48822765 50986783 53390905 56050211 59019253 62343962 66291286
3958 66291286 70907271 76330459 82877394 90477099 99339754 109581868 121599295 135717287
3950 135717287 152669225 172521669 195608272 222642112 255045242 295149822 344298863
3943 344298863 402177015 459953694 498110281 496920064 454508436 387057504 318132147
3936 318132147 260785751 217308817 185331266 161150418 142188120 126978248 114521320
$$ packed form
3992B2477707L53380L28246L36004N08754M39775M65477N60118N10150L72188
3983B6351799L56197N00644N05382N57767P23057P87508R42719J019725J078197
3974C2822995J159303J325810J305865J377771J520830J670344J843385J904862
3966D4931165J939448J952152K164018K404122K659306K969042L324709L947324
3958F6291286M615985N423188O546935P599705Q862655J0242114J2017427J4117992
3950A35717287J6951938J9852444K3086603K7033840L2403130M0104580M9149041
3943C44298863N7878152N7776679L8156587j190217m2411628o7450932o8925357
3936C18132147n7346396m3476934l1977551k4180848j8962298j5209872j2456928
$$ plain form
3929 114521320 104157482 95716071 88529820 82342934 76863206 72030369 67659899 63652438
3921 63652438 60012450 56925030 54161394 51794716 49756101 47950449 46058298 44382324
3913 44382324 42627543 40864459 39265098 37764868 36368967 35118651 33884346 32800146
3905 32800146 31819444 30754317 29616052 28482091 27371757 26340618 25305549 24326716
3897 24326716 23427716 22772665 22123988 21663070 21220420 20774522 20332705 19889157 19463230
3888 19463230 19114458 18880757 18661230 18624757 18499288 18210802 17817206 17285626 16848257 16391695
3878 16391695 16016820 15619437 15340483 15157729 14964173 14788670 14757702 14760228 14737794 14635994
3868 14635994 14628493 14544956 14378025 14248932 14096233 13997477 13925877 13872888 13767828 13700049 13643309
$$ packed form
3929A14521320j0363838q441411p186251o186886n479728m832837m370470m007461
3921F3652438l639988l087420k763636k366678k038615j805652j892151j675974
3913D4382324j754781j763084j599361j500230j395901j250316j234305j084200
3905C2800146r80702j065127j138265j133961j110334j031139j035069r78833
3897B4326716q99000o55051o48677m60918m42650m45898m41817m43548m25927
3888A9463230l48772k33701k19527l6473j25469k88486l93596n31580m37369m56562
3878A6391695l74875l97383k78954j82754j93556j75503l0968K526k2434j01800
3868A4635994p501q3537j66931j29093j52699r8756p1600n2989j05060o7779n6740
$$ plain form
3857 13643309 13551918 13343934 13261539 13222541 13172095 13189797 13203368 13388275 13495666 13630063
3847 13630063 13832189 13939879 14098566 14200592 14379441 14459913 14633970 14811885 15049851 15191973
3837 15191973 15343249 15576443 15939096 16242717 16584473 17094878 17429750 17968208 18568879
3828 18568879 19166447 19817650 20541775 21154442 21774521 22502671 23077390 23742396 24578153
3819 24578153 25457851 26464222 27451220 28605254 29932307 31348202 33034354 34970162
3811 34970162 37253459 39874330 42859820 46488538 50651609 55519623 61295433 68186423
3803 68186423 76316024 85930914 97348956 110829627 126883053 145481751 165868958
3796 165868958 186084679 203425341 214785067 217436169 209717761 193243795 171623645
$$ packed form
3857A3643309r1391k07984q2395l8998n0446J7702J3571J84907J07391J34397
3847A3630063K02126J07690J58687J02026J78849Q0472J74057J77915K37966J42122
3837A5191973J51276K33194L62653L03621L41756N10405L34872N38458O00671
3828A8568879N97568O51203P24125O12667O20079P28150N74719O65006Q35757
3819B4578153Q79698J006371R86998J154034J327053J415895J686152J935808
3811C4970162K283297K620871K985490L628718M163071M868014N775810O890990
3803F8186423Q129601R614890J1418042J3480671J6053426J8598698K0387207
3796A65868958K0215721J7340662J1359726K651102p718408j6473966k1620150
$$ plain form
3789 171623645 148336849 126172006 107032956 91663428 79602510 70183537 62733872
3782 62733872 56775113 51802458 47643683 44354964 41483633 38897982 36670353 34638609
3774 34638609 32834577 31190383 29881384 28560767 27260634 26093809 24973124 24016264
3766 24016264 23079752 22301037 21515953 20886000 20261910 19730608 19283360 18802220 18376271
3757 18376271 18002949 17611195 17334252 16977170 16701228 16396865 16192087 16125128 16085660 16143128
3747 16143128 16311579 16662688 16999180 17562338 18021693 18643084 19380462 20250249 21312806
3738 21312806 22389420 23497896 24497136 25229212 25454575 25262912 24411575 23002818 21347186
3729 21347186 19553109 17947793 16558874 15283452 14087241 13156777 12447934 11737142 11118314
$$ packed form
3789A71623645k3286796k2164843j9139050j5369528j2060918r418973p449665
3782F2733872n958759m972655m158775l288719k871331k585651k227629k031744
3774C4638609j804032j644194j308999j320617j300133j166825j120685r56860
3766B4016264r36512p78715p85084o29953o24090n31302m47248m81140m25949
3757A8376271l73322l91754k76943l57082k75942l04363k04778o6959l9468N7468
3747A6143128J68451L51109L36492N63158M59355O21391P37378Q69787J062557
3738B1312806J076614J108476R99240P32076K25363j91663q51337j408757j655632
3729B1347186j794077j605316j388919j275422j196211r30464p08843p10792o18828
$$ plain form
3720 11118314 10640947 10146866 9637878 9298313 8857751 8505395 8139314 7837033 7467735
3711 7467735 7157062 6944092 6687745 6502508 6330849 6263721 6097945 5989586 5910242 5798850
3701 5798850 5780772 5548278 5374533 5290065 5164985 5067922 5077942 5013412 4863057 4820854 4768717
3690 4768717 4722491 4612463 4634152 4658738 4640879 4703678 4829793 4935659 5158846 5383032
3680 5383032 5610440 5807834 5919002 5782297 5455978 5046516 4669414 4323048 3936155 3689638
3670 3689638 3525959 3378620 3291775 3142752 3034328 2990389 2931348 2799063 2728893 2630789
3660 2630789 2521770 2464425 2439734 2332575 2266170 2239694 2203752 2098041 2057560 2004836 1941375
3649 1941375 1908618 1904186 1856223 1768713 1782354 1796687 1732233 1651671 1693015 1661447 1596412 1570032
$$ packed form
3720A1118314m77367m94081n08988l39565m40562l52356l66081l02281l69298
3711G467735l10673k12970k56347j85237j71659o7128j65776j08359p9344j11392
3701E798850j8078k32494j73745q4468j25080r7063J0020o4530j50355m2203n2137
3690D768717m6226j10028K1689K4586j7859O2799J26115J05866K23187K24186
3680E383032K27408J97394J11168j36705l26319m09462l77102l46366l86893k46517
3670C689638j63679j47339q6845j49023j08424m3939n9041j32285p0170r8104
3660B630789j09019n7345k4691j07159o6405k6476l5942j05711m0481n2724o3461
3649A941375l2757m432m7963q7510J3641J4333o4454q0562M1344l1568o5035k6380
$$ plain form
3637 1570032 1452052 1369715 1430646 1430208 1332927 1376131 1291366 1267612 1282494 1315723 1363146 1335899
3625 1335899 1327578 1334645 1295903 1182155 1241037 1207192 1098513 1082596 1088424 1103635 1097900 1008440
3613 1008440 977686 1015131 988439 1007136 999619 1007002 1000640 1024181 1040756 1017436 1014959 997187
3601 997187 952419 946105 939797 877840 942200 857275 874506 864490 842022 778030 772617 783634
3589 783634 815127 805965 726301 735375 705907 652210 727110 743750 735972 793189 752193 777351
3577 777351 809999 760956 730812 615564 687974 646745 609215 618790 525258 544199 618197 656660
3565 656660 596143 571210 509316 499823 620670 631248 654148 633030 640650 643382 630775 681449
3553 681449 700637 699422 681845 743792 696281 675927 630409 645619 797417 746419 733205 806811
$$ packed form
3637A570032j17980q2337O0931m38r7281M3204q4765k3754J4882L3229M7423k7247
3625A335899q321P067l8742j13748N8882l3845j08679j5917N828J5211n735q9460
3613A008440l0754L7445k6692J8697p517P383o362K3541J6575k3320k477j7772
3601I97187m4768o314o308o1957O4360q4925J7231j0016k2468o3992n413J1017
3589G83634L1493r162p9664R074k9468n3697P4900J6640p778N7217m0996K5158
3577G77351L2648m9043l0144j15248P2410m1229l7530R575r3532J8941P3998L8463
3565F56660o0517k4933o1894r493J20847J0578K2900k1118P620K732j2607N0674
3553F81449J9188j215j7577O1947m7511k0354m5518J5210J51798n0998j3214P3606
$$ plain form
3541 806811 820582 844883 801174 883535 966283 981905 986748 1012184 1110189 1253075 1417950
3530 1417950 1483799 1512446 1563806 1528588 1447337 1375977 1318373 1179670 1057296 891227 801427
3519 801427 785911 702653 699305 666691 615143 644570 608570 504814 524551 558116 489135 473913
3507 473913 441408 431131 438280 489671 528567 515599 472490 457687 450558 410478 429347 440238
3495 440238 433252 417339 369896 443355 424661 404256 469148 485801 504285 524185 443341 382997
3483 382997 441145 408708 365751 325282 386665 411969 365107 414586 411978 367773 422262 491408
3471 491408 444810 357446 327432 447187 533300 443675 386183 362016 366916 353538 320699 301325
3459 301325 314711 383561 310082 266855 287438 273237 345229 387157 365381 311956 309446 303467
$$ packed form
3541H06811J3771K4301m3709Q2361Q2748J5622M843K5436R8005J42886J64875
3530A417950O5849K8647N1360l5218q1251p1360n7604j38703j22374j66069q9800
3519H01427j5516q3258l348l2614n1548K9427l6000j03756J9737L3565o8981j5222
3507D73913l2505j0277P149N1391L8896j2968m3109j4803p129m0080J8869J0891
3495D40238o986j5913m7443P3459j8694k0405O4892J6653J8484J9900q0844o0344
3483C82997N8148l2437m2957m0469O1383K5304m6862M9479k608m4205N4489O9146
3471D91408m6598q7364l0014J19755Q6113q9625n7492k4167M900j3378l2839j9374
3459C01325J3386O8850p3479m3227K0583j4201P1992M1928k1776n3425k510n979
$$ plain form
3447 303467 304421 270830 251493 336438 315474 290277 248360 266766 286189 310157 317888 318976
3435 318976 306325 299733 256910 212261 290741 280497 374583 378207 374835 398241 319805 337802
3423 337802 375741 360148 326264 312634 287440 207342 339872 369390 304467 282025 281400 320115
3411 320115 289363 217560 301346 306624 353271 413521 368134 341720 360010 388002 365691 358995
3399 358995 355661 351343 357275 401480 349353 242550 266272 348796 342512 406606 416301 426216 392433
3386 392433 444018 432269 419965 455423 409546 435521 455581 476419 449015 476861 456705 445565
3374 445565 435979 428049 491540 508075 513922 472043 479933 564448 533919 522803 576558 544317
3362 544317 588225 572352 591107 608088 649086 647371 617419 635573 593744 588264 622038 607241
$$ packed form
3447C03467R54l3591j9337Q4945k0964k5197m1917J8406J9423K3968P731J088
3435C18976j2651o592m2823m4649P8480j0244R4086L624l372K3406p8436J7997
3423C37802L7939j5593l3884j3630k5194q0098J32530K9518o4923k2442o25L8715
3411C20115l0752p1803Q3786N278M6647O0250m5387k6414J8290K7992k2311o696
3399C58995l334m318N932M4205n2127j06803K3722Q2524o284O4094R695R915l3783
3386C92433N1585j1749j2304L5458m5877K5975K0060K0838k7404K7846k0156j1140
3374D45565r586p930O3491J6535N847m1879P890Q4515l0529j1116N3755l2241
3362E44317M3908j5873J8755J6981M0998j715k9952J8154m1829n480L3774j4797
$$ plain form
3350 607241 609017 590436 607288 631169 638133 631964 703232 651474 656576 681972 640419 722081
3338 722081 712636 763260 731904 640745 728914 838000 783212 862334 866051 758315 737860 737377
3326 737377 724675 781110 822152 814665 805561 726786 642819 705935 827579 824427 872448 749978
3314 749978 751354 829097 872807 861001 813307 844413 906822 946491 953951 971726 954565 965422
3302 965422 976586 1066333 1088059 1041219 1048021 1021294 1009548 923059 841257 845830 866516 862548
3290 862548 843249 852884 833517 853921 834348 880595 862212 855901 812571 800103 810873 808701
3278 808701 861855 936924 996771 1017290 993416 945241 941565 919654 869076 888005 848139 830239
3266 830239 862641 880811 854969 795699 785946 851643 843365 789375 760652 724613 733757 778930
$$ packed form
3350F07241J776j8581J6852K3881O964o169P1268n1758N102K5396m1553Q1662
3338G22081r445N0624l1356r1159Q8169J09086n4788P9122L717j07736k0455m83
3326G37377j2702N6435M1042p487r104p8775q3967O3116J21644l152M8021j22470
3314G49978J376P7743M3710j1806m7694L1106O2409L9669P460J7775j7161J0857
3302I65422J1164Q9747K1726m6840O802k6727j1746q6489q1802M573K0686l968
3290H62548j9299R635j9367K0404j9573M6247j8383o311m3330j2468J0770k172
3278H08701N3154P5069N9847K0519k3874m8175l676k1911n0578J8929l9866j7900
3266H30239L2402J8170k5842n9270r753O5697q278n3990k8723l6039R144M5173
$$ plain form
3254 778930 850271 912028 838756 794398 812574 784152 813034 765659 723533 758429 744120 713708
3242 713708 669932 747663 799893 791756 773512 844521 844368 805282 742882 679361 662433 649955
3230 649955 635433 621785 729790 720416 663330 667967 661293 650234 646192 661453 668380 676787 674654
3217 674654 677969 683729 685949 706895 702943 689822 653956 652947 609251 651539 741952 738491 715291
3204 715291 772028 743404 748214 810818 824592 871059 895858 836308 820238 771936 760589 714451
3192 714451 745963 677038 701538 785921 853839 891967 849038 855436 818171 842182 838563 874073
3180 874073 903401 905980 955087 1017665 979537 897042 896233 953120 998487 1033294 1044041 1041655
3168 1041655 1037386 1018357 1037547 1127543 1138476 1070562 1095012 1130284 1164064 1182106 1138519 1246574
$$ packed form
3254G78930P1341O1757p3272m4358J8176k8422K8882m7375m2126L4896j4309l0412
3242G13708m3776P7731N2230q137j8244P1009j53l9086o2400o3521j6928j2478
3230F49955j4522j3648J08005r374n7086M637o674j1059m042J5261O927Q407k133
3217F74654L315N760K220K0946l952j3121l5866j009m3696M2288R0413l461k3200
3204G15291N6737k8624M810O2604J3774M6467K4799n9550j6070m8302j1347m6138
3192G14451L1512o8925K4500Q4383O7918L8128m2929O398l7265K4011l619L5510
3180H74073K9328K579M9107O2578l8128q2495q09N6887M5367L4807J0747k386
3168A041655m269j9029J9190Q9996J0933o7914K4450L5272L3780J8042m3587J08055
$$ plain form
3156 1246574 1378697 1335567 1332784 1363945 1467309 1562523 1612430 1666622 1709642 1683945 1715868
3145 1715868 1788031 1775161 1733124 1733262 1787060 1875615 1972072 2052753 2087251 2193887 2362382
3134 2362382 2458052 2508696 2615480 2866298 3108909 3243926 3501247 3843231 4262062 4790603
3124 4790603 5293945 5595913 5488325 5024734 4473199 4051213 3737222 3531420 3369607 3262987
3114 3262987 3223192 3182526 3189876 3257767 3238013 3350398 3354783 3490742 3641879 3767988 3915554
3103 3915554 4171420 4476882 4805951 5199266 5719743 6355202 7147347 8120550 9137748
3094 9137748 9988573 9842714 9137515 8144989 7252072 6739463 6430574 6187331 5925685 5931314
3084 5931314 5864207 5582159 5302655 5031264 4758629 4488928 4292500 4262102 4164906 3988915
$$ packed form
3156A246574J32123m3130k783L1161J03364R5214M9907N4192M3020k5697L1923
3145A715868P2163j2870m2037J38N3798Q8555R6457Q0681L4498J06636J68495
3134B362382R5670N0644J06784K50818K42611J35017K57321L41984M18831N28541
3124D790603N03342L01968j07588m63591n51535m21986l13991k05802j61813j06620
3114C262987l9795m0666P350O7891j9754J12385M385J35959J51137J26109J47566
3103C915554K55866L05462L29069L93315N20477O35459P92145R73203J017198
3094I137748Q50825j45859p05199r92526q92917n12609l08889k43243k61646N629
3084E931314o7107k82048k79504k71391k72635k69701j96428l0398r7196j75991
$$ plain form
3074 3988915 3899937 3934456 3919124 3969631 4089946 4242745 4485744 4802254 5266500 5701693
3064 5701693 5572491 5103203 4591031 4119328 3827658 3607874 3334432 3143329 3105251 3041445
3054 3041445 3025735 3019986 2963560 2895589 2898103 2821964 2718364 2614696 2504719 2357002 2215943
3043 2215943 2129337 2049791 2017159 1917182 1866617 1884809 1934616 1891802 1847917 1917775 1991772
3032 1991772 2049668 2025165 2105661 2200204 2243700 2350673 2530094 2695450 2778014 2872560 2946856
3021 2946856 2916998 2896033 2869470 2868238 2703151 2479141 2334357 2261386 2177247 2130613 2089683
3010 2089683 2076241 2013281 2003324 1913572 1836633 1898718 1808370 1744784 1734696 1745560 1767163 1856140
2998 1856140 1821035 1848585 1875061 1994309 2130727 2203425 2257485 2126030 2189330 2215630 2207530
$$ packed form
3074C988915q8978L4519j5332N0507J20315J52799K42999L16510M64246M35193
3064E701693j29202m69288n12172m71703k91670k19784k73442j91103l8078o3806
3054C041445j5710n749n6426o7971K514p6139j03600j03668j09977j47717j41059
3043B215943q6606p9546l2632r9977n0565J8192M9807m2814m3885O9858P3997
3032A991772N7896k4503Q0496R4543M3496J06973J79421J65356Q2564R4546P4296
3021B946856k9858k0965k6563j232j65087k24010j44784p2971q4139m6634m0930
3010B089683j3442o2960r957q9752p6939O2085r0348o3586j0088J0864K1603Q8977
2998A856140l5105K7550K6476J19248J36418P2698N4060j31455O3300K6300q100
$$ plain form
2987 2207530 2241505 2252258 2218739 2264701 2432310 2572083 2671903 2796867 2814079 2673808 2546264
2976 2546264 2437021 2170846 2036507 1892384 1735219 1625402 1546897 1478101 1380860 1378281
2966 1378281 1403147 1441033 1454090 1465788 1505790 1582283 1531561 1627173 1737873 1792183 1972520
2955 1972520 2129936 2245834 2453677 2699368 2944443 2980253 2935146 2775165 2462038 2201747
2945 2201747 1959186 1757272 1560347 1446709 1396982 1327474 1297484 1184579 1144173 1116760
2935 1116760 1108838 1078887 1081456 1119324 1176604 1214161 1168482 1226953 1285375 1360902 1404499 1482375
2923 1482375 1575697 1622172 1697421 1686072 1602136 1425875 1384670 1345307 1258877 1209900 1119667
2912 1119667 1094373 1063418 1069524 1047813 1000697 977148 932766 988376 989151 1043196 1057404 1155782
$$ packed form
2987B207530L3975J0753l3519M5962J67609J39773R9820J24964J7212j40271j27544
2976B546264j09243k66175j34339j44123j57165j09817p8505o8796r7241k579
2966A378281K4866L7886J3057J1698M0002P6493n0722R5612J10700N4310J80337
2955A972520J57416J15898K07843K45691K45075L5810m5107j59981l13127k60291
2945B201747k42561k01914j96925j13638m9727o9508k9990j12905m0406k7413
2935A116760p922k9951K569L7868N7280L7557m5679N8471N8422P5527M3597P7876
2923A482375R3322M6475P5249j1349q3936j76261m1205l9363q6430m8977r0233
2912A119667k5294l0955O106k1711m7116k3549m4382N5610P75N4045J4208R8378
$$ plain form
2900 1155782 1193370 1083727 1084482 1137247 1177603 1238195 1339030 1324437 1387439 1419531 1521910
2889 1521910 1546855 1617458 1679123 1746907 1881157 1955337 2057431 2169051 2111613 2055274 2092131
2878 2092131 2104128 2080522 2036821 2078682 2132702 2111670 2060378 2123820 2210698 2179787 2200270
2867 2200270 2231962 2257201 2281794 2354617 2374683 2368537 2444361 2530468 2621201 2744727 2875293
2856 2875293 3088546 3271543 3429556 3726470 3997322 4256791 4401543 4489295 4453438 4336013
2846 4336013 4198877 3958995 3721335 3565118 3433186 3482472 3537139 3645153 3689703 3700318
2836 3700318 3658967 3682030 3716606 3682304 3577610 3503683 3498311 3419756 3460507 3525907 3568854
2825 3568854 3698926 3825291 3912549 3974398 3957075 4012006 4058285 4012058 3917504 3788567 3554330
$$ packed form
2900A155782L7588j09643P55N2765M0356O0592J00835j4593O3002L2092J02379
2889A521910K4945P0603O1665O7784J34250P4180J02094J11620n7438n6339L6857
2878B092131J1997k3606m3701M1861N4020k1032n1292O3442Q6878l0911K0483
2867B200270L1692K5239K4593P2823K0066o146P5824Q6107R0733J23526J30566
2856B875293K13253J82997J58013K96914K70852K59469J44752Q7752l5857j17425
2846D336013j37136k39882k37660j56217j31932M9286N4667J08014M4550J0615
2836C700318m1351K3063L4576l4302j04694p3927n372p8555M0751O5400M2947
2825C568854J30072J26365Q7258O1849j7323N4931M6279m6227r4554j28937k34237
$$ plain form
2814 3554330 3385096 3234106 3181777 3065486 2946179 2936212 2916544 2872260 2976579 3055059 3173817
2803 3173817 3209822 3184858 3247827 3281140 3367611 3439083 3558613 3598807 3457586 3280277 3175824
2792 3175824 3038373 2811923 2619534 2414390 2259448 2172434 2149264 1976108 1894775 1882020
2782 1882020 1879629 1881723 1819489 1883906 1876414 1881930 1871767 1860748 1815911 1813511 1899641 1959989
2770 1959989 2048495 2096926 2085411 2073111 2066680 2014773 1973993 1956881 1783627 1676612 1536690
2759 1536690 1536680 1438928 1406452 1389719 1279133 1213521 1150139 1084443 1076527 991908 979326 1036674
2747 1036674 929486 982593 925512 917699 866232 830663 867037 754183 753732 747912 697914 819611
2735 819611 850740 717244 658521 644534 592338 592956 620964 599471 519658 495535 447323 424241
$$ packed form
2814C554330j69234j50990n2329j16291j19307r967j9668m4284J04319P8480J18758
2803C173817L6005k4964O2969L3313Q6471P1472J19530M0194j41221j77309j04453
2792C175824j37451k26450j92389k05144j54942q7014k3170j73156q1333j2755
2782A882020k391K094o2234O4417p492N516j0163j1019m4837k400Q6130O0348
2770A959989Q8506M8431j1515j2300o431n1907m0780j7112j73254j07015j39922
2759A536690j0r7752l2476j6733j10586o5612o3382o5696p916q4619j2582N7348
2747A036674j07188N3107n7081p813n1467l5569L6374j12854m51n820m9998J21697
2735H19611L1129j33496n8723j3987n2196O18K8008k1493p9813k4123m8212k3082
$$ plain form
2723 424241 451496 453330 478559 376877 350827 406896 473616 350614 322548 333013 301987
2712 301987 279461 293927 273003 194130 209436 213510 218624 232536 308158 231119 251387 225541
2700 225541 145129 141638 167808 191669 139821 136629 153381 162603 165353 158170 208375 170063 177476
2687 177476 140544 106419 217047 240309 200626 251354 206257 168299 152940 171119 95390
2676 95390 120700 175718 137105 118830 46333 72519 14181 21925 23943 25221 100924 114460
2664 114460 161868 145800 111213 85791 57320 62645 32224 49674 5496 99646 108993 68102
2652 68102 75423 89570 143201 122778 71228 62937 751 9875 43098 90360 2096 -1437 51031
2639 51031 62627 75658 30016 11013 -14452 7815 18176 48262 27893 58596 98073 89108
$$ packed form
2723D24241K7255J834K5229j01682k6050N6069O6720j23002k8066J0465l1026
2712C01987k2526J4466k0924p8873J5306M074N114J3912P5622p7039K0268k5846
2700B25541q0412l491K6170K3861n1848l192J6752R222K750p183N0205l8312P413
2687A77476l6932l4125J10628K3262l9683N0728m5097l7958j5359J8179p5729
2676I5390K5310N5018l8613j8275p2497K6186n8338P744K018J278P5703J3536
2664A14460M7408j6068l4587k5422k8471N325l0421J7450m4178R4150R347m0891
2652F8102P321J4147N3631k0423n1550q291o2186R124L3223M7262q8264l533N2468
2639E1031J1596J3031m5642j9003k5465K2267J0361L0086k0369L0703L9477q965
$$ plain form
2627 89108 48280 64129 103854 64604 29218 103688 189151 125032 116170 128911 69418 188854
2615 188854 182138 163568 111766 48474 57795 126981 157186 102336 137556 145397 78382 14889
2603 14889 49291 115254 115142 140215 70890 74350 61604 128863 188654 111812 137933 106926
2591 106926 121710 193136 234891 229906 207986 196791 267771 253585 251628 253608 249471 346205
2579 346205 269853 273563 265629 255193 299262 308369 246302 335068 399414 408605 455514 455552 399277
2566 399277 435130 608737 562728 524595 502548 553607 655442 650261 614766 700006 779666
2555 779666 761902 723216 836831 880963 818114 836401 852246 940735 957807 932678 999050
2544 999050 1014040 964283 1000093 1126130 1101618 1036983 1110693 1089989 1113584 1183006 1141891
$$ packed form
2627H9108m0828J5849L9725l9250l5386P4470Q5463o4119q862J2741n9493J19436
2615A88854o716j8570n1802o3292R321O9186L0205n4850L5220P841o7015o3493
2603A4889L4402O5963j12K5073o9325L460j2746O7259N9791p6842K6121l1007
2591A06926J4784P1426M1755m985k1920j1195P0980j4186j957J980m137R6734
2579C46205p6352L710p934j0436M4069R107o2067Q8766O4346R191M6909L8n6275
2566C99277L5853J73607m6009l8133k2047N1059J01835n181l5495Q5240P9660
2555G79666j7764l8686J13615M4132o2849J8287J5845Q8489J7072k5129O6372
2544I99050J4990m9757L5810J26037k4512o4635P3710k0704K3595O9422m1115
$$ plain form
2533 1141891 1140474 1097709 1087387 1099202 1209569 1121835 1205866 1305579 1349150 1503746 1542008
2522 1542008 1489537 1364938 1455533 1527942 1502678 1489525 1571807 1614936 1621132 1702391 1743000
2511 1743000 1776055 1763612 1729044 1699968 1627001 1593944 1517287 1443449 1417450 1363589 1343662
2500 1343662 1316316 1279234 1255516 1279715 1270012 1338039 1436556 1388820 1380220 1440645 1420153 1423872
2488 1423872 1406543 1448614 1455855 1438068 1388119 1403096 1368881 1384556 1445869 1458685 1441258 1425726
2476 1425726 1375859 1284726 1201911 1080614 997034 1012359 998302 790391 727140 713500 756880
2465 756880 657323 608083 647059 649299 579965 585843 672092 633559 599654 624074 640059 638941
2453 638941 580563 559879 566110 566338 566102 486242 485074 474880 401842 365567 474436 517387 477294
$$ packed form
2533A141891j417m2765j0322J1815J10367q7734Q4031R9713M3571J54596L8262
2522A542008n2471j24599R0595P2409k5264j3153Q2282M3129O196Q1259M0609
2511A743000L3055j2443l4568k9076p2967l3057p6657p3838k5999n3861j9927
2500A343662k7346l7082k3718K4199r703O8027R8517m7736q600O0425k0492L719
2488A423872j7329M2071P241j7787m9949J4977l4215J5675O1313J2816j7427j5532
2476A425726m9867r1133q2815j21297q3580J5325j4057k07911o3251j3640M3380
2465G56880r9557m9240L8976K240o9334N878Q6249l8533l3905K4420J5985j118
2453F38941n8378k0684O231K28k36p9860j168j0194p3038l6275J08869M2951m0093
$$ plain form
2440 477294 390353 320386 304016 307025 318821 336257 307419 222232 183793 175278 225477 224503
2428 224503 227719 128128 67907 118603 158652 159545 185708 154671 108191 77881 48614 52063
2416 52063 46393 89963 127949 27032 48669 98407 107192 -17590 -83419 -81094 -92135 -52516
2404 -52516 -20251 7810 54076 107156 175423 198927 216709 162834 53397 9730 -44317 -9859
$$ packed form
2440D77294q6941o9967j6370L009J1796J7436k8838q5187l8439q515N0199r74
2428B24503L216r9591o0221N0696M0049Q93K6163l1037m6480l0310k9267L449
2416E2063n670M3570L7986j00917K1637M9738Q785j24782o5829K325j1041L9619
2404e2516L2265K8061M6266N3080O8267K3504J7782n3875j09437m3667n4047L4458
$$ [...]
##END NTUPLES=NMR SPECTRUM
##END=
