##TITLE=1H_CA-8910-2
 CDCl3, 8 sc, 
 4.08.2021
##JCAMPDX= 6.0         $$ Bruker NMR JCAMP-DX V2.0
##DATA TYPE= NMR SPECTRUM
##DATA CLASS= NTUPLES
##ORIGIN= UXNMR, Bruker Analytische Messtechnik GmbH
##OWNER= root
$$ XWIN-NMR		Version 3.5
$$ Wed Aug  4 08:39:00 2021 Russian Standard Time (UT+4h)  she@DPX200
##.OBSERVE FREQUENCY= 200.131506
##.OBSERVE NUCLEUS= ^1H
##.ACQUISITION MODE= SIMULTANEOUS
##.ACQUISITION SCHEME= undefined
##.AVERAGES= 8
##.DIGITISER RES= 18
##SPECTROMETER/DATA SYSTEM= spect
##.PULSE SEQUENCE= zg30
##.SOLVENT NAME= CDCl3
##.SHIFT REFERENCE= (INTERNAL, CDCl3, 0, 17.502)
##AUDIT TRAIL= $$ (NUMBER, WHEN, WHO, WHERE, WHAT)
$$ ##TITLE= Audit trail, XWIN-NMR		Version 3.5
$$ ##JCAMPDX= 5.01
$$ ##ORIGIN= Bruker BioSpin GmbH
$$ ##OWNER= she
$$ F:/spectra/data/she/nmr/H-F/1/pdata/1/auditp.txt
$$ ##AUDIT TRAIL=  $$ (NUMBER, WHEN, WHO, WHERE, WHAT)
(   1,<2021-08-04 08:37:50.25 +0400>,<she>,<DPX200>,
      <created by zg, POWCHK disabled, PULCHK disabled
       configuration hash MD5:
       00 E9 B6 7A A2 85 ED C7 34 08 36 98 17 FE 4E 26
       data hash MD5: 16K
       84 A9 92 92 92 29 35 3B 22 E8 A5 86 51 ED D2 8E>)
(   2,<2021-08-04 08:37:52.70 +0400>,<she>,<DPX200>,
      <Start of raw data processing
       efp BC_mod = 2 LB = 0.24 FT_mod = 6 PKNL = 1 PHC0 = -13511.07 PHC1 = 9.800991 SI = 16K 
       data hash MD5: 16K
       B6 BD 03 E1 27 6A FD 5E BF 76 7A DF A3 D5 58 58>)
(   3,<2021-08-04 08:38:07.62 +0400>,<she>,<DPX200>,
      <pk PHC0 = -0.1841775 PHC1 = -0.2 
       data hash MD5: 16K
       B2 D4 B9 74 06 28 95 45 72 FB 8B 99 C5 A6 91 C1>)
(   4,<2021-08-04 08:38:10.79 +0400>,<she>,<DPX200>,
      <abs ABSG = 5 
       data hash MD5: 16K
       DB E5 41 D5 F1 A1 D3 FA CD 7F 83 E0 62 AC 85 48>)
(   5,<2021-08-04 08:38:40.84 +0400>,<she>,<DPX200>,
      <abs ABSG = 5 
       data hash MD5: 16K
       CA ED 99 A7 33 6A 42 EA 32 41 CE 4A D8 D1 9A 58>)
$$ ##END=
$$ 
$$ hash MD5
$$ 2F 2B 2D BA B2 4F F7 67 E2 01 99 85 82 B9 BE FD
##$RELAX= 
##$RELAX= 
##$RELAX= 
##$RELAX= 
##$RELAX= 
##$RELAX= 
$$ Bruker specific parameters
$$ --------------------------
##$DU= <F:/spectra>
##$EXPNO= 1
##$NAME= <H-F>
##$PROCNO= 1
##$TYPE= <nmr>
##$USER= <she>
##$AMP= (0..31)
100 100 100 100 100 100 100 100 100 100 100 100 100 100 100 100 100 100 
100 100 100 100 100 100 100 100 100 100 100 100 100 100 
##$AQSEQ= 0
##$AQ_mod= 1
##$AUNM= <au_zg>
##$AUTOPOS= <>
##$BF1= 200.13
##$BF2= 200.13
##$BF3= 200.13
##$BF4= 200.13
##$BF5= 200.13
##$BF6= 200.13
##$BF7= 200.13
##$BF8= 200.13
##$BYTORDA= 1
##$CFDGTYP= 0
##$CFRGTYP= 5
##$CHEMSTR= <none>
##$CNST= (0..31)
1 1 145 1 1 1 1 1 1 1 1 1 1 1 1 1 1 1 1 1 1 1 1 1 1 1 1 1 1 1 1 1 
##$CPDPRG= <>
##$CPDPRG1= <>
##$CPDPRG2= <>
##$CPDPRG3= <>
##$CPDPRG4= <mlev>
##$CPDPRG5= <mlev>
##$CPDPRG6= <mlev>
##$CPDPRG7= <mlev>
##$CPDPRG8= <mlev>
##$CPDPRGB= <>
##$CPDPRGT= <>
##$D= (0..31)
0 1.2 0 0 0 0 0 0 0 0.06 0 0.03 0 0 0 0 0.0002 0 0 0 0 0 0 0 0 0 0 0 0 
0 0 0 
##$DATE= 1628051869
##$DBL= (0..7)
$$ [...]
##$SUBNAM3= <"">
##$SUBNAM4= <"">
##$SUBNAM5= <"">
##$SUBNAM6= <"">
##$SUBNAM7= <"">
##$SUBNAM8= <"">
##$SUBNAM9= <"">
##$SW= 20.0188882624521
##$SWIBOX= (0..15)
0 0 2 0 0 0 0 0 0 0 0 0 0 0 0 0 
##$SW_h= 4006.41025641026
##$TD= 16384
##$TD0= 1
##$TE= 0
##$TE2= 300
##$TE3= 300
##$TEG= 300
##$TL= (0..7)
0 120 120 120 120 120 120 120 
##$TP= (0..7)
150 150 150 150 150 150 150 150 
##$TP07= 0
##$TPNAME0= <>
##$TPNAME1= <>
##$TPNAME2= <>
##$TPNAME3= <>
##$TPNAME4= <>
##$TPNAME5= <>
##$TPNAME6= <>
##$TPNAME7= <>
##$TPOAL= (0..7)
0.5 0.5 0.5 0.5 0.5 0.5 0.5 0.5 
##$TPOFFS= (0..7)
0 0 0 0 0 0 0 0 
##$TUNHIN= 0
##$TUNHOUT= 0
##$TUNXOUT= 0
##$USERA1= <user>
##$USERA2= <user>
##$USERA3= <user>
##$USERA4= <user>
##$USERA5= <user>
##$V9= 5
##$VALIST= <valist>
##$VCLIST= <CCCCCCCCCCCCCCC>
##$VD= 0
##$VDLIST= <DDDDDDDDDDDDDDD>
##$VPLIST= <PPPPPPPPPPPPPPP>
##$VTLIST= <TTTTTTTTTTTTTTT>
##$WBST= 1024
##$WBSW= 4
##$XGAIN= (0..3)
0 0 0 0 
##$XL= 0
##$YL= 0
##$YMAX_a= 122417
##$YMIN_a= -150913
##$ZGOPTNS= <>
##$ZL1= 120
##$ZL2= 120
##$ZL3= 120
##$ZL4= 120
##$ABSF1= 17.502
##$ABSF2= -2.517038
##$ABSG= 5
##$ABSL= 3
##$ALPHA= 0
##$AQORDER= 0
##$ASSFAC= 0
##$ASSFACI= 0
##$ASSFACX= 0
##$ASSWID= 0
##$AUNMP= <proc_1d>
##$AZFE= 0.1
##$AZFW= 0.1
##$BCFW= 0
##$BC_mod= 2
##$BYTORDP= 0
##$COROFFS= 0
##$CY= -3
##$DATMOD= 1
##$DC= 0
##$DFILT= <>
##$DTYPP= 0
##$F1P= 0
##$F2P= 0
##$FCOR= 1
##$FTSIZE= 16384
##$FT_mod= 6
##$GAMMA= 0
##$GB= 0
##$INTBC= 1
##$INTSCL= 1.334414e-10
##$ISEN= 128
##$LB= 0.24
##$LEV0= 0
##$LPBIN= 0
##$MAXI= 10000
##$MC2= 0
##$MEAN= 0
##$ME_mod= 0
##$MI= 1.114404
##$NCOEF= 0
##$NC_proc= -6
##$NLEV= 6
##$NOISF1= 3.799351
##$NOISF2= 2.8
##$NSP= 0
##$NTH_PI= 0
##$NZP= 0
##$OFFSET= 17.502
##$PC= 1
##$PHC0= -13511.25
##$PHC1= 9.600991
##$PH_mod= 1
##$PKNL= yes
##$PPARMOD= 0
##$PSCAL= 0
##$PSIGN= 0
##$REVERSE= no
##$SF= 200.130006530204
##$SI= 16384
##$SIGF1= 3
##$SIGF2= 2
##$SINO= 5.538805
##$SIOLD= 16384
##$SREGLST= <1H.CDCl3>
##$SSB= 0
##$STSI= 16384
##$STSR= 0
##$SW_p= 4006.41025641026
##$SYMM= 0
##$S_DEV= 0
##$TDeff= 16384
##$TDoff= 0
##$TI= <>
##$TILT= no
##$TM1= 0
##$TM2= 0
##$TOPLEV= 0
##$USERP1= <user>
##$USERP2= <user>
##$USERP3= <user>
##$USERP4= <user>
##$USERP5= <user>
##$WDW= 1
##$XDIM= 16384
##$YMAX_p= 286244583
##$YMIN_p= -112638
$$ End of Bruker specific parameters
$$ ---------------------------------
##NTUPLES= NMR SPECTRUM
##VAR_NAME=  FREQUENCY,     SPECTRUM/REAL,   SPECTRUM/IMAG
##SYMBOL=    X,             R,               I
##VAR_TYPE=  INDEPENDENT,   DEPENDENT,       DEPENDENT
##VAR_FORM=  AFFN,          ASDF,            ASDF
##VAR_DIM=   16384,         16384,           16384
##UNITS=     HZ,            ARBITRARY UNITS, ARBITRARY UNITS
##FACTOR=    0.24454680195387, 1,            1
##FIRST=     3502.67553613993, 0,            0
##LAST=      -503.734720270327, 0,           0
##MIN=       -503.734720270327, -112638,     0
##MAX=       3502.67553613993, 286244583,    0
$$ Real data points
##PAGE= N=1
##DATA TABLE= (X++(R..R)), XYDATA
$$ [...]
7299B23547K9705k1397N2342L6163L345m6165J3834o7928k4435K988l5186j5752
7287A51061J1631j871j1285j3721R375Q562o366j1444J7166j614L3152J7455j2090
7274A90011k1404K7550R797J5460O9323n3406j4026J8237K7177k5162k8180J6075
7262B31452J5053l2234k4932J7882M1403M5565p546l0309Q95l798J7477J6605
7250B87513J2038m6024r366j954L9164L192m5431L1443l0286o870K4275J3884
7238B71578q023K4323k1014K308K9999K1610k9214k429j4701J1569M210K4956
7226C15172M5194j1300l4214N0052N5672N3064j2445r158K390M7020M0743l8421
7214E03769m0237j1266J3240L193K701q330L8486K0258J5751L5994L7796j1170
$$ y = [223547, 253252, 231855, 284197, 320360, 323705, 277540, 291374, 223446, 199011, 201999, 166813, 151061, 162692, 160821, 149536, 135815, 145190, 153752, 147386, 135942, 153108, 151494, 184646, 202101, 190011, 168607, 196157, 205954, 221414, 290737, 237331, 223305, 241542, 268719, 243557, 215377, 231452, 246505, 214271, 189339, 207221, 248624, 294189, 286643, 256334, 257229, 253431, 270908, 287513, 299551, 253527, 244161, 242207, 281371, 284563, 239132, 270575, 240289, 233419, 257694, 271578, 263555, 287878, 266864, 269172, 299171, 320781, 291567, 289138, 274437, 286006, 290216, 315172, 360366, 349066, 314852, 364904, 420576, 473640, 461195, 452037, 454427, 501447, 542190, 503769, 463532, 452266, 465506, 468699, 471400, 463070, 501556, 521814, 537565, 573559, 611355, 600185]
7202F00185L0006K9583N399K4611L0023N097L2152J4427O6435L047O5233N0096
7190I56294K4858L2473N1928L5002L9610P8019J2285M7751L8984Q5648L3468M1326
7178A477646L9165J06755J07891J9430K2444K6858P4808O8124O0774j4567N1559
7167B040887Q2485O8341M9623L7533R1066Q9612L6526P1368P5236R7005J10150
7156B849832O6778J02968J82390Q7427O7851J27427J33172J41380J20807J34067
7146D014099J41560J67836J44746K13473J91228K15173K77832K52260L42962L54151
7136F315320L73349L77518M12658M22121M62815N28194N50847O59109P47069P68065
7126A1617065R76133J142351J327474J636456K085322K542792K965309L398295
$$ y = [600185, 630191, 659774, 665173, 689784, 719807, 724904, 757056, 771483, 837918, 840965, 906198, 956294, 981152, 1013625, 1065553, 1100555, 1140165, 1218184, 1230469, 1278220, 1317204, 1402852, 1436320, 1477646, 1516811, 1623566, 1731457, 1750887, 1773331, 1800189, 1874997, 1943121, 2003895, 1989328, 2040887, 2123372, 2191713, 2241336, 2278869, 2369935, 2459547, 2496073, 2567441, 2642677, 2739682, 2849832, 2916610, 3019578, 3201968, 3289395, 3357246, 3484673, 3617845, 3759225, 3880032, 4014099, 4155659, 4323495, 4468241, 4681714, 4872942, 5088115, 5365947, 5618207, 5961169, 6315320, 6688669, 7066187, 7478845, 7900966, 8363781, 8891975, 9442822, 10101931, 10849000, 11617065, 12593198, 13735549, 15063023, 16699479, 18784801, 21327593, 24292902, 27691197]
7118B7691197L838302M375329N118411O280364P697592R425593J0569758R959802
7110H4956348O153038J5461o497747j1121190j2365056j1282785q979751o691707
7102C4186611m895068l636641k728245k230162j885801j634276j415273j260730
7094A4500415j130828j051586q81297p48955o91910o33947n40226m12504m64958
7085G944204l97432l47897l10125k87102k00644k23458k61453k37871k28586k27800
7075E221836k32892k23296k10933j61496j78941k12919j27554j59984j13191o8265
7065C532365r4247o5218o7048j24792q0222j13530j12836j07324j12063j44174
7055B510911r3579p9254l8699o1851k8770m2056r1201q1193p8299p3097m9853
$$ y = [27691197, 31529499, 35904828, 41023239, 47303603, 55001195, 64426788, 74996546, 84956348, 91109386, 91124847, 84627100, 73505910, 61140854, 49858069, 40878318, 34186611, 29291543, 25654902, 22926657, 20696495, 18810694, 17176418, 15761145, 14500415, 13369587, 12318001, 11436704, 10687749, 9995839, 9361892, 8821666, 8409162, 7944204, 7546772, 7198875, 6888750, 6601648, 6401004, 6177546, 5916093, 5678222, 5449636, 5221836, 4988944, 4765648, 4554715, 4393219, 4214278, 4001359, 3873805, 3713821, 3600630, 3532365, 3438118, 3372900, 3305852, 3181060, 3100838, 2987308, 2874472, 2767148, 2655085, 2510911, 2417332, 2338078, 2299379, 2237528, 2208758, 2166702, 2075501, 1994308, 1916009, 1842912, 1793059]
7044A793059l9247k5159n2981m2504k7171p2396m2736l5774k989o9156o8100l3452
7032A281394J0515m7110j2063m3948j8298k6994n3156j0245m9627J3286L587n5418
7020I91923l1929j2063q679k0859n7009K9221l626k2686q605k177j1190n3968
7008G88353j3298k8911p899n5040j4758k7520l4722M622j7559J0103k5256J4531
6996E92646M615k3319J5327K2589j0857n034k7763K678m8818l8743L3000j2453
6984E03868N558k1527J4292M657n4483j9244O881j8573l1645j4669j9720j4561
6972C40834j7116j0880K9874N492q928l968R313j6256k3582Q012m6000j1548J5833
6959B71080J4309L8165k0104n9946M745J9994k8565k31n778J8296l7541L5809
$$ y = [1793059, 1753812, 1728653, 1675672, 1633168, 1605997, 1533601, 1490865, 1455091, 1452102, 1382946, 1314846, 1281394, 1291909, 1244799, 1232736, 1188788, 1170490, 1143496, 1090340, 1080095, 1030468, 1043754, 1047341, 991923, 959994, 947931, 939252, 918393, 861384, 890605, 886979, 864293, 855688, 853511, 842321, 788353, 775055, 746144, 738245, 683205, 668447, 640927, 606205, 610827, 593268, 603371, 578115, 592646, 597261, 573942, 589269, 611858, 601001, 595967, 568204, 570882, 522064, 483321, 516321, 503868, 509426, 487899, 502191, 506848, 452365, 433121, 440002, 421429, 389784, 375115, 355395, 340834, 323718, 312838, 342712, 348204, 339276, 335308, 344621, 328365, 304783, 312795, 266795, 255247, 271080, 285389, 323554, 303450, 243504, 248249, 268243, 239678, 239447, 233669, 251965, 214424, 250233]
6947B50233N839O098j8589p456K3371l1436k7054K7847M873k7975J2706j4592
6935B03865q841j1914J9054K6391n0772m3021L4067K8249k1035K2694m6455n9606
6923I2676R463L1962k1105K2728M3090l0301l3316J8769l9414O8814n366k5315
6911A32685q877K908n703k0762j8939M351J5685j3636L5651k3246k1429J4193
6899I2881M5328m7281R459k185L1640l228r225j5224J6607j8702m6072j99M5243
6886I9042k2450m4062M8286K7903J423j0472q064k5721k1041M9911q894k664O36
6873H3833L487j498l3221q78K5730j4410K5199l484N367J3865j291j4870l9521
6860D8308Q76M3886O660M905l1773l32j2349R964l098L2337q127n1329K1336K2821
$$ y = [250233, 256072, 262170, 243581, 236125, 259496, 228060, 201006, 228853, 233726, 205751, 218457, 203865, 195024, 183110, 202164, 228555, 177783, 134762, 168829, 197078, 176043, 198737, 152282, 92676, 102139, 134101, 112996, 135724, 178814, 148513, 115197, 133966, 94552, 163366, 158000, 132685, 123808, 126716, 121013, 100251, 81312, 85663, 101348, 87712, 123363, 100117, 78688, 92881, 138209, 90928, 100387, 98202, 129842, 126614, 117389, 102165, 118772, 100070, 53998, 53799, 99042, 76592, 32530, 80816, 108719, 110142, 99670, 91606, 65885, 44844, 94755, 85861, 83197, 83833, 87320, 85822, 52601, 51723, 77453, 63043, 88242, 84758, 90125, 103990, 102699, 87829, 48308, 49184, 93070, 99730, 104635, 72862, 72530, 60181, 70145, 67047, 99384, 91257, 39928, 61264, 84085]
6846H4085L1614J2751j1426k0324L820k685J7992m9965j4497L0510R294p537N555
6833H9187m3116J5893L4055j9298k6019L388J4198N780N215M196l8740M463K9776
6820G8978o435k8884L624L2170J421J5242j2249k3036J829k0110K507R456r902
6807D4611P901o576o011p462L714k1867J779J7690N1500j4526Q120k5987l0598
6794B2288m28N2832P676j5498J0793l8910q636J7348J3595q512j593j665P9833
6781A29123k9251k3686k4075J4817J046M517n564J289j8743K9053L3j8328K8541
6768H8772k6842K0114J9983l8199J8421p413P038J5754j2027J1993l5499Q634
6756G0729K8077K9978J7420j0737j168j319K134K5074j7608L0166J4771r493L2851
$$ y = [84085, 115699, 128450, 117024, 96700, 100520, 97835, 115827, 65862, 51365, 81875, 91169, 83632, 89187, 46071, 61964, 96019, 76721, 50702, 54090, 68288, 74068, 79283, 83479, 44739, 49202, 78978, 72543, 43659, 47283, 79453, 80874, 96116, 83867, 60831, 62660, 42550, 45057, 54513, 44611, 52512, 45936, 39925, 32463, 36177, 14310, 16089, 33779, 85279, 70753, 78873, 52886, 22288, 21860, 74692, 82368, 66870, 77663, 38753, 30117, 47465, 61060, 52548, 50955, 49290, 129123, 99872, 76186, 52111, 66928, 67974, 72491, 66927, 68216, 49473, 78526, 78559, 60231, 88772, 61930, 82044, 102027, 63828, 82249, 74836, 81874, 97628, 85601, 97594, 62095, 70729, 98806, 128784, 146204, 135467, 134299, 132980, 135114, 160188, 142580, 172746, 187517, 178024, 210875]
6743B10875N0014k882K3455O9856R9954L7583n16P0214j2930m1283o3778p8492
6731C62070k6028q1362j5640o868o5811k4597j1284M4236l5055q188k323J5799
6719A44949l7461j3863L3869m3695K366m778K2374k4463q371M2297r472p272J8080
6706A14560O025O16j130m3852P002K584M408k473j7519k8038j551L401l3621K4460
6692C4872K0402K3248r127M5418k4149l4050L4872K0980M161N920j8980n137r304
6679H9126j6003J5252l6726K3454o438R446k6911L7768J5545L304J7008k2631
6667A02194k1573r858K3807L5693K0367M06j4147l587L549j7695j9221J0732m118
6654A06549K563L8044l9308Q073k910M23k366j722J0631K6926n9203K8878K9901
$$ y = [210875, 260889, 258007, 281462, 351318, 451272, 488855, 488339, 558553, 545623, 504340, 440562, 362070, 336042, 254680, 239040, 232172, 166361, 141764, 130480, 174716, 139661, 131473, 129150, 144949, 107488, 93625, 127494, 83799, 86165, 81387, 103761, 79298, 70927, 113224, 103752, 96480, 114560, 120585, 121201, 120071, 76219, 83221, 85805, 90213, 87740, 70221, 42183, 40632, 44033, 10412, 34872, 55274, 78522, 69395, 114813, 90664, 56614, 91486, 112466, 116627, 122547, 103567, 98430, 89126, 73123, 88375, 51649, 75103, 68665, 78111, 51200, 88968, 104513, 107817, 124825, 102194, 80621, 70763, 94570, 130263, 150630, 151036, 136889, 133302, 136851, 119156, 99935, 110667, 106549, 109112, 147156, 107848, 115921, 113011, 113434, 111068, 109346, 119977, 146903, 87700, 116578, 146479]
6641A46479n239m4347k4200R822N9013k4992k6151K0441m613K2695r555j8911
6629A00442P039K7774L1137l2222O394j8436o308K261k5713J5266O2786N386O08
6616A76414K2171m5724m0225r539M0639m950K2717P375M964o987J1991M5158K2293
6603B46297k8282K0523K6134O518K0201P3827L2049K5919J0758O7994Q5336L878
6591E91152k2392Q7320L0614J7742j3103j6520K734l3918l2665k9967n3870o8292
6579D58835k2944q0483o2877k0377K680k4l9359l6629j7698M9333j2459k1575
6567A96423j0057L514o772P660P104l068K429J9860N15Q249p006m4833n438J2009
6553A80589J2251j5132n224j905o771m4565O2301k7056J1684K228J914j024M872
$$ y = [146479, 141240, 96893, 72693, 82515, 141528, 116536, 90385, 110826, 106213, 128908, 119353, 100442, 107481, 135255, 166392, 134170, 140564, 122128, 115820, 118081, 92368, 107634, 170420, 175806, 176414, 198585, 152861, 112636, 103097, 143736, 138786, 161503, 168878, 173842, 166855, 178846, 224004, 246297, 218015, 238538, 264672, 271190, 291391, 365218, 397267, 423186, 433944, 501938, 587274, 591152, 568760, 656080, 686694, 704436, 691333, 674813, 677547, 643629, 610964, 580997, 527127, 458835, 435891, 355408, 292531, 272154, 274834, 274810, 235451, 198822, 181124, 230457, 217998, 196423, 186366, 189880, 183108, 190768, 197872, 194804, 197233, 217093, 217608, 225857, 218851, 174018, 168580, 180589, 192840, 177708, 172484, 170579, 163808, 119243, 181544, 154488, 166172, 168400, 170314, 169290, 174162]
6540A74162L6882j4505p517K2655l6901k9783K5960r090l2406J6940K627J2835
6528A61859R292J2475J1225n934k0714n0050J5400J5858n689q929O0607k2824
6516A72576M2M748k6431j4096J4419K9982o036l8490n63J8492r069K8126j4565
6503A59135m645k7700K8662K3719j8573K1358q881k6961k1630L880L5530K8876
6491A92770j330m0437k4535Q396P505J1066o918L2666K3751n304O584k59k4985
6478A78970k0102Q258m228m0198j9163N6995P054P409o178L8444n169o090l1902
6465A64100k4497J1450N7198J5799N83N071n941j9638o7668J2001j4772L901k0150
6452A17437R217L2145L1331R123k1055L088J455k1782K4749l3233j0716L3975
$$ y = [174162, 211044, 196539, 189022, 211677, 174776, 144993, 170953, 161863, 129457, 146397, 149024, 161859, 171151, 183626, 194851, 188917, 168203, 118153, 133553, 149411, 143722, 134793, 195400, 172576, 172618, 177366, 150935, 136839, 151258, 181240, 175204, 136714, 136151, 154643, 145574, 173700, 159135, 154490, 126790, 155452, 179171, 160598, 181956, 173075, 146114, 124484, 128364, 163894, 192770, 191440, 151003, 126468, 134864, 142369, 153435, 146517, 179183, 202934, 197630, 204214, 203955, 178970, 158868, 167126, 162898, 122700, 103537, 160532, 167586, 174995, 168817, 207261, 202092, 196002, 164100, 139603, 151053, 208251, 224050, 224633, 229704, 223763, 204125, 136457, 148458, 133686, 137587, 117437, 126654, 158799, 190130, 199253, 178198, 181286, 182741, 160959, 185708, 152475, 141759, 175734]
6440A75734K295K096M8970k5710m38L594m4642K0814l367j1482K3013J2154K892
6427B05923k9318K6261M0413k2457j4448J8532M0155j933j7519o4806Q168M8529
6415B37500q0059J2777K9950J6805l6599k2006M9052n377k0432K1019M323k7720
6403A79233K0281K3345k5457J6327j4147m0485l623K3705O929j4615K0234r579
6391A82148r303L5189j6661k8156N5521O4909l2021m7723l8687L853K2496M7531
6379B39096j7142j4462L7922J5093k834J146p787m8737o35n655L644J2500j766
6366B10383J0176J4969n208K9062J6421j4925m1218Q59L9237L0623j5446J159
6354B76092J7495L7663k1306K4231K140K5265J1431N1677K5660M653O729L1522
$$ y = [175734, 178029, 180125, 229095, 203385, 202947, 206541, 161899, 182713, 179346, 167864, 190877, 203031, 205923, 176605, 202866, 243279, 220822, 206374, 224906, 265061, 263128, 245609, 180803, 188971, 237500, 157441, 170218, 200168, 216973, 180374, 158368, 207420, 202043, 181611, 202630, 206953, 179233, 199514, 222859, 197402, 213729, 199582, 159097, 155474, 179179, 186108, 171493, 191727, 182148, 172845, 208034, 191373, 163217, 218738, 283647, 251626, 203903, 165216, 169069, 191565, 239096, 221954, 207492, 245414, 260507, 257673, 258819, 251032, 202295, 201660, 196005, 199649, 212149, 210383, 220559, 235528, 230320, 259382, 275803, 260878, 219660, 220519, 259756, 290379, 274933, 276092, 293587, 331250, 309944, 334175, 336315, 361580, 373011, 424688, 450348, 455001, 461730, 493252]
6342D93252k7171l694J6106l9677n9186j1436O055q850m9195n0779O406K53j2037
6329B60047m2143J9380J2696R698p246J9383K0036m5244j665K0681r729J0465
6317B66359J3838l5746m3071l256Q632J7794k1500J3817L3895n495j6130m7518
6305A81619L9354P262Q468l9523p603L3376j9635k740J3764j845k1863M885j3964
6292A81555k986K4850K101k8189K3982l3772L1516J6765K3944j2048j8701K697
6280B11714K0834P804p027l5993J3033K5582P799m1453j8710J8692Q980M5069
6268B56324J2472O06k283r315R999Q458k1496k3383K1515M1499N1364l9790m0068
6255B65902k2102j3768j577m576L1510k3714L2336k6068k1167p075r22K6316r11
$$ y = [493252, 466081, 462387, 478493, 438816, 379630, 368194, 374249, 365399, 316204, 265425, 271831, 272084, 260047, 217904, 237284, 249980, 259678, 252432, 271815, 291851, 246607, 244942, 265623, 255894, 266359, 280197, 244451, 201380, 198124, 206756, 224550, 203050, 216867, 250762, 245267, 229137, 181619, 220973, 228235, 236703, 197180, 189577, 222953, 203318, 200578, 214342, 212497, 190634, 195519, 181555, 178569, 203419, 205520, 177331, 201313, 167541, 199057, 215822, 239766, 227718, 209017, 211714, 232548, 240352, 233325, 197332, 210365, 235947, 243746, 202293, 183583, 202275, 211255, 256324, 268796, 269402, 267119, 257804, 267803, 276261, 254765, 231382, 252897, 294396, 345760, 305970, 265902, 243800, 230032, 228455, 223879, 255389, 231675, 264011, 237943, 216776, 209701, 208779, 235095, 234184]
6242B34184q417J6339K0481k0303K3256k9996k4246O688k6675Q114K6121L2004
6230B57550k0783k9658L2239K9756j5456j0226j7987L185K5371l5231l9640P219
6218A86339N8187K3838J8021l9970m311O544m3202J7691K1581L6994M421n6811
6206B29322n2357M2596o834Q873L0877o2266L0243k7152K5215R646l9086j1668
6194A77409J8765k0790M485K9970k9504J7940K826L494L1229K7926k5886j3291
6182B24573K444j2379J2073l0274l8402M3036K1470p359L0293j4085J4446r922
6170B35914l1169K4554O375J2814j9487k6750j960J8860k307O168l5954J8242
6158B05300r235P135K7911K0522j3407N607j6697p143l3501m205J7525J1954J1340
$$ y = [234184, 225767, 242106, 262587, 242284, 265540, 235544, 211298, 217986, 191311, 199425, 225546, 257550, 236767, 207109, 239348, 269104, 253648, 243422, 225435, 228620, 253991, 218760, 179120, 186339, 244526, 268364, 286385, 246415, 242104, 248648, 205446, 223137, 244718, 281712, 286133, 229322, 176965, 219561, 212727, 221600, 252477, 190211, 220454, 193302, 218517, 228163, 189077, 177409, 196174, 175384, 179869, 209839, 180335, 198275, 201101, 204595, 235824, 263750, 237864, 224573, 227017, 214638, 226711, 196437, 158035, 201071, 222541, 215182, 245475, 231390, 245836, 235914, 204745, 229299, 235674, 248488, 229001, 202251, 200291, 219151, 216844, 223012, 187058, 205300, 196065, 203200, 231111, 251633, 238226, 243833, 227136, 219993, 186492, 182287, 199812, 211766, 223106]
6145B23106j0658k0109J9710J0184k5501m103m2338L2535K4033K0599l9973J3366
6133B00851N356k1318J2677J3553l0570K0404j2658J4586L9211j2326j1619k1578
6121A96569L8240m7054J3798k2641q349K9562j1718J532K4701k9274J2923n588
6109A92701k7987M920q308L1390K1418j9857j1038K7118k4100k3420L0720J4301
6097B07858q723k7723M3671K693k7679k9365K3846L055k883j0502L78j2360P262
6084A69528M1539k1920j1394j5105j8309J9702q827J5208K9054O412k6151k0469
6072A59268K7669J9768m340k2518r85P73j7629k0382L0864n511K965j6753L3378
6059A86567J047k4533o899M669K357L4044k0208L5687m6624k6305K5441j2706
$$ y = [223106, 212448, 192339, 212049, 222233, 196732, 192629, 150291, 182826, 206859, 227458, 187485, 200851, 206207, 184889, 197566, 211119, 180549, 200953, 188295, 202881, 242092, 229766, 218147, 196569, 234809, 187755, 201553, 178912, 170563, 200125, 188407, 189939, 214640, 185366, 198289, 192701, 164714, 169634, 161326, 192716, 214134, 194277, 183239, 210357, 186257, 162837, 193557, 207858, 199135, 171412, 215083, 217776, 190097, 160732, 184578, 187633, 184750, 174248, 174626, 162266, 169528, 211067, 189147, 177753, 162648, 144339, 164041, 155214, 170422, 199476, 205888, 179737, 159268, 186937, 206705, 202365, 179847, 178862, 179635, 162006, 141624, 172488, 166977, 169942, 153189, 186567, 187614, 163081, 156182, 160851, 163208, 197252, 177044, 212731, 166107, 139802, 165243, 152537]
6047A52537j8689K8978K8336K1017j6273j935K0065k8604J4104j6643n220l164
6035A74509L768L2287q468k4823p456m587L4298P006j5197k081k7636M052K9228
6022A94900L0929j7465M828q831j5031M358l8014j0358O0372J2551j4830k007
6010B01402k9535K3822J9823j9184Q105K659J081k3124J1571J6037l1044L389
5998A85002N2896O810O482p204k9762j1436M722K1249m138J6701k6454o189P391
5985B16070k4244m382J9670L488n0985L1806J3719j5034L6393j8683k6296k7597
5973A53925L796l6539J1670L9747L78k3583j1041J5552K9158L91K4667Q237p2599
5960A43759k4921n923J7452M1519P750l3924L091L419n391K5515L0296k4824k9026
$$ y = [152537, 133848, 162826, 191162, 212179, 195906, 193971, 214036, 185432, 199536, 182893, 177673, 174509, 178277, 210564, 202096, 177273, 169817, 165230, 199528, 206534, 191337, 189256, 161620, 165672, 194900, 225829, 208364, 213192, 204361, 189330, 193688, 155674, 145316, 205688, 218239, 203409, 201402, 171867, 195689, 215512, 196328, 204433, 207092, 208173, 185049, 196620, 212657, 181613, 185002, 237898, 244708, 251190, 243986, 214224, 202788, 207510, 228759, 224621, 241322, 214868, 208679, 216070, 191826, 187444, 207114, 210602, 159617, 191423, 205142, 190108, 226501, 207818, 181522, 153925, 157721, 121182, 132852, 172599, 172977, 149394, 138353, 153905, 183063, 183454, 208121, 216358, 143759, 118838, 112915, 130367, 171886, 179636, 145712, 148803, 152222, 146831, 172346, 202642, 177818, 148792]
5947A48792J6207l9175P1840K4956l2078m3734N481K3571J401q601k9779j4801
5935A24080M0227k7796K1661L2557k355j0570k3870M609j5851M859J113n885L8161
5922A80940J4078K4925j0325l8125L3338j6929j0331j1189j4678K5535K0114r027
5910A88326M147k717j5146j8881L1591j1179j6971J0454J8171Q773o361K0553
5898B10760m5335J7959k2079k0167J9416J9933J911M392l3584J0350J3332k6529
5886A50359M5934k3272k6829J622r655J2900M6660M264k7722k5095L0429k5109
5874A54486Q362K2201j3508l1459K8308J0060M0433R58J1077k9792k1327p556
5862A72243l098K4849m11j3773K4411Q760k6606p177J3506K4127l4821J2791M1129
$$ y = [148792, 164999, 125824, 197664, 222620, 190542, 146808, 152289, 175860, 177261, 168660, 138881, 124080, 164307, 136511, 158172, 190729, 188374, 177804, 153934, 158543, 142692, 147551, 148664, 142779, 180940, 195018, 219943, 209618, 171493, 204831, 187902, 177571, 166382, 151704, 177239, 197353, 188326, 192473, 189756, 174610, 155729, 187320, 176141, 159170, 169624, 187795, 196568, 190207, 210760, 165425, 183384, 161305, 141138, 160554, 180487, 182398, 186790, 153206, 163556, 176888, 150359, 196293, 173021, 146192, 147814, 138159, 151059, 197719, 201983, 174261, 149166, 179595, 154486, 162848, 185049, 171541, 140082, 168390, 178450, 218883, 219841, 230918, 201126, 179799, 172243, 169145, 193994, 193583, 179810, 204221, 212981, 186375, 179198, 192704, 216831, 182010, 194801, 235930]
5849B35930K0254r184J779j2862P326k5048M314K4476K3697Q696j4331k9840L6828
5836B72035N587M670J901J3353J6155l5718L6545K4855J077J2232j23L7498L1489
5823D21556L6498P1081L6007N038N0696P7344O1605Q8608P9899J04926J38536
5812A171794M6823p3749o5369j46873j28770r6622r1128o0343m8733k5005K1058
5801E03083l5559l2836o395j4814k4007p669N816l5005k812k1483k8375K536P621
5788C10101p997k182J9241J0526K3544j0288j9836K0273j4525j6571j744R608
5776C20150K2545N633k2241L5967K9491l1671K6855j6769l197M4173k7944J6248
5764C99240J0912L9877m164j0618N589Q32J9612j5891q412R5460K0029l7396j971
$$ y = [235930, 256184, 247000, 248779, 235917, 243243, 218195, 222509, 246985, 270682, 279378, 265047, 235207, 272035, 277622, 282292, 284193, 297546, 313701, 277983, 314528, 339383, 340460, 352692, 352569, 390067, 421556, 458054, 529135, 565142, 570180, 620876, 698220, 759825, 848433, 928332, 1033258, 1171794, 1218617, 1144868, 1079499, 932626, 803856, 707234, 616106, 555763, 507030, 482025, 503083, 467524, 434688, 428293, 413479, 389472, 381803, 387619, 352614, 349802, 328319, 299944, 302480, 310101, 302104, 299922, 319163, 329689, 353233, 342945, 323109, 343382, 328857, 312286, 310542, 320150, 342695, 348328, 326087, 362054, 391545, 359874, 386729, 369960, 366763, 410936, 382992, 399240, 410152, 450029, 445865, 435247, 440836, 441668, 461280, 445389, 436977, 532437, 552466, 515070, 513099]
5751E13099J0685M9700j3845j5346K1506L1932L2257k8219p370P394K8086J9858
5739F49737j674N1229J6853K2731j672M4844L49L6483L7462m922M7219L7182J7247
5726I53068M6109L7470N4340M7139M3642M6195Q5501O1167J7964R6139O5418Q7999
5714A642151J02900J43498O0716J62758J44378J95633J51996J81091K03515J61746
5704C150382J97862J31153K03815J20256J01896Q1651l8138o2787r9185j23146
5694C663759j60982j76143j82983j91299j30258j75253j70149j40309j06429r4059
5684B135895o8176q8275m9308p9118j7650p2607r936l911J9116L3246O4649O0737
5672A924662N5160J43307K8016l9901o4594j47653j82576j25259r8092o3012p799
$$ y = [513099, 523784, 573484, 559639, 544293, 565799, 597731, 629988, 601769, 594399, 601793, 629879, 649737, 648063, 699292, 716145, 738876, 737204, 782048, 782397, 818880, 856342, 851420, 898639, 935821, 953068, 999177, 1036647, 1090987, 1138126, 1181768, 1227963, 1313464, 1374631, 1392595, 1488734, 1554152, 1642151, 1745051, 1888549, 1949265, 2112023, 2256401, 2452034, 2604030, 2785121, 2988636, 3150382, 3348244, 3479397, 3683212, 3803468, 3905364, 3987015, 3948877, 3886090, 3786905, 3663759, 3502777, 3326634, 3143651, 2952352, 2822094, 2646841, 2476692, 2336383, 2229954, 2135895, 2067719, 1979444, 1930136, 1851018, 1833368, 1760761, 1750825, 1746914, 1766030, 1799276, 1863925, 1924662, 1979822, 2123129, 2151145, 2111244, 2046650, 1898997, 1716421, 1591162, 1493070, 1430058, 1422259]
5661A422259j1815l0540n7725k2683m2571p8293p2051j5022L8062l1326K7257
5650A125552l282K696N247k0467R060O451K0272K90l9903m667o115K069m5996
5637A051207n507L864J9017J4376K2910p284J038j123J2475j0643J0749k0456
5625A090623K8336L2414R193L5065R434Q7149N0298L5571N8509Q0704R7237J03674
5613A718207Q3128J38379J30286J09560J31486N712r1319j51398j34679q6917
5603A852445r7787n3810M4148L6791l0698K7665P7733J6616N365M6580L5524L8961
5591A999533K5303M5527P0052N7410N6140O5960M7079Q2058R7166P2768Q5500
5580B704496J11165J57094J19576O9837O7788J32460K07763J69417R5581J39440
$$ y = [1422259, 1410444, 1379904, 1322179, 1299496, 1256925, 1178632, 1106581, 1091559, 1129621, 1098295, 1125552, 1122270, 1124966, 1130213, 1109746, 1118806, 1125257, 1145529, 1145819, 1105916, 1101249, 1095134, 1097203, 1051207, 1045700, 1049564, 1068581, 1082957, 1105867, 1098583, 1099621, 1098498, 1110973, 1100330, 1111079, 1090623, 1118959, 1151373, 1160566, 1195631, 1205065, 1292214, 1342512, 1378083, 1436592, 1517296, 1614533, 1718207, 1801335, 1939714, 2070000, 2179560, 2311046, 2316758, 2225439, 2074041, 1939362, 1852445, 1754658, 1700848, 1744996, 1781787, 1751089, 1778754, 1856487, 1873103, 1878468, 1925048, 1960572, 1999533, 2024836, 2070363, 2140415, 2197825, 2253965, 2319925, 2367004, 2449062, 2546228, 2618996, 2704496, 2815661, 2972755, 3092331, 3162168, 3229956, 3362416, 3570179, 3739596, 3835177, 3974617]
5570C974617K30005J75001K02097J95689K32324J67448J64539J26087Q041m467
5560E471381n4986J6569P5768Q5692P4935J24949J62202J95943J86261J76893
5550F515607J84797K34746K57028K69556L08403L07054L03494L62797L85660M03701
5540I532843M14159M75781N81866O49364P25524P10999M72017J99208J23017J94207
5530A4078985L64911N28094O83234O66695P49693Q31721R63388J055478J162969
5521B1085168J427666J531620J805178K035860K367287K834458L628786M597738
5513D1313761N572433O341931P069781P980133R059302J0823604J3300631J6487237
5505A17948813K0369481K4284761K5966220J4496428j0851815k6840159k9757419
$$ y = [3974617, 4204622, 4379623, 4581720, 4777409, 5009733, 5177181, 5341720, 5467807, 5475848, 5471381, 5416395, 5432964, 5508732, 5594424, 5669359, 5794308, 5956510, 6152453, 6338714, 6515607, 6700404, 6935150, 7192178, 7461734, 7770137, 8077191, 8380685, 8743482, 9129142, 9532843, 9947002, 10422783, 11004649, 11654013, 12379537, 13090536, 13562553, 13761761, 13884778, 14078985, 14443896, 14971990, 15655224, 16321919, 17071612, 17903333, 18866721, 19922199, 21085168, 22512834, 24044454, 25849632, 27885492, 30252779, 33087237, 36716023, 41313761, 46886194, 53228125, 60297906, 68278039, 77337341, 88160945, 101461576, 117948813, 138318294, 162603055, 188569275, 203065703, 192213888, 165373729, 135616310]
5498A35616310k6850780k0343626j4726852j0718611q006857n914579m623252
5491D4431753l740166l190085k926351k702768k411544k122655j931977j716154
5483B3690053j470391j274353j095721r51370q37450p29782o35604n98272o38191
5474A5458919o78150o52432o33190n68299n43812n09513n13974n50032n12566
5465A0296951m69415m26957l83449k78998k46402k80952k15599k20097j64482
5456G610600k14608j98125j92451j66758j34143r4068q8596j08012l1626O1463
5446F443676O3031N5789p5667k52914m01685l28621k93891k97691k23189j89739
5436D499099j53853j17428j12805j32061j12640o7858j02705j25562q9031j15040
$$ y = [135616310, 108765530, 88421904, 73695052, 62976441, 54969584, 49055005, 44431753, 40691587, 37501502, 34575151, 31872383, 29460839, 27338184, 25406207, 23690053, 22219662, 20945309, 19849588, 18898218, 18060768, 17330986, 16695382, 16097110, 15458919, 14780769, 14128337, 13495147, 12926848, 12383036, 11873523, 11359549, 10809517, 10296951, 9827536, 9400579, 9017130, 8738132, 8491730, 8210778, 7995179, 7775082, 7610600, 7395992, 7197867, 7005416, 6838658, 6704515, 6610447, 6521851, 6413839, 6382213, 6443676, 6506707, 6562496, 6486829, 6233915, 5832230, 5503609, 5209718, 4912027, 4688838, 4499099, 4345246, 4227818, 4115013, 3982952, 3870312, 3802454, 3699749, 3574187, 3485156, 3370116]
5426C370116j41337o4631k5670l0952j3001l9952n5173n6383k4838j8576m0440
5415B859163J891o3487M6301n0426l0403p6098l2495J8386m8955m3937k8444m9210
5403B502286l9114Q293o4037n690l9806m4233l5660n7954j7594o4586j1644N7191
5391B187452K6341O059L7788N4084K1845N9143L3545L7874M3879N0599R9536R7417
5379B755562Q7987J28266J25312J38429K30200K60695L05381L80019M15933M61818
5369E289602M95720O18930P26986Q82632R77862R39738J73015r61395j413740
5360G729350j348166j095639p54232n53148l56412k85146j75469q4775o6775j13348
5350B896240q7481j00495r6750p1006l2298l6495p5717q1778r8003m9223J8245
$$ y = [3370116, 3228779, 3164148, 3138478, 3107526, 3094525, 3054573, 2999400, 2943017, 2918179, 2899603, 2859163, 2861054, 2797567, 2843868, 2793442, 2763039, 2686941, 2654446, 2672832, 2623877, 2579940, 2551496, 2502286, 2463172, 2471465, 2407428, 2401738, 2361932, 2317699, 2282039, 2224085, 2206491, 2141905, 2130261, 2187452, 2213793, 2219852, 2257640, 2311724, 2333569, 2392712, 2426257, 2464131, 2508010, 2558609, 2658145, 2755562, 2843549, 2971815, 3097127, 3235556, 3465756, 3726451, 4031832, 4411851, 4827784, 5289602, 5785322, 6404252, 7131238, 8013870, 8991732, 9931470, 10104485, 9143090, 7729350, 6381184, 5285545, 4531313, 3978165, 3621753, 3336607, 3161138, 3076363, 3009588, 2896240, 2808759, 2708264, 2611514, 2540508, 2508210, 2471715, 2395998, 2314220, 2216217, 2166994, 2185239]
5339B185239j8001O558N0448L6697M4402O8233Q9781J27513J90248K73254K80195
5328C334567L31767L25557R3617k15226k52212k06080r3584O102P9262o9182k59323
5317C075265l95255l55769k83613k16317k00218j43216p9785n7408o1179n4817
5307A227688l4342o2425m8256l0361m8531n8276j5168m5324k6753j8178L424o715
5295H36783l0154k9510L4877l0951l3393j3946m3566p492j3709k5404l3544k8513
5283E81478J5359j6801K0491n2375l0254J4368k652j1321l8494J548j4679l6630
5271D30038O3223J2573p2367m9199L7728q324l525l2547n766K2266K9776m8803
5259C75073J3944J1765j8593j0743l5332k0603j8532M7669N628m9926K5457M385
$$ y = [2185239, 2167238, 2173796, 2224244, 2260941, 2305343, 2373576, 2463357, 2590870, 2781118, 3054372, 3334567, 3666334, 3991891, 4085508, 3870282, 3618070, 3411990, 3318406, 3324508, 3403770, 3334588, 3075265, 2680010, 2324241, 2040628, 1824311, 1624093, 1480877, 1401092, 1343684, 1282505, 1227688, 1193346, 1130921, 1082665, 1052304, 1003773, 945497, 930329, 885005, 858252, 840074, 843498, 836783, 806629, 777119, 811996, 781045, 747652, 733706, 690140, 682648, 668939, 643535, 609991, 581478, 596837, 580036, 600527, 548152, 517898, 532266, 529614, 518293, 479799, 481347, 466668, 430038, 493261, 505834, 433467, 384268, 421996, 413672, 410147, 377600, 371834, 394100, 423876, 375073, 389017, 400782, 382189, 371446, 336114, 315511, 296979, 344648, 350276, 300350, 325807, 330192]
5247C30192J6882j7107j2092j2106O917M6708O453J931k4912j887K4695N0830
5235D16504N411p0808k1817J6466j1154J0579j1336k1492l8979R641L7426P777
5223C28218J3731L8971m9578l2710J8029K5747K9166J7812R349r775m296l0580
5211C54084p340k551K9991l280l2109L6959J004j0528M2547L8271L734P709j226
5198D57265O0223R1836Q782J8037Q5450P3668N3012P3832J22855J32673L8936
5187A216569j21911j48537j36560j38773q9331p1882p4982k4411k8248j2524n4800
5176C14610j0389k3265l2489L9100K668P512K988l5764j8235j5940m8017K3949
5164B06728K5730n15k7466j2811l1562L7148K643l0539k4236r94M8738R909l5951
$$ y = [330192, 347074, 329967, 317875, 305769, 312686, 359394, 365847, 367778, 342866, 340979, 365674, 416504, 421915, 351107, 329290, 345756, 334602, 345181, 333845, 312353, 273374, 283015, 320441, 328218, 341949, 380920, 331342, 298632, 316661, 342408, 371574, 389386, 398735, 388960, 384664, 354084, 346744, 344193, 374184, 370904, 338795, 375754, 376758, 366230, 408777, 447048, 450782, 458491, 457265, 517488, 609324, 618106, 636143, 721593, 795261, 848273, 922105, 1044960, 1177633, 1216569, 1094658, 946121, 809561, 670788, 581457, 509575, 434593, 410182, 381934, 369410, 314610, 304221, 280956, 248467, 287567, 290235, 297747, 300735, 264971, 246736, 230796, 182779, 206728, 232458, 231943, 204477, 191666, 160104, 197252, 199895, 169356, 145120, 144126, 192864, 202773, 166822]
5151A66822K604K647j6448o187k2327J0933n632K24L904p0779K4538L1799N486
5138A27584R077j576j2430j9507j6387L1870K0799m4306l4806J5315M942P775
5126H8350K4541m067K3767m937j8960j7270m210k5655J1849j6509J3050K1854
5114I1803L4624k6762M801j5876K2269R887k962k8722K3522K9141N976J7695j1254
5101A54142j3023r850K1594j3071j5597k3197j1837L5562j7897K111k6871K4766
5089A06832J8616Q432j5556l9739K1443O489j2041q602J3876o840J316J5651N886
5076A15763L3076n0750Q218J2457j758J10J871M3491l2847l0270M0797K1228N2304
5063B13690j3309J3674K9164o046K4366p2433P550O968J0986m0634k7513K3809
$$ y = [166822, 169426, 172073, 155625, 149438, 127111, 138044, 132412, 132636, 136540, 65761, 90299, 122098, 127584, 136661, 135085, 122655, 103148, 86761, 118631, 139430, 95124, 60318, 75633, 80575, 88350, 112891, 108824, 132591, 127654, 108694, 91424, 87214, 61559, 73408, 56899, 69949, 91803, 126427, 99665, 104466, 88590, 110859, 120746, 117784, 89062, 112584, 141725, 147701, 165396, 154142, 141119, 131269, 152863, 139792, 124195, 100998, 89161, 124723, 106826, 108937, 82066, 106832, 125448, 133880, 118324, 78585, 100028, 106517, 94476, 85874, 99750, 92910, 94226, 109877, 115763, 148839, 98089, 106307, 118764, 117006, 117116, 118987, 162478, 129631, 99361, 140158, 161386, 213690, 200381, 214055, 243219, 237173, 261539, 189106, 196656, 203624, 214610, 173976, 146463, 170272]
5051A70272k143k2762M37j3892L206n758n35k9099K156M8145K845l2694N44j7861
5037A02861M2397M3032R78r868J8226k0769L2222j390m934J7891p099p863j7727
5024A87957l9257l5098j427O030k0243L1872J9449l5368K4891l352J9234L0785
5012A85473k441m8827p136J8971l2276J2366N241R944q879M442J2173j297k3342
4999A24412l280q280R642j998J5692m9395o138L1267L7635j632l9740K0369K9682
4986A58236k3497r308j5074l6271O154M5039L4624l0623l2132O485J0517L232
4974A17382J135Q613L3301r103p550l3967j3047J5583K3688k1244m4764K2399
4962I2426L8152j5917l344k6853M7723j5603p019J1020J7059K2692n115J3569
$$ y = [170272, 168129, 145367, 145804, 131912, 135118, 129360, 128825, 99726, 101882, 150027, 152872, 120178, 120722, 102861, 145258, 188290, 189268, 179400, 197626, 176857, 209079, 207689, 202755, 220646, 213547, 205684, 187957, 148700, 113602, 112175, 118205, 97962, 129834, 149283, 113915, 138806, 135454, 154688, 185473, 183032, 134205, 127069, 146040, 113764, 126130, 131371, 141315, 132436, 136878, 149051, 147754, 124412, 121132, 112852, 122494, 120496, 136188, 86793, 80655, 111922, 149557, 147925, 108185, 128554, 158236, 134739, 125431, 110357, 74086, 80240, 125279, 159903, 129280, 97148, 103633, 114150, 117382, 118517, 127130, 160431, 151328, 143778, 109811, 96764, 112347, 136035, 114791, 70027, 92426, 130578, 114661, 111317, 84464, 132187, 116584, 109565, 120585, 137644, 160336, 155221, 168790]
4950A68790l792j3598k074k7001M88J1986j7348M4606j2619l7193J3194R313r177
4937A25575J9825K4192J2337m2574j9567L8154J1681J7363J2043K7531m4446l9170
4925A42944q875N8785j9195K3772J4845l0249k368J1582j6800N1424k229R317
4913B32953J6442K9031J8635j5406J0389j3557l075L3457J6207j9690J5539j1765
4901C09160N8523K2784M1919R49l9490O835N0588K5245R764J8690k8824N066L1625
4888E12834L7667j4526j4228J6924n020L9392L2839J8439J1203m383j434K6699
4876F56406M2526P3092p040J8476L4896N0853M8474P3254O4289m972Q6522M3189
4864A179965R952M8461Q5199O2446O8038R7551O2715Q9736R9021J38044J65448
$$ y = [168790, 164998, 151400, 149326, 122325, 122813, 134799, 117451, 162057, 149438, 112245, 125439, 134752, 125575, 145400, 169592, 181929, 139355, 119788, 157942, 169623, 186986, 199029, 226560, 182114, 142944, 134069, 192854, 173659, 197431, 212276, 182027, 179659, 191241, 174441, 225865, 223636, 232953, 249395, 278426, 297061, 281655, 292044, 278487, 275412, 308869, 325076, 305386, 320925, 309160, 367683, 390467, 432386, 433335, 393845, 400680, 451268, 476513, 486277, 504967, 476143, 481209, 512834, 550501, 535975, 521747, 538671, 533651, 573043, 605882, 624321, 635524, 631141, 629707, 656406, 698932, 772024, 764984, 783460, 818356, 869209, 917683, 990937, 1055226, 1050254, 1136776, 1179965, 1189917, 1238378, 1323577, 1386023, 1454061, 1551612, 1614327, 1704063, 1803084, 1941128, 2106576]
4853B106576R4950J43633K14323K46818K70370L56049L65740M49502N16778O26706
4843E391445P38191Q47119R35586J081753J244535J253593J222871R60813N38095
4834A4214001P2596m44780q85637j244836j448988j382744j280004j049633q29176
4825E720799o53946n76127m22861l33114k50109k77682k49900k15996j56437j23635
4815B460992j33406j15770o6085m6820l0123k3822l4122m5406l9684k6159q5113
4804A814482m4028q4120r8176q5688j12954p8168n5487k6656o1519q1708l9341
4793A046637j0479l8241j4782m883k138j2284j2672K07M312q985k1800L8404J8958
4780I82254j0857K073K6585K5916J9127k9213o8219q5475j7108n1115j4336m665
$$ y = [2106576, 2201526, 2345159, 2559482, 2806300, 3076670, 3432719, 3798459, 4247961, 4764739, 5391445, 6129636, 6976755, 7912341, 8994094, 10238629, 11492222, 12715093, 13675906, 14214001, 14286597, 13841817, 12956180, 11711344, 10262356, 8879612, 7599608, 6549975, 5720799, 5066853, 4490726, 4067865, 3734751, 3484642, 3206960, 2957060, 2741064, 2584627, 2460992, 2327586, 2211816, 2145731, 2098911, 2068788, 2044966, 2010844, 1965438, 1925754, 1899595, 1814482, 1770454, 1686334, 1588158, 1502470, 1389516, 1311348, 1255861, 1229205, 1167686, 1085978, 1046637, 1036158, 997917, 983135, 978252, 976114, 963830, 951158, 951365, 955677, 946692, 924892, 963296, 982254, 971397, 973470, 1000055, 1025971, 1045098, 1015885, 947666, 862191, 845083, 793968, 779632, 774967]
4768G74967l7917m1552k2437j4977k3450O0662j5583k8904k0757l0961J5319P566
4756F21976k3419j8111P320n019n287K8681K5042j2323k8150k1985N984o4185
4744E10524J2224J6197k9842j8201n845M3094n397l8443l2605L4623R655m491
4732D91493K5862l6601j0699J7039l2083j2348j5783l8627L7983l9445l0070P983
4720C64704j7219j9800j4920L3474K105j3949p657M784K2922m6725k1593r817
4708B76309k5127J5743P431J5394L3641q21m5083k5528l8657J4831m9206M2054
4696B20981J6145J0764k4246m1333K8193k3207L6644M010j0294j4784o784p79
4684A95310O740K0122L799o8945m1452M2155O243m2289M553J3299k4037l974K3970
$$ y = [774967, 737050, 695498, 673061, 658084, 634634, 695296, 679713, 650809, 630052, 599091, 614410, 621976, 598557, 580446, 587766, 582747, 577460, 606141, 631183, 618860, 590710, 568725, 574709, 510524, 522748, 538945, 509103, 490902, 485057, 528151, 522754, 484311, 451706, 486329, 495984, 491493, 517355, 480754, 470055, 487094, 455011, 442663, 426880, 388253, 426236, 386791, 356721, 364704, 347485, 327685, 312765, 346239, 348344, 334395, 326738, 331522, 354444, 307719, 286126, 276309, 251182, 266925, 274356, 289750, 323391, 322570, 277487, 251959, 213302, 228133, 178927, 220981, 237126, 247890, 223644, 182311, 210504, 187297, 223941, 227951, 217657, 202873, 196089, 195310, 202050, 222172, 225971, 157026, 115574, 157729, 163972, 121683, 126236, 139535, 115498, 111524, 135494]
4671A35494l3761n2305N6745R38m9290M0402K467J3212j8369K1404j7049j4795
4659H5093J8651k1881L4228K0544k8051k535q084l8782n298P811j3066l1943K2317
4646C9004J895l7705J281m010M6392o919K079M8878J9351j5835j99P1j2705j7584
4632F3994J7066r943j0911l895j3780J0955K0510J1486k5870K7740j9652l0015
4620C7685m076o684l4601J9522j0504l01K146P794L0539o897Q899m9855r068J9259
4606C858p45l566K2324J8430m392P432k3056M0518k1834j3096J148j4115r000
4593C906M531j1338J7699M4136r564j8469L2089j705k8489n5886J860N1080K8313
4580E8163l0078m7618K8466M3606J5830K5630O856m2986k6981j0216j7243M4823
$$ y = [135494, 101733, 49428, 106173, 107111, 57821, 98223, 100690, 113902, 95533, 116937, 99888, 85093, 103744, 81863, 116091, 136635, 108584, 106049, 97965, 59183, 53885, 61696, 48630, 16687, 39004, 40899, 3194, 4475, 465, 46857, 39938, 42017, 90895, 110246, 94411, 94212, 94283, 81578, 63994, 81060, 71117, 60206, 56311, 42531, 53486, 73996, 85482, 59612, 87352, 67700, 37685, 33609, 26925, -7676, 11846, 1342, 1041, 3187, 10981, 41520, 34623, 43522, -6333, -15401, 3858, 3113, -453, 21871, 40301, 35909, 43341, 20285, 60803, 38969, 25873, 27021, 12906, 3906, 8437, -2901, 14798, 58934, 49370, 30901, 62990, 61285, 32796, -23090, -21230, 29850, 58163, 28085, -19533, 8933, 52539, 68369, 93999, 100855, 57869, 30888, 20672, 3429, 48252]
4568D8252N0107j0163J022J4127l1510j1160K5613J6794j0735j800K1985o8959
4556D3573J8254J1810p386l3416J0149j0046J1630L873l7530l0188O219L7378
4544B4320p453k7889j2264J1758K8755K7944J7765j6847p01M77j4650K5o799J8167
4530D2608L1813J0268J0666m2362m124j0370J5702N888j9453M6760l3545r118
4518D4733j5924k4409K7416j5958K8781o570M61j243r071J4654m45N099l8021
4505I503j1351L6189L2852k8105l622q236O611j0129M038j5285j9392p568M7398
4492C2903j3738N06m999J1486k1428J1734j3139L3921K995r518j4474M430l599
4479A7080L0899l20n9122l200J0289k677M6299N575J0645j3146P054P466j8051
$$ y = [48252, 98359, 88196, 89218, 103345, 71835, 60675, 86288, 103082, 92347, 90547, 112532, 43573, 61827, 73637, 66251, 32835, 42984, 32938, 44568, 48441, 10911, -19277, -13058, 24320, 16867, -11022, -23286, -11528, 17227, 45171, 62936, 46089, 45388, 45865, 31215, 31240, 24441, 42608, 74421, 84689, 95355, 52993, 48869, 38499, 54201, 60089, 40636, 87396, 53851, 44733, 28809, 4400, 31816, 15858, 44639, 38069, 38530, 37287, 28216, 42870, 42425, 47524, 9503, -1848, 34341, 67193, 39088, 35466, 27230, 33841, 23712, 27750, 12465, -6927, -14495, 32903, 19165, 19671, 14672, 26158, 4730, 16464, 3325, 37246, 40241, 30723, 16249, 20679, 17080, 47979, 47659, -11463, -14663, -4374, -7051, 39248, 44823, 55468, 42322, 49376, 56842, 38791]
4466C8791K984J177o930K0626p342l2169K8105J9210M117n8810K5737M0544K1915
4453I7955o2151O1084n0922J6147k6327j498M3578L0403l0330j5042r803q706
4441D4388k3547k2648K1426R001l7169n096J3628L6374j9591j615m277J6301K9459
4428E6634j6809k45J2028K0700l2709J5144l374P366Q424r216l3398O764M9306
4415H0615l0926m7545M3487J878k8956O827K7015l6771k7681K5074J2459J028
4403B6504j3360J9488J8154j5768l603L303L1769j2738K1968M552l3057J7422
4391F4634j251p929q945j1839l9490M0394J6459L0584J2632k3315K2015k6191
4379F7758r149m845p780j3199K9037j4985J9262j7125K7517R267J9092o951j3124
$$ y = [38791, 41775, 42952, 36022, 56648, 49306, 17137, 45242, 64452, 68569, 9759, 35496, 76040, 97955, 35804, 96888, 45966, 62113, 35786, 34288, 77866, 108269, 77939, 62897, 53094, 44388, 20841, -1807, 19619, 28620, -8549, -13645, -17, 36357, 16766, 15151, 10874, 27175, 56634, 39825, 39580, 51608, 72308, 39599, 54743, 51369, 58735, 67159, 57943, 24545, 31309, 80615, 49689, 2144, 45631, 47509, 18553, 25380, 52395, 15624, -12057, 13017, 25476, 26504, 13144, 32632, 50786, 35018, 31415, 34718, 66487, 53749, 75717, 80269, 47212, 64634, 63383, 55454, 46509, 34670, -4820, 35574, 52033, 82617, 95249, 71934, 93949, 67758, 58609, 53764, 45984, 32785, 61822, 46837, 66099, 48974, 76491, 85758, 104850, 97899, 84775]
4366H4775l028j940m7237K170M7961m9020j2829L1502K6052k7286m678k752K3863
4353F7553j3164l423J6443K8758l4083K7951o340P727K824N147l1258J915K7109
4340I7159j4333K9115k7310j7235K0009J3860j2462K8231J8870j3254k4182l2075
4328F6393j0441N2504k5125J4624k7746J6162j2782J0812K6593k647l4955l2832
4316D0560K0895K1504K7751j2349j4897l2385p864K2310K1185m1N682j5551j2252
4303F4548R152m602K7476N748j8889O912Q95P233k0690J921K9811j2543l9365
4290E7607L2385N1805k6360j8628j9306K584N3678N2599j8725l6899j6598J0295
4278A24437l1164J4523L3375j4886J1262J7821R203R409j9471r295j4156M4976
$$ y = [84775, 81747, 79807, 32570, 34740, 82701, 33681, 20852, 52354, 78406, 51120, 46442, 43690, 67553, 54389, 50966, 67409, 96167, 62084, 90035, 83695, 91422, 94246, 99393, 68135, 70050, 97159, 82826, 111941, 84631, 67396, 87405, 101265, 88803, 117034, 135904, 122650, 98468, 66393, 55952, 108456, 83331, 97955, 70209, 86371, 73589, 84401, 110994, 108347, 73392, 40560, 61455, 82959, 110710, 98361, 83464, 51079, 43215, 65525, 86710, 86669, 92351, 76800, 64548, 73700, 69098, 96574, 102322, 83433, 90345, 91240, 98473, 77783, 79704, 109515, 96972, 57607, 89992, 141797, 115437, 96809, 77503, 80087, 133765, 186364, 167639, 130740, 114142, 124437, 93273, 107796, 141171, 126285, 137547, 155368, 164571, 173980, 154509, 145214, 131058, 176034]
4266A76034P666J5547j7746k1663K9454K3169K1754j6032Q026j0824K0302j5194
4254B20493L743J2220j8191l4840K9715L0843J3806K750o575L8448K0589k9687
4242B83314N2061k5204k1653K493K9346L610K0086N5953K0335K9089J7295N5204
4230E21929N2802J8051M7362M4037J45108R5862N8852J13075J57173J92818K10571
4219A657640J62144M8395j17517j78246j62760j82357j50771q6432j03969o2303
4209H23824o596j1742q613j3016J6200l8546k4158K3812J1422K5848m240N272
4197G99467J9318j6918K3507J2132O5004N0655K0484O4225P2099L9984J22784
4186A272741J37683J34261J33346J53155K13675K23033K40761J63462L9787m3035
$$ y = [176034, 183700, 199247, 181501, 159838, 189292, 212461, 234215, 218183, 226209, 215385, 235687, 220493, 224236, 236456, 218265, 183425, 213140, 243983, 257789, 260539, 253964, 292412, 313001, 283314, 335375, 310171, 288518, 291011, 320357, 323967, 344053, 400006, 420341, 449430, 466725, 521929, 574731, 592782, 640144, 684181, 829289, 925151, 984003, 1097078, 1254251, 1447069, 1657640, 1819784, 1868179, 1750662, 1572416, 1409656, 1227299, 1076528, 990096, 886127, 823824, 817228, 805486, 796873, 783857, 800057, 761511, 737353, 761165, 772587, 798435, 794195, 799467, 818785, 801867, 825374, 837506, 902510, 953165, 973649, 1037874, 1109973, 1149957, 1272741, 1410424, 1544685, 1678031, 1831186, 2044861, 2267894, 2508655, 2672117, 2711904, 2668869]
4176B668869l5287m5011j53421k61786k43006j66290j59517o1359q2791p3784
4166A386617l2108j1990J460M935M3778N9916J2923O7864Q7328J03432K14294
4155A938449J40617J50851Q6772j16358j26408k43250j55624j13041o9311o6391
4145A426306o2392m6327m7078k6618q2271l2115l7635N244P739k6520m9889j7764
4133A010680L677K1663L8190N2199m6382P647O77L6989K704k4040N4356M3438
4121A201798O7261K5160M9777P3328K8377K9383J1368K232l7661o748M3647M9604
4109A537526k4427L8785N9707n791P4017O3402Q1604L6268O3366O5581J4145Q7905
4097B092088O0006O9215J10311R7359J03744J25378J57864J52587J71064K32257
$$ y = [2668869, 2633582, 2588571, 2435150, 2173364, 1930358, 1764068, 1604551, 1543192, 1460401, 1386617, 1354509, 1342519, 1343979, 1348914, 1392692, 1452608, 1465531, 1533395, 1620723, 1724155, 1938449, 2079066, 2229917, 2316689, 2200331, 2073923, 1830673, 1675049, 1562008, 1492697, 1426306, 1363914, 1317587, 1270509, 1243891, 1161620, 1129505, 1091870, 1097114, 1104853, 1078333, 1028444, 1010680, 1014357, 1036020, 1074210, 1126409, 1080027, 1087674, 1088351, 1125340, 1128044, 1104004, 1158360, 1201798, 1269059, 1294219, 1343996, 1417324, 1445701, 1475084, 1486452, 1488684, 1451023, 1444275, 1487922, 1537526, 1513099, 1551884, 1611591, 1605800, 1679817, 1743219, 1824823, 1861091, 1924457, 1990038, 2004183, 2092088, 2152094, 2221309, 2331620, 2428979, 2532723, 2658101, 2815965, 2968552, 3139616, 3371873]
4087C371873J79528K51547K73510L28241M31177M30864N63514O07876O85318P83154
4077G906602R18336R79270Q26523L54127l31320q60865j089083j056198q75850
4068F771542p41406n73794l95668l57126k76565k49827k24654j47894j53061j11580
4058C539967j11326m1611j2815k6493l4097m872J2097j182o1739n841K8302L997
4046C284387J9842N5508K1088J08508N2189M0558Q3191P1715J00884J12774J42284
4035D092928J25693J22141J24685J39575J18167J53112J62939J73780J74559K12669
4025E600248J66167J49797K03102J47044R9586J00670J05542J88296J21992J28004
4015G010448K13875J68979J73164J73103K20300K28985K09410K42911K78117L15327
$$ y = [3371873, 3551401, 3802948, 4076458, 4404699, 4835876, 5266740, 5830254, 6438130, 7123448, 7906602, 8824938, 9804208, 10630731, 10984858, 10653538, 9792673, 8703590, 7647392, 6771542, 6030136, 5456342, 5060674, 4703548, 4426983, 4177156, 3952502, 3804608, 3651547, 3539967, 3428641, 3387030, 3374215, 3347722, 3313625, 3308753, 3320850, 3319668, 3257929, 3252088, 3280390, 3284387, 3304229, 3359737, 3380825, 3489333, 3541522, 3582080, 3665271, 3736986, 3837870, 3950644, 4092928, 4218621, 4340762, 4465447, 4605022, 4723189, 4876301, 5039240, 5213020, 5387579, 5600248, 5766415, 5916212, 6119314, 6266358, 6365944, 6466614, 6572156, 6760452, 6882444, 7010448, 7224323, 7393302, 7566466, 7739569, 7959869, 8188854, 8398264, 8641175, 8919292, 9234619]
4005I234619K67336K80971L31237L50845L36118L35503M19195L93122M21259M26928
3995A2797133L84643M61550M88415N84028O55410O94608P51652Q97398R69144
3986A8683981J026829J186686J262550J299507J341162J402737J583743J723748
3978B9510943J999852K237499K511314K887513L353308L938805M790804N838843
3970E7068881P137214Q485275R855336J1173749J2682553J4614003J7582525K1663355
3962A60262891K7123282L3250037L6215384K6222357L170632k2740276l9262933
3955B24241374m0694634l4828269k6462242j9154747j4052281j0567496q240816
3948G0240889o557998n404807m593520l999283l619370l379915l148651k881572
$$ y = [9234619, 9501955, 9782926, 10114163, 10465008, 10801126, 11136629, 11555824, 11948946, 12370205, 12797133, 13181776, 13643326, 14131741, 14715769, 15371179, 16065787, 16817439, 17714837, 18683981, 19710810, 20897496, 22160046, 23459553, 24800715, 26203452, 27787195, 29510943, 31510795, 33748294, 36259608, 39147121, 42500429, 46439234, 51230038, 57068881, 64206095, 72691370, 82546706, 93720455, 106403008, 121017011, 138599536, 160262891, 187386173, 220636210, 256851594, 283073951, 286244583, 263504307, 224241374, 183546740, 148718471, 122256229, 103101482, 89049201, 78481705, 70240889, 63682891, 58278084, 53684564, 49685281, 46065911, 42685996, 39537345, 36655773]
3940C6655773k497671k138014j848884j591764j428243j217967j105685r86114
3932B3841431q44356p45036o04206n65583m69049m14645l99488m25979p12333
3923A8660756r51747r64283r38544q08844o33646n36768m76152m24008l95608
3914A2531156m02398m20378m35044l76154l97762l90318l96379l43759k61474
3905I107490l27493k47080k21230k10065j73473j81088k19002j89283j94808k07533
3895F936435j91442j92564j35402j61818j25723j08410j65971q1139j36983j52902
3885E484081j28811j09707m3400l2572l5134q464k240n1093j05095q0242j27787
3874D759536j68940p4602n3713j9072l1112n8801k6733m4300o6534k518k7008
$$ y = [36655773, 34158102, 32020088, 30171204, 28579440, 27151197, 25933230, 24827545, 23841431, 22997075, 22252039, 21647833, 21082250, 20613201, 20198556, 19799068, 19373089, 18660756, 17709009, 16744726, 15806182, 14997338, 14363692, 13826924, 13350772, 12926764, 12531156, 12128758, 11708380, 11273336, 10897182, 10499420, 10109102, 9712723, 9368964, 9107490, 8779997, 8532917, 8311687, 8101622, 7928149, 7747061, 7528059, 7338776, 7143968, 6936435, 6744993, 6552429, 6417027, 6255209, 6129486, 6021076, 5855105, 5773966, 5636983, 5484081, 5355270, 5245563, 5202163, 5169591, 5134457, 5125993, 5123753, 5072660, 4967565, 4887323, 4759536, 4590596, 4515994, 4462281, 4443209, 4412097, 4353296, 4326563, 4282263, 4215729, 4213211, 4186203]
3863D186203M1720k1714Q764K6695J1506m0080M849O868O923r741L2471N5287
3851D309751O8735J25523J20474J64757J48932J90379K17473K91583K63429K37611
3841F138647K88037K59987L08832M01433M34170N37644P32000Q62657R77569J172045
3831A2113021J417379J689064K034198K226375K168851J753647J077541n1370
3823B4428706j332822k086041k508288k688153k467142j940958j519840j172088
3815H713374r15643o65603n99782m58905l59447l01992l30226k24552k82590k56311
3805D318323k33148k90537k38791j64184j52629j75108j13857r3319o6491o8860
3795B721399p1766m2303q0302j07728q9400p4445l4715q3664p5692k3038q9701
$$ y = [4186203, 4227923, 4206209, 4214973, 4241668, 4253174, 4213094, 4217943, 4224811, 4231734, 4221993, 4254464, 4309751, 4378486, 4504009, 4624483, 4789240, 4938172, 5128551, 5346024, 5637607, 5901036, 6138647, 6426684, 6686671, 6995503, 7396936, 7831106, 8368750, 9100750, 9963407, 10940976, 12113021, 13530400, 15219464, 17253662, 19480037, 21648888, 23402535, 24480076, 24428706, 23095884, 21009843, 18501555, 15813402, 13346260, 11405302, 9885462, 8713374, 7797731, 7132128, 6532346, 6073441, 5713994, 5412002, 5081776, 4857224, 4574634, 4318323, 4085175, 3794638, 3555847, 3391663, 3239034, 3063926, 2950069, 2856750, 2790259, 2721399, 2649633, 2607330, 2527028, 2419300, 2329900, 2255455, 2220740, 2137076, 2061384, 2038346, 1948645]
3784A948645o7368k6478p6972o2453p8314p3130j414m2107n7042n8144r8959p8116
3772A228148j4766M066n3834n9046j6933m40Q58J8131o1019Q52r978k6676j0923
3759I98440k8746n1544j5152l5792q713l0234r055P534k7638J6225l9368N07k6853
3746G49611J8329j9481k0911k6169L717j962l0606P921j0104O056j576K0611j1383
3733F84053j1948j0341j5795K2540n2184j5232j90L5653J0698j8444k5836L556
3721F06530J6797j1491j2739o2295J0987J3580j3731M6617L5641J2921J9350j1048
3709F51119J1977m613M2587Q1199O4416L0732R3299Q0386J16434J38327J44083
3698A449946J84999K04018P9559k0354j89397k26234j82212j87064j37852j14599
$$ y = [1948645, 1881277, 1854799, 1777827, 1715374, 1637060, 1563930, 1562516, 1520409, 1463367, 1405223, 1306264, 1228148, 1213382, 1217448, 1163614, 1104568, 1087635, 1087195, 1088053, 1106184, 1045165, 1046017, 1036039, 1009363, 998440, 969694, 918150, 902998, 867206, 858493, 828259, 819204, 826738, 799100, 815325, 775957, 776464, 749611, 767940, 748459, 727548, 701379, 705096, 703134, 672528, 680449, 670345, 676401, 674825, 695436, 684053, 672105, 661764, 645969, 668509, 616325, 601093, 600903, 636556, 647254, 628810, 602974, 606530, 623327, 611836, 599097, 536802, 547789, 561369, 547638, 594255, 629896, 642817, 662167, 651119, 663096, 658483, 701070, 782269, 846685, 877417, 970716, 1051102, 1167536, 1305863, 1449946, 1634945, 1838963, 1918522, 1898168, 1708771, 1482537, 1300325, 1113261, 975409, 860810]
3688H60810o9282n6070l5342j082l2056o761l8047m5676j6466k2595n468l3428
3676D98537j597k8573k7860j3152o258K9631j1293j3336K5018K771n8552q234
3664C87102n3661j6461O574k7371j8177L3278k5984J7185L0967m7858p119N714
3652B84189k1455m2213J1778NK6462K5709m5722j2429j1076M030J9577o7001K341
3639A74195j9576J2708K248K6649q890j602K6850k7408k6338j0660j6891j0091
3627A21194J7905J7248p424Q256K3223k382j7980j3078N480J398J9292m067j3538
3614A55527j5872k1065l956O131L2756j6356K5555j9071K4719j2344r653M6869
3602A93240l4283l523j631n0022L1446k0667k7549J074K7822P99l5231l874P8568
$$ y = [860810, 791528, 735458, 700116, 699034, 666978, 660217, 622170, 576494, 560028, 537433, 531965, 498537, 496940, 468367, 440507, 427355, 421097, 450728, 439435, 426099, 451117, 453888, 395336, 387102, 333441, 316980, 323554, 296183, 278006, 311284, 285300, 302485, 333452, 285594, 278475, 284189, 262734, 220521, 232299, 232304, 258766, 284475, 238753, 226324, 215248, 219278, 238855, 171854, 174195, 154619, 167327, 169575, 196224, 187334, 185732, 212582, 185174, 158836, 148176, 131285, 121194, 139099, 156347, 148923, 157179, 180402, 178020, 160040, 146962, 152442, 153840, 173132, 169065, 155527, 139655, 118590, 114634, 120765, 153521, 137165, 162720, 143649, 168368, 156024, 146371, 193240, 158957, 155434, 153803, 103781, 135227, 114560, 87011, 88085, 115907, 116706, 81475, 77601, 156169]
3589A56169j2970p049k0961O343L4750m8858m71J3526K0322O880K4047J0541l2494
3576A49775J7055l423m5455M1016J2290j0503o720L1418J2654K2394M273k774
3564B22000k4915J5798J4305M5299p21j5097j1240R78n683k9747j2123k8735n3959
3551A16160M4959j2013l8796j1873L2146r57l4003p315J3670J9210k1294k8124
3539G1770k6462j6973J6906Q957L0882j6155l2631j0722L0205J4497n612j1091
3527E3571m321j219k220m3943K1656K4166Q691N2950k0658J5304n9970K4940O383
3514G5330m591J6669l459O864k937k9306J6800L4280p60j8012J1273L9495n080
3501A36566m7216K2503r691q019J6500K2867j3125m230L4675j0566m0094j9334
$$ y = [156169, 143199, 136150, 115189, 121532, 156282, 107424, 106953, 120479, 140801, 147681, 171728, 182269, 149775, 166830, 163407, 117952, 158968, 171258, 160755, 154035, 185453, 198107, 220501, 224774, 222000, 197085, 212883, 227188, 272487, 271766, 256669, 245429, 246407, 240724, 210977, 198854, 170119, 116160, 161119, 149106, 110310, 98437, 130583, 129626, 95623, 88308, 101978, 121188, 99894, 71770, 45308, 28335, 45241, 54198, 85080, 68925, 36294, 25572, 55777, 70274, 64662, 53571, 49250, 48031, 45811, 1868, 23524, 47690, 56381, 109331, 88673, 103977, 44007, 68947, 75330, 70739, 87408, 83949, 90813, 87876, 58570, 75370, 109650, 108890, 90878, 102151, 141646, 136566, 89350, 111853, 102162, 94143, 110643, 133510, 120385, 116155, 150830, 140264, 100170, 80836]
3489H0836J7016J0590N909N7Q66j2887q83J4884n6433r902K5810o698N550L1640
3475A06355k1576k1898J0875J9128R254l8398L0448n373l8625K6554J848k9966
3463D8626o594K8790J1857Q444j2839Q632K036J1244R035R124K4538l1853p643
3450A03397K2843J9164k4111r456J6075K9502L4052J6421j0017q065p122K7942
3438B10625l4093l4447M0732J2233L556M5224k8861j1686l242j1079p651J6251
3426A97562J2633q694j0285K2311K2085m4824J5351J3895m5093n84K0591r637
3414A85311j6142n3411K8862J2627K8915L7618l6966m035k045J4668J8449J3465
3402B27316k2807l6665m14n672J681p978J718O6653J788m2086L0731J4523j3129
$$ y = [80836, 97852, 108442, 114351, 114408, 115274, 102387, 101504, 116388, 59955, 50053, 75863, 69165, 74715, 106355, 84779, 62881, 73756, 92884, 102138, 63740, 94188, 88815, 50190, 76744, 78592, 48626, 42032, 70822, 82679, 91123, 78284, 86916, 88952, 100196, 109231, 118355, 142893, 111040, 103397, 126240, 145404, 121293, 111837, 127912, 157414, 191466, 207887, 197870, 189805, 182683, 210625, 176532, 142085, 182817, 195050, 198606, 243830, 214969, 203283, 200041, 188962, 181311, 197562, 210195, 201501, 191216, 213527, 235612, 190788, 206139, 220034, 174941, 174357, 194948, 185311, 169169, 115758, 144620, 157247, 186162, 223780, 186814, 182779, 180734, 195402, 213851, 227316, 204509, 167844, 167430, 161758, 163439, 155461, 157179, 223832, 225620, 183534, 214265, 228788, 215659]
3389B15659L3864Q244o666k3140K0543k4378k714j8344J4551J9205j0066J3983
3377B40741l0131J8398R660L1798l9347K6871M8606n810j6940Q100m8026n951
3365B37969l4023m0448P6119J5705j1965L1835j9225k1169J5823k2600J2944p64
3353B40201L5527L388p777l5330k3956N1708K525Q735m4629m0220L7879J8645
3341B46696l4776k4573M4251J6328l5972J5040M8188J2646m6567Q259K0499r467
3329B60552O918L7613M867m2601j3340p933k8087Q871L4305m695J7581J325Q78
3316B76254l0268J5484K7245j6162l038m7858L204K0144P123L80k1567K4621M181
3303B59743L315k705l2361M5676K4567J5395j1680n7227J9957L1258l8245m3476
$$ y = [215659, 249523, 257767, 251101, 227961, 248504, 224126, 221412, 203068, 217619, 236824, 226758, 240741, 210610, 229008, 238668, 270466, 231119, 257990, 306596, 300786, 283846, 291946, 243920, 237969, 203946, 163498, 239617, 255322, 243357, 275192, 255967, 234798, 250621, 228021, 240965, 240201, 275728, 279116, 271339, 236009, 212053, 263761, 266286, 275021, 230392, 190172, 228051, 246696, 211920, 187347, 231598, 247926, 211954, 226994, 275182, 287828, 241261, 249520, 270019, 260552, 267470, 305083, 309950, 267349, 254009, 246076, 217989, 226860, 261165, 256470, 274051, 275376, 276254, 245986, 261470, 288715, 272553, 269515, 221657, 224861, 245005, 252128, 252508, 230941, 255562, 259743, 263058, 260353, 227992, 273668, 298235, 313630, 301950, 244723, 264680, 295938, 257693, 214217]
3291B14217M6836L437l780J4171k3364j65J8669R813J6764l8442o253j3081J890
3278B40712K178k4326M7795J6485m7579M882J4803J0631K5447k6392J6082j507
3266B79211l3969L9450J2873n7777p88J426m58K7394k670K909j1785n6064J91
3253A99943L0105o248l4168L0433J9842P385r272l5059j5464j0807j0718l1436
3241A34536J9587L9314J391N005m6706L7053K2338p513J1016O821j127M929j1286
3228B15358n320j7799M6382K0587n311L0465o336M3664N157k543k1264M765k1436
3215B86369O107m89o607L1185j0k0453N037j4947M0937M141k1412M332j1560K5489
3201C28119J7508K5065J3985j0465j1480L9213k3810n3528M5319O3966K4913j14
$$ y = [214217, 261053, 264490, 260710, 274881, 251517, 251352, 270021, 279834, 296598, 258156, 251903, 238822, 240712, 242890, 218564, 266359, 282844, 235265, 240147, 254950, 265581, 291028, 264636, 280718, 279211, 245242, 284692, 297565, 239788, 239000, 240426, 239968, 267362, 264692, 267601, 255816, 199752, 199943, 230048, 223800, 189632, 220065, 239907, 247292, 238020, 202961, 187497, 176690, 165972, 134536, 154123, 193437, 194828, 199833, 153127, 190180, 212518, 205005, 216021, 222842, 221715, 226644, 215358, 210038, 192239, 238621, 259208, 253897, 284362, 278026, 321690, 326847, 324304, 303040, 307805, 286369, 292476, 291987, 285380, 316565, 316555, 296102, 301139, 286192, 327129, 331270, 309858, 314190, 302630, 328119, 345627, 370692, 384677, 374212, 362732, 401945, 378135, 324607, 369926, 433892, 458805, 458691]
3189D58691j4623j3252j0866R036M5404j2627K9827p919M2714J7888j823q101
3177E34349M2442Q1521p968k5464K087J2190K1448K8109O270L1248P571M537J7050
3164G55390M5608J880j1349O6707N1496M4952M7473M3378M0613N2659Q7948L5174
3152A261929R2639Q7947R8948J43471J47004J66485J89769K28197L00639L59345
3142C076373L90669M04743O2433l27168m58742m20454k87850k31674j68627j01990
3132A937713n1439j5945k0574k9249J4030J9231M0733Q4580J06826J02968J22486
3121B311360J87970J93462K26184L16904L11016M14988M84517O76245Q99684Q27618
3111F849948K09687o33484r31027q24282o69643m69887l50686k27829j56192j19306
$$ y = [458691, 444068, 430816, 419950, 428986, 474390, 461763, 491590, 483671, 526385, 544273, 542450, 534349, 576791, 658312, 650344, 624880, 626967, 639157, 660605, 688714, 694984, 726232, 733803, 738340, 755390, 800998, 802878, 791529, 858236, 909732, 954684, 1002157, 1045535, 1086148, 1138807, 1226755, 1261929, 1354568, 1442515, 1541463, 1684934, 1831938, 1998423, 2188192, 2416389, 2717028, 3076373, 3467042, 3871785, 3934218, 3607050, 3148308, 2727854, 2440004, 2208330, 2039703, 1937713, 1886274, 1870329, 1849755, 1820506, 1834536, 1853767, 1894500, 1979080, 2085906, 2188874, 2311360, 2499330, 2692792, 2918976, 3235880, 3546896, 3961884, 4446401, 5122646, 6022330, 6849948, 7059635, 6426151, 5495124, 4670842, 4001199, 3531312, 3180626, 2952797, 2796605, 2677299]
3101B677299m4322M1804k5874K5487L6225N5791J08097J22516J42007J10768P9183
3090C328981M9444Q8816Q759N3707J18780J80077K58381L17657J22618l03964
3080D223256m93578m70793m06570l32981k28051j52623j53584j12475j10054p2727
3070A689820r6365p7506l7556o0476n6909p1873p3062K8959n3696n8750q091j2989
3058A111506o053P177K4105P854m7429l4644j8804L9699j4577j3479N2024M7707
3046A155086Q422k8198J6542k7272J6878l16n3216j6020l9113n2218l2719k6986
3034I20870r982j7986m2520k971P3650O5134o126J2065l5083r9080k5761k4530
3022H07680m0990j6366L6764j3653J5959K6621k8056J5715K1779J4847K5985K9955
$$ y = [2677299, 2632977, 2674781, 2648907, 2674394, 2710619, 2766410, 2874507, 2997023, 3139030, 3249798, 3328981, 3378425, 3467241, 3476000, 3529707, 3648487, 3828564, 4086945, 4404602, 4527220, 4223256, 3729678, 3258885, 2852315, 2519334, 2291283, 2138660, 1985076, 1872601, 1762547, 1689820, 1593455, 1515949, 1478393, 1417917, 1361008, 1289135, 1216073, 1245032, 1191336, 1132586, 1124495, 1111506, 1105453, 1112630, 1136735, 1144589, 1097160, 1062516, 1043712, 1083411, 1068834, 1055355, 1107379, 1155086, 1163508, 1135310, 1151852, 1124580, 1141458, 1141142, 1087926, 1071906, 1032793, 980575, 947856, 920870, 910888, 892902, 850382, 847411, 921061, 986195, 980069, 992134, 957051, 857971, 832210, 807680, 766690, 750324, 787088, 773435, 789394, 816015, 787959, 803674, 825453, 840300, 866285, 896240]
3010H96240L4944k6692J3694J6007k4699j4449r5918m7025l0998J5288K738j1216
2998G27914l1953k7154l5367p1310k0882l4958m672j9575K1322N26o056L9915
2986E37750L7540K168k3995K3756L8384O9100M6965R681M0618J7946m4207j05919
2974F49787o1092p0425l9947j0467n0504j6578l1621K3662j9934k6072l3588j4966
2962B98255L6254J1470n628k8101k0251J2992R294j6560L5862K5042N948j7601
2950C46976L9917L4319O940l7473j1331l7444k9124k2018l2254o2358J0555m941
2938B01764k5736O4120k3187m1652L7405j1520n380k677l1436J7211j0702j3653
2926A54557J0077n7170r222J6016m958O074P237J4426J7957p657k0206j2053l365
$$ y = [896240, 931184, 904492, 918186, 934193, 909494, 895045, 799127, 752102, 721104, 736392, 739130, 727914, 695961, 668807, 633440, 562130, 541248, 506290, 501618, 482043, 503365, 503891, 497835, 537750, 575290, 577458, 553463, 577219, 615603, 684703, 731668, 741349, 781967, 799913, 755706, 649787, 588695, 518270, 478323, 467856, 417352, 400774, 369153, 392815, 372881, 346809, 313221, 298255, 334509, 345979, 340351, 312250, 291999, 304991, 314285, 297725, 333587, 358629, 364577, 346976, 386893, 421212, 428152, 390679, 379348, 341904, 312780, 290762, 258508, 196150, 206705, 201764, 176028, 240148, 216961, 175309, 212714, 201194, 195814, 193137, 161701, 178912, 168210, 154557, 164634, 107464, 98242, 114258, 109300, 115374, 122611, 137037, 154994, 147337, 127131, 115078, 111713]
2913A11713k36M1K0439M529k2806r604K2000K2835P715k8802k7791O693K9830
2900A36556l0852M0500J4620J3220l6013L8871K7074R133l508K7424L899Q793
2888B49717K4177N08L5962J2228L3461j6049M1887k0626M60N4271k9660j0504
2876C75832J7473p916L605m595J6438j584J7585L2918p273K1435R241L7490k0564
2863D90085N8695J2867m3466j3902j603K2304N2993K2429K918M3636O9346O2402
2851G78704N1283Q4554L9203o192M6721q504k8312K7614m0156L5554L898m7231
2839I37136o736M4030j2302J074k6624p0730n9745m1798k1084n9462J558J8736
2827G04053k1508j6345K6401M1238M2324Q884L6724Q3118Q7597N5045O3036K8893
$$ y = [111713, 111477, 111518, 131957, 136486, 113680, 104076, 126076, 148911, 156626, 127824, 100033, 106726, 136556, 105704, 146204, 160824, 174044, 138031, 176902, 203976, 213109, 209601, 237025, 240924, 249717, 273894, 274402, 310364, 322592, 356053, 340004, 381891, 361265, 361725, 415996, 386336, 375832, 393305, 385389, 388994, 384399, 400837, 399253, 416838, 449756, 442483, 463918, 473159, 510649, 490085, 548780, 561647, 518181, 504279, 502676, 524980, 577973, 600402, 603320, 646956, 716302, 778704, 829987, 914541, 953744, 947552, 994273, 985769, 957457, 985071, 944915, 980469, 984367, 937136, 930400, 974430, 962128, 963202, 936578, 865848, 806103, 764305, 743221, 683759, 685317, 704053, 682545, 666200, 692601, 733839, 776163, 785047, 821771, 904889, 992486, 1047531, 1110567, 1139460]
2815A139460J9657J5609o2066l061k5305p527j1041o1553J5806l6601k9787n4917
2803H98674l8712l3589o7543n309l4662l2078k6216J3641l5279K2177L1669J7784
2791G10557n153p0K2073M5260L7667j72j4416J0169j1896k5639p4058l6230P428
2778F65520n4554m8692j4222l0380l3888l1966l9263M217j0109j3570J5483k1016
2766C87560l0253K805n829k2943R479m650R486L1114r457j4757j4161k3091q612
2753C06691K2102r733l476l3168j0743j5338l4901n468j2969k038O225k3661J6816
2740B00339m6263K8984J7874n2153n886L5788k1920m0622O922N327l369l9308
2728H5713n616R403k9764J6192q811k8269L51K4231J6412l3616K6790M518k5075
$$ y = [1139460, 1159117, 1174726, 1112660, 1109599, 1084294, 1076767, 1065726, 1004173, 1019979, 983378, 953591, 898674, 859962, 826373, 758830, 753521, 718859, 686781, 660565, 674206, 638927, 661104, 692773, 710557, 705404, 705334, 727407, 772667, 810334, 810162, 795746, 805915, 794019, 768380, 694322, 658092, 665520, 610966, 562274, 548052, 517672, 483784, 451818, 412555, 416772, 406663, 393093, 408576, 387560, 357307, 360112, 354283, 331340, 340819, 336169, 345655, 376769, 367312, 352555, 338394, 315303, 306691, 328793, 319060, 315584, 282416, 271673, 256335, 221434, 215966, 202997, 200959, 207184, 183523, 200339, 154076, 183060, 200934, 148781, 142895, 178683, 156763, 116141, 123063, 128390, 125021, 85713, 80097, 89500, 59736, 75928, 67117, 38848, 39199, 63430, 79842, 46226, 73016, 77534, 52459]
2715E2459J4521n707r676J0975j4212K0827k8723L067k7649K1776L714P026K753
2702E1151k4691q210Q437r96j9474J1756J3730k546l4531K7779j8209K2717q036
2689A8877j8708P731q507r334K6336N823j0547j5485j7255k290o559L2787k6886
2676b4017P006J6215K255n866J5569J5971k027J2890l4879J2655l5083m6616L9803
2663b6124L6960J3573m2638r501L5440p196m16l4266P806R386M4668l661k1454
2650B577r347j1057l625r674J3097K9568j8732j8315O273J1076O838l3788r432
2637d4541k3462K6434N359j1679L41j452r15J2654n025q349N069J2872J4389J4173
2623d132k342k8905L5572K018l1731m392L6504L3205l4747k9127r193J6672n63
$$ y = [52459, 66980, 61273, 51597, 62572, 48360, 69187, 40464, 43531, 15882, 37658, 41372, 48398, 51151, 26460, 18250, 26687, 25691, 6217, 17973, 31703, 29157, -5374, 22405, 4196, 26913, 18877, 169, 7900, -607, -9941, 16395, 22218, 11671, -3814, -21069, -23359, -29918, 2869, -24017, -17011, -796, 1459, -4407, 11162, 27133, 25106, 37996, 3117, 15772, -19311, -65927, -26124, 10836, 24409, -18229, -27730, 7710, 514, 98, -34168, -26362, -16976, 27692, 24031, 2577, -6770, -17827, -21452, -31126, -18029, 11539, -7193, -25508, -19235, -8159, -1321, -35109, -44541, -68003, -41569, -36210, -47889, -47548, -49000, -49915, -37261, -42286, -50635, -45566, -32694, -18305, -4132, -6474, -35379, 193, 2211, -29520, -33912, 2592, 35797, 1050, -28077, -37270, -20598, -21161]
2610b1161J2339J101N223j9200m487K4387m2913J7162l0497Q683L1037J2884k0099
2597b5541J454P738P896K754J9994M2529j3341L326n0045P37O086k2255o16M6430
2583B7146k4839k8539k5216J0644o929J6645M0113K140p329O813K1634j4726K2544
2570D0101q139k4995J538M20m510k1102L9034K0302L3917l0814K9790J5157j1019
2557G9680k6097j5029J7420J287M7467j3295k3469k0109k6941O485K6306j83L9589
2544I3111J8299K4855K8757R84l5433k1003J1647m579p898j5961j4190K7601m687
2531A01503L9558L4592k5900j130K4345j4618J8396J3878k2523k5592k5959J1796
2519A28346K6336J3945k4576l904J2379p572K1584L4001r59q835j6324p705J4295
$$ y = [-21161, -8822, -7721, -2498, -21698, -26185, -1798, -44711, -27549, -58046, -49363, -18326, -5442, -25541, -24087, -16349, -8453, -5699, 14295, 56824, 43483, 46809, -3236, -2499, 3587, -18668, -19284, 27146, 2307, -26232, -51448, -40804, -47733, -31088, 9025, 11165, 3836, 10649, 32283, 17557, 40101, 31962, 6967, 8505, 8925, 4415, -16687, 22347, 42649, 76566, 45752, 75542, 90699, 79680, 53583, 38554, 55974, 57261, 104728, 91433, 67964, 47855, 20914, 27399, 53705, 53522, 93111, 111410, 136265, 165022, 166006, 130573, 109570, 121217, 116638, 108740, 92779, 78589, 106190, 101503, 141061, 175653, 149753, 148623, 172968, 158350, 176746, 190624, 168101, 142509, 116550, 128346, 154682, 168627, 144051, 140147, 152526, 144954, 166538, 200539, 199580, 190745, 174421, 166716, 181011]
2506A81011l7819J8867J4734l6533l9987O209j9378L8691M3160j3392l0765m345
2494A20453O3652J550n1607P381N6751q906o7465r722j5289k122L9625k7346p031
2481I9924M9025J1264r345k8980r479O595K20J4984J0180n2248m1424O435k1443
2468C5708J4569n822j2493k7410L5292M725L434J6615k3419R686J8915k7062n0971
2455h233K1326K2300m8433m823M966J9874k6958M3173L5376j7273n6965J4753
2443i17P691o099k8754J2699J1310j7820j217j1412K2940o630L423l3232N5585
2430G567k9591m5902m642j3565L8222P549L1749K137M2084L4879L2877N291m0880
2417F7775p1780l2543j2647k6411O6334L5313N53k0547J6626l553j9768j9526
$$ y = [181011, 143192, 162059, 176793, 140260, 100273, 106482, 87104, 125795, 168955, 155563, 124798, 120453, 184105, 185655, 134048, 141429, 198180, 189274, 121809, 112087, 96798, 94676, 134301, 106955, 99924, 148949, 160213, 150868, 121888, 112409, 119004, 119224, 134208, 144388, 92140, 50716, 57151, 35708, 50277, 44455, 31962, 4552, 39844, 44569, 48003, 64618, 41199, 50885, 69800, 42738, -8233, 13093, 35393, -13040, -17863, -12897, 6977, -19981, 23192, 58568, 41295, -15670, -917, 6774, 675, -28079, -15380, -4070, -21890, -23107, -34519, -11579, -18209, -14786, -48018, 7567, -22024, -67926, -72568, -86133, -47911, -40362, -8613, -6476, 35608, 70487, 103364, 108655, 67775, -4005, -36548, -49195, -75606, -9272, 26041, 26594, 6047, 22673, 19120, -648, -20174]
2405b0174m2138m583J2875m2244M6067k6611K0142M137K6186p186l076k5015k5217
2392h6837M6201m276L88K5290j4149k3235j066L4901n553j5698K782j7685J0017
2379d8920m7333K3994K1010o18K1168J3774k5633K5527L118j6023j015j603K0064
2366a2490k0580k6086k7806P855j677p41J4963o535N6535K6258p791j4541n679
2353a8315K5645j3535j2799M5282J995k3819P525j3585k016k8424P961J3659j4964
2340b5390j3290r878O082K0660J2459j2492J2101m366K4155q777k8043k7682J5876
2327c8585k0739K2088O250k400K846o921M2798p486J409m2326M057q914J3353
2314c4570l6j8261L3416J1079J2560N02l9636K1071J1529m752P810K6523O207
$$ y = [-20174, -62312, -66895, -54020, -96264, -50197, -76808, -56666, -52529, -26343, -33529, -36605, -61620, -86837, -40636, -44912, -44524, -19234, -33383, -56618, -57684, -22783, -28336, -44034, -41252, -58937, -48920, -96253, -72259, -51249, -51867, -30699, -16925, -42558, -17031, -13913, -29936, -30951, -32554, -12490, -33070, -59156, -86962, -79107, -80784, -81525, -66562, -73097, -16562, 9696, 1905, -12636, -18315, 7330, -6205, -19004, 26278, 28273, 4454, 11979, -1606, -3622, -32046, -24085, -10426, -25390, -38680, -48558, -42476, -21816, -9357, -21849, -9748, -14114, 10041, 1264, -26779, -54461, -38585, -59324, -37236, -30986, -33386, -30540, -37461, 5337, -2149, -740, -43066, -39009, -47923, -34570, -34606, -52867, -19451, -8372, 4188, 4690, -34946, -13875, -2346, -7098, 712, 27235, 33442]
2301C3442K3463J5931m6119k2367K5300j2977j6255L4735j9249m3070l9597L0469
2289c6294K1239n41j2561K144k0184J4411R616J9744k9206J9500M900Q60O4j2085
2275a8393J407j5909K5j7237K3091l7965q051j892Q050L8761o50q2j7459k2257
2261f8561j2521L7945M2878j6051o4599L3681L1485M844k2662J1137q075R503
2249b0996k2049N191R013P376r23j2008j5843K536P182j9293M4261k5001j6395
2236e6949l8J6419l386K5892n381J1217L104J4996k5017j9304J7828k3572N37
2223d3654L9341k4434Q913j6893J2030K7753k9163M613l31J1619R313k8376R784
2210a9485J1838M438j583j3834O833L2783J7507j1898k6954r802j798J2588j2497
$$ y = [33442, 56905, 72836, 26717, 4350, 29650, 16673, 418, 35153, 15904, -27166, -66763, -36294, -15055, -15596, -28157, -26013, -46197, -31786, -22170, -2426, -31632, -12132, -7232, -6372, -6308, -18393, -16986, -32895, -32870, -50107, -27016, -64981, -73032, -74924, -66874, -28113, -28763, -28845, -46304, -68561, -81082, -43137, -259, -16310, -80909, -47228, -15743, -10899, -33561, -22424, -30499, -20996, -43045, -37854, -28841, -21465, -22388, -34396, -50239, -47703, -40521, -59814, -15553, -40554, -56949, -56987, -40568, -43954, -18062, -23443, -12226, -9122, 5874, -19143, -38447, -20619, -44191, -43654, -4313, -28747, -19834, -36727, -24697, 3056, -26107, -21494, -21825, -10206, -893, -29269, -19485, -7647, -3209, -4792, -18626, -11793, 20990, 38497, 26599, -355, -10157, -11955, 633, -11864]
2197a1864P659k2685o97j9955M831m088l172J5206J1954m605L2078j3694k158
2184a1190Q715k3187K1833o145J2148J5713J1223j2263l42L7631J108j0019J6173
2171F1398J8960n3966k4727k6683J9010L7086L896L1389l1637j3218m214O4272
2159H1566Q04P874m1251R967J460J5427L087l6079J7939O476m1880r625N6076
2146G1841J7317r402K6789L1615Q69j8993O982Q627J5875J5424J2756L662m0485
2133A42877j2374j0574O1744P983j5167K0447J4501M2495R659k0387k0444J0129
2121B30889P431L3366P636l5222K1003J6092K380K052j2381K9207L6027J067J5090
2108C54637K1720j9932L7715J2737M3023J1157j8205K1088j8762L4561L1210n164
$$ y = [-11864, -4205, -26890, -27587, -47542, -42711, -46799, -49971, -34765, -22811, -27416, 4662, -9032, -11190, -2475, -25662, -3829, -9974, 2174, 17887, 29110, 16847, 16505, 54136, 55244, 45225, 61398, 80358, 26392, 1665, -25018, -6008, 31078, 34974, 66363, 34726, 21508, 17294, 81566, 82370, 90244, 48993, 58960, 60420, 75847, 78934, 42855, 60794, 67270, 25390, 15765, 71841, 89158, 79756, 106545, 138160, 139029, 120036, 127018, 135645, 151520, 166944, 179700, 183362, 142877, 130503, 119929, 181673, 189656, 174489, 194936, 209437, 251932, 261591, 241204, 220760, 230889, 238320, 271686, 279322, 244100, 265103, 281195, 283575, 285627, 273246, 302453, 338480, 339547, 354637, 376357, 356425, 394140, 406877, 449900, 461057, 442852, 463940, 445178, 479739, 510949, 505785]
2096E05785k797N3837M8726L6595M5817M5762L6168K8874N9640M6630R4368L8401
2084A037806P9492P3279O7267Q0313J13772J49329J29365J12589K21206K10676
2074B275094K54130K29281L27155L45057M52732N35694O03961P41272R20736J197792
2064G882904J520031J954325K358454R46788j791613k369277k184574j841466
2056F475572j246456q65591o26410m16837l23686k79017k02067q7247j01797j58602
2046B167862k06286j79852j87241j28228r4897j29874p5496o5360m1404o1911
2036I97313n4741k0035r0895m5077L45l4029k9707m225k2165o9251r051k6350
2024E92132k6107m6921o5281K1329l0963j2363m4339n584q381j2908K074P086
$$ y = [505785, 502988, 556825, 605551, 642146, 687963, 733725, 769893, 798767, 858407, 905037, 999405, 1037806, 1117298, 1190577, 1257844, 1338157, 1451929, 1601258, 1730623, 1843212, 2064418, 2275094, 2529224, 2758505, 3085660, 3430717, 3883449, 4419143, 5023104, 5764376, 6685112, 7882904, 9402935, 11357260, 13715714, 14662502, 12870889, 10501612, 8317038, 6475572, 5229116, 4363525, 3737115, 3320278, 2996592, 2717575, 2515508, 2428261, 2326464, 2167862, 1961576, 1781724, 1594483, 1466255, 1371358, 1241484, 1165988, 1100628, 1059224, 997313, 942572, 922537, 831642, 786565, 786910, 752881, 723174, 718949, 696784, 627533, 618482, 592132, 566025, 519104, 453823, 475152, 444189, 431826, 387487, 381903, 373522, 360614, 362688, 369774]
2012C69774m900n7115J1278j9416j0321k0900n026o443m152K340j2991l3392k614
1999B06122n3453J9270L1217j8236j968j382P808o982n241Q110j9680j8927Q785
1986A55443m177k4057k464K3506P260k0561K8884j2573m5502J8103n7372j6066
1974E0424L0075J4133k1287M4997l6278k1975M6604l5389l5444N593K2641k64
1962F3830j3811P644N549m270L9472j237J9m617N365m6661k5284L2485m193L553
1948E7844K432j8913l0984K0646J5785l5316j5755M1631J2875J1304J5905m0913
1936C6541J8640n1121m0008L2865M078K2116m150N979J8751l981j8522j7729n922
1923b463j4259L3213K2577k9133k1237K0169k51j1829J823q827K2510j472k1796
$$ y = [369774, 364874, 307759, 319037, 299621, 289300, 268400, 263374, 256931, 252779, 255119, 242128, 208736, 206122, 152669, 171939, 203156, 184920, 182952, 181570, 189378, 182396, 177155, 185265, 165585, 146658, 155443, 151266, 127209, 124745, 148251, 155511, 134950, 163834, 151261, 105759, 123862, 66490, 50424, 80499, 94632, 73345, 118342, 82064, 60089, 106693, 71304, 35860, 41453, 64094, 63830, 50019, 57663, 63212, 58942, 98414, 97177, 97196, 92579, 97944, 51283, 25999, 58484, 54291, 57844, 60276, 41363, 10379, 31025, 46810, 11494, -4261, 37370, 50245, 61549, 77454, 36541, 55181, 4060, -35948, -3083, 995, 23111, 18961, 24940, 43691, 39710, 21188, 3459, -2463, -16722, 16491, 39068, 9935, -11302, 8867, 8616, -3213, -1390, -10217, 12293, 10821, -10975]
1910a0975J3006l106K3515L1633k5471l3558j8051J3374J388J1391Q741j0771
1898A116j0953Q35K3773M535k4049j4767l1521q372N4568j0300J7585j65R521
1885A1806o775K3970J2244j4116j1653Q72n632j1581L011j2180j7591K3489O743
1872B607o382K09K373K28j3604M95m4135O325K8221k0261J0311M302J525m443
1858c2229o028L6706n4149L9802J2290l0907n563j7136j2564L7744K8629K2581
1846A9176j1668l4561l7980J8978K6978j5787L4208j652m0909N22j3579J5126
1834d1148J6140l01K126J1698k391r179j0456J8191J8784K4104J3337l4027k1972
1821a5094L28L2194J1183N160k4735j8446o126N669p364J60K1123n809k2025r59
$$ y = [-10975, 2031, -1075, 22440, 54073, 28602, -4956, -23007, -9633, -8245, 3146, 11887, 1116, -9837, -9002, 14771, 19306, -4743, -19510, -51031, -59403, -4835, -15135, 2450, 2285, 11806, 5031, 29001, 41245, 27129, 15476, 16348, 10716, -865, 2146, -10034, -27625, -4136, 2607, -3775, -3566, -1193, -965, -14569, -14074, -58209, -51884, -23663, -43924, -33613, -29311, -27786, -32229, -38257, -1551, -55700, -15898, -3608, -34515, -40078, -57214, -69778, -32034, -3405, 19176, 7508, -27053, -65033, -46055, -19077, -34864, -656, -2308, -43217, -42695, -56274, -41148, -25008, -25309, -23183, -11485, -13876, -23055, -33511, -15320, 3464, 27568, 40905, 6878, -15094, -14766, 17428, 28611, 33771, 9036, -9410, -15536, -9867, -17231, -17071, 4052, -1757, -23782, -24741]
1807b4741j5509j525l8980L8405M0477o3217J1605M724J3008k4492j538K7527
1795c4256K2313K8123j4024j4294j5231k4981Q688j1676n7300K1692P8913k5119
1783c7152k1000J5836K0928J8046j491J6115j8082J4534k6648j1843r01j312J8011
1770a4959n759m4649N4044j2585J4108r968j2022k2403m577J6099K926j054N199
1757c5600P171K0642J2339j2136j7810j8711n683n433L4360K192Q826l3187k9172
1744g2202n86o529P353M3956K4744j3873R336J3587J3926l5725l5170L8182n165
1731a8166O886J8684l393k3037J4971k985m8765n874L0238j221r077L983N5227
1718A7471l1240k0717r865J8620j1329p927L7888j2961m6519L270K0388J167L047
$$ y = [-24741, -40250, -41775, -80755, -42350, -1873, -65090, -53485, -48761, -35753, -60245, -61783, -34256, -11943, 16180, 2156, -12138, -27369, -52350, -43662, -55338, -112638, -90946, -12033, -37152, -58152, -42316, -21388, -3342, -4833, 11282, -6800, 7734, -18914, -30757, -31658, -32970, -14959, -20718, -65367, -11323, -23908, -9800, -19768, -31790, -54193, -58770, -42671, -39745, -40799, -35600, -28429, -7787, 4552, -7584, -25394, -44105, -49788, -55221, -20861, -18669, -9843, -43030, -72202, -72788, -79317, -71964, -28008, -3264, -17137, -7801, 5786, 19712, -16013, -51183, -13001, -18166, -11280, 7404, 4011, -19026, -4055, -7040, -55805, -61679, -31441, -32662, -41739, -37756, 17471, -13769, -34486, -44351, -25731, -37060, -44987, -7099, -20060, -66579, -63309, -42921, -41754, -38707]
1705c8707l69J5427L9018m0937R47o89J6236l4803M988J1714j3949q98P754M2251
1691G983k7883k899j1135O689K2697M982k9755J6020j2251J1647j7660k7042N8397
1678b10j102o575K9600o664k5852j3580J7044k0690K3074k854r405j5029q548
1665d0791q405N7509k4145j2573m544m610M3250j8714J926k6887L6640m6168R340
1652c8172L7321j9388j1894k0665K175r322l1288K6311L5851J5833J4173n1299
1640e0364L1384J4595k7856J2894N461m0960J72L4513l2759M026R347j6553J2364
1627d3736j1036L8066K8132J031l7328J3869L786l0882M629j0228j6211N0085
1615i823j5320j3685M6963n1834L651N98J7400r516j537J8226j5985k0355J1115
$$ y = [-38707, -39076, -23649, 15369, -25568, -24621, -25310, -9074, -43877, -38889, -27175, -41124, -42022, -34268, 7983, -19900, -22799, -33934, -27245, -4548, 434, -29321, -13301, -25552, -13905, -31565, -58607, -210, -1312, -7887, 21713, 15049, -10803, -24383, -7339, -28029, -4955, -7809, -17214, -32243, -40791, -49196, 8313, -15832, -28405, -32949, -37559, 5691, -13023, -11097, -37984, -1344, -47512, -38172, -851, -20239, -32133, -52798, -50623, -59945, -91233, -64922, -29071, -13238, 935, -50364, -18980, -4385, -32241, -19347, -13886, -54846, -54674, -20161, -52920, -48894, -39547, -56100, -43736, -54772, -16706, 11426, 12457, -24871, -11002, -7216, -38098, -33469, -43697, -59908, -9823, -25143, -38828, 8135, -43699, -40048, -39450, -22050, -31566, -33103, -14877, -30862, -51217, -40102]
1602d0102J839K4102J0604l9145J4567R53j1252k4630J2466j5841J0060J2850
1590d3529k0322o314L4770K3184J1072j1397J4468j8116r584L3085K244J001m8566
1577c8004n28J0171L409k205k0737K7839L0492K1210o8403k5344J0498m1407K1557
1564g1452K911J7051N3853K8531j5969m3715l8968J8495K1107K3588P380j5213
1552a2401l1896M368K4639M851M057k5426J8376K1416j7736j4633k3621J5940
1540c2066K1241p918m7668K8092L1102O588N855K7006j9371n4345k6357M7212
1528b0629K5983K808m5207l4863R738O615M9027P418m279K5437n211n5449O130
1515c2482J6670l3526Q657o369l350J2503n8376L0852j898J1039K4756L79N0254
$$ y = [-40102, -38263, -14161, -3557, -42702, -28135, -27182, -38434, -63064, -50598, -66439, -56379, -43529, -63851, -70165, -35395, -12211, -1139, -12536, 1932, -16184, -25768, 7317, 9561, 10562, -38004, -38532, -28361, -24952, -27157, -47894, -20055, 10437, 31647, -36756, -62100, -51602, -93009, -71452, -68541, -51490, 2363, 30894, 14925, -28790, -67758, -49263, -28156, -4568, 2812, -12401, -44297, -39929, -15290, -10439, -6382, -31808, -13432, 7984, -9752, -24385, -48006, -32066, -10825, -18743, -66411, -38319, -7217, -629, 5226, 32232, 12861, -41484, -67841, -20629, 5354, 8162, -37045, -71908, -62170, -55555, -6528, 890, -3389, 22048, 16837, -38612, -32482, -15812, -49338, -40681, -47050, -50400, -37897, -96273, -65421, -67319, -56280, -31524, -31145, 19109]
1502A9109R053j1110k6850n2649J4031k0604J931L0242j6534K4542p041K5161
1490a0719P143q333j5637j4494J5429o828o549M578j7999q956K263k3519M7938
1477c5683J176j8703J0378N275J5141m733J9761K9811q175o025k0909k9537K6495
1464a5728M325P88n211j2567k861J2600k2611Q154L7946K8786k3316o939j7324
1451a3958l4402K9437L1291L378K6278K8585q950j5803j3479k5742n3044l6737
1439h3146J9981K4335K1277j5724K3483Q273m0236N97J5185j1229k7596J7416
1427d7384K268p789j1027K8977J6680J3046o565k159k883L1967j4401O356J4230
1414B1316l1534l2457N5624K273m125M3400m018o9665J5323J8059n815n979K49
$$ y = [19109, 28162, 17052, -9798, -62447, -48416, -69020, -67089, -36847, -53381, -28839, -35880, -10719, -3576, -11909, -27546, -42040, -26611, -33439, -39988, -35410, -53409, -62365, -60102, -83621, -35683, -34507, -53210, -42832, -37557, -22416, -27149, -7388, 22423, 14248, 8223, -12686, -42223, -15728, -11403, -10615, -15826, -28393, -31254, -18654, -41265, -33111, 4835, 33621, 10305, 3366, -13958, -48360, -18923, 12368, 15746, 42024, 70609, 61659, 45856, 32377, 6635, -46409, -83146, -63165, -38830, -17553, -33277, -9794, -1521, -41757, -41160, -25975, -37204, -64800, -47384, -45116, -52905, -63932, -34955, -18275, -5229, -11794, -13953, -16836, 15131, 730, 7086, 21316, -10218, -42675, 12949, 15222, 11097, 54497, 50479, -19186, -3863, 14196, 8381, 2402, 2651]
1401B651p24l5792J1424k4357J1151J8011j7831j5851J242J8458L3644l9847k3947
1388f1768K7150L4912l4401J4228j692J3497K5760l5374j8503P092L3721k4685
1376b0063n73k7695j1514L5323O0026j1030r445n135k2142M827k147K6572j5754
1363A250m7119K62L5989L7268j722m0419j3596o867L913J8306k8439j9981m159
1350f5314P465N5680J3161K0042q57j0879l2453J2605K7864m005k9985j100K411
1337e365j1325J430P140q928m868r969m3618J3117L1092N5361K1701k509j6600
1324B6659n9448n2135K5682N6156K42l8032n424K4578j0024o099l068k6411M7969
1311a9355r697j8550L2935k7799J2442J4916q097q611J9966j0217M404J7353j428
$$ y = [2651, 1927, -33865, -22441, -46798, -35647, -17636, -35467, -51318, -50076, -31618, 2026, -37821, -61768, -34618, 294, -34107, -19879, -21571, -8074, 17686, -17688, -36191, -29099, 4622, -20063, -20636, -48331, -59845, -24522, 35504, 24474, 15029, 9894, -12248, -7421, -9568, 17004, 1250, -45869, -45607, -9618, 27650, 25928, -14491, -28087, -34954, -31041, -12735, -41174, -61155, -65314, -57849, -2169, 10992, 31034, 30177, 19298, -13155, -550, 27314, 23309, -6676, -7776, -5365, -16690, -15260, -8120, -17048, -21916, -31885, -75503, -62386, -31294, 24067, 45768, 43259, 26659, -32789, -84924, -59242, -3086, -2844, -40876, -46300, -21722, -31746, -37845, -40913, -67324, -19355, -29052, -47602, -14667, -42466, -30024, -15108, -23205, -31816, -11850, -22067, -17663, -310, -1738]
1298a738j3871r373j4385q573K6371q545M0710M0586l3503j2478k7618P931M599
1285i887q077j3088M856j3891K4698J0961j5057K5073J6029l3108j6229K4530
1273c190j108l595L1826n456N558K8125Q882j9625j3575J1951k516l1119K1053
1260B7211K3231l0501M548p555N397j1913K328j7831k4488K617J1447K0107K9551
1247C4149K6769l8577l4597P742m880K2078m1769J2276k0422K8151K8581j6590
1235B911n082K0079k3278P241J205m995n908J9882K0220K4654k2103j197m6432
1222a2803k5058J147k743N0551m2375K375K710J8921o725l308K2730K3842k466
1209B6798k2693j42j6990l508K2278l3414M0004j7132J6144L530Q09q769l0665
$$ y = [-1738, -15609, -24982, -39367, -47940, -21569, -30114, 10596, 51182, 17679, 5201, -22417, -14486, -9887, -17964, -31052, -26196, -40087, -15389, -4428, -19485, 5588, 21617, -11491, -27720, -3190, -4298, -7893, 23933, 18477, 24035, 52160, 61042, 41417, 27842, 39793, 37277, 6158, 27211, 50442, 19941, 24489, 16934, 22331, 10418, 12746, -5085, -29573, -26956, -15509, 4598, 34149, 60918, 22341, -12256, -4514, -9394, 12684, -29085, -16809, -37231, -9080, 19501, 2911, -2171, 17908, -5370, 1871, 3076, -1919, -7827, 12055, 32275, 56929, 34826, 33629, -12803, -37861, -36714, -39457, 11094, -31281, -28906, -26196, -7275, -14000, -17308, 5422, 29264, 26798, 4105, 3963, -13027, -16535, 5743, -27671, 12333, -4799, 11345, 14875, 15684, 6915, -23750]
1196b3750j8648M6895r350M1406j8772l5462J3291Q44R089L2281l7514N025J9980
1183B5315k4281j0898K3547M2247o6236n659j7670O584J1692K9690k6142J4224
1171B413q438P032l1556k764K7006j830J0751l4270l18K2750J1122L976K3812
1158B9686m3378P777j961k0663N918m4409K7859K2541j5633P091K3430P486p178
1145a434l845m478k1808J8520j3122o064J8556R549j7432Q127J3277q908l0447
1132c9509l542K9283k3850L3053j9105R883K3729k0816q856m999l06j4009N1616
1119A2572k5500q308l3551J057M2490J3467K0113J220m5717J1520j1962P184Q868
1106f547J0769N387k7774q910M3390o260j8650K1392n5280k559L2469k8614J383
$$ y = [-23750, -42398, 4497, -4853, 36553, 17781, -17681, -4390, -3546, 5543, 37824, 310, 5335, 25315, 1034, -9864, 13683, 55930, -10306, -15965, -33635, -27051, -15359, 14331, -11811, 2413, -6025, 1007, -30549, -33313, -6307, -8137, 2614, -31656, -31974, -9224, 1898, 5874, 29686, -13692, -5915, -7876, -28539, -22621, -67030, -39171, -16630, -32263, -25172, -1742, 5744, -1434, -5279, -9757, -31565, -13045, -26167, -32231, -13675, -4126, -21558, -13431, -154, -9062, -39509, -43051, -13768, -37618, -4565, -23670, -13787, 9942, -10874, -19730, -24729, -25035, -39044, 12572, -12928, -21236, -54787, -53730, -11240, 2227, 22340, 23560, -22157, -10637, -22599, -15415, -6547, 4222, 9609, -18165, -27075, 16315, 10055, -8595, 12797, -42483, -45042, -12573, -41187, -39804]
1093c9804J031R287M5884j1740N698q289p806J0497K3650l7437j5383k7470N6178
1080D296O903q249k8302L1536K1192n0120j893K3809M925j5238j546k2523J8476
1067a6734j0603K1709L3200o477k7674n2627J7088L1513o51r26K9730L736k6485
1054e201j1673K8807j311n669m0453J126r207L668j455K5478K3340j8668K2876
1041A1658k3161j186J7472K591L438L4469m4535Q465K0190l6866J8251j0807J0053
1028A0032k3244J5821J484j1016J6039k8806L8919J6813m997q247j6537J0785
1016A7046k3521l0562R852K7925K0799K0956k8896q997k407k3793J5282j203M914
1003b605j1867J5826P770N883j4358j7799j0907K1158K8099j7861R98K9316l3113
$$ y = [-39804, -38773, -29486, 16398, 4658, 10356, 2067, -5739, 4758, 28408, -9029, -24412, -51882, 4296, 11199, 2950, -25352, 6184, 27376, -22744, -24637, -828, 4097, -11141, -12687, -35210, -16734, -27337, -5628, 27572, 21095, -6579, -59206, -42118, -10605, -11256, -12182, 17548, 21284, -5201, -16874, 11933, 10622, 4953, -35500, -34374, -43581, -39913, -41368, -15890, 7450, -11218, 11658, -11503, -12689, 4783, 7374, 10812, 45281, 746, 9211, 29401, -7465, 10786, -21, 10032, -13212, 2609, 4093, -6923, 9116, -19690, 19229, 36042, 31045, 22798, 6261, 17046, -6475, -37037, -27185, 740, 21539, 42495, 13599, 4602, 2195, -21598, -6316, -7519, -2605, -14472, 1354, 9124, 15007, 649, -17150, -28057, -6899, 21200, 3339, 4337, 33653, 540]
990E40L737k0884J768K191R429L1692k9973j6762j1863L4907K608J9843J5585
977D2818k0964l9891L508K8541O073J916J924k5116m764K679l0218Q553L3161
964H220r477l0135L4017k4713j5922L0842M6841R260l2844o391o123K3076k8213
951a562p513r626Q492n579k8186L5599Q776O6978J155k1151m4451l4145M4932
938A3719n864l7690J1092L7693J2104j8841k785o074m456j2019o758K679L2387
925A5187j6248o003k981J8143K3488l3092K9097L3892R784j5283l2606j300r628
912A2450J2226J9803j7771k4178K4861l037q676j9296j6433J1707k642p457L0335
899A1892K3916p832K2347l5632P281K309k1275k3222K7149K556p636k648L594
$$ y = [540, 4277, -16607, -14839, -12648, -3219, 28473, -1500, -18262, -30125, 4782, 7390, 27233, 42818, 21854, -18037, -14529, 14012, 20085, 22001, 23925, -1191, -5955, -3276, -33494, -24941, 8220, -1257, -31392, 2625, -22088, -38010, -7168, 39673, 48933, 16089, 9698, 3575, 26651, -1562, -9075, -18701, -10209, -15788, -43974, -8375, 401, 67379, 68534, 47383, 2932, -31213, 13719, 7855, -29835, -18743, 18950, 31054, 12213, 9428, 3354, -1102, -13121, -19879, -17200, 15187, -1061, -7064, -10045, 8098, 31586, -1506, 27591, 61483, 71267, 55984, 23378, 22078, 12450, 24676, 44479, 26708, 2530, 27391, 24354, 15678, -3618, -20051, -8344, -10986, -18443, 11892, 35808, 27976, 50323, 14691, 21972, 24281, 3006, -20216, 6933, 9489, 1853, -795, 2799]
886B799K5077j1093J329j588k0774J3096l4703J1505J7529j6857K3413l6865L2779
873E647l057l1308M042K3157N089l995k1008j7341O860L9229J0022j9495K4607
860B2449j0505k3137R04q745j1905l4185K0169O9036k6901l72J3506J8511J6612
847D5437k9890k564j8868J191J6299k4864L7724l9754P904j850m714j7352J0078
834b1223L4435J1839k980K1116n755n15O918K7283n4107k7689K7624O4n995r911
820A104r881J2523o607J8175k131j2623N3786l641J5308j582k9539Q555j4601
807B8846L5313J7667l4446p366K451k470j22K666k1319j073J195J0027m0007j2457
793b1095M0287j4556l0925L7836l602j564r43M1405K295j4000m4083J7788J229
$$ y = [2799, 27876, 16783, 18112, 16524, -4250, 8846, -25857, -14352, 3177, -13680, 9733, -27132, 5647, 2590, -28718, -24676, -1519, 3570, -425, -21433, -38774, -31914, 7315, 17337, -2158, 22449, 11944, -11193, -10289, -19034, -30939, -65124, -44955, 24081, -2820, -3192, 10314, 28825, 45437, 15547, 12983, -5885, -4694, 11605, -13259, 24465, -15289, -7385, -9235, -13949, -31301, -21223, 13212, 25051, 22071, 43187, 37432, 36917, 43835, 71118, 17011, -10678, 16946, 17010, 11015, 1104, -8777, 3746, -2861, 15314, 13183, 560, 54346, 50705, 66013, 64431, 34892, 43447, 28846, 64159, 81826, 47380, 40014, 42465, 39995, 39873, 42539, 21220, 20147, 21342, 31369, -8638, -21095, 19192, 4636, -26289, 11547, 7945, 6381, 5438, 46843, 49138, 35138, -8945, 8843, 10072]
780A0072Q46K233J6764q704K4791l6803J1410n419l4947N486J3765O969N944k58
766A2149j2927n248P645K1023L893j1688M025J7895k6478l247L0745l546J2359
753D6600J1788k5164P944l1570m842J0938K4380l7516K3261j8301o208Q972L7942
740D8224j9990j6784j2320o092K6889J7541r730o787j5994J704K0435Q161N667
727D0924m7772k2432N0650k6574J9579J3606m6453M7197j7972j3655k6773M1039
715A1364k9799R681J8022k0810k199M5723J3446o152L056k4290J1461l2822N2
702c267J4588J460O720j6263j6455l004J3146n953J8803J0078l9880J9125K4557
689B3655k9392J497K2977J708o899m2972j9426K1532O568K4908J3054l3809o046
$$ y = [10072, 10918, 13151, 29915, 21211, 46002, 9199, 20609, 15190, -19757, -14271, -506, 6463, 12407, 12149, -778, -6026, 1619, 22642, 26535, 14847, 18872, 36767, 10289, 7042, 37787, 34241, 46600, 58388, 33224, 41168, 9598, 4756, 15694, 40074, 2558, 25819, 7518, 1310, 10282, 48224, 28234, 11450, -870, -6962, 19927, 37468, 27738, 20951, 4957, 6661, 27096, 35257, 40924, -6848, -29280, 21370, -5204, 14375, 27981, -18472, 28725, 10753, -2902, -29675, 11364, -18435, -8754, 9268, -11542, -13741, 31982, 45428, 39276, 42332, 18042, 29503, -3319, -3267, 11321, 12781, 19501, 3238, -13217, -16221, -3075, -9028, 9775, 19853, -20027, -902, 23655, -5737, -4240, 18737, 20445, 13546, -29426, -48852, -27320, -20752, 4156, 17210, -16599, -22645]
676b2645N5731l9725j6838K0460L3880J482k9344r573l6260J3020p85N2472l826
663A8049R743j1169j6580M0003K2776k6237l7516J8555L6689l033m6174r18j3486
650i298Q97J6158n505m5354L0138J0159O43K3820O029m318Q570k825j7161q1N223
635A7095j0429j3974J8975P501J5389l4316j2115K4383K2773l4529J214k4332
623b2365J5149j2263J0179J7883J0340R876J4974m3525K8144O317k6705J0330
611A8334j6791J8195j0979l444r929J4839Q640J0241M047j7631l4039L5425r518
598G390L1107J9161j7474m307j6888j4205l2604K8781K2657j4980J7179N911n3798
585b2070O492M5739J38K9382J1201o381k3742j1691j2663O08J6647q688M1765
$$ y = [-22645, 33086, -6639, -23477, -3017, 30863, 32345, 3001, -6572, -42832, -29812, -30597, 21875, 18049, 27792, 16623, 43, 40046, 62822, 36585, -931, 17624, 54313, 51280, 5106, 4188, -9298, -8401, 7757, 2252, -43102, -12964, -2805, -2162, 21658, 27687, 23369, 31939, 29114, 11953, 11872, 17095, 6666, -7308, 11667, 19168, 34557, 241, -11874, 12509, 35282, 753, 1967, -22365, -7216, -19479, -9300, 8583, 18923, 28799, 43773, 248, 28392, 34709, 8004, 18334, 1543, 19738, 8759, 5315, -4614, 10225, 18865, 29106, 33153, 15522, -18517, 16908, 7390, 38497, 57658, 40184, 35877, 18989, 4784, -27820, 961, 23618, 8638, 25817, 31728, -22070, -15578, 30161, 30299, 59681, 70882, 64501, 40759, 29068, 16405, 17013, 33660, 24972, 66737]
572F6737j3391l7442K8608P704j3017m2733j7779J5871K5997r909K2312M671j7277
559B0352P591n69J793p386J9079o3742j5621L8426K9028L4244J3542m8270J8852
546D7319j6880m2949J2884K2863K5329K7767n4706j4286J0637k6066N1452M267
534D7631j9933L087P679j2767L987k0605k5080m034P1020q121K00K8696k3276
521D8484l8787Q668K4250o74k7367j5165j8491J5712K8774k3160j2228K0915L5563
508D6494l8109N414r848M6098K3809o0974K1995r672K639J2502o208j5590q279
495A0271r307L4802k2741j7572J3937J5086K8312j4531J863k7742J3714k9676
483c584q817M2456K3516l2554n5439L5863K0678n944J765J5347k1400K8390J4070
$$ y = [66737, 53346, 15904, 44512, 52216, 39199, -3534, -21313, -5442, 20555, 10646, 32958, 37629, 20352, 27943, 27374, 29167, 21781, 40860, -22882, -38503, -77, 28951, 63195, 76737, 28467, 47319, 30439, -12510, 374, 23237, 48566, 76333, 21627, 7341, 17978, -8088, 43364, 47631, 27698, 30785, 38464, 25697, 29684, 9079, -16001, -20035, 50985, 42864, 43064, 71760, 48484, 9697, 18365, 42615, 41941, 14574, -591, -19082, -3370, 25404, 2244, -9984, 10931, 46494, 8385, 13799, 3951, 50049, 73858, 12884, 34879, 25207, 27846, 40348, 34140, 18550, 10271, 964, 35766, 13025, -4547, 9390, 24476, 52788, 38257, 40120, 12378, 26092, -3584, -12401, 30055, 53571, 21017, -34422, 1441, 22119, 16175, 17940, 33287, 11887, 40277, 54347]
470E4347k3152J6695j8486m1869L7991J2901K9321j5805j7271j7898o952P323
458A7145L0141p543R11J2752k1822J0475l1192k233J6806L4758k154j3424j8697
445B5923K8392m081j4093N646L0159p893n7165j390K9225j6480L9403l31l8213
432A9102l859k029K6375o367k6410N794K0567Q460m9074J5593L0677P570l3958
419A2441k7268L2170K3967L1944p890l1612j7510q7k580L6633J9378m7430q684
$$ y = [54347, 31195, 47890, 29404, -12465, 25526, 38427, 67748, 51943, 34672, 16774, 9822, 17145, 47286, 39743, 40654, 53406, 31584, 42059, 10867, 8634, 25440, 60198, 58044, 44620, 25923, 54315, 50234, 36141, 41787, 71946, 64053, 6888, 5498, 34723, 18243, 57646, 57315, 19102, 15243, 13214, 39589, 33222, 6812, 12606, 33173, 41633, -7441, 8152, 38829, 46399, 12441, -14827, 17343, 41310, 73254, 65364, 33752, 16242, 16155, 13575, 50208, 69586, 22156, 13472]
$$ [...]
##END NTUPLES=NMR SPECTRUM
##END=
