##TITLE=1H_CA-8910-1
 CDCl3, 8 sc, 
 3.08.2021
##JCAMPDX= 6.0         $$ Bruker NMR JCAMP-DX V2.0
##DATA TYPE= NMR SPECTRUM
##DATA CLASS= NTUPLES
##ORIGIN= UXNMR, Bruker Analytische Messtechnik GmbH
##OWNER= root
$$ XWIN-NMR		Version 3.5
$$ Tue Aug  3 12:03:27 2021 Russian Standard Time (UT+4h)  she@DPX200
##.OBSERVE FREQUENCY= 200.131506
##.OBSERVE NUCLEUS= ^1H
##.ACQUISITION MODE= SIMULTANEOUS
##.ACQUISITION SCHEME= undefined
##.AVERAGES= 8
##.DIGITISER RES= 18
##SPECTROMETER/DATA SYSTEM= spect
##.PULSE SEQUENCE= zg30
##.SOLVENT NAME= CDCl3
##.SHIFT REFERENCE= (INTERNAL, CDCl3, 0, 17.4995)
##AUDIT TRAIL= $$ (NUMBER, WHEN, WHO, WHERE, WHAT)
$$ ##TITLE= Audit trail, XWIN-NMR		Version 3.5
$$ ##JCAMPDX= 5.01
$$ ##ORIGIN= Bruker BioSpin GmbH
$$ ##OWNER= she
$$ F:/spectra/data/she/nmr/H-F/1/pdata/1/auditp.txt
$$ ##AUDIT TRAIL=  $$ (NUMBER, WHEN, WHO, WHERE, WHAT)
(   1,<2021-08-03 12:02:16.60 +0400>,<she>,<DPX200>,
      <created by zg, POWCHK disabled, PULCHK disabled
       configuration hash MD5:
       00 E9 B6 7A A2 85 ED C7 34 08 36 98 17 FE 4E 26
       data hash MD5: 16K
       37 B5 EC 55 6D 31 55 7E B9 86 E7 4A 6F 19 B4 77>)
(   2,<2021-08-03 12:02:19.54 +0400>,<she>,<DPX200>,
      <Start of raw data processing
       efp BC_mod = 2 LB = 0.24 FT_mod = 6 PKNL = 1 PHC0 = -13354.37 PHC1 = 10.60099 SI = 16K 
       data hash MD5: 16K
       AF C2 C4 C4 C8 BF 4B 15 BA B0 EA 35 9F 08 2C C9>)
(   3,<2021-08-03 12:02:35.67 +0400>,<she>,<DPX200>,
      <pk PHC0 = -1.110662 PHC1 = 0.6000003 
       data hash MD5: 16K
       4C A2 85 93 45 02 A0 61 BD A2 A7 32 74 EA 90 C6>)
(   4,<2021-08-03 12:02:38.65 +0400>,<she>,<DPX200>,
      <abs ABSG = 5 
       data hash MD5: 16K
       48 0D 7E DF A7 8F FB 06 04 24 4F 76 B2 9E 4F 22>)
$$ ##END=
$$ 
$$ hash MD5
$$ DD F0 C0 C9 60 EF 6C F5 C5 D4 74 E3 46 9F A0 14
##$RELAX= 
##$RELAX= 
##$RELAX= 
##$RELAX= 
##$RELAX= 
##$RELAX= 
$$ Bruker specific parameters
$$ --------------------------
##$DU= <F:/spectra>
##$EXPNO= 1
##$NAME= <H-F>
##$PROCNO= 1
##$TYPE= <nmr>
##$USER= <she>
##$AMP= (0..31)
100 100 100 100 100 100 100 100 100 100 100 100 100 100 100 100 100 100 
100 100 100 100 100 100 100 100 100 100 100 100 100 100 
##$AQSEQ= 0
##$AQ_mod= 1
##$AUNM= <au_zg>
##$AUTOPOS= <>
##$BF1= 200.13
##$BF2= 200.13
##$BF3= 200.13
##$BF4= 200.13
##$BF5= 200.13
##$BF6= 200.13
##$BF7= 200.13
##$BF8= 200.13
##$BYTORDA= 1
##$CFDGTYP= 0
##$CFRGTYP= 5
##$CHEMSTR= <none>
##$CNST= (0..31)
1 1 145 1 1 1 1 1 1 1 1 1 1 1 1 1 1 1 1 1 1 1 1 1 1 1 1 1 1 1 1 1 
##$CPDPRG= <>
##$CPDPRG1= <>
##$CPDPRG2= <>
##$CPDPRG3= <>
##$CPDPRG4= <mlev>
##$CPDPRG5= <mlev>
##$CPDPRG6= <mlev>
##$CPDPRG7= <mlev>
##$CPDPRG8= <mlev>
##$CPDPRGB= <>
##$CPDPRGT= <>
##$D= (0..31)
0 1.2 0 0 0 0 0 0 0 0.06 0 0.03 0 0 0 0 0.0002 0 0 0 0 0 0 0 0 0 0 0 0 
0 0 0 
##$DATE= 1627977736
##$DBL= (0..7)
120 120 120 120 120 120 120 120 
##$DBP= (0..7)
150 150 150 150 150 150 150 150 
##$DBP07= 0
##$DBPNAM0= <>
##$DBPNAM1= <>
##$DBPNAM2= <>
##$DBPNAM3= <>
##$DBPNAM4= <>
$$ [...]
##$SUBNAM3= <"">
##$SUBNAM4= <"">
##$SUBNAM5= <"">
##$SUBNAM6= <"">
##$SUBNAM7= <"">
##$SUBNAM8= <"">
##$SUBNAM9= <"">
##$SW= 20.0188882624521
##$SWIBOX= (0..15)
0 0 2 0 0 0 0 0 0 0 0 0 0 0 0 0 
##$SW_h= 4006.41025641026
##$TD= 16384
##$TD0= 1
##$TE= 0
##$TE2= 300
##$TE3= 300
##$TEG= 300
##$TL= (0..7)
0 120 120 120 120 120 120 120 
##$TP= (0..7)
150 150 150 150 150 150 150 150 
##$TP07= 0
##$TPNAME0= <>
##$TPNAME1= <>
##$TPNAME2= <>
##$TPNAME3= <>
##$TPNAME4= <>
##$TPNAME5= <>
##$TPNAME6= <>
##$TPNAME7= <>
##$TPOAL= (0..7)
0.5 0.5 0.5 0.5 0.5 0.5 0.5 0.5 
##$TPOFFS= (0..7)
0 0 0 0 0 0 0 0 
##$TUNHIN= 0
##$TUNHOUT= 0
##$TUNXOUT= 0
##$USERA1= <user>
##$USERA2= <user>
##$USERA3= <user>
##$USERA4= <user>
##$USERA5= <user>
##$V9= 5
##$VALIST= <valist>
##$VCLIST= <CCCCCCCCCCCCCCC>
##$VD= 0
##$VDLIST= <DDDDDDDDDDDDDDD>
##$VPLIST= <PPPPPPPPPPPPPPP>
##$VTLIST= <TTTTTTTTTTTTTTT>
##$WBST= 1024
##$WBSW= 4
##$XGAIN= (0..3)
0 0 0 0 
##$XL= 0
##$YL= 0
##$YMAX_a= 319374
##$YMIN_a= -383061
##$ZGOPTNS= <>
##$ZL1= 120
##$ZL2= 120
##$ZL3= 120
##$ZL4= 120
##$ABSF1= 17.49589
##$ABSF2= -2.523148
##$ABSG= 5
##$ABSL= 3
##$ALPHA= 0
##$AQORDER= 0
##$ASSFAC= 0
##$ASSFACI= 0
##$ASSFACX= 0
##$ASSWID= 0
##$AUNMP= <proc_1d>
##$AZFE= 0.1
##$AZFW= 0.1
##$BCFW= 0
##$BC_mod= 2
##$BYTORDP= 0
##$COROFFS= 0
##$CY= -3
##$DATMOD= 1
##$DC= 0
##$DFILT= <>
##$DTYPP= 0
##$F1P= 0
##$F2P= 0
##$FCOR= 1
##$FTSIZE= 16384
##$FT_mod= 6
##$GAMMA= 0
##$GB= 0
##$INTBC= 1
##$INTSCL= 1.334414e-10
##$ISEN= 128
##$LB= 0.24
##$LEV0= 0
##$LPBIN= 0
##$MAXI= 10000
##$MC2= 0
##$MEAN= 0
##$ME_mod= 0
##$MI= 1.114404
##$NCOEF= 0
##$NC_proc= -5
##$NLEV= 6
##$NOISF1= 3.799351
##$NOISF2= 2.8
##$NSP= 0
##$NTH_PI= 0
##$NZP= 0
##$OFFSET= 17.49955
##$PC= 1
##$PHC0= -13355.48
##$PHC1= 11.20099
##$PH_mod= 1
##$PKNL= yes
##$PPARMOD= 0
##$PSCAL= 0
##$PSIGN= 0
##$REVERSE= no
##$SF= 200.13000702048
##$SI= 16384
##$SIGF1= 3
##$SIGF2= 2
##$SINO= 5.538805
##$SIOLD= 16384
##$SREGLST= <1H.CDCl3>
##$SSB= 0
##$STSI= 16384
##$STSR= 0
##$SW_p= 4006.41025641026
##$SYMM= 0
##$S_DEV= 0
##$TDeff= 16384
##$TDoff= 0
##$TI= <>
##$TILT= no
##$TM1= 0
##$TM2= 0
##$TOPLEV= 0
##$USERP1= <user>
##$USERP2= <user>
##$USERP3= <user>
##$USERP4= <user>
##$USERP5= <user>
##$WDW= 1
##$XDIM= 16384
##$YMAX_p= 301896373
##$YMIN_p= -153763
$$ End of Bruker specific parameters
$$ ---------------------------------
##NTUPLES= NMR SPECTRUM
##VAR_NAME=  FREQUENCY,     SPECTRUM/REAL,   SPECTRUM/IMAG
##SYMBOL=    X,             R,               I
##VAR_TYPE=  INDEPENDENT,   DEPENDENT,       DEPENDENT
##VAR_FORM=  AFFN,          ASDF,            ASDF
##VAR_DIM=   16384,         16384,           16384
##UNITS=     HZ,            ARBITRARY UNITS, ARBITRARY UNITS
##FACTOR=    0.24454680195387, 1,            1
##FIRST=     3502.18503748232, 0,            0
##LAST=      -504.225218927945, 0,           0
##MIN=       -504.225218927945, -153763,     0
##MAX=       3502.18503748232, 301896373,    0
$$ Real data points
##PAGE= N=1
##DATA TABLE= (X++(R..R)), XYDATA
$$ [...]
7236E29399K7245K8024o0646R223K266j7101L1108q9166N0081Q7175n1398P66
7224E46976N8366J7857L4101k4965k1005k1978L275O87M7536P0194J5416K0948
7212G47408j6430k3186n4648J09926p0990M860K8257M8894L2091N5825j3742J9846
7200H68111L1918R2073M7222K5781L3251j1009J2253M994K9688J05588J03664
7189A343534M6845N591L7412J00298O1596L4220M4549P4588L1005J04925Q4519
7178A969082O2922K7441J9954J17680P2485L6729R4743O5454O5448O5344J5916
7167B613198Q5559Q4044M2259M2824R7483J23059O5305J31021q530L2010J37541
7156C445773J11564J03450J43813J27763J47204J80408J32264J94215J92311K12470
$$ y = [529399, 556644, 584668, 524022, 533245, 535511, 518410, 549518, 460352, 510433, 597608, 546210, 546976, 605342, 623199, 657300, 632335, 611330, 589352, 592627, 593314, 640850, 711044, 726460, 747408, 730978, 707792, 653144, 763070, 692080, 696940, 725197, 774091, 806182, 862007, 848265, 868111, 900029, 992102, 1039324, 1065105, 1098356, 1087347, 1099600, 1104594, 1134282, 1239870, 1343534, 1390379, 1395970, 1433382, 1533680, 1595276, 1629496, 1674045, 1748633, 1779638, 1884563, 1969082, 2032004, 2059445, 2079399, 2197079, 2269564, 2306293, 2401036, 2466490, 2531938, 2597282, 2613198, 2698757, 2782801, 2825060, 2867884, 2965367, 3088426, 3153731, 3284752, 3276222, 3308232, 3445773, 3557337, 3660787, 3804600, 3932363, 4079567, 4259975, 4392239, 4586454, 4778765, 4991235]
7146D991235K42552J75583K07701K92397K45597K84354K41447L55248M72676L62599
7136G871389M48739N40729N84330O94684P76952Q73636J009890J163987J313334
7127A5277670J671170K037162K309935K524338K997505L376185L705096M321373
7119C8220434N099600O267080P875019R613765J0908131R760385N565332j099269
7111I2210477q305305j2450622j3380798j1594075q746824o147272m428166l356203
7103B3801212k714257k218986j811782j661577j343158j085798r33858q20689
7095A1211107p35078n99265n56655m73400l93574m20837l80896l61797l53401
7086F936204l02876l15826l12585l22583k79858k32659k36378j74180j32529j27656
$$ y = [4991235, 5233787, 5409370, 5617071, 5909468, 6155065, 6439419, 6680866, 7036114, 7508790, 7871389, 8320128, 8860857, 9445187, 10139871, 10916823, 11790459, 12800349, 13964336, 15277670, 16948840, 18986002, 21295937, 23820275, 26817780, 30193965, 33899061, 38220434, 43320034, 49587114, 57462133, 67075898, 77984029, 87744414, 93309746, 92210477, 83905172, 71454550, 58073752, 46479677, 37732853, 31585581, 27157415, 23801212, 21086955, 18867969, 17056187, 15394610, 14051452, 12965654, 12031796, 11211107, 10476029, 9876764, 9320109, 8846709, 8453135, 8032298, 7651402, 7289605, 6936204, 6633328, 6317502, 6004917, 5682334, 5402476, 5169817, 4933439, 4759259, 4626730, 4499074]
7076D499074k33752j64583j29042j30168j04940j85766j17943p1343n3985l6141
7066C271411j50188j44735j06136j10830k1282j7344r9294j15273j13044j47861
7056B245424p7808m8674j02393n7248l4844o7555m472m7258q4569k1421n4875
7045A644307Q179l1032o0746N60m5919o7218j9560o8k2600j4508j24285l6455
7033A230655k0333n4576r341j00019q664p1439m1695o275M128j3613M647r128
7021I04347l8629k4348j6206r960k1940J6605o5841l9187m7301o967L0504l3795
7009F47282j4489n1484l2336k192k1998k8401N1377l979k8577k9273o129j4126
6997D65675K3514n0227q688o518m0643k6830K9916k7290l2710J2583j6152M3542
$$ y = [4499074, 4265322, 4100739, 3971697, 3841529, 3736589, 3550823, 3432880, 3361537, 3307552, 3271411, 3121223, 2976488, 2870352, 2759522, 2738240, 2720896, 2621602, 2506329, 2393285, 2245424, 2167616, 2118942, 2016549, 1959301, 1924457, 1856902, 1852430, 1805172, 1720603, 1699182, 1644307, 1652486, 1621454, 1560708, 1561268, 1515349, 1448131, 1428571, 1428503, 1405903, 1391395, 1267110, 1230655, 1210322, 1155746, 1146405, 1046386, 1037722, 966283, 924588, 918313, 922441, 908828, 913475, 904347, 865718, 841370, 825164, 815204, 793264, 809869, 744028, 704841, 657540, 650573, 681077, 647282, 632793, 581309, 548973, 546781, 524783, 496382, 547759, 543780, 515203, 485930, 479801, 465675, 489189, 438962, 430274, 423756, 383113, 356283, 386199, 358909, 326199, 338782, 322630, 366172]
6985C66172k4482o245o9552n249P3555K3767l8018L1883J6449m9611J1819l9728
6973B90760k1578L9551M6682J0585k8827k5719J8696k120k1286k7910p144k3602
6961B48088n3183K7409j8918n0704J3691n766l7336m2573j0725N3754j4154N1351
6949A60934n3258l7596K0197O9651l5525J6369N983j6578l6568k7765R4114R30
6937A60888j02792k340q768j0610N2636K1479r551K5865J7549l9119M3762o2068
6925H6931P3165k1419j2427k4382J0661m8542o7581J06654l053J3917J7270K2249
6913A53443k9071k7603R416p2199N860K2238o775N643n3107L8255m036L4283j4462
6900F1885n6142J8095K7906k2966j013l745K113O3280j9264k9089K2939K026o8314
$$ y = [366172, 341690, 335445, 265893, 260644, 334199, 357966, 319948, 351831, 368280, 318669, 330488, 290760, 269182, 308733, 355415, 366000, 337173, 311454, 330150, 328030, 306744, 278834, 271690, 248088, 194905, 222314, 203396, 152692, 166383, 160617, 123281, 80708, 69983, 123737, 109583, 160934, 107676, 70080, 90277, 159928, 124403, 140772, 146755, 130177, 93609, 65844, 159958, 160888, 58096, 55756, 46988, 36378, 89014, 110493, 100942, 126807, 144356, 105237, 148999, 86931, 160096, 138677, 126250, 101868, 112529, 63987, -3594, 103060, 100007, 113924, 131194, 153443, 124372, 96769, 106185, 33986, 39846, 62084, 55309, 60952, 7845, 46100, 42064, 76347, 61885, 5743, 23838, 51744, 28778, 27765, 24020, 26133, 89413, 70149, 41060, 63999, 66025, -2289]
6887b289n2228O1479O741j23J2661m161K7692l5285J7086K8830K688l3569o481
6874B3041L4233n9024m1885N6133k4452k6024J0985l3151M1478R0933q5153j5057
6862b7943K8961Q440o490O082Q732m2658N652P805L256M258M1232P69n4513k3494
6848c9911M1957O1718k076k5069j0678m3930k8810P1294j5641j1915o9158k7419
6836i9638N7699J9783k4210k4879M2132L5164k5053R80l6928q0959K5957O7497
6824d2455L4123L503N5085o5382q6659J6566M3343L1213k8948K4647K9164m8208
6812c4008Q03o915M9250J2817K139p5924L1450n6395k9975M4053J6261O3762M919
6799B2237j05983o9999Q7298M3911m3700Q019k263O265P6780p633q23l4727k2059
$$ y = [-2289, -54517, 6962, 13703, 13580, 26241, 22080, 49772, 14487, 31573, 60403, 63091, 29522, 23041, 57274, -1750, -43635, 12498, -11954, -37978, -26993, -60144, -18666, 72267, -12886, -27943, 1018, 9458, 2968, 9050, 17782, -24876, -19224, -11419, -8163, -3905, 37327, 38096, -16417, -39911, 2046, 63764, 61688, 36619, 25941, -17989, -46799, 24495, 8854, -3061, -72219, -99638, -41939, -22156, -46366, -71245, -29113, 6051, -19002, -18022, -54950, -135909, -109952, -42455, -8332, -4829, 50256, -15126, -101785, -85219, -41876, -10663, -39611, -14964, 14200, -34008, -33205, -40120, 9130, 21947, 24086, -51838, -20388, -76783, -106758, -62705, -46444, 17318, 22237, -83746, -153745, -66447, -22536, -66236, -58217, -60480, -54215, 22565, 14932, 14109, -20618, -42677]
6786d2677k2988J2296k8738K9350K9744J7948K446R836l2767k6253M1852K0119
6774A0168k3483j593l221l759J9135L0344l5056K0962N1698m1289k7160L8710
6762C5456m4108k9072Q841L2588j3054j0249K6476n9922J7520P547O8521K7774
6750F8318N3771Q893L1636L7792K7272L5933M04r403Q1852P5062R5451O163j12758
6737D00386n5650j17414m2519m9414j0538m673m6301p10P94L2357r0808l9072
6725b3562K1634l3446k39L0558j6632j6667N824N6516k4186o947l1239N5300N5291
6712G2205p4625k402J3365J8885l0947l2675K9113K777J9057J9684n2554j7238
6700c5355l8211K9374Q893j0018P00k174O292K7577R199K220j05560N1254K5439
$$ y = [-42677, -65665, -53369, -82107, -52757, -23013, -5065, -2619, 7217, -25550, -51803, -9951, 10168, -13315, -14908, -18129, -21888, -2753, 27591, -7465, 13497, 65195, 23906, -3254, 35456, -8652, -37724, -28883, 3705, -9349, -19598, 6878, -53044, -35524, -27977, 40544, 68318, 122089, 130982, 162618, 200410, 227682, 263615, 264019, 254616, 336468, 411530, 506981, 513144, 400386, 344736, 227322, 184803, 135389, 124851, 120178, 73877, 73167, 73961, 106318, 15510, -23562, -1928, -35374, -35613, -5055, -21687, -38354, -32530, 23986, -200, -7147, -38386, 16914, 72205, -2420, -4822, 8543, 27428, -3519, -36194, -7081, -4304, 14753, 34437, -18117, -35355, -73566, -44192, -35299, -45317, -44617, -46791, -40499, -12922, -3723, -1503, -107063, -55809, -30370]
6687c0370l1567k6470o267M4616J4015o5684K7223M3989K7523O3897n8844l3457
6675c1396j4751R598n443n0325M6062K5585Q592l6707q141M339m196M7537m599
6662a3845k6153m3934L6093k5108K3460k8430j5792K3404n851J7190j3328n025
6650g7319K7604M6166J9136n5729j7536O872J004K1030K3181M0066K935p625K392
6637C2177m1453q2782m294L790M7424N1184k1226N6144M592j5086k3268o7066
6625e9864P8489K4618K9587m5635m1612K1754L9743M7898j8357l2483k1086J0792
6613C3844m0759N0387K2737O1673j5911K4255N950J7896j9761r076N4319O6615
6601B52169L8757O613L2284M0978R6864J26401O8065P6056L3979J05974N3825
$$ y = [-30370, -61937, -88407, -94674, -50058, -36043, -101727, -74504, -30515, -2992, 60905, 2061, -31396, -46147, -36549, -41992, -92317, -46255, -20670, -12078, -48785, -56926, -52587, -56783, -9246, -13845, -39998, -83932, -47839, -72947, -49487, -77917, -93709, -70305, -76156, -58966, -72294, -77319, -49715, -3549, 15587, -40142, -57678, -50806, -49802, -28772, -5591, 34475, 37410, 29785, 32177, -9276, -92058, -96352, -92562, -45138, 6046, -15180, 40964, 45556, 30470, 7202, -59864, 18625, 43243, 72830, 27195, -14417, 7337, 47080, 94978, 76621, 44138, 23052, 33844, -6915, 43472, 66209, 127882, 111971, 136226, 142176, 160072, 140311, 131235, 185554, 252169, 290926, 297539, 329823, 370801, 467665, 594066, 662131, 738187, 772166, 878140, 931965]
6590I31965o3531K2479R965l268p4569p6892j02073j27300k8165l0182q0284j04747
6578B73398O093l1745q2670p104m3637J1383J600o1346l8856k582O3331L7020
6566A24885k1332n1811p9310Q1495L3333m3159n2377L5722l2914j8159J564P003
6554a5060k1826o831K5224J2658J0781j1924q2550k1518N9704j1153O0118J5028
6542A2651k2958l07K3955j9036m3651Q3164m4012M7109P211p9132N887L2754M0302
6529D3937k6028m1008P909O672J4250p92l5138p2420O1883j4367j5613L1414K1124
6516a8177k5393n9754R9144J4525k5714k4802j2146j8294J5497J8301N919k6273
6504e7167K2648K668J6479j2990l3823j3376M926N3847K3389K54q001k4494j3984
$$ y = [931965, 868434, 890913, 900878, 897610, 823041, 746149, 644076, 516776, 488611, 458429, 378145, 273398, 279491, 247746, 165076, 157972, 114335, 125718, 127318, 65972, 27116, 24534, 87865, 124885, 103553, 51742, -27568, 53927, 87260, 44101, -8276, 27446, -5468, -23627, -22063, -15060, -36886, -43717, -18493, -5835, 4946, -6978, -89528, -111046, -51342, -62495, -2377, 12651, -10307, -10614, 13341, -5695, -49346, 33818, -10194, 36915, 44126, -35006, -29119, 3635, 43937, 17909, -23099, -15190, -8518, 5732, 4940, -30198, -102618, -40735, -55102, -70715, -39301, -18177, -43570, -103324, -4180, 10345, -15369, -40171, -52317, -70611, -55114, -36813, -30894, -57167, -34519, -31851, -15372, -28362, -62185, -75561, -70635, -16788, 6601, 6855, -1146, -25640, -39624]
6491c9624l7133K7045N1467J6122o3469l3066R69j4905o1169O8049L0738m1595
6479i6571n0942P6397J4328r4718M9730l3394N9003J5445j9698J5700k3585L8595
6467d9710K6825j7133M1011l5898l8256K3342j3649K1504k323J1339L3604l7953
6455c7297k7689k1080M0434N9787M73m0523o8112M8546l0914N1Q912J9105N47
6442d7760J1345j9501J1262n04J3710l281r583l2284K1427M0029o5424Q7687k0981
6429a3858N845L0094p5025j2864K4274k340j5127K5388K2506n414k5589p1522
6417a13632J0008K5348J9672k6364J5115k7264m6747L2475O1375k1894O5312n186
6405a1782l6885l6187k0993K2711J6924j8225K1486n247m2582P8374j41l3716
$$ y = [-39624, -76757, -49712, 1755, 17877, -45592, -78658, -77689, -92594, -153763, -85714, -54976, -96571, -147513, -71116, -56788, -151506, -101776, -135170, -76167, -60722, -80420, -64720, -88305, -49710, -22885, -40018, 993, -34905, -73161, -49819, -63468, -41964, -44287, -32948, 656, -37297, -64986, -86066, -45632, 14155, 14628, -25895, -94007, -45461, -76375, -76324, -67412, -48307, -47760, -36415, -55916, -44654, -45158, -31448, -34729, -44312, -76596, -55169, -15140, -80564, 7123, -13858, -8013, 22081, -52944, -65808, -41534, -43874, -59001, -33613, -11107, -16521, -42110, -113632, -103624, -78276, -58604, -84968, -69853, -97117, -143864, -111389, -50014, -71908, -6596, -11782, -48667, -84854, -105847, -83136, -66212, -84437, -62951, -68198, -110780, -32406, -32547, -66263]
6393f6263J3652p8451M5327R6283j3009l5639m3512j980J8519j7601O124M4078
6381c2472J2688k3474l903K1210j5253J64k5065j283O9199L0841o3144n0783J2299
6368f8976K851P503n2623K6332J8320J4332m1771L742P7237M1k3449o3283J6875
6355h2869Q524M3166l5362K3324N5191l6826l4037O5003L6197n1654k6829L3413
6343b759J264l207m3999o1213J1718O7758k9603J9202k9327m2107P3353K9849
6331i071j01829k5619M1286O3232J069J5151O66j9112j7172k4522M8804L4991
6319G874j7164N458j0697l9002n681L2725k4923M755K7592m5729M466K7965R934
6306b2427L918Q54j4947l1437j6037L4075L4508L8368r1339k8253N8443k8587
$$ y = [-66263, -52611, -131062, -85735, 10548, -2461, -38100, -81612, -83592, -65073, -82674, -76550, -32472, -19784, -43258, -47161, -25951, -41204, -41040, -66105, -67388, 1811, 32652, -30492, -81275, -68976, -66125, -58622, -111245, -84913, -66593, -52261, -94032, -90290, -13053, -13012, -36461, -99744, -82869, -74345, -31179, -66541, -43217, 11974, -24852, -58889, 6114, 42311, -9343, -36172, -2759, -1495, -4702, -48701, -109914, -98196, -30438, -60041, -40839, -70166, -112273, -38920, -9071, -110900, -136519, -95233, -32001, -30932, -15781, -15115, -34227, -51399, -75921, -27117, 7874, -9290, -3832, -14529, -53531, -59212, -26487, -51410, -46655, -19063, -64792, -60326, -32361, -22427, -18509, -17655, -32602, -64039, -80076, -46001, -11493, 26875, -64464, -92717, -34274, -62861]
6294f2861K1664k2189N0924O4505j5178J0496k7061L132M6618l9866m3593O0668
6282D7259k4042J4364Q764L1431j3322L8573j9779j5731K5619J2233K5963K4884
6270A56216n1369j8959P9254L0012L0436N6907j6347N9699R521l9700K7181k0221
6258C02630n4095J2097j6716r3315k9378j4l9999j8612k3226J603J366k7262o116
6245H963P729P0336j9900m8021l9538m3346O2425L5960N4921o1007r8323L3654
6233c6147J8848N391N8108k6499l7008j5269m651K043J6997K7011m6645J2265
6221b5556m684j7325j1752O9832K3718j9119L0108L953k2711L1892k4702j6713
6209A6941M9546k9095m6145m74o938L1198L2565n8036m4797K3492m7147l4271
$$ y = [-62861, -41197, -63386, -12462, 52043, 36865, 47361, 20300, 23432, 70050, 30184, -13409, 47259, 23217, 37581, 46345, 77776, 64454, 103027, 83248, 67517, 93136, 105369, 131332, 156216, 104847, 85888, 165142, 195154, 225590, 282497, 266150, 325849, 335370, 295670, 322851, 302630, 248535, 260632, 243916, 150601, 121223, 121209, 81210, 62598, 39372, 40975, 42341, 15079, 8963, 16692, 87028, 67128, 19107, -20431, -63777, -1352, 34608, 89529, 28522, -69801, -36147, -17299, -11908, 46200, 19701, -17307, -32576, -37227, -35184, -18187, 8824, -37821, -25556, -30240, -47565, -59317, 10515, 34233, 15114, 45222, 49175, 26464, 58356, 33654, 16941, 66487, 37392, -8753, -9227, -16165, 15033, 47598, -10438, -55235, -31743, -78890, -113161]
6197a13161K2982Q8982k564J3730l8002j1869J9460k7771L1581K1815m1942j3870
6185e0629L0031j9176K482n2017p879M6733n4295R0205Q177n5402K560p469j1786
6172g8465J1205Q4354N395p4058m3388L5678K9396K9160l0867J4565o927J2927
6160a1025r796l2164Q848k4127k0533n111k312M5589P079K3030m1421n6967M442
6147a14468M7291K6311L1649J9323j2916j2821J6825J0551l5605j4947r654m640
6135e3101R859M4436l7254l4546L0213K53k8238L4394K7388n938n590q473n0334
6122g6931L4509m2945J2362L9889K393L3071j3114k933J1705k3124l6901n63K3989
6109c8593J3514N5973l6887j1274l341l0331l3538M7866M0514k3465L2919j7580
$$ y = [-113161, -90179, -1197, -3761, 9969, -28033, -39902, -20442, -48213, -16632, 5183, -36759, -50629, -20598, -39774, -37292, -89309, -97188, -50455, -104750, -14545, -6368, -61770, -59210, -66679, -78465, -67260, 17094, 22489, -51569, -94957, -59279, -29883, -723, -31590, -17025, -23952, -11025, -20821, -52985, -44137, -68264, -88797, -93908, -96220, -50631, -43552, -20522, -61943, -118910, -114468, -67177, -40866, -9217, 10106, -2810, -15631, 1194, 11745, -23860, -38807, -48461, -53101, -43242, 1194, -36060, -70606, -40393, -40140, -68378, -33984, -6596, -12534, -18124, -26597, -76931, -42422, -85367, -73005, -33116, -30723, 2348, -10766, -13699, -1994, -25118, -62019, -62582, -38593, -25079, 30894, -5993, -17267, -20608, -50939, -84477, -36611, 3903, -19562, 13357, -4223]
6097d223j3406L0469N148o3780L2079k4438j9362r884J9045J3274r106J5875k4951
6084e3260J276O6447m5647j2666L9475K3770m0512q363J8865n104M0850o84q25
6071B3622k0993j5172L2718M1212p3840k2738K4066J0959K8975j2978l3115J9771
6059B487o056N9246l87k4912k439p6323K7977L3983M0771j0159j0203p2644L9180
6046E21J9649Q052J9492j7870k6467L3654l4818L6052R580l5651O4944m7356L3226
6033F3008m385k7161k7847k7769L611K7622K1005j6780K6133L4350O7724o7850
6021G1661n5928l0875k5452R7865Q073j6172L8287N505l1638k9118K4096N0163
6009A06467J2918M6631M9351j9813Q474j8330l9877o923l4697m7893M9062M1863
$$ y = [-4223, -17629, 12840, 17988, -45792, -13713, -38151, -57513, -67397, -48352, -35078, -44184, -28309, -53260, -51984, 14463, -31184, -43850, -4375, 19395, -21117, -29480, -10615, -15719, 25131, 24447, 23622, 2629, -12543, 20175, 61387, -12453, -35191, -11125, -166, 28809, 15831, -17284, 2487, -3569, 55677, 55290, 30378, 27939, -48384, -20407, 13576, 54347, 44188, 33985, -38659, 521, 20170, 28222, 47714, 29844, 3377, 37031, 2213, 38265, 47845, 12194, 77138, 29782, 63008, 58623, 31462, 3615, -24154, -20543, 7079, 28084, 11304, 37437, 71787, 139511, 71661, 15733, -15142, -40594, 57271, 65344, 49172, 87459, 92964, 61326, 32208, 56304, 106467, 119385, 166016, 215367, 195554, 204028, 185698, 145821, 138898, 104201, 56308, 105370, 147233]
5997A47233q1334j3802J4380J5554k4690J0124o855P967J0792L4693J4913q7761
5985D1214J4874R305O857L5603j4641o31l1899J1766k2986J5006K6078k6476m435
5972E9635R086O5823J643q268k2827n0729M3110j3985j9289j5727j29218O2289
5960a8457j8491O3669K2872r5256P5479j6350k3791o616L9059k0473K2871O834
5948C1350J0600j0771M5774N6267o1743J1624K4195q4490k6212k153O7119k1648
5936C9912J2740m259j0644J9379P521j2902K2913J6743n3485M2284M0192j0520
5924A09874p7935K5685q629k7511M0796j9293K3481K530J7228N6863l7407l3991
5912G1691P1219M8849o1516j24750K753O6454J9313o0479K9381j1850M5656K3946
$$ y = [147233, 65899, 52097, 66477, 82031, 57341, 67465, 60610, 68577, 79369, 114062, 128975, 41214, 56088, 65393, 72250, 107853, 93212, 92581, 60682, 72448, 49462, 64468, 90546, 64070, 59635, 68721, 134544, 136187, 127919, 105092, 54363, 97473, 83488, 64199, 48472, -80746, -18457, -36948, 26721, 49593, -45663, 29816, 13466, -10325, -16941, 22118, 1645, 24516, 31350, 41950, 31179, 76953, 133220, 71477, 83101, 107296, 22806, -3406, -5559, 61560, 39912, 52652, 48393, 37749, 57128, 64649, 51747, 74660, 91403, 37918, 80202, 120394, 109874, 31939, 57624, 48995, 21484, 62280, 42987, 66468, 68998, 86226, 143089, 105682, 71691, 142910, 191759, 130243, 5493, 8246, 74700, 94013, 33534, 62915, 51065, 96721, 120667]
5900A20667o328K6782o6320L0253K8664J9582m012k1933m0642J8730Q227N111
5888A18781k0472M449l2596K4871J4668J78R068k4556j3632K0058K983R135K9995
5875A42930J0231L1658P0857j8539r190q954j0398j5520L1750m5306k1151m3017
5863A15351M9868j0716J3267J4980N1045J4214p82K6546j4267m5088K3489o599
5851B31308l9520L7361j675j6340M6089l066J6345K2997l3585P5415K7901K2541
5839C85771q3973Q3857l106R900J9179J6169m442K1084K6858P0587J7398K3091
5827E82373r58L8563M8057k175J11395R7655J37897J20187J54728J46084J9651
5816A453457j46078j28375j79378j55651o6762q0910p1529k2138k7441L75j2811
$$ y = [120667, 114339, 141121, 74801, 105054, 133718, 153300, 149288, 127355, 86713, 105443, 113670, 118781, 98309, 102758, 70162, 95033, 109701, 109879, 118947, 94391, 80759, 100817, 103800, 112935, 142930, 153161, 184819, 255676, 237137, 227947, 218993, 208595, 193075, 224825, 179519, 158368, 115351, 165219, 154503, 167770, 182750, 233795, 248009, 247227, 273773, 259506, 214418, 237907, 231308, 191788, 229149, 227474, 211134, 257223, 254157, 270502, 293499, 259914, 335329, 363230, 385771, 301798, 385655, 382549, 392449, 411628, 427797, 423355, 444439, 471297, 541884, 559282, 582373, 581415, 619978, 668035, 665860, 777255, 874910, 1012807, 1132994, 1287722, 1433806, 1453457, 1307379, 1179004, 999626, 843975, 777213, 696303, 624774, 602636, 575195, 575570, 562759]
5805E62759j0296k4279m7314m458M4146R282j9825K3275K2566J4534m5829J1169
5793E35730K4542J2848p978q712j8685L7332O922P2457k1459p42J8348o922m1488
5780F02193O0723M2628K256K7172k0315K3466O7729J5285r300L7002M2096j3718
5768H77217J0731L5110K899N2000N3787R2313M5434Q8275K5072j3769N4359N2941
5756A376369J0946K6773l5973N3672L9358J602n3212O3321K1089L3525O8541J8951
5744A624962K1069M9071Q1480N5296P5167P813R0940J12413P3935P6535O5267
5733B333948J43198M7382J12181J16099Q9661J55986J64223J52829J28814J82938
5723C627259J91853K55901K86013L06987L73474L67832M70173M58094N68371P27531
$$ y = [562759, 552463, 528184, 480870, 476412, 520558, 529840, 510015, 533290, 555856, 570390, 524561, 535730, 560272, 573120, 565142, 556430, 537745, 575077, 581999, 654456, 632997, 632255, 650603, 643681, 602193, 662916, 705544, 707800, 734972, 714657, 738123, 805852, 821137, 811837, 848839, 890935, 877217, 887948, 923058, 925957, 977957, 1031744, 1124057, 1169491, 1257766, 1282838, 1269069, 1323428, 1376369, 1387315, 1414088, 1378115, 1431787, 1471145, 1472747, 1419535, 1482856, 1503945, 1537470, 1606011, 1624962, 1646031, 1695102, 1776582, 1831878, 1907045, 1914858, 2005798, 2118211, 2192146, 2268681, 2333948, 2477146, 2524528, 2636709, 2752808, 2842469, 2998455, 3162678, 3315507, 3444321, 3627259, 3819112, 4075013, 4361026, 4668013, 5041487, 5409319, 5879492, 6337586, 6905957, 7633488]
5713G633488Q04897R34341R90698J148782J351786J480196J599296J957115K279404
5704B0180003K835917L227082L404542K921072R16436j876817l862350m504887
5696B3240998l896284l013113k366261j770949j406280j161296r00081p53460
5688G973274n76582n34733l86565l54673l11936j36498j30609j62845o709O0190
5678E432314l1787P5353J78527Q3263j35416l86115m65964m09901l82984k01697
5668C755593j48865j81935j25219q6304j71025j21140j00518j28397r7140m6450
5658B548600q4766j14970j37054m5910p2329P0259K7409k0711j2632j8066R589
5647B149419L8404j03985J4597l393j5454K6170o0986J3823J8256P9622J1697
$$ y = [7633488, 8438385, 9372726, 10363424, 11512206, 12863992, 14344188, 15943484, 17900599, 20180003, 23015920, 26243002, 29647544, 32568616, 33485052, 31608235, 27745885, 23240998, 19344714, 16331601, 13965340, 12194391, 10788111, 9626815, 8726734, 7973274, 7396692, 6861959, 6475394, 6120721, 5808785, 5672287, 5541678, 5378833, 5372124, 5432314, 5400527, 5475880, 5654407, 5737670, 5602254, 5216139, 4750175, 4340274, 3957290, 3755593, 3606728, 3424793, 3299574, 3213270, 3042245, 2921105, 2820587, 2692190, 2595050, 2548600, 2463834, 2348864, 2211810, 2165900, 2093571, 2163830, 2191239, 2170528, 2157896, 2139830, 2149419, 2187823, 2083838, 2098435, 2095042, 2079588, 2105758, 2044772, 2058595, 2076851, 2156473, 2168170]
5636B168170M6506K382Q6692K6290m3928L0158N4021j1778R6342K2892l4379j1099
5624B432269L6224Q5082J25256N1381J09963J40664R8939J62823J76821K01508
5614C620930L26035K93693N1687k08611l28767l25364k43034j52007n7968j55931
5604B820663q2702k8381j1100o4024k3308O6785K1672j8188L6979J02647J04232
5593B925275M5832M9413P0266O6517P5341L7908P4104J42148J41032K2090J48406
5582C798332J53625J49264J46870J45303J53265K35882K28474J74622K21190K89323
5572E696150K03501K40869L20527J81238j2727m3089j5103L067J17745J44231
5562F836409N2544R4534O1640J01384J02685J97544J42960K43266K13481K84379
$$ y = [2168170, 2214676, 2217058, 2303750, 2330040, 2286112, 2316270, 2370291, 2358513, 2454855, 2477747, 2443368, 2432269, 2468493, 2553575, 2678831, 2730212, 2840175, 2980839, 3079778, 3242601, 3419422, 3620930, 3946965, 4240658, 4292345, 4083734, 3754967, 3429603, 3186569, 3034562, 2976594, 2820663, 2737961, 2709580, 2698480, 2634456, 2611148, 2677933, 2699605, 2681417, 2718396, 2821043, 2925275, 2971107, 3020520, 3090786, 3157303, 3232644, 3270552, 3344656, 3486804, 3627836, 3649926, 3798332, 3951957, 4101221, 4248091, 4393394, 4546659, 4782541, 5011015, 5185637, 5406827, 5696150, 5899651, 6140520, 6461047, 6642285, 6629558, 6586469, 6571366, 6574433, 6692178, 6836409, 6888953, 6983487, 7045127, 7146511, 7249196, 7446740, 7589700, 7832966, 8046447, 8330826]
5552H330826K26804K83143L39061M05754M23819N56512N22847M96204P09166Q38533
5542A3132669R11040Q58077L86755R0349j16837m0792J45931L72532M67662O83504
5532A6890890O57990P85567J031381J203555J281657J485668J755810K002358
5524B7094876K283109K635316L147960L838577M659497N447833N730453O290916
5516F1128537P237879Q556588R921813J1892098J4378931J8493195K2802806K9310642
5508A83722489K9366733N805440k1143680l7459678l7381865k6530426j7582260
5501G8796753j2219964q994407o923790n568374m671796l890470l134588k627140
5493C0766224k089871j819418j672037j594833j349899j177507r58824p87876
$$ y = [8330826, 8557630, 8840773, 9179834, 9585588, 10009407, 10565919, 11088766, 11584970, 12294136, 13132669, 14043709, 14901786, 15288541, 15378890, 15262053, 15221261, 15367192, 15739724, 16207386, 16890890, 17548880, 18334447, 19365828, 20569383, 21851040, 23336708, 25092518, 27094876, 29377985, 32013301, 35161261, 38999838, 43659335, 49107168, 54837621, 61128537, 68366416, 76923004, 86844817, 98736915, 113115846, 131609041, 154411847, 183722489, 213089222, 218894662, 197750982, 160291304, 122909439, 96379013, 78796753, 66576789, 57582382, 50658592, 45090218, 40418422, 36527952, 33393364, 30766224, 28676353, 26856935, 25184898, 23590065, 22240166, 21062659, 20103835, 19315959]
5485A9315959p09860n87772o06724p15919q54717r30642q07579q37635o64555
5476A2600556n66710n52511m42709l63432m63854l23277k91050m00440l16360
5467H880213k78482k69266k72351k40141j57728k89289j72179k27735j79196j95622
5457F598224j27426j23593p2362q0889r5162j07155L6621J08354J58962K09554
5447F505128R799k35346l26727m12111l04990k12659k51975k31960p5500j46592
5437D317067p4546k3148r0693j22748j05085j02122n8757j46974o9467j40472
5427C383055j00811j02801r2268q9995n4194R974r1451l7421l6859m8666l9753
5416B698810j0931o621o2208p709L5368j16423j9375k2420r2379k6552L4888K1472
$$ y = [19315959, 18606099, 18018327, 17411603, 16695684, 15840967, 14910325, 14102746, 13265111, 12600556, 12033846, 11481335, 11038626, 10675194, 10211340, 9888063, 9597013, 9196573, 8880213, 8601731, 8332465, 8060114, 7819973, 7662245, 7372956, 7200777, 6973042, 6793846, 6598224, 6470798, 6347205, 6274843, 6193954, 6098792, 5991637, 6028258, 6136612, 6295574, 6505128, 6514927, 6279581, 5952854, 5540743, 5235753, 5023094, 4771119, 4539159, 4463659, 4317067, 4242521, 4219373, 4128680, 4005932, 3900847, 3798725, 3739968, 3592994, 3523527, 3383055, 3282244, 3179443, 3087175, 2997180, 2942986, 2952960, 2861509, 2824088, 2787229, 2738563, 2698810, 2687879, 2681258, 2619050, 2611341, 2646709, 2530286, 2510911, 2488491, 2396112, 2369560, 2404448, 2425920]
5404B425920k4318j5386n581O612l2736j9429J6703J1003N8547k8023N5177Q8280
5392B536769O6003P4606j6880j8404P5149K5808K3577R1198J88909K00260J54671
5381C401666K61506L16075K74424L62075M59148M56145N75155P41751Q45719J019444
5371H713108J403145J621732J127417k68070j353737j802827j694516j231979
5363F514273r06250o22824m67201m17708l38820k76148l01747k11120j20757j51496
5353B700202l0664r5618o310L6756k2063m1015p732N8400r0110p8010j1809Q324
5341B420351k408J01854J16078J05527J05843J8164j41676j93162j13916j24770
5331B291885n1558L2876K6759J08380J08700J59189J55081K21220L19322M27145
$$ y = [2425920, 2401602, 2386216, 2380635, 2387247, 2354511, 2335082, 2351785, 2362788, 2421335, 2393312, 2448489, 2536769, 2602772, 2677378, 2660498, 2642094, 2717243, 2743051, 2766628, 2857826, 3046735, 3246995, 3401666, 3663172, 3979247, 4253671, 4615746, 5074894, 5531039, 6106194, 6847945, 7693664, 8713108, 10116253, 11737985, 12865402, 12597332, 11243595, 9440768, 7746252, 6514273, 5608023, 4985199, 4517998, 4100290, 3761470, 3485322, 3183575, 2972455, 2851698, 2700202, 2669538, 2573920, 2567610, 2604366, 2582303, 2541288, 2533556, 2591956, 2501846, 2423836, 2412027, 2420351, 2417943, 2519797, 2635875, 2741402, 2847245, 2865409, 2723733, 2530571, 2416655, 2291885, 2240327, 2273203, 2299962, 2408342, 2517042, 2676231, 2831312, 3052532, 3371854, 3798999]
5321C798999J99530k05615m89949n54207l89761l60144k67020j20493j94862o7909
5311A348569o6764k9714P370p4154r2830q4474o2863j4694O215q390n2877L0888
5299I06282p24M1352r104m2188n594n4037o8611l5357p881l9711K1918O483k3757
5286F89071m7437K969K1845k4958M4885K406o1758p318k5076p026J3715r6568
5274E04750j4947p016m559m6727m4092L7307L7964m9676j8855p816l0079N1001
5262D07255n7536M948m1563l6244k0997L1863O2881L3300m1461K380j24J5623
5250C60325j2486n3205J4024M1502J0740j6685k5194K3819m2726K4889m6062m2119
5238B36822M2404O6080K2014k0856L0265L895k6969m6479p247j7384k8729k6846
$$ y = [3798999, 3998529, 3792914, 3302965, 2748758, 2358997, 1998853, 1731833, 1611340, 1416478, 1348569, 1281805, 1252091, 1259461, 1185307, 1092477, 1008003, 945140, 930446, 936661, 928271, 875394, 906282, 905558, 946910, 937806, 895618, 890024, 835987, 767376, 732019, 724138, 684427, 706345, 712828, 689071, 641634, 644603, 666448, 641490, 686375, 688781, 627023, 619705, 594629, 587603, 601318, 504750, 489803, 482787, 478228, 431501, 387409, 424716, 462680, 413004, 394149, 386333, 356254, 407255, 349719, 354667, 313104, 276860, 255863, 287726, 350607, 383907, 342446, 344826, 344702, 360325, 347839, 294634, 308658, 350160, 360900, 344215, 319021, 342840, 300114, 325003, 278941, 236822, 279226, 345306, 367320, 346464, 376729, 380624, 353655, 307176, 299929, 282545, 253816, 226970]
5226B26970j1151O6208N5738J974O78m8934j495l7259K7275Q8854k4196L1263
5214C75925M8811o6523P638M8222m2150l1479M0084L5463J9405q049O3936L2445
5202E23728N0430N4904N5352M5873J26721J45640N5069J71243J39005o5250j30972
5191A171743j87196j76469j22278j16606k5827k2938j08996p9709J1358J846l9267
5180C05661o6256R952M9935N132m5510l1861o941P638j8054j5922N2341N1346
5168B97461k8262p4776l8032J9483m080L1924m1956N8683J052O139j31573l7917
5156E8146Q5218L702K3627k9734N4466l7534k6963L0646m035j3362m0143M6124
5144A50158q870L860N8476m4777j5025O72o0016L1453J7081j1137L169L7568o191
$$ y = [226970, 215819, 282027, 337765, 339739, 340417, 291483, 289988, 252729, 280004, 368858, 344662, 375925, 424736, 358213, 365851, 414073, 371923, 340444, 380528, 415991, 435396, 427347, 491283, 523728, 574158, 629062, 684414, 730287, 857008, 1002648, 1057717, 1228960, 1367965, 1302715, 1171743, 984547, 808078, 685800, 569194, 543367, 520429, 411433, 331724, 343082, 344928, 305661, 239405, 249357, 299292, 304424, 258914, 227053, 220112, 227750, 209696, 193774, 246115, 297461, 269199, 194423, 156391, 175874, 171794, 203718, 161762, 220445, 221497, 227636, 96063, 58146, 143364, 147066, 170693, 140959, 195425, 157891, 130928, 161574, 157539, 144177, 104034, 150158, 141288, 145148, 203624, 158847, 143822, 144494, 84478, 115931, 133012, 121875, 125044, 162612, 156421]
5131A56421q2248P540M882L1933J5098L8312j1608j9288j0928L8666k6336O097
5119A48541k7132k9043J26172K2384k6699L8588K9638L8626j957p3424K4616j1908
5107B58402j8820l1035l301m2802j11690M7030n469N1697N1819l4638M7829j1696
5095A97326n7589j9135m2552K6206M4658Q760k0688j0306J629j4637L9164j5341
5083A37495l455J2847j5318n6595J4954O1559k9640m2496K8135K4720j9819j7174
5071I5213R411M4599l5298Q122Q7362n471J6715l3623n6850j2575l6387L3887
5059A15105K7816M2892l7563L9091p43o1031l1701J7531k5053M5672m8503j6904
5047F6609L6077N8838l4224m696k4838M5511l6960M1189J385K9779N3638l0137
$$ y = [156421, 74173, 81713, 86595, 118528, 133626, 171938, 160330, 141042, 130114, 168780, 142444, 148541, 121409, 92366, 218538, 240922, 214223, 252811, 282449, 321075, 319118, 245694, 270310, 258402, 239582, 208547, 205246, 162444, 50754, 97784, 92315, 144012, 195831, 161193, 209022, 197326, 139737, 120602, 78050, 104256, 148914, 157674, 136986, 126680, 128309, 113672, 152836, 137495, 134040, 146887, 131569, 74974, 89928, 151487, 121847, 79351, 107486, 132206, 112387, 95213, 104624, 149223, 113925, 122047, 209409, 203938, 220653, 187030, 130180, 117605, 81218, 115105, 142921, 185813, 148250, 187341, 186598, 125567, 93866, 111397, 86344, 132016, 83513, 66609, 102686, 161524, 127300, 122604, 97766, 143277, 106317, 147506, 148891, 178670, 232308, 202171]
5035B02171r889k9741O1765l632j7767l6398J2490m293p9m1141j8564k8568P0179
5022A56533M4930N043J1646k9061p727O3649p7351L1544M3100Q980M3604J4003
5010C08893k9948J6032Q6202k0053q1531M8352k2288j03336N7185j6700k0240
4999B22568K1024j8848J2953j7740L86l0505Q6018J1810m5204J8076N2496j8728
4987B94306m4581j3938K6648j0108N6472j4136M9810N3022m422o1930N6766j8722
4975C69187l3340L5378p645O5423m1022n3762n0897k9227M1729P2034m0957k9098
4963B97803M0846k4133m3819M5490K9249m1779L473J658j4587N5746M5739k1880
4951C73806j12833m784O7207O1793J2647o33m4551N7939Q919n2332J0483l2698
$$ y = [202171, 192282, 162541, 224306, 220674, 202907, 166509, 178999, 174706, 174627, 133486, 114922, 86354, 156533, 201463, 206506, 218152, 189091, 181364, 245013, 167662, 199206, 242306, 251286, 294890, 308893, 278945, 294977, 381179, 361126, 279595, 327947, 305659, 202323, 259508, 242808, 222568, 243592, 224744, 237697, 219957, 220343, 189838, 275856, 287666, 242462, 260538, 313034, 294306, 249725, 235787, 262435, 252327, 308799, 294663, 344473, 397495, 393073, 331143, 387909, 369187, 335847, 371225, 363580, 429003, 387981, 334219, 283322, 254095, 295824, 367858, 326901, 297803, 338649, 314516, 270697, 316187, 345436, 303657, 307130, 308788, 294201, 349947, 395686, 373806, 260973, 256189, 323396, 385189, 397836, 397203, 352652, 410591, 419510, 367178, 377661, 344963]
4939C44963M3833P3759j8340j3748j3547m2418k4220K5786R3829J8803J379K4634
4927E14713k8250R213p95q701k7927O6400K7093k3728K5166J24013k614n0896
4915F23687j074P5100k2095k9075Q5278K8470N5085m9922L3583O0866P7896o943
4903I30856N8137O281Q789M5552R206N0831j614J5851Q964K5804Q107M3051M7025
4890A256840O7840K1725j2547m963K6508K0316O1600Q9833N1518L3146N3502J09462
4878A774780O4407O6251R1182J01337Q1629J7790O5082J77064J77410J28464Q3198
4867B828594J21563J55721J89361J99167K10078K53398J81063K22690L31002M17279
4857E109916N10597N25496N71457P65870Q32800R44415J101052J200103J385907
$$ y = [344963, 388796, 462555, 444215, 430467, 416920, 374502, 350282, 376068, 469897, 488700, 490079, 514713, 486463, 495676, 494881, 486180, 458253, 524653, 551746, 528018, 553184, 677197, 674583, 623687, 622613, 697713, 675618, 646543, 731821, 760291, 815376, 765454, 799037, 859903, 937799, 930856, 988993, 995274, 1004063, 1049615, 1058821, 1109652, 1108038, 1123889, 1132853, 1158657, 1166764, 1209815, 1256840, 1324680, 1346405, 1333858, 1328895, 1355403, 1375719, 1437319, 1527152, 1578670, 1611816, 1665318, 1774780, 1839187, 1905438, 1996620, 2097957, 2179586, 2197376, 2262458, 2439522, 2616932, 2745396, 2828594, 2950157, 3105878, 3295239, 3494406, 3704484, 3957882, 4138945, 4361635, 4692637, 5109916, 5620513, 6146009, 6717466, 7483336, 8316136, 9260551, 10361603, 11561706, 12947613]
4848A2947613J717116J980011K282001K672268K719852K692873K371795J299498
4840C0683027K12645p27324j863245k672280l171829l218475k927171k501441
4832A3813907k037020j510332j165474r43505p98576o45189n29458m43822l85369
4823E355162l85496k55076k86121j99736j68351j53596j37482j39790j09563j29824
4813C390127j21746r4336l2394q4049j27103o7796j17810p2447j01620j24965
4803B445861r3937r0964j58116q7323p0201k8594j00577M022q4930p5403j2386
4792A647452o2011j4861l819R201k9016l1820k916M6540J7764o8055M9991K7600
4780A586050r9394n4004n7099M157l9579n6277p1048L458k9597K91r666q8590
$$ y = [12947613, 14664729, 16644740, 18926741, 21599009, 24318861, 27011734, 29383529, 30683027, 30895672, 30168348, 28305103, 25632823, 22460994, 19242519, 16315348, 13813907, 11776887, 10266555, 9101081, 8157576, 7359000, 6713811, 6184353, 5740531, 5355162, 4969666, 4714590, 4428469, 4228733, 4060382, 3906786, 3769304, 3629514, 3519951, 3390127, 3268381, 3174045, 3141651, 3057602, 2930499, 2862703, 2744893, 2672446, 2570826, 2445861, 2351924, 2260960, 2102844, 2015521, 1945320, 1916726, 1816149, 1820171, 1735241, 1659838, 1647452, 1585441, 1570580, 1566761, 1575962, 1546946, 1515126, 1512210, 1558750, 1576514, 1508459, 1558450, 1586050, 1486656, 1432652, 1375553, 1379710, 1340131, 1283854, 1212806, 1216264, 1186667, 1186958, 1177292, 1088702]
4768A088702n0578N7599k675k4580J922j3167n3942L4077K7344n3133r3239N67
4756I18897J5326L2831m030l1696l3613n1188k2616M541l1024R027m4886o9160
4744F92409J9534M0673K8065k0172l1619J0281j5928r816m8622o1959J2862L7009
4732F52717j0260n3079O9550p263q3747n013K9022J8049k7853k9029k2493n7817
4720D72784k8000K2969J5958m3102m8965N7365J9024j8155K3211l2961J5190J2200
4708D67518Q973k5087o0081l9898l9921o872O8203l4066m0747L3591k4784n280
4696C01549k2281J1832N0856K2700L9323p8967m6478L6511J50k5492l5673K5443
4684B79473l2275J3861n2458j72J4802M5261k4759l3858m382J078Q753m3616J3289
$$ y = [1088702, 1038124, 1095723, 1093048, 1068468, 1070390, 1057223, 1003281, 1037358, 1064702, 1011569, 918330, 918897, 934223, 967054, 963024, 931328, 897715, 846527, 823911, 828452, 797428, 806455, 761569, 692409, 711943, 752616, 780681, 760509, 728890, 739171, 723243, 713427, 664805, 602846, 615708, 652717, 642457, 589378, 658928, 651665, 567918, 562905, 591927, 609976, 582123, 553094, 530601, 472784, 444784, 467753, 483711, 440609, 391644, 449009, 468033, 449878, 473089, 440128, 455318, 467518, 476491, 451404, 391323, 351425, 311504, 304632, 372835, 338769, 298022, 331613, 306829, 301549, 279268, 291100, 341956, 364656, 403979, 325012, 278534, 315045, 315195, 289703, 254030, 279473, 247198, 261059, 208601, 208429, 223231, 268492, 243733, 209875, 205493, 206571, 215324, 171708, 184997]
4671A84997Q778K2594m0793m827L1521K0813J8576p111k0589k2247j4313r491
4659A67908J7712k6096l0344J7921M3521O934j01181J7195K0524k7066m4793J1339
4647G3574k7607M6424O3341l858j6994L8272l8376o7941N835O1711n6899P561
4635H5043k7128K766N5683r455o453M2728L2736K4402m1050o8345J9506o55l3820
4622G5958N2113N2782n9723J6336l2399n5633L971L7008J5597J2067o479K1916
4610A33514Q1J6025k08n8208o770N4273K246n6390l3576J6767K5694k4719K6031
4597I4760j3940N864K4556m4204P6827l7050K07l0943K3773J4820O3821J7575
4585A96066p2731k5521J3882M4884l3996M8729J3796k404m220J0666J501k8698
$$ y = [184997, 193775, 216369, 175576, 170749, 202270, 223083, 241659, 234548, 213959, 191712, 177399, 167908, 185620, 159524, 129180, 147101, 190622, 197556, 96375, 113570, 134094, 107028, 62235, 73574, 45967, 92391, 155732, 151874, 134880, 173152, 134776, 66835, 72670, 134381, 77482, 85043, 57915, 60681, 116364, 106909, 100456, 143184, 175920, 200322, 159272, 90927, 110433, 109778, 75958, 128071, 180853, 121130, 137466, 105067, 49434, 53405, 90413, 106010, 118077, 111598, 133514, 133595, 149620, 149412, 91204, 84434, 138707, 140953, 84563, 50987, 67754, 93448, 68729, 94760, 80820, 86684, 111240, 67036, 143863, 106813, 107020, 76077, 99850, 114670, 178491, 196066, 123335, 97814, 111696, 156580, 122584, 171313, 185109, 182705, 178485, 189151, 190652, 161954]
4573A61954P2606k5123K439Q0874j194K1267M434N1495K4019L0720q415k9723
4561C85353j5326m9205j6008M0077p0033n3246K9198m54N7850k7158k2225J8358
4549B77181J7634k2311L826O3612K7166l1594k6840O0869j8715K744O8200N3932
4537D75704j924K6315L0177l5393L1405J3061l493j8457q833j2603m5248l7510
4525D13201L7071k8271l8023k117O269r5723l597M8598m667j9966R327K8942Q099
4512C59143L4984Q4142o6433j6047Q0218K5691K0638M1948k2817J3461R683n1582
4500E13029K5751r1094q325n5466k8750k3213m5165l8156N1266m5862j199j8248
4488B34568O750n862j0400K1322o6657M237O6266O880k0458l8016P484L9181k3125
$$ y = [161954, 234560, 209437, 211876, 292750, 291556, 312823, 317257, 368752, 392771, 423491, 415076, 385353, 370027, 320822, 304814, 344891, 274858, 221612, 250810, 250356, 308206, 281048, 258823, 277181, 294815, 272504, 276330, 339942, 367108, 335514, 308674, 369543, 350828, 353572, 421772, 475704, 473780, 500095, 530272, 494879, 526284, 539345, 535852, 517395, 508562, 495959, 450711, 413201, 450272, 422001, 383978, 381861, 388130, 292407, 288810, 337408, 332741, 312775, 322102, 351044, 359143, 394127, 478269, 411836, 395789, 476007, 501698, 522336, 564284, 541467, 554928, 564611, 513029, 538780, 447686, 439361, 383895, 355145, 331932, 286767, 248611, 299877, 254015, 252816, 234568, 241318, 235456, 225056, 246378, 179721, 183958, 250224, 257104, 236646, 198630, 206114, 245295, 222170]
4475B22170L84K8728L0814j5066k8662M8615r886L1895m7622n7272J7264M5121
4463B66483j9063o1249J592j1852N5152l078K8091P178m2133q3471o413K1300
4451A52537m407n638L6710j6845j8419j533J2752k7283p683q065J7228R016l0467
4438A07903r0k5870j3844J0133L96J7855j5179k8961J5498J0178J9766L4140N241
4425A37166L1236J9721m495L7331j1044m9166m0176R726j5888K898J5604n4477
4413G8436m100N4647J660R882L4966l8442j9671m2395K1505l2598K5428J5779
4401A05097p1278P77M8222J4311J3520k121L0985M2422j7344j1073j1493n44l6201
4388A05280L2212M9471n2829N551k3529l477p902k3753L3519K4004K6857k6033
$$ y = [222170, 222554, 251282, 282096, 267030, 238368, 286983, 277097, 308992, 261370, 204098, 221362, 266483, 247420, 186171, 187763, 175911, 231063, 227985, 256076, 263254, 221121, 137650, 131237, 152537, 148130, 142492, 179202, 162357, 143938, 142405, 155157, 127874, 120191, 112126, 129354, 138370, 107903, 107813, 81943, 68099, 78232, 78628, 96483, 81304, 52343, 67841, 78019, 97785, 131925, 137166, 168402, 188123, 183628, 220959, 209915, 160749, 120573, 130299, 114411, 117309, 132913, 78436, 74336, 128983, 130643, 140525, 175491, 137049, 117378, 74983, 96488, 63890, 89318, 105097, 33819, 34596, 82818, 97129, 110649, 108528, 139513, 181935, 164591, 153518, 142025, 141481, 105280, 137492, 186963, 134134, 139685, 116156, 112679, 104777, 81024, 114543, 138547, 165404, 139371]
4376A39371J2894K9972L208K5503k6479o6441j6267R333m0562k8243M7698J7514
4364A07501l1379j078K4332L2714J8544j8229l9387P5702J4072m4718O3440J1109
4352B12623L4519l0912J1155N3015q145m60K8948o727O1407O2890L218o6877l7180
4339C17474o2881N0525j10567J014L6013l322l2076L2072P297l6480N979J5654
4327B20702O755j7946k4660M5139k619J1179K076L0553k3814p310l5152m8202
4315A56701N0750k5515k5585N2491K4545K3161l9255n5605N7564o725K9573j5032
4303B27068l6815m4597N3032j0110L0947m3383k1443K5651L9392L0819j8480n413
4291B26668L9119q016m8371K651Q0964j6144L6365K5164k169l1825K0342l786
$$ y = [139371, 152265, 182237, 185445, 210948, 184469, 118028, 101761, 111094, 70532, 42289, 89987, 107501, 76122, 75044, 99376, 132090, 150634, 132405, 93018, 168720, 182792, 138074, 201514, 212623, 247142, 216230, 227385, 280400, 272255, 271795, 300743, 294016, 355423, 418313, 421531, 354654, 317474, 254593, 305118, 194551, 195565, 231578, 228256, 196180, 228252, 235549, 199069, 205048, 220702, 227457, 209511, 184851, 229990, 227371, 238550, 240626, 271179, 247365, 240055, 204903, 156701, 207451, 181936, 156351, 208842, 233387, 256548, 217293, 161688, 219252, 212527, 242100, 227068, 190253, 145656, 198688, 188578, 219525, 176142, 154699, 180350, 219742, 250561, 232081, 226668, 265787, 257771, 209400, 212051, 293015, 276871, 313236, 338400, 336231, 304406, 324748, 320962]
4279C20962M548J1561j4549l0668L3765J391O5845m8433k1324M9688Q591M3894
4267D25271l3486l5246L3226Q3690j3843J1137l591j5620J4513j9575J6306O9795
4255E32577n4816o9655k52N8749R9696K8865J8053k9563K5897j805J0469q915
4243F09300N7433K8226L8991L9233j697K3016P535K6358M4217K0344O837M7799
4231I47592Q3464J0110O0664Q1886P5244J07753R1414J10248J94388K65743J15317
4220B143823K01173q9625j04783j75684k08839j34417r8507n6348m5956K9778
4210A460615J0327K3030n2462m5528P5616k742J2689Q3849K5170J9334k2k4644
4198A585232K9381Q3039J00432J78851P6299J72739J59178K15371J90290L01639
$$ y = [320962, 325510, 337071, 322522, 291854, 325619, 327010, 392855, 344422, 323098, 372786, 381377, 425271, 391785, 356539, 389765, 473455, 459612, 470749, 467158, 451538, 466051, 446476, 462782, 532577, 477761, 408106, 407854, 466603, 566299, 595164, 613217, 583654, 609551, 607746, 618215, 609300, 666733, 694959, 733950, 773183, 771486, 794502, 802037, 828395, 872612, 892956, 899793, 947592, 1031056, 1041166, 1101830, 1183716, 1258960, 1366713, 1458127, 1568375, 1762763, 2028506, 2143823, 2344996, 2255371, 2150588, 1974904, 1766065, 1631648, 1533141, 1476793, 1430837, 1460615, 1470942, 1493972, 1441510, 1395982, 1471598, 1468856, 1481545, 1565394, 1590564, 1609898, 1609876, 1585232, 1614613, 1697652, 1798084, 1976935, 2053234, 2225973, 2385151, 2600522, 2790812, 3092451]
4188C092451M18306L50739L98404K28125L7448j00734m3115n3922k75687m08432
4178C643583l38072l44468k08199j24005r0904l7328k872M5842K3413o139R8184
4167B659035J74552J52042J32231J57924K04761K94113L53855L73634L52231q5187
4157D769191l39125m58605m85740k76960j75991r5366j56364j07003j9015J3667
4147B668689l9936p5086l3581J5496M3508P3238m4660J6091O5634O276N836J1356
4135B712861M5977L3445J9770L9803K2829O0528P3637J08669M1086O3929N0132
4124C272666N7922J28164P2282O8064J47946J37105J37197J00927R0025J42678
4114D354976J23488Q0050P4910O9519J73636J91307J93131J83530K84043L21622
$$ y = [3092451, 3510757, 3861496, 4259900, 4488025, 4525473, 4424739, 4381624, 4327702, 4052015, 3643583, 3305511, 2961043, 2752844, 2628839, 2537935, 2500607, 2497735, 2543577, 2566990, 2560851, 2659035, 2833587, 2985629, 3117860, 3275784, 3480545, 3774658, 4128513, 4502147, 4854378, 4769191, 4430066, 3971461, 3485721, 3208761, 3032770, 2937404, 2781040, 2674037, 2655022, 2668689, 2628753, 2553667, 2520086, 2535582, 2579090, 2652328, 2607668, 2623759, 2689393, 2695669, 2701505, 2712861, 2758838, 2792283, 2812053, 2851856, 2874685, 2935213, 3008850, 3117519, 3158605, 3222534, 3272666, 3330588, 3458752, 3531034, 3599098, 3747044, 3884149, 4021346, 4122273, 4212298, 4354976, 4478464, 4558514, 4633424, 4702943, 4876579, 5067886, 5261017, 5444547, 5728590, 6050212]
4104F050212L43112L59033M02939M62153M74775N85901O50172P34247Q92796J046083
4094A2001423J154609J329856J481226J633862J867240K219160K506826K946290
4086B7140492L470523M310278N352262O477759O982881L683653k222860p062457
4078D8132531q941599p626570n480776l896886k824211k157334j744784j406443
4070A4053928j189049r89884p48612n63117n58662m94128n42694m11675l44863
4061H211244k17767k62111k63720j95582k10084j99162j23782j75404q7391j12601
4051F363640j34295n0000K082k4192j4748p2338R093N6597m6014K4861q576j276
4039F104834P3598J1662J37276O8968J30694J35383O3409J26840J61717J88966
$$ y = [6050212, 6393324, 6752357, 7155296, 7617449, 8092224, 8678125, 9328297, 10062544, 10955340, 12001423, 13156032, 14485888, 15967114, 17600976, 19468216, 21687376, 24194202, 27140492, 30611015, 34921293, 40273555, 46751314, 53734195, 57417848, 55194988, 48132531, 39190932, 31564362, 26083586, 22186700, 19362489, 17205155, 15460371, 14053928, 12864879, 11874995, 11126383, 10563266, 10004604, 9510476, 8967782, 8556107, 8211244, 7993477, 7731366, 7467646, 7272064, 7061980, 6862818, 6739036, 6563632, 6476241, 6363640, 6229345, 6179345, 6181427, 6157235, 6142487, 6070149, 6079242, 6135839, 6089825, 6114686, 6106110, 6104834, 6178432, 6190094, 6327370, 6396338, 6527032, 6662415, 6725824, 6852664, 7014381, 7203347]
4029G203347J66942J72423J62355J42448J32469J69251J79075J66837K80024J82543
4019H957714J81200J58619J77670K02296J70783J62347J38722K34831K34846J79128
4009A0798156J66936K10405K13939J96680J96145L05996M06053L27265L80858
4000A3202433M96372N08171N19017N08410N86147O31747O57053P09009P14064
3991A8532423P24478Q12186R16396R45395J047037J063538J183196J366511J550936
3982B8142096J768546K049632K346624K641110K986414L472835L979631M705551
3974E2092439N549050O486370P309815Q169294R267263J0730886J2329283J4284891
3966A26219291J6887857K0743812K5975709L2866500L8205723L0600795J0396686
$$ y = [7203347, 7370289, 7542712, 7705067, 7847515, 7979984, 8149235, 8328310, 8495147, 8775171, 8957714, 9138914, 9297533, 9475203, 9677499, 9848282, 10010629, 10149351, 10384182, 10619028, 10798156, 10965092, 11175497, 11389436, 11586116, 11782261, 12088257, 12494310, 12821575, 13202433, 13698805, 14206976, 14725993, 15234403, 15820550, 16452297, 17109350, 17818359, 18532423, 19256901, 20069087, 20985483, 21930878, 22977915, 24041453, 25224649, 26591160, 28142096, 29910642, 31960274, 34306898, 36948008, 39934422, 43407257, 47386888, 52092439, 57641489, 64127859, 71437674, 79606968, 88874231, 99605117, 111934400, 126219291, 143107148, 163850960, 189826669, 222693169, 260898892, 291499687, 301896373]
3959C01896373j8954108m0866707m6546414m0185833k8900489k0061929j4543341
3952I1837552j1224184r031920p656022o334091n167794l938805l335338k854042
3944D2295356k735907k529554k297761j966523j680992j460862j261136j118458
3936B7244163j179141j014783j010371r70984r57214q76003p25819o02257m47726
3927A9459865l28034k40460k29513m94771p10473r34092q89484p64231o16815
3918A4251992m93106n01729m22915m27879l91315m10139m19231k23243l11611
3909A0650824l13241k87718l01192k59462k98833k45574j92220j58119j09657
3900H484808j77193j27314j24585q5432q0861j27400j18460l2960o7725q6735
$$ y = [301896373, 282942265, 242075558, 195529144, 155343311, 126442822, 106380893, 91837552, 80613368, 71581448, 63925426, 57591335, 52423541, 48484736, 45149398, 42295356, 39559449, 37029895, 34732134, 32765611, 31084619, 29623757, 28362621, 27244163, 26065022, 25050239, 24039868, 23068884, 22111670, 21235667, 20509848, 19907591, 19459865, 19131831, 18891371, 18661858, 18167087, 17456614, 16522522, 15633038, 14868807, 14251992, 13758886, 13257157, 12834242, 12406363, 12015048, 11604909, 11185678, 10962435, 10650824, 10337583, 10049865, 9748673, 9489211, 9190378, 8944804, 8752584, 8594465, 8484808, 8307615, 8180301, 8055716, 7970284, 7889423, 7762023, 7643563, 7610603, 7542878, 7456143]
3890G456143m1119o3229n3516j18356j08712l4854r6129o4513q4065r4656j58827
3879F538167o9679q3415n0842p8949j9795K0428M2852k0650j4275L5632O3770
3868F363244O6178J9103J8115L0225J05655J21578L5256O3791P5670J18883J98636
3857G216334J82028K57902K26685K79358K93029M40875M87463M77613O04180P00211
3847A1165678Q46270J001690J138035J292414J545616J709405J926181K296138
3839B2921427K749630L266019L933000M728640M895171M199842L553578J690170
3831E1937477j191155l467845n103863n667671n466276m913872l799767k769312
3823A9557716k109171j567920j249174j005118p91021o98243p24671p08501o37002
$$ y = [7456143, 7415024, 7351795, 7298279, 7179923, 7071211, 7036357, 6940228, 6875715, 6791650, 6696994, 6538167, 6468488, 6385073, 6334231, 6255282, 6235487, 6255915, 6298767, 6278117, 6263842, 6299474, 6363244, 6429422, 6448525, 6466640, 6496865, 6602520, 6724098, 6759354, 6823145, 6898815, 7017698, 7216334, 7398362, 7656264, 7882949, 8162307, 8455336, 8896211, 9383674, 9861287, 10465467, 11165678, 12011948, 13013638, 14151673, 15444087, 16989703, 18699108, 20625289, 22921427, 25671057, 28937076, 32870076, 37598716, 42493887, 46693729, 50247307, 51937477, 50746322, 47278477, 42174614, 36506943, 31040667, 26126795, 22327028, 19557716, 17448545, 15880625, 14631451, 13626333, 12835312, 12137069, 11412398, 10703897, 10066895]
3814A0066895o29486o02384m68801n34484m63207m62433l55668l79496l38808
3805E832128k82976k39366k32213j98580k01993j41920j33231j19374j74220j21016
3795C987239k5514n8844j13645j28326l2531l8362j08382q852o4089n1489R632
3784C366837p2857n7186l6710k5015j18972J021M8413k4310m9520o298l8523j12837
3772B874043l2185O2589N6468O5091O5124J07809k4741p6887o6718j14589j70840
3761B745164k10402j15571k00293j24316q5974q3098q8156j10212l6489k8830
3751A661823m2258o4899k5965J4026k0046j5146m8544m1923k5384k2543M2714
3740A411855N0201o2888q6799l2517j3453L6923m8027k8058n4175l0177M3468
$$ y = [10066895, 9437409, 8835025, 8366224, 7831740, 7368533, 6906100, 6550432, 6170936, 5832128, 5549152, 5309786, 5077573, 4878993, 4677000, 4535080, 4401849, 4282475, 4108255, 3987239, 3961725, 3902881, 3789236, 3660910, 3628379, 3590017, 3481635, 3472783, 3408694, 3357205, 3366837, 3293980, 3236794, 3200084, 3175069, 3056097, 3057118, 3105531, 3081221, 3031701, 3025403, 2986880, 2874043, 2841858, 2904447, 2960915, 3026006, 3091130, 3198939, 3174198, 3097311, 3030593, 2916004, 2745164, 2534762, 2419191, 2218898, 2094582, 2008608, 1925510, 1837354, 1727142, 1690653, 1661823, 1619565, 1554666, 1528701, 1542727, 1522681, 1507535, 1458991, 1417068, 1391684, 1369141, 1411855, 1462056, 1399168, 1312369, 1279852, 1266399, 1303322, 1255295, 1227237, 1173062, 1142885, 1186353]
3729A186353J941n9227k7648K634K2870p1463p085N9501o8187q4771n4423J4815
3717I15310J1872J7818j6756m144n443J2953J5915K2869N4022L7637K5082K3133
3705A110268J27376J14049M7393R1864J86605J61406J74512J23365L1250r1452
3695B076636k47475k69682j43249j51699j89976r5584n7991o830m0525n3419n8488
3684G61718n6015k1157M455l7931J6992n5868n6614n230l2073m4119m138j3215
3672D56805K9864N7459l0272j0972p922q62n9054M5426l7140n1668Q1857q8213
3660C85308K7074P0023j06264J3131J8076m0797n0470N6772J0591j7516n259J1897
3648C72566P0527k1327k0259o6418j0501J5418q81L4621K8894j2872n5331n0909
$$ y = [1186353, 1188294, 1129067, 1101419, 1104053, 1126923, 1055460, 1048375, 1107876, 1039689, 954918, 900495, 915310, 927182, 945000, 928244, 924100, 918657, 931610, 947525, 970394, 1024416, 1062053, 1087135, 1110268, 1237644, 1351693, 1399086, 1490950, 1677555, 1838961, 2013473, 2136838, 2168088, 2076636, 1829161, 1559479, 1416230, 1264531, 1074555, 978971, 920980, 914150, 873625, 820206, 761718, 705703, 684546, 689001, 651070, 668062, 612194, 555580, 550350, 518277, 474158, 470020, 456805, 486669, 544128, 513856, 502884, 494962, 494100, 435046, 480472, 443332, 391664, 473521, 385308, 412382, 482405, 376141, 389272, 407348, 366551, 316081, 372853, 383444, 365928, 360669, 372566, 443093, 421766, 401507, 335089, 324588, 340006, 339125, 373746, 402640, 389768, 334437, 283528]
3636B83528K6020k2863J8123J2867K0081L0983l7634L104N0541K055p5990m8963
3624B61852J1747R5740p4420k5981K7617q659q76m8529M2789R030M304l0168j2590
3611B51856L82n3866O1508J6796K2734k7082M577j2889N0l4451p731L6807n6636
3598B02055M3676N294o7433Q280L603l2200n4495J507O3689n098j9815M8484k3094
3585A74453K5546k0593K070O416J8499r127M1662L2920l0248J7861n5451J1159
3573B15167N6536m7303K4592Q2693J5209K5490J8895J8893l739K1272o3402j6591
3561C47712k8889L1948K5731o3725J919l1234o0649n6266K8249Q8676n2560p305
3549B23607j6131o158L3271n5048k5935L0482K603O1534k3969J4808l5286l3271
$$ y = [283528, 309548, 286685, 304808, 317675, 337756, 368739, 331105, 334209, 384750, 386805, 310815, 261852, 273599, 369339, 294919, 268938, 296555, 287896, 287020, 238491, 281280, 290310, 294614, 264446, 251856, 252238, 198372, 259880, 276676, 299410, 272328, 276905, 264016, 264066, 229615, 221884, 258691, 202055, 245731, 251025, 183592, 191872, 195475, 163275, 108780, 110287, 173976, 168878, 149063, 197547, 174453, 199999, 179406, 181476, 187892, 206391, 197264, 238926, 271846, 241598, 259459, 204008, 215167, 271703, 224400, 248992, 331685, 346894, 372384, 391279, 410172, 406433, 427705, 364303, 347712, 318823, 350771, 376502, 312777, 314696, 283462, 222813, 166547, 194796, 283472, 230912, 223607, 207476, 201318, 234589, 179541, 153606, 184088, 186691, 248225, 224256, 239064, 203778, 170507]
3537A70507m1466L049n08k9457L5725L7169l6176N8092j2701k6419l432j7523
3525A36860k2357j5452k3480M6874O999j1432J8577l3607K7744J7106J4595m0789
3513A21638O2007P114k0562m5255m9504p1484K3487N6412j2154j2827J1137j1037
3501E8972P087K8319j0295m0656L8176L36O7292j3622Q70k8857k688J8527k3605
3488I9856K4123r749q957o326K3830r693j9589k454J5567P326R19p838M622K639
3474A14276k4774J0878M070J2325m829K0308O6061n9490l9509L1960K1206K0989
3462A73471O0818J3048q2965r1524p500L752K5148K8567K7553m591l8223l873
3450A03681P2624r575Q948K4811p105r017N2080l1832m861K6695O72J3914n915
$$ y = [170507, 129041, 132090, 131582, 102125, 137850, 175019, 138843, 196935, 184234, 157815, 154383, 136860, 114503, 99051, 75571, 122445, 129444, 118012, 136589, 102982, 130726, 147832, 162427, 121638, 183645, 190759, 170197, 124942, 75438, 3954, 27441, 83853, 71699, 58872, 70009, 58972, 66059, 94378, 84083, 43427, 81603, 81939, 149231, 135609, 136479, 107622, 104934, 123461, 99856, 123979, 114230, 105273, 98947, 122777, 113084, 93495, 91041, 106608, 113934, 114853, 107015, 111637, 114276, 89502, 100380, 104450, 116775, 111946, 132254, 198315, 138825, 99316, 131276, 152482, 173471, 234289, 247337, 164372, 72848, 65348, 69100, 94248, 122815, 150368, 145777, 107554, 103681, 176305, 166730, 175678, 200489, 193384, 184367, 236447, 204615, 199754, 226449, 227121, 241035, 235120]
3437B35120k3346q531q086j2615j9028j8089J4045K9102L1861m516l5594m2643
3425A37680J0477j1136M3731L2830l178k3811M2024P2895k9320N89r576o211o539
3412B50455J8441O637k503J2150k3032J478l666P8015l7139j36k1593j4904N31
3399B64734L3319m1486p424n9664k4827P3506M1174P6303j5906j1133N2613k5675
3387C55534j3239J225Q333m6777J2487K7655j3245M1961L5977J6141L0795L9492
3375D96339L0089l6697k1791J6111j5233N2744q517K9242m261K4731M3362M3144
3363F49263O4186R734K7292K0550m651k9169o2839j435K1168m8159p0908j1778
3351E63254r598K6560o926J8380m3418l8809l5293k3291M4453M2149Q1733k0740
$$ y = [235120, 211774, 203243, 195157, 182542, 163514, 145425, 159470, 188572, 220433, 215917, 180323, 137680, 148157, 137021, 180752, 213582, 210404, 186593, 228617, 301512, 272192, 272781, 263205, 256994, 250455, 268896, 275533, 273030, 285180, 262148, 263626, 259960, 337975, 300836, 300700, 279107, 264203, 264734, 298053, 256567, 249143, 189479, 164652, 238158, 279332, 355635, 339729, 328596, 381209, 355534, 342295, 343520, 351853, 305076, 317563, 345218, 331973, 373934, 409911, 426052, 456847, 496339, 526428, 489731, 467940, 484051, 468818, 521562, 513045, 542287, 538026, 562757, 606119, 649263, 713449, 723183, 750475, 771025, 766374, 737205, 674366, 672931, 694099, 645940, 575032, 563254, 553656, 580216, 573290, 591670, 548252, 509443, 474150, 450859, 495312, 537461, 619194, 598454]
3339E98454K8807L4789K831l3178K7065J6754L8583M248M734N5602p671m5805
3327G25213n2735k2973l7315m9680k0083k265n5164j482j8311n3056k6408K2144
3315D07885q178m097J0499q536M3149j0500n6056K0798K6651L9485o254k2872
3303D31974l7164J5215k4059j5294J1922J6207k6138K4477k590m1444j085l0197
3291C21824j9870J02899m4347j2607j6927l336M14p272l5270l0026J7539K5891
3279B98912M1278k4178K7953k8140j3806J3118J556n5494j754K1402l8696K8171
3267B70322K9735K7164r382m4961j1078J1122L6167n2153j9899L2486K9100j2235
3255B86388n9486P1387K7910k3100L1722k5552m1866k1261J06102j3733O209o0944
$$ y = [598454, 627261, 662050, 664881, 631703, 658768, 675522, 714105, 718353, 723087, 778689, 771018, 725213, 672478, 649505, 612190, 562510, 542427, 540162, 484998, 483516, 465205, 412149, 385741, 407885, 399707, 395610, 406109, 397573, 440722, 430222, 374166, 394964, 421615, 461100, 454846, 431974, 394810, 410025, 385966, 370672, 382594, 398801, 372663, 397140, 394550, 353106, 352021, 321824, 301954, 404853, 360506, 347899, 330972, 327636, 328050, 320778, 285508, 255482, 273021, 298912, 340190, 316012, 343965, 315825, 302019, 315137, 316693, 261199, 259445, 280847, 242151, 270322, 300057, 327221, 317839, 272878, 261800, 272922, 309089, 256936, 237037, 269523, 298623, 286388, 226902, 298289, 326199, 303099, 334821, 309269, 267403, 246142, 352244, 338511, 344720, 283776]
3243B83776N494Q4897m3875k1101J9939l7675j0949J1159k5075M4519K0597K8999
3231C60705o8274l2657M2807o9681L1406O8488L1380J2981L3696J0043m7435j4762
3219C58697M1183K3936n2946K3552L2782k610P576j8817N4075k5735j2982j3861
3207D14850M3864j5754O9648J9989J1322o125j2404O1886j7301o8721P9375L6133
3195F16762k3317L8747J1397J9103M3249P058J2957N834J3600N5327M5418K4064
3183H70199L9896M524J3390O6088K6340O4085O8915L9202Q0018J04645R0852J77933
3171A646087p987J3956p9268K1535n6049l8458k6122K5779O9273m623R8029R3408
3159A755560N6317J42229K3841J16602K26888K04906K48048J80435K87609M01088
$$ y = [283776, 289270, 374167, 330292, 309191, 329130, 291455, 280506, 291665, 266590, 311109, 331706, 360705, 292431, 259774, 302581, 232900, 264306, 332794, 364174, 377155, 410851, 420894, 373459, 358697, 399880, 423816, 370870, 394422, 427204, 424594, 432170, 413353, 467428, 441693, 428711, 414850, 458714, 442960, 512608, 532597, 543919, 537794, 525390, 587276, 569975, 501254, 580629, 616762, 593445, 632192, 643589, 662692, 705941, 712999, 725956, 731790, 745390, 800717, 846135, 870199, 910095, 914619, 928009, 994097, 1020437, 1084522, 1153437, 1192639, 1272657, 1377302, 1468154, 1646087, 1638100, 1652056, 1572788, 1594323, 1538274, 1499816, 1473694, 1499473, 1568746, 1564123, 1662152, 1755560, 1811877, 1954106, 1977947, 2094549, 2321437, 2526343, 2774391, 2954826, 3242435, 3643523]
3149C643523M94004O03309O39031L15522j60724n14523m91821l37779k14055k09048
3139C767439l03052k34138k29741j01522r9995j07008n2334L7063Q9461N8916
3129B825089J38533J81630J57461K59732K38277L05998L38460M73641O07863P53178
3119F279862R73445J207194P20279l43361j027439j358808j050758p26111m75000
3110D199303l58114k38408k59481k20050j80405p4913r1324q0629q383N1023Q7817
3099B826436O6666J33425R2519J26152K70307J48815J87422L07790L99849L38224
3089D897605N04464L97650j41090n68019p63127o10526n02198l51498k45917j72546
3079B444798j56097j24426j03722o5316j19631o7716j21137j99022n1652j3708
$$ y = [3643523, 4137527, 4740836, 5379867, 5695389, 5534665, 5020142, 4528321, 4190542, 3976487, 3767439, 3464387, 3230249, 3000508, 2898986, 2798991, 2691983, 2639649, 2676712, 2766173, 2825089, 2963622, 3145252, 3302713, 3562445, 3800722, 4106720, 4445180, 4918821, 5526684, 6279862, 7253307, 8460501, 9180780, 8837419, 7809980, 6451172, 5400414, 4674303, 4199303, 3841189, 3602781, 3343300, 3123250, 2942845, 2867932, 2776608, 2695979, 2687596, 2738619, 2826436, 2893102, 3026527, 3119046, 3245198, 3515505, 3664320, 3851742, 4159532, 4559381, 4897605, 5402069, 5799719, 5658629, 5090610, 4327483, 3716957, 3214759, 2863261, 2617344, 2444798, 2288701, 2164275, 2060553, 1995237, 1875606, 1807890, 1686753, 1487731, 1436079, 1422371]
3069A422371o3188l3880o8888o3976K5278k4592n0307q7443L789J6475M0305L5029
3057A150973o2281K5129M7154M7668L1289O9418j5496o2790K8095k1256n9710
3046A178193N6197L0308o7967m9328o2107r5136l3477j00007m7266K5520m0855
3035G94075j4506J1556m035k2978K5260m4568L245N1559l796L145k2002J2959
3023G89914L5456J6944K5112k0548l5110r145Q7053O9249l5044J2383K6904K209
3011I65377m8890J7299Q957j2267K1904n9698m3508k5159o4742m3078j34199l507
2999E78489N558L8205M1558j33918J3075L0541l8908K7387N3044l6042m5699N4291
2987E87581J1788P3948N7654L7841P7624N0405N8398k0269o963l9334n983m8332
$$ y = [1422371, 1359183, 1325303, 1256415, 1192439, 1217717, 1193125, 1142818, 1055375, 1059164, 1075639, 1115944, 1150973, 1088692, 1113821, 1160975, 1208643, 1239932, 1309350, 1293854, 1231064, 1259159, 1237903, 1178193, 1234390, 1264698, 1196731, 1147403, 1085296, 990160, 956683, 856676, 809410, 834930, 794075, 779569, 791125, 787090, 764112, 789372, 744804, 748049, 799608, 795812, 798957, 776955, 789914, 825370, 842314, 867426, 846878, 811768, 802623, 889676, 958925, 923881, 936264, 963168, 965377, 916487, 933786, 942743, 930476, 952380, 892682, 849174, 824015, 759273, 716195, 581996, 578489, 584047, 622252, 663810, 529892, 542967, 573508, 534600, 561987, 615031, 578989, 533290, 587581, 599369, 673317, 730971, 768812, 846436, 896841, 955239, 934970, 928007, 888673, 882690, 834358]
2975H34358l0353j35397r3571O337o4662o1589M0823l8264o4311O4171k3692K598
2963D36448O3497K5739j23016k6886L2562j1363l2451K3483N9915R361K0077k8582
2951D48784M3639J5881j3132N0710n6429k4146J3867o0113j3450p9972k9829L3858
2939C29668m1996L6521J9390l621j30l0987K8346R969l3411k4620k1689J9301
2927B86741J9828m8924K3928l7133K8060j0323o2338L1903j6404K3736Q920k4788
2915B23206o197L917J1906M0391o300J1494O9704j4073K2278L5235l6538p946
2903C47077j8382p7503M0093J0487j4351K1302M6116J379k0423K4528p463P317
2891C60177O8251M8026m5904j2466k0104Q9843O2416L4222O1988L5643l7546J4004
$$ y = [834358, 804005, 668608, 575037, 581374, 516712, 455123, 495946, 457682, 393371, 457542, 433850, 436448, 499945, 525684, 402668, 375782, 408344, 396981, 364530, 388013, 447928, 457289, 477366, 448784, 492423, 508304, 495172, 545882, 489453, 465307, 479174, 419061, 405611, 325639, 295810, 329668, 287672, 324193, 343583, 339962, 339832, 308845, 337191, 347160, 313749, 289129, 267440, 286741, 306569, 257645, 281573, 244440, 272500, 262177, 199839, 231742, 215338, 239074, 247994, 223206, 217009, 220926, 232832, 273223, 266923, 278417, 348121, 334048, 356326, 391561, 355023, 347077, 328695, 251192, 291285, 301772, 287421, 308723, 354839, 356218, 335795, 360323, 352860, 360177, 428428, 476454, 430550, 418084, 397980, 487823, 550239, 584461, 646449, 682092, 644546, 658550]
2879F58550P0743m7308m1708R7850m0057n555L5974L5373N338k6879L1625q217
2867G65729J947k6296l4196j0012O4384j4859k0682O1836O9326N5158K2195O9796
2855A004326N5483K6048P3653P3652J28949R3036K7293O2907R8417n1342j23563
2844A468859k2984n4887k8159L1802j6441O135L2007m1569p5151n0411q9747o1648
2832A097806o1839o4415r257J8376j5208k010M3533k906J06100J815R7979J02100
2820A312074K1670R9218K3956l8412k462K5110m5291n6194j12779K311o550k0590
2808A202061p5804m2624m4332m2912k9835j07348o5415m7752J5562P788p5772
2797F93617J8037k322k6695K8165K2876K2985J2382j716l8575m93L1945j8967
$$ y = [658550, 729293, 681985, 640277, 738127, 698070, 692515, 728489, 763862, 769200, 742321, 773946, 765729, 767676, 741380, 707184, 697172, 761556, 746697, 726015, 787851, 857177, 912335, 934530, 1004326, 1059809, 1085857, 1159510, 1233162, 1362111, 1455147, 1482440, 1545347, 1643764, 1592422, 1468859, 1445875, 1390988, 1362829, 1394631, 1378190, 1384325, 1416332, 1374763, 1299612, 1249201, 1159454, 1097806, 1035967, 971552, 962295, 980671, 965463, 963453, 1006986, 1004080, 1110180, 1111995, 1209974, 1312074, 1333744, 1432962, 1456918, 1418506, 1416044, 1441154, 1395863, 1339669, 1226890, 1229201, 1222651, 1202061, 1126257, 1083633, 1039301, 996389, 966554, 859206, 793791, 746039, 761601, 769389, 693617, 711654, 709332, 682637, 710802, 733678, 756663, 769045, 767329, 728754, 728261, 760206, 741239]
2785G41239m2977j1042q6597n2319l1853K1990m3082n6122n3446K6702Q804O261
2773D27558j1961M570m2624k9527l2220P1724M9307j08655o2832O266N1869o0599
2761B62876K1500l4360L823M2113l2552R933k7869l3614J6788l487j3924m6493
2749A64734K1780J344j4865L1807P679k7802k914o9616k7429Q641J3029j246K698
2736A07840J4956n8908l133L0394J6630N478k7995p335p851M400k7202j432J8561
2723F4403K839l2451P4358n8404l6693J5543j2575L8769J5129K0624n8229M8061
2711H1374r74m3862R137j0660n572m6537J9842m6640O2583M6050L3451J521n1033
2698D8680o804l956K523j0149o5774k9170O4512k2148K4304k3986L1700J6147
$$ y = [741239, 698262, 687220, 600623, 548304, 516451, 538441, 495359, 439237, 385791, 412493, 421297, 427558, 415597, 420167, 377543, 348016, 315796, 387520, 436827, 328172, 265340, 271606, 323475, 262876, 284376, 250016, 253839, 295952, 263400, 273333, 245464, 211850, 228638, 225151, 211227, 164734, 186514, 187858, 172993, 204800, 212479, 184677, 181763, 112147, 84718, 93359, 106388, 105142, 107840, 122796, 63888, 60755, 91149, 107779, 113257, 85262, 77927, 70076, 74476, 47274, 45842, 64403, 67242, 34791, 109149, 50745, 14052, 29595, 17020, 55789, 70918, 91542, 33313, 81374, 80400, 36538, 45675, 35015, 29443, -17094, 2748, -43892, 18691, 64741, 98192, 99713, 48680, 41876, 37920, 40443, 30294, -35480, -64650, -138, -22286, 2018, -21968, 9732, 25879]
2686B5879k630j5917P3678p825j1076J1273l7336j0586j1074p5690L2256P732
2674b1316K7143o939j2161l4898J833j5513l4110R3038K951L9809m2485k7152
2662b9800M560O1483j106l4223J5261M1627m9236K3675k8212n8452j2373K7368
2650c9428K7471k1451k8880J3098P1082l9456l1395L9311O1347J4580r8930j7559
2638e0210K4987l9717O0132n846j5109J97k4020J0417p240k1013O3134L8751j0385
2625B4078m4867l9067l439J4775l4684l531N6245M8308l0935J5784j3304L589
2613g048K2472J9694n7059L851M1873k5694m1276L5069J0209k6439k5127L6622
2601a2853L1546K0944j7370J2619J9584j748j1743j354l773q181L7512L342R675
$$ y = [25879, 23249, 7332, 81010, 73185, 62109, 73382, 36046, 25460, 14386, -61304, -29048, -21316, 5827, -1112, -13273, -48171, -46338, -61851, -95961, -2923, 28, 39837, -2648, -29800, -25240, 36243, 35137, 914, 16175, 57802, 8566, 32241, 4029, -54423, -66796, -39428, -11957, -33408, -62288, -49190, 21892, -17564, -48959, -9648, 51699, 66279, -32651, -50210, -25223, -64940, -4808, -10654, -25763, -25566, -49586, -39169, -46409, -67422, -4288, 34463, 24078, -20789, -59856, -63295, -48520, -83204, -86735, -30490, 17818, -13117, 2667, -10637, -7048, 15424, 35118, -21941, -18090, 23783, -1911, -43187, -8118, 2091, -24348, -49475, -12853, 18693, 39637, 22267, 34886, 54470, 52722, 40979, 39625, 35852, 27671, 65183, 68525, 78200]
2588G8200n8371j3255N9441J6428j5655l630L2499m755n7575J0615j1413N4460
2576H6989k5284O800K043l9080l8448J35549q445l9217K7028K1482O9734l0923
2564A68228n0252m672j8540O5972l0963l2175N4921K8593J6373k6314R056O7343
2552B47570o4465k1364k5195k3069O2240M6767k8465K9907l2090k0217M6763N4058
2540B72440O2251m5393K0354j3844k2079n8133L0508M3689J5331k9913J9023L1819
2528C26053K1517J3973k3841M5204k4033p78L1068m0849m4635K092j1633M3865
2516C38003K0905J4284K415J6715k0702l309r82J140M1378l1664j1348l0098J6076
2503C52813k857J8447K8730j2189j9684J0195Q254Q44n4780k5629o72O0803J7555
$$ y = [78200, 19829, 6574, 66015, 82443, 66788, 63158, 95657, 90902, 33327, 43942, 32529, 86989, 61705, 68505, 70548, 31468, -6980, 128569, 120124, 80907, 107935, 129417, 199151, 168228, 117976, 113304, 94764, 160736, 129773, 97598, 152519, 181112, 197485, 171171, 180227, 247570, 183105, 161741, 136546, 113477, 175717, 222484, 194019, 223926, 191836, 171619, 218382, 272440, 334691, 289298, 309652, 295808, 273729, 215596, 246104, 289793, 305124, 275211, 294234, 326053, 347570, 361543, 337702, 382906, 358873, 358095, 389163, 348314, 303679, 305771, 294138, 338003, 358908, 373192, 375607, 392322, 371620, 368311, 367329, 368469, 409847, 378183, 366835, 336737, 352813, 349956, 368403, 397133, 384944, 365260, 375455, 383709, 384553, 329773, 304144, 303472, 364275, 381830]
2490C81830l2609k8676L4424m3955m1482M6522j0602j0716n270m3400M3403Q0211
2478C69680J6511o232p359o7565j1005J7699k1157k4709m6700q950K3110k7027
2466B06296p845j320l8168l5805R073K1735M0673k7685j3014k0503M219l3199
2454A04457m579K9074Q782K589m4238j8528k9155N691k5582N0189n923K3846j2028
2441H4595j1918k8877N1334K2230p3088k2256j376n7990N0522k970K2270j664
2429C0812j5819P1242j0013j7742p6141l262k2580l8928L6201M4194m003M4564
2417C8525M7141L1127q4797n1752Q4917Q922K2528l6097p0765m6270O79L0372
2405b5470q6333L2987R9421K1255o5232k4109O9221J7175J1891o0896o448j083
$$ y = [381830, 349221, 320545, 354969, 311014, 269532, 316054, 305452, 294736, 289466, 246066, 289469, 369680, 386191, 379959, 372600, 305035, 294030, 311729, 290572, 265863, 219163, 210213, 233323, 206296, 198451, 197131, 158963, 123158, 132231, 153966, 194639, 166954, 153940, 133437, 137656, 104457, 99878, 128952, 137734, 140323, 96085, 77557, 48402, 54093, 28511, 78700, 72777, 96623, 84595, 72677, 43800, 95134, 117364, 44276, 22020, 20644, -37346, 13176, 10206, 32476, 30812, 14993, 86235, 76222, 58480, -17661, -20923, -43503, -82431, -46230, -2036, -6039, 38525, 85666, 116793, 31996, -19756, 65161, 74083, 96611, 60514, -10251, -56521, -55842, -25470, -111803, -78816, 20605, 41860, -23372, -47481, 21740, 38915, 50806, -10090, -16538, -17621]
2393a7621j0048L1457J1237j8309q6686j3203L6919Q380K6702L4776k9844L6985
2381A0745m6227J1056K6984j7856k0976j8874O3794j1126n0084L647J7370j4022
2369d5569J2918M754m2364K9554K4595j9762M5431K077m1253Q215L101J3765K4050
2356A9512J435j9635J6210P5420o2820L332J8325p3441n4076L2635K6055j2621
2344b9669Q826r062J2050k7019J3219M5847J1192m0449o7140L2786M0430k0677
2332b9666P334n3013L0515J0100j4721J888k751k044K6653L6428n2324k4026m557
2319g0184n608O0461J3072l8129P4752p84j2841j6082K2962N752N0330l069l264
2306G7368K0128j9077O980J13681o1515r8384j6417l4971l2009L1571n9314J5390
$$ y = [-17621, -27669, 3788, 15025, -3284, -89970, -103173, -66254, -57874, -31172, 3604, -26240, 10745, -35482, -24426, 2558, -15298, -36274, -55148, 8646, -2480, -52564, -48917, -31547, -45569, -32651, -27897, -70261, -40707, -16112, -35874, 9557, 11634, -29619, -21404, -18303, -4538, 19512, 20947, 1312, 17522, 92942, 30122, 33454, 51779, -21662, -75738, -43103, -17048, -29669, -20843, -29905, -17855, -44874, -31655, 14192, 25384, -15065, -82205, -49419, -8989, -29666, -22332, -75345, -44830, -34730, -49451, -47563, -50314, -52358, -25705, 10723, -41601, -65627, -70184, -75792, -15331, -2259, -40388, 34364, 33580, 20739, 4657, 27619, 33371, 83701, 80632, 77368, 97496, 78419, 85399, 199080, 137565, 39181, 22764, -12207, -44216, -12645, -71959, -56569]
2294e6569O1792L1857m656q260r582l7101J7743L2047L981k9115L7953l9840J1556
2281A1806O90K5221j741j6631m2821M784K3362L3715l635k9760n6203K3942J4718
2268a2553j8864J9540L416k8608J6965K7050J299m7871k89J3995k2650M7812R235
2255H477N1686m8533N859r29m0312k285l973J4039j5187J1487O8724K2241r40
2242G0354m867n9597l8131k6272J6527m849O7611k0870L3518m0486L7165M4601
2230G4704l2904l6641J0724p429o376K6360Q642L9443O560o0977R897K2421K817
2217E7241n7516J5932J9010j4480L8891j3709k0754p262K4746K3997j1988j7431
2205C6677K37N1817k3153p0571L7918P208M0280n9369M0666q224M307J3417l732
$$ y = [-56569, 5223, 37080, 32424, 24164, 14582, -22519, -4776, 27271, 31252, 2137, 40090, 250, 11806, 12496, 37717, 35976, 19345, -23476, -18692, 4670, 38385, 34750, 4990, -51213, -27271, -12553, -31417, -11877, -8461, -37069, -20104, 6946, 8245, -39626, -39915, -25920, -48570, -758, 8477, 60163, 11630, 17489, 16560, -23752, -26037, -30010, -15971, -31158, -19671, 49053, 71294, 70354, 65487, 5890, -32241, -58513, -41986, -46835, 20776, -94, 33424, -7062, 30103, 74704, 41800, 5159, 15883, 8454, 2078, 28438, 37080, 76523, 83083, 22106, 32003, 54424, 57241, -275, 15657, 34667, 20187, 59078, 45369, 24615, 17353, 42099, 66096, 54108, 36677, 36914, 88731, 65578, -4993, 32925, 40133, 80413, 21044, 61710, 53486, 57793, 71210, 67478]
2192F7478k6965M438r117O8550k3876p6783M2344L9515K8691k6310l5473M818
2180E7310J2079o262j955n453J9261R344L3659r526m9175N1280J5061k6911q785
2167H9927m1808K5640K8885k5394N6058L4418l0409l3431L3931K8000j3412K0545
2155A72950M4952m7496m5274o890O3585R833N569l182K3985M9053j580J6230j6747
2142B64988n6489k134N2407J6555n139Q186N1371K662L9137N6303l0972n0170
2130C46705N7648p1938q971J7854K2599M4640k3020M8830O8616J5435m13k6643
2118D91342P6857l0127J4545l910K2583L8171k7688L2784M8911N472R3635j1655
2106G50920r548k354M7565Q9044p679O0824j6242L5128M2164k8285L6721P9698
$$ y = [67478, 40513, 44951, 35834, 104384, 80508, 3725, 46069, 85584, 114275, 87965, 52492, 57310, 69389, 63127, 61172, 55719, 74980, 84324, 117983, 108457, 59282, 110562, 125623, 98712, 89927, 48119, 73759, 102644, 77250, 133308, 167726, 137317, 103886, 137817, 165817, 152405, 172950, 217902, 170406, 125132, 118242, 181827, 191660, 197229, 194047, 218032, 267085, 265505, 281735, 264988, 208499, 206365, 258772, 275327, 270188, 278374, 329745, 332407, 371544, 427847, 396875, 346705, 404353, 332415, 323444, 341298, 363897, 408537, 385517, 434347, 502963, 518398, 517985, 491342, 568199, 538072, 552617, 548707, 571290, 609461, 581773, 614557, 663468, 668940, 762575, 750920, 741372, 739018, 786583, 875627, 867948, 928772, 912530, 947658, 989822, 961537, 998258, 1077956]
2094A077956O3939J47610j6333J9185J05749R8284J04458Q4165J26605J23088
2084A934706Q0400J96252J35890K09393J64249K46431L68275L59556M25422M38824
2074D559398M37110M46859N55458O50557P90597R92975J182132J390403J859004
2065A2864493K343187L171060L697943R75778k263127m056706m096454k748006
2057I888168j757426j223812r77580p20384m97985m71605l79955k15537k68463
2048C375421j86324k27429j93859k38647j95714k19814j25671o4403p7875j13097
2038A732588j21039m1294q5385m1808q0942p9921l2455o4128p6913l6868o0769
2027A011066n3977M4445q3917m4394l4282K3175l9565l8236o3810l357l4356j4568
$$ y = [1077956, 1141895, 1289505, 1273172, 1292357, 1398106, 1496390, 1600848, 1685013, 1811618, 1934706, 2015106, 2211358, 2347248, 2556641, 2720890, 2967321, 3335596, 3695152, 4120574, 4559398, 4996508, 5443367, 5998825, 6649382, 7439979, 8432954, 9615086, 11005489, 12864493, 15207680, 18378740, 22076683, 23052461, 20789334, 16732628, 12636174, 9888168, 8130742, 6906930, 5929350, 5208966, 4710981, 4239376, 3859421, 3643884, 3375421, 3189097, 2961668, 2767809, 2529162, 2333448, 2113634, 1987963, 1923560, 1845685, 1732588, 1611549, 1570255, 1484870, 1443062, 1362120, 1282199, 1249744, 1185616, 1108703, 1071835, 1011066, 957089, 1001534, 917617, 873223, 838941, 862116, 822551, 784315, 720505, 717148, 682792, 668224]
2015F68224J657l2047j4365m4343q522k8999k3313m0339p2652L5114O736q084
2003D39067n0773j6048J9288J9338l2350j9747L403R062q950k4383J2129p419
1991C42617J4371K91L590k6781k8419j1547J8304j1414m3068k8757J9554j6496
1979B32245j3896P258N852r404l2413Q040k2616m2174N5336j2971J9391l8476
1967A56172J5418j1282O433L360M6013n2323n6624N767K4396J8637k4452k674
1955A28841l794J8529K108j876k8043j7575l3921o037k376k013k461O720l715
1942E4387L05L1689l7086p502K8004J7632l699k162J1355K950l3590K8521j957
1929H8847j1797L1848o3838J1047M487J2068m0817o818k6246Q076N7579N2455
$$ y = [668224, 669881, 637834, 623469, 579126, 570604, 541605, 518292, 477953, 405301, 440415, 447151, 439067, 388294, 372246, 391534, 410872, 378522, 358775, 362178, 371240, 362290, 337907, 350036, 342617, 356988, 357279, 360869, 334088, 305669, 294122, 312426, 301012, 257944, 229187, 248741, 232245, 218349, 225607, 231459, 222055, 189642, 197682, 175066, 132892, 188228, 175257, 194648, 156172, 171590, 160308, 166741, 170101, 216114, 163791, 107167, 112934, 137330, 155967, 131515, 128841, 125047, 143576, 145684, 143808, 115765, 98190, 64269, 58232, 55856, 53843, 51382, 58102, 54387, 54692, 86381, 49295, 41793, 69797, 87429, 83730, 81568, 92923, 95873, 62283, 90804, 88847, 77050, 108898, 45060, 56107, 60594, 72662, 31845, 25027, -1219, 6857, 64436, 116891]
1917A16891n9862L9134K4832j5692j1964o3581L4925n9203L985M7128J2410k4877
1905D4126n3508L2579K9464K91l8738l2592j009K8030J5244N86R086m3660j510
1892a1611O218J5666O61K3487L700q892n9375O8733N232j7740l3355J4922L5743
1879D3389Q295l7162K5120l9552n5756R2737J9516O50j7727J3824n6736m3996
1867d7398p87J3538j2563j6775L7726O6296Q6341o6475q5895l2940P4458R509
1855B5035m0110N3546l253K9927L872k3989n2586L806J4579M0066M912J3489l6263
1842C3031n8170N6750P456n9042L9917l4775K6392Q259K4586L2679K5533j8978
1830H3638k7716j6529n4089P1348l2763J9670Q036J0975K8808l2272k1403O9584
$$ y = [116891, 57029, 96163, 120995, 105303, 93339, 29758, 64683, 5480, 9465, 56593, 69003, 44126, -9382, 23197, 52661, 52952, 14214, -18378, -19387, 8643, 23887, 24473, 33559, -10101, -11611, -5393, 10273, 10934, 34421, 38121, 29229, -30146, 38587, 43819, 26079, -7276, 7646, 43389, 51684, 14522, 39642, 90, -55666, 37071, 56587, 57237, 39510, 53334, -3402, -47398, -48185, -34647, -47210, -63985, -26259, 40037, 126378, 59903, -25992, -58932, 15526, 25035, -15075, 38471, 35218, 65145, 69017, 45028, -7558, -3752, 10827, 50893, 55805, 69294, 33031, -25139, 31611, 39067, -19975, 19942, -14833, 11559, 19818, 44404, 77083, 102616, 83638, 55922, 39393, -14696, 56652, 23889, 43559, 51595, 62570, 91378, 59106, 37703, 107287]
1818A07287l9531n3369J7515k8932M8270l5884k4944Q312R681j6126j6789j4489
1806c8999n934J4933L6254j8011M1559J9256k4348j1217m9727P777R1244L84j06939
1793d3768J1390M666N173L436R020j0685J4091M3193k3978j6478j0139k2318J2774
1780b3623J2728k9909N056J0973R560M6578o388j3710n6453M5219L9049l6253
1768B827K6656K1471l5350m2438M9818l4473J6856k8442K6195k9556O109j5245
1756c5572k5371O619L9224k8002l4477K2336L0211J186M585J9853m7308K3992
1744b2724J62K40m7442R632O1517j1335L89k7933Q509j0915J3807N1105J6906
1731D1918N450j24239L2036K6677j7224L8638p915j17935Q6231N4307J3463n8975
$$ y = [107287, 67756, 14387, 31902, 2970, 51240, 15356, -9588, -1276, 8405, -7721, -24510, -38999, -44933, -30000, 6254, -11757, 29802, 49058, 24710, 13493, -36234, -28457, 62787, 63171, -43768, -32378, -27712, -22539, -19103, -10083, -20768, -6677, 36516, 12538, -3940, -14079, -36397, -23623, -10895, -40804, -35748, -24775, -15215, 31363, 24975, 11265, -45188, 31, 39080, 2827, 29483, 50954, 15604, -26834, 22984, -11489, 5367, -23075, 3120, -26436, -20327, -35572, -60943, -54324, -15100, -43102, -77579, -55243, -25032, -23846, -19261, 592, -46716, -22724, -22562, -22322, -69764, -60132, 1385, -9950, -9561, -37494, -28985, -39900, -26093, 25012, 41918, 47368, -76871, -44835, -18158, -35382, 3256, -4659, -122594, -36363, 17944, 31407, -27568]
1719b7568J963L2368j713o6049M2583j8966o5460M0448M9882P9724k0203j8360
1707B8649N3524n5203p8161M5831M7650m3230n0282L4193P961j1285k1182L8910
1695b625q719l5929K0375N7197L4706j4137n7965o3202K1626q731j8774K6058
1683e0120J3745M624l2234k5385J9979J0289M2334J9343m5104M923j3038O8166
1671A7522J2411k7263n2725m2702M5023N7539M069m1469J7153r199J2868N8799
1659E2026r1186J4584N5608k3268J619J0974l4927j2381Q093n1185j7631O3935
1647b3739P6412k4701o9550M641l0560L8624M6308L984l3644j4073Q37L7056J4689
1634B6284m0085j8059K7154k8009n2467M0513J9745k0426k6732J4814N2354k8815
$$ y = [-27568, -25605, 6763, 5050, -60999, -18416, -37382, -102842, -62394, -12512, 67212, 47009, 28649, 82173, 26970, -51191, -5360, 42290, -940, -51222, -17029, -9068, -20353, -41535, -2625, -11344, -47273, -26898, 30299, 65005, 50868, -7097, -70299, -48673, -57404, -76178, -50120, -36375, -31751, -63985, -89370, -69391, -59102, -16768, 2575, -42529, -37606, -50644, 17522, 29933, 2670, -50055, -92757, -47734, 9805, 13874, -27595, -10442, -19641, -6773, 52026, -39160, -24576, 31032, 7764, 9383, 20357, -14570, -26951, -18858, -70043, -87674, -23739, 52673, 27972, -41578, -36937, -67497, -28873, 17435, 21419, -12225, -26298, -25461, 11595, 26284, -13801, -31860, -4706, -32715, -85182, -44669, -24924, -45350, -72082, -57268, -4914, -33729]
1622c3729k9439P1117k3736L097l870L6544m1867J55O2184n5408m1957k1702L9122
1609c9489k7294j9576K3197L9524j2436L4881K5634q0442J7256L7013k3202l7786
1597f2720L0195K6124K3112J7978n18j8306l5441J6685K3970j2234K8449m2772
1585e478K503n3200J9124K5667m8310N0882j2590K4616N685l4236n794n1955J7666
1572f5420O4049P6798p4905k0395J6632L5898K3676n2578l312k1324M3459l1120
1560h542p433M0971L2324m0796o9870N3183N1154o8589l0064J1019k4244L5885
1548b5002Q0282l9093l2499n342M2674j7208n0692l6108L3537N0847j4660L394
1536i870k4843l8838N579P8115j2267L2281K4303q8226K0031J1573P2547j0006
$$ y = [-33729, -63168, 7949, -15787, -12690, -16560, 19984, -21883, -21728, 40456, -14952, -56909, -78611, -39489, -66783, -86359, -63162, -23638, -36074, -1193, 24441, -56001, -38745, -1732, -24934, -62720, -32525, -6401, 16711, 34689, 34171, 15865, -19576, -2891, 21079, 8845, 37294, -5478, -2975, -56175, -37051, -11384, -59694, -8812, -21402, 3214, 8899, -25337, -31131, -83086, -65420, -1371, 75427, 522, -19873, -3241, 32657, 56333, 3755, 443, -20881, 22578, -8542, -15975, 24996, 57320, 16524, -53346, -163, 50991, -17598, -47662, -36643, -60887, -25002, 55280, 16187, -16312, -21654, 21020, 3812, -46880, -82988, -49451, 1396, -13264, -9870, -34713, -73551, -67972, 10143, -2124, 30157, 54460, -33766, -13735, -2162, 70385, 60379]
1524F0379Q384k2010n9522l132R309l8007l3167m837Q4320N369j1463N4338j7845
1511C2116m8663K8603L5431k0320m4214N1695k5481N5431o3582j20515Q1186K529
1499c5784m0817L3612J2618l7749N7944j5053j2367l3749P6111j7657R37k947
1487a4901K7555k4911j8909l0787P2162N5707L3670p3547l9030n709k5861p53
1475d5314L4379N5159l4749J0827l788q9253Q3494K9032K0481j9597r369m8051
1463a6749r649M9034l6886O7499M451r7130l1101K8925N7474n682o9087J4677
1451d4224n1225l1438P4407J611o657p531m991N2167m2597L372j2652N262N521
1438e8975J7516k0293N793K0351Q655k6052p410O5005p608j0331m5077m297K8737
$$ y = [60379, 68763, 46753, -12769, -15901, -6592, -44599, -77766, -82603, 1717, 7086, -4377, 49961, 32116, -16547, 12056, 47487, 27167, -17047, 34648, 9167, 64598, 1016, -119499, -38313, -35784, -76601, -42989, -30371, -68120, -10176, -25229, -37596, -71345, 4766, -12891, -11954, -14901, 12654, -12257, -31166, -61953, 10209, 65916, 99586, 26039, -12991, -18700, -44561, -45314, -10935, 44224, 9475, 20302, 16514, -72739, 10755, 39787, 60268, 40671, 31302, -16749, -26398, 22636, -14250, 53249, 57700, -39430, -70531, -41606, 15868, 10186, -58901, -44224, -95449, -126887, -52480, -50869, -57526, -65057, -70048, -17881, -60478, -57106, -69758, -64496, -58975, -41459, -61752, -55959, -35608, -26953, -53005, -60415, 4590, -3018, -13349, -58426, -62723, -33986]
1425c3986l0720L5123m729J0071p5656K2713R7511K1888n5398N707l5003q8335
1413a30814L6496Q3675J3539L1080o1292m025N0370L0409k2657l8549L1638r111
1401A0759L6608L0697o6422L2137j3873m063j6168k1684K3413m2410K3714K1650
1389A4358n6884l1402O5682L2567n9854k4970L7212M5816o7193K2356M4073Q41
1377B2602j6054k0052J2810j422J0582J3888m8847K91M9183m1694n98q66j2084
1364c2261N6210L864m2594O004l9817j700K6258K5149m0540K311p8453L2999K2108
1351f0462K2459K4095L7364O3539j8466J1397q933o3646K1967J468n810m7420
1339b2448k8883N28P0402r533k3426O139p5884M915N0361p48k5637J1602N4174
$$ y = [-33986, -64706, -29583, -34312, -24241, -99897, -77184, 20327, 42215, -13183, -7476, -42479, -130814, -94318, -10643, 2896, 33976, -27316, -31341, 19029, 49438, 26781, -11768, 19870, 10759, 47367, 78064, 11642, 43779, 29906, 25843, 9675, -12009, 11404, -31006, -7292, 14358, -42526, -73928, -8246, 24321, -35533, -60503, -23291, 22525, -44668, -22312, 21761, 22602, 6548, -13504, -694, -2116, 8466, 22354, -26493, -26202, 22981, -18713, -19311, -20177, -32261, 23949, 27813, -14781, -8777, -48594, -50294, -24036, 1113, -39427, -37116, -115569, -82570, -60462, -38003, -13908, 23456, 86995, 68529, 79926, 70993, 7347, 29314, 30782, 24972, -22448, -51331, -50803, 19599, 10066, -13360, -7221, -83105, -78190, -27829, -28577, -54214, -42612, 11562]
1326A1562j517J2068l5857J1348m6934K7316j453j5108R076N2907J4400r557l4434
1313f183l4047j2535q883K3446L6866K4578k2735K7331k5153o1777l532L5623
1301b7001j225J656k5620K0720L1360L764o7580M1244k249K4487k2719J5060l0547
1288c8650J8282R723l2695P018k8707L6537N9880l6794j2325k8691N0568l633
1276E13J668n7731M4290j5562p566L3108k3315L616M7372P503o9479N9424o321
1263A7520n2153J7990K4858K5771m6017P622l6655J3402k1893P343L5600j5014
1251b1626l8283l7602M3624J9182Q080K6365m02l1427j3996m446N4171r370J7851
1238A2121k5581M0945j2291j6018j5863j4002O0757J7369J637K4342o2971j023
$$ y = [11562, 10045, 22113, -13744, -2396, -49330, -22014, -23467, -38575, -29499, 23408, 37808, 28251, -6183, -40230, -52765, -61648, -38202, -1336, 23242, 507, 27838, 2685, -59092, -62624, -27001, -28226, -26570, -52190, -31470, -110, 3654, -63926, -22682, -24931, -444, -23163, -8103, -38650, -20368, -10645, -43340, -36322, -65029, -28492, 31388, -5406, -17731, -46422, 4146, 513, 2181, -55550, -11260, -26822, -34388, -1280, -24595, -20979, 26393, 33896, -35583, 23841, 17520, -34633, -16643, 8215, 33986, -12031, -4409, -41064, -27662, -49555, -42212, -6612, -21626, -59909, -97511, -53887, -34705, -26625, -260, -662, -32089, -46085, -50531, 3640, -5730, 12121, -13460, 27485, 15194, -824, -16687, -30689, 30068, 47437, 49074, 73416, 10445, 9422]
1226I422M669L07L2833n1878L8317O944j2890p0660R509P2464q3229n7153M3424
1213e7921M6304P878M2770o7426K0177m6423K9636J1734j6235N2395J6113n6025
1201a7023q058m815l0272j4500K9895K3448J1161l3180k6953L3909k6521O577
1189e6332J3310R749M2016p3277k639K7465J9164l2011J2090K7787P864l4369
1177c9183j1630J6049r326J5509M1264J9819K1907j6075m0405J6077q785O147
1165A1368k0188q536j4261L8834k1134K6869K3216m7101j8221L7767l0716l6512
1153e8615M6246j0601k0207q729K9998J7186L437l5573m411J4063o4406J6624
1141g4988K3482R6411O062O876J63m2479j2199O3610K0633m9011K0994k447k5759
$$ y = [9422, 14091, 14398, 47231, -4647, 33670, 40614, 27724, -42936, -33427, 39037, -44192, -101345, -57921, -11617, -3739, 39031, -28395, -8218, -54641, -25005, -13271, -29506, 22889, 39002, -17023, -25081, -29896, -60168, -74668, -44773, -21325, -10164, -43344, -70297, -36388, -62909, -56332, -43022, -33273, 8743, -64534, -67173, -39708, -20544, -52555, -40465, -12678, -4814, -39183, -50813, -34764, -44090, -28581, 12683, 32502, 54409, 38334, -2071, 14006, 5221, 11368, -8820, -17356, -31617, 7217, -13917, 12952, 36168, -10933, -29154, 8613, -22103, -58615, -12369, -22970, -43177, -51906, -21908, -4722, -1285, -36858, -41269, -27206, -91612, -74988, -51506, 44905, 50967, 57843, 58006, 15527, 3328, 66938, 87571, 38560, 59554, 57107, 31348]
1128C1348k4772j8447M3154J0247Q31j1907o393j4397K0372n4408o2046K8605
1116e7813N7004J0997k4202j830K4501m6068p956l6907J4889J02347m4512j7693
1104b7243M99Q441l1774J9147N5131J4666k7481k7036n2664M9226L4932r034l1077
1091b4267O9420N151p8909K9168J9887j4112J8718J1928n8072O379j7691K1767
1079a0633m3766L7685q4717O6774N5674J5545n8330m492j8047L2132L5411q7156
1067f3920K9242O3137m2737N3402p520p2025Q7716J3535l9223m9319m53J1285
1055a6880K7883n5658P929M4170N3723n2513m4305j0085K1861k8917Q7378o4985
1043c0399K730m0911K8717K7509Q336j2777m2159q236N5445K2139r42k537n44
$$ y = [31348, 6576, -11871, 31283, 41530, 42361, 30454, 24061, 9664, 30036, -24372, -86418, -57813, -809, 10188, -14014, -15844, 8657, -37411, -45367, -82274, -67385, 34962, -9550, -27243, -26744, -18303, -50077, -30930, 24201, 38867, 11386, -15650, -68314, -19088, 15844, 6810, -24267, 45153, 50304, -28605, 563, 20450, 6338, 25056, 36984, -21088, -14709, -32400, -10633, -54399, -16714, -101431, -34657, 21017, 36562, -21768, -26260, -44307, -12175, 23236, -63920, -34678, 28459, -14278, 39124, 31604, -40421, 47295, 60830, 21607, -27712, -28165, -16880, 11003, -44655, -36726, 7444, 61167, 8654, -35651, -45736, -23875, -52792, 34586, -30399, -27669, -68580, -39863, -12354, -4018, -16795, -58954, -67190, -11745, 10394, 9452, 6915, 6371]
1030F371K3325m5196o3154K1379P8573m7688M9222K1413J212q008k2432j9680
1018d663J7812k376L4349j4540p00J2602l8710L9007L3746p7746m8689N0061L4023
1005C4176k5976J5616o3884L0194K6970m9536M0769K0478L406j5355m0913O0771
993C6716N9622J5843o5812k7815J9665P244k1313m563r443J1917q524J45J1793
980B5475n3404o2428l0200R7256m1518L4008K9995L5494q1377l6002K9185j5795
968f9311j2618P817M7262K0288J4523k8940j3897Q698N5427J0737P251o5689J4523
955c929k4875J1538M8198J130Q224n6118m1806k6967O3070J10O3665m5754r844
942a3358M036p2311M6666J04219j9608j9794n030m6000K9570P9509j28649j6947
$$ y = [6371, 29696, -15500, -78654, -57275, 21298, -26390, 22832, 44245, 45457, 37449, 15017, -4663, 13149, 10773, 45122, 30582, 29882, 42484, 3774, 42781, 76527, -1219, -49908, 153, 34176, 8200, 23816, -40068, -9874, 17096, -32440, 8329, 28807, 32213, 16858, -24055, 36716, 96338, 112181, 46369, 18554, 38219, 45463, 24150, 19587, 10144, 22061, 13537, 13682, 25475, -27929, -90357, -120557, -23301, -64819, -30811, -816, 34678, -46699, -82701, -53516, -69311, -81929, -74112, -26850, -6562, 7961, -20979, -34876, -26178, 29249, 39986, 47237, -18452, -3929, -28804, -17266, 30932, 32062, 40286, -15832, -57638, -84605, -21535, -21425, 42240, -3514, -13358, -9322, -81633, -34967, 69252, 49644, 29850, 24820, -21180, 8390, 87899, -40750, -57697]
930e7697K7536j9926L7499k340L8480L3421r948k9928j2361M2443p1118k02j4324
917c8465j3258O5310K1605j4110L0247J300l9529m1977L0539N0793l6737K9764
905D5482l0853K6963j4451q040l3019Q0749k5417k0374k4281P85j0201K2981m6167
892c5843J6948l891M7190m4309L3272n9069j5623P198L588J7870K0505j7770j3123
879d3057K6800o511k1826K611M3503O272K2915k0149l2597l2869P0413o163n8824
866d9482k6226L2020p058P8338L2436k7094k8227J1070M8771q151q4601N0232
854B2028M6487o8073p9025L4450O2981r98o3882M817J6587j7031Q657m912O799
841c1115O5222M5861l6790p4937P6533j891k0748J2154l7931J3312Q766q076j9828
$$ y = [-57697, -30161, -50087, -12588, -14928, 23552, 56973, 47025, 17097, 4736, 47179, -23939, -24141, -38465, -51723, 13587, 35192, 21082, 51329, 52629, 13100, -28877, 1662, 52455, 15718, 45482, 14629, 41592, 27141, 19101, -13918, 66831, 41414, 21040, -3241, -2456, -12657, 10324, -35843, -18895, -22786, 24404, -19905, 13367, -45702, -61325, -54127, -50539, -32669, -12164, -29934, -43057, -16257, -22768, -44594, -41983, 1520, 7792, 30707, 10558, -22039, -54908, 15505, 9342, -49482, -75708, -43688, -50746, 27592, 60028, 32934, 4707, 15777, 64548, 56397, -28204, 22028, 68515, 442, -78583, -44133, 18848, 17850, -46032, -41215, -24628, -41659, -33002, -37914, -31115, 34107, 79968, 43178, -31759, 44774, 42883, 22135, 34289, -3642, 9670, 18436, 10360, -9468]
828i468L1382j7346l0224j3214j4338L6134K9172k7570n2955J06484N4468n6530
816C5995k7806n9999Q214N0957K6455M2978m373J552k4580o4404l9353P39M9972
803c653j148L0849J0252k6655J0006k5171j0241j3963K5064K9827k6681l6078
791c7592k7400q873J4606O5842l0119r317M6677l72o417l9625Q135J4791L6679
778B7015j3708j7950J2287L7704m2996n221l6559J3703M3166q1311L3007K899
766b7964M9029l0905k0880K9788J156m6422l9970K0512M1117l3218M8534N9802
754E0579m6121k3209N8007k6519l0757q36k4627N0682J5511j1363m8467K8589
742h531L8769m385N983M3516m9280n0215O672n798N5762n3122J6081L8806P711
$$ y = [-9468, 21914, 4568, -25656, -38870, -53208, -17074, 12098, -15472, -68427, 38057, 92525, 35995, 8189, -51810, -43596, 7361, 33816, 76794, 72421, 73973, 49393, -15011, -54364, -53625, -3653, -4801, 26048, 36300, 9645, 19651, -5520, -15761, -29724, -4660, 25167, -1514, -37592, -64992, -73865, -59259, 6583, -23536, -32853, 13824, 13452, 7035, -32590, -24455, -9664, 27015, 13307, -4643, 7644, 45348, 2352, -2869, -39428, -25725, 17441, -63870, -30863, -27964, 21065, -9840, -30720, -932, 224, -46198, -86168, -65656, -24539, -57757, -9223, 50579, 4458, -18751, 39256, 12737, -18020, -18856, -43483, 7199, 22710, 11347, -37120, -8531, 30238, 25853, 31836, 75352, 26072, -24143, -17471, -23269, 32493, -20629, -4548, 34258, 41969]
729D1969j1602m1098J5135p5356R4942J3912n5142l1091k0457K5659L4480J0853
717B204k1869m5137K9984K234j1909K3369N6617L7235l1524l3210m658l959n3478
704e4101m601J5239L131L1998J8312M3529m0941M969m2057J6163L602J4225M3268
691E2736p5193J3209R892j9203o2387n4623O0428L1204l9836O6038P017J0195
679e23N3694K9268o7386L9460j0392L9327k3886L0129R135k5989o6569n834K0615
666B1049K0545l449p8026M0225M3800K4760j8895n8528j3387M6088j1082k074
654A1026K8318M327j6968J3675l4470l1109j5615M3081J3240J2036q962N5983
642G4562l7441o7680K7027j0814J4298J4355J2431n0015M1737J7072P441K1399
$$ y = [41969, 30367, -10731, 4404, -70952, 23990, 37902, -17240, -48331, -68788, -43129, -8649, 2204, -19665, -64802, -34818, -32584, -44493, -21124, 35493, 72728, 41204, 7994, 3336, -623, -54101, -58702, -43463, -40332, -8334, 9978, 53507, 12566, 17535, -24522, -8359, -4757, 9468, 52736, -22457, -9248, 644, -18559, -80946, -135569, -75141, -43937, -83773, -17735, -10718, -523, 53171, 82439, 15053, 54513, 44121, 83448, 59562, 89691, 98826, 72837, 6268, 434, 21049, 41594, 38145, -39881, 344, 44144, 68904, 50009, -8519, -21906, 24182, 13100, 11026, 39344, 43671, 26703, 40378, 5908, -25201, -40816, 2265, 15505, 27541, 18579, 74562, 37121, -30559, -3532, -14346, -48, 14307, 26738, -23277, 18460, 35532, 42973, 64372]
630F4372L6492k8064n4582k2081O2839R185J1875o1662k5362J8126M2408j6569
618C6977k8069k6688O2061K7244J1998n9099k0670K5364r658Q149o4571K81K8933
605g748N4331l2252N136K3669K4009j08154K4689J9256k4944j5724Q2835L755
593D8858j9142k1348l2647J7696Q19L2653n3860j1854k632j1433M7164n116J7036
580F194Q040j9434j509j879M9683L1559o572n7939m6098J5068M7516M4028k4191
567D4466k7687j2346l093k105k7480k4385M4349N5176L5188j4196m0246n3337
555b5696P35L8831K8963Q330j1557k9341N1884j4913n2862j6911J6639J9808R889
542B3799n9286L4125n610j5795M5503O8833l5654j2855l6989m8820J7167M5919
$$ y = [64372, 100864, 72800, 18218, -3863, 58976, 68161, 80036, 18374, -6988, 11138, 53546, 36977, 8908, -17780, 44281, 71525, 83523, 24424, 3754, 29118, 19460, 27609, -36962, -36681, -7748, 46583, 14331, 19467, 43136, 67145, -41009, -16320, 2936, -22008, -37732, 45103, 48858, 29716, 8368, -24279, -6583, -5764, 26889, -26971, -38825, -41457, -52890, -5726, -10842, 6194, 14234, -5200, -6709, -8588, 41095, 72654, 66082, 8143, -37955, -22887, 24629, 68657, 44466, 16779, 4433, 1340, -765, -28245, -52630, -8281, 46895, 82083, 67887, 27641, -25696, -24961, 13870, 42833, 51163, 39606, 10265, 62149, 47236, -5626, -22537, -5898, 13910, 23799, -35487, -1362, -6972, -22767, 22736, 91569, 55915, 43060, 6071, -42749, -25582, 20337]
530B0337K0959j4851m3615k7225j4822M2814N4803m1369K3002M543M0746Q276
518G3598k4582m4309j4673q715O6404q0336K2464L1453K535k1498j4007M5373
$$ y = [20337, 41296, 26445, -17170, -44395, -59217, -16403, 38400, -2969, 20033, 24576, 65322, 73598, 49016, 4707, -9966, -18681, 47723, -32613, -10149, 21304, 23839, 2341, -11666, 33707]
$$ [...]
##END NTUPLES=NMR SPECTRUM
##END=
