##TITLE=1H_CA-8909-1
 CDCl3, 8 sc, 
 3.08.2021
##JCAMPDX= 6.0         $$ Bruker NMR JCAMP-DX V2.0
##DATA TYPE= NMR SPECTRUM
##DATA CLASS= NTUPLES
##ORIGIN= UXNMR, Bruker Analytische Messtechnik GmbH
##OWNER= root
$$ XWIN-NMR		Version 3.5
$$ Tue Aug  3 08:41:04 2021 Russian Standard Time (UT+4h)  she@DPX200
##.OBSERVE FREQUENCY= 200.131506
##.OBSERVE NUCLEUS= ^1H
##.ACQUISITION MODE= SIMULTANEOUS
##.ACQUISITION SCHEME= undefined
##.AVERAGES= 8
##.DIGITISER RES= 18
##SPECTROMETER/DATA SYSTEM= spect
##.PULSE SEQUENCE= zg30
##.SOLVENT NAME= CDCl3
##.SHIFT REFERENCE= (INTERNAL, CDCl3, 0, 17.502)
##AUDIT TRAIL= $$ (NUMBER, WHEN, WHO, WHERE, WHAT)
$$ ##TITLE= Audit trail, XWIN-NMR		Version 3.5
$$ ##JCAMPDX= 5.01
$$ ##ORIGIN= Bruker BioSpin GmbH
$$ ##OWNER= she
$$ F:/spectra/data/she/nmr/H-F/1/pdata/1/auditp.txt
$$ ##AUDIT TRAIL=  $$ (NUMBER, WHEN, WHO, WHERE, WHAT)
(   1,<2021-08-03 08:39:39.32 +0400>,<she>,<DPX200>,
      <created by zg, POWCHK disabled, PULCHK disabled
       configuration hash MD5:
       00 E9 B6 7A A2 85 ED C7 34 08 36 98 17 FE 4E 26
       data hash MD5: 16K
       FC 12 81 21 5D 3E 04 52 46 B7 45 20 5D 3B 48 53>)
(   2,<2021-08-03 08:39:42.28 +0400>,<she>,<DPX200>,
      <Start of raw data processing
       efp BC_mod = 2 LB = 0.24 FT_mod = 6 PKNL = 1 PHC0 = -13378.35 PHC1 = 40.60099 SI = 16K 
       data hash MD5: 16K
       4D C5 9A 5D 38 52 F5 7F C6 5E 25 E9 EF CF 21 CF>)
(   3,<2021-08-03 08:40:04.70 +0400>,<she>,<DPX200>,
      <pk PHC0 = 28.80805 PHC1 = -34.8 
       data hash MD5: 16K
       BB 23 24 E9 67 B4 8B 37 79 21 B7 CF 77 BE 09 A4>)
(   4,<2021-08-03 08:40:07.89 +0400>,<she>,<DPX200>,
      <abs ABSG = 5 
       data hash MD5: 16K
       13 B5 50 FC CD 6B 09 C9 64 A0 C8 30 AA 69 C4 56>)
$$ ##END=
$$ 
$$ hash MD5
$$ 95 54 A2 29 59 25 94 63 8F 33 39 EE 55 65 32 0C
##$RELAX= 
##$RELAX= 
##$RELAX= 
##$RELAX= 
##$RELAX= 
##$RELAX= 
$$ Bruker specific parameters
$$ --------------------------
##$DU= <F:/spectra>
##$EXPNO= 1
##$NAME= <H-F>
##$PROCNO= 1
##$TYPE= <nmr>
##$USER= <she>
##$AMP= (0..31)
100 100 100 100 100 100 100 100 100 100 100 100 100 100 100 100 100 100 
100 100 100 100 100 100 100 100 100 100 100 100 100 100 
##$AQSEQ= 0
##$AQ_mod= 1
##$AUNM= <au_zg>
##$AUTOPOS= <>
##$BF1= 200.13
##$BF2= 200.13
##$BF3= 200.13
##$BF4= 200.13
##$BF5= 200.13
##$BF6= 200.13
##$BF7= 200.13
##$BF8= 200.13
##$BYTORDA= 1
##$CFDGTYP= 0
##$CFRGTYP= 5
##$CHEMSTR= <none>
##$CNST= (0..31)
1 1 145 1 1 1 1 1 1 1 1 1 1 1 1 1 1 1 1 1 1 1 1 1 1 1 1 1 1 1 1 1 
##$CPDPRG= <>
##$CPDPRG1= <>
##$CPDPRG2= <>
##$CPDPRG3= <>
##$CPDPRG4= <mlev>
##$CPDPRG5= <mlev>
##$CPDPRG6= <mlev>
##$CPDPRG7= <mlev>
##$CPDPRG8= <mlev>
##$CPDPRGB= <>
##$CPDPRGT= <>
##$D= (0..31)
0 1.2 0 0 0 0 0 0 0 0.06 0 0.03 0 0 0 0 0.0002 0 0 0 0 0 0 0 0 0 0 0 0 
0 0 0 
##$DATE= 1627965578
##$DBL= (0..7)
120 120 120 120 120 120 120 120 
##$DBP= (0..7)
150 150 150 150 150 150 150 150 
##$DBP07= 0
##$DBPNAM0= <>
##$DBPNAM1= <>
##$DBPNAM2= <>
##$DBPNAM3= <>
##$DBPNAM4= <>
$$ [...]
##$SUBNAM3= <"">
##$SUBNAM4= <"">
##$SUBNAM5= <"">
##$SUBNAM6= <"">
##$SUBNAM7= <"">
##$SUBNAM8= <"">
##$SUBNAM9= <"">
##$SW= 20.0188882624521
##$SWIBOX= (0..15)
0 0 2 0 0 0 0 0 0 0 0 0 0 0 0 0 
##$SW_h= 4006.41025641026
##$TD= 16384
##$TD0= 1
##$TE= 0
##$TE2= 300
##$TE3= 300
##$TEG= 300
##$TL= (0..7)
0 120 120 120 120 120 120 120 
##$TP= (0..7)
150 150 150 150 150 150 150 150 
##$TP07= 0
##$TPNAME0= <>
##$TPNAME1= <>
##$TPNAME2= <>
##$TPNAME3= <>
##$TPNAME4= <>
##$TPNAME5= <>
##$TPNAME6= <>
##$TPNAME7= <>
##$TPOAL= (0..7)
0.5 0.5 0.5 0.5 0.5 0.5 0.5 0.5 
##$TPOFFS= (0..7)
0 0 0 0 0 0 0 0 
##$TUNHIN= 0
##$TUNHOUT= 0
##$TUNXOUT= 0
##$USERA1= <user>
##$USERA2= <user>
##$USERA3= <user>
##$USERA4= <user>
##$USERA5= <user>
##$V9= 5
##$VALIST= <valist>
##$VCLIST= <CCCCCCCCCCCCCCC>
##$VD= 0
##$VDLIST= <DDDDDDDDDDDDDDD>
##$VPLIST= <PPPPPPPPPPPPPPP>
##$VTLIST= <TTTTTTTTTTTTTTT>
##$WBST= 1024
##$WBSW= 4
##$XGAIN= (0..3)
0 0 0 0 
##$XL= 0
##$YL= 0
##$YMAX_a= 234528
##$YMIN_a= -287589
##$ZGOPTNS= <>
##$ZL1= 120
##$ZL2= 120
##$ZL3= 120
##$ZL4= 120
##$ABSF1= 17.51055
##$ABSF2= -2.50849
##$ABSG= 5
##$ABSL= 3
##$ALPHA= 0
##$AQORDER= 0
##$ASSFAC= 0
##$ASSFACI= 0
##$ASSFACX= 0
##$ASSWID= 0
##$AUNMP= <proc_1d>
##$AZFE= 0.1
##$AZFW= 0.1
##$BCFW= 0
##$BC_mod= 2
##$BYTORDP= 0
##$COROFFS= 0
##$CY= -3
##$DATMOD= 1
##$DC= 0
##$DFILT= <>
##$DTYPP= 0
##$F1P= 0
##$F2P= 0
##$FCOR= 1
##$FTSIZE= 16384
##$FT_mod= 6
##$GAMMA= 0
##$GB= 0
##$INTBC= 1
##$INTSCL= 1.334414e-10
##$ISEN= 128
##$LB= 0.24
##$LEV0= 0
##$LPBIN= 0
##$MAXI= 10000
##$MC2= 0
##$MEAN= 0
##$ME_mod= 0
##$MI= 1.114404
##$NCOEF= 0
##$NC_proc= -7
##$NLEV= 6
##$NOISF1= 3.799351
##$NOISF2= 2.8
##$NSP= 0
##$NTH_PI= 0
##$NZP= 0
##$OFFSET= 17.502
##$PC= 1
##$PHC0= -13349.54
##$PHC1= 5.800991
##$PH_mod= 1
##$PKNL= yes
##$PPARMOD= 0
##$PSCAL= 0
##$PSIGN= 0
##$REVERSE= no
##$SF= 200.130006530915
##$SI= 16384
##$SIGF1= 3
##$SIGF2= 2
##$SINO= 5.538805
##$SIOLD= 16384
##$SREGLST= <1H.CDCl3>
##$SSB= 0
##$STSI= 16384
##$STSR= 0
##$SW_p= 4006.41025641026
##$SYMM= 0
##$S_DEV= 0
##$TDeff= 16384
##$TDoff= 0
##$TI= <>
##$TILT= no
##$TM1= 0
##$TM2= 0
##$TOPLEV= 0
##$USERP1= <user>
##$USERP2= <user>
##$USERP3= <user>
##$USERP4= <user>
##$USERP5= <user>
##$WDW= 1
##$XDIM= 16384
##$YMAX_p= 386062723
##$YMIN_p= -636098
$$ End of Bruker specific parameters
$$ ---------------------------------
##NTUPLES= NMR SPECTRUM
##VAR_NAME=  FREQUENCY,     SPECTRUM/REAL,   SPECTRUM/IMAG
##SYMBOL=    X,             R,               I
##VAR_TYPE=  INDEPENDENT,   DEPENDENT,       DEPENDENT
##VAR_FORM=  AFFN,          ASDF,            ASDF
##VAR_DIM=   16384,         16384,           16384
##UNITS=     HZ,            ARBITRARY UNITS, ARBITRARY UNITS
##FACTOR=    0.24454680195387, 1,            1
##FIRST=     3502.67553615238, 0,            0
##LAST=      -503.734720257883, 0,           0
##MIN=       -503.734720257883, -636098,     0
##MAX=       3502.67553615238, 386062723,    0
$$ Real data points
##PAGE= N=1
##DATA TABLE= (X++(R..R)), XYDATA
$$ [...]
6933D146792k15222o1340o2805k22349r2992l23423J8135M7192p1181j77976l3682
6922B951149k01444J623K2080p8710o001r5091j62785k24015J58176Q0267p7558
6911B367691j53188M0807j19464L4288K183n2337j06151j24699Q8882n8906P6225
6900A995331O3898k23603J3871M0356m8176k23539k12042m7298J79655J12571
6890A651024L1349k1999K4454n9230k29642R3562L86515n9745k12598M5633j3379
6879A635944j8824j55197L7404j5054k20391j9566m2457R1042j00919J43243N9394
6868A394619q7231K25683k26304k22021Q5966J20440J89618l5465k35820J2859
6858A222344j5014j23669k52205K90322J85035k05386J0487R6204n2721k2390
$$ plain form
6933 4146792 3931570 3870230 3807425 3585076 3492084 3168661 3186796 3233988 3162807 2984831 2951149
6922 2951149 2749705 2751328 2773408 2694698 2688697 2593606 2430821 2206806 2364982 2445249 2367691
6911 2367691 2214503 2255310 2135846 2170134 2172317 2119980 2013829 1889130 1978012 1919106 1995331
6900 1995331 2059229 1835626 1849497 1889853 1841677 1618138 1406096 1358798 1538453 1651024
6890 1651024 1682373 1660374 1684828 1625598 1395956 1489518 1876033 1816288 1603690 1649323 1635944
6879 1635944 1617120 1461923 1499327 1484273 1263882 1244316 1201859 1292901 1191982 1335225 1394619
6868 1394619 1307388 1533071 1306767 1084746 1170712 1291152 1480770 1445305 1209485 1222344
6858 1222344 1207330 1083661 831456 1121778 1306813 1101427 1111914 1208118 1155397 1133007
6848A133007l1720j05499q3106K45902K13868j67836N1706R4513L9306K32466
6838A622607J61563j20205k54816J45944L86712l0343j45213m7604j12547j38154
6828A467944R4481j36695o1288j91831m1060l5423j23710K29934k9750j98103
6818I74499j3929j4940k30083J30597m4155o5320l3575K35250L1403l105j47616
6807H19026j36775N9516J23273J13568l2701J6851j07500J24190J57209L531R6910
6796A237098k7494Q2493J37968j12796O5064r604k08885r1421K57610K85436k51413
6785A364056j91926j60826n0977p4119k64731l8900J41698O956J36983N6643j86315
6774G38542N6942J57765n1939m97958K07995j9778j10556K8389j86878o45J25932
$$ plain form
6848 1133007 1101287 995788 912682 1158584 1372452 1204616 1256322 1350835 1390141 1622607
6838 1622607 1784170 1663965 1409149 1555093 1941805 1911462 1766249 1718645 1606098 1467944
6828 1467944 1562425 1425730 1364442 1172611 1131551 1096128 972418 1202352 1172602 974499
6818 974499 960570 945630 715547 846144 801989 736669 703094 938344 969747 966642 819026
6807 819026 682251 741767 865040 978608 945907 962758 855258 979448 1136657 1140188 1237098
6796 1237098 1209604 1292097 1430065 1317269 1382333 1372729 1163844 1072423 1330033 1615469 1364056
6785 1364056 1172130 1011304 960327 886208 621477 582577 724275 731231 868214 924857 738542
6774 738542 795484 953249 901310 403352 611347 591569 481013 509402 322524 321879 447811
6763D47811K17614J82204o0676M6704n7702k88399J0783L9867j6310K21998J95048
6752I38942R0850j34789p7699P2767K92925J53257J43503j91966j83913j2124
6742A091753l35894l81352J95835Q7112R2989q2031j91187P9644R5147O370N1114
6731G09500j81297r7713K8621o5821L2378J81641M5822j36614r0700K65101L3865
6720G24783J03336k00988j00791R3366J56486K01732J72003M9116l61928j82170
6710F54945K1889J02855o8042K02908L2670J80925p6333o924N5467O4288R0082
6699A254730q0141j14604j87954n6420J22970k1464J38571m72811K62490J94597
6689A039964k48126j33628l2101L90305m8475r9584j93388j502K67149l7429j30776
$$ plain form
6763 447811 665425 847629 786953 833657 775955 487556 498339 538206 521896 743894 938942
6752 938942 1029792 895003 817304 890071 1182996 1336253 1479756 1287790 1103877 1091753
6742 1091753 755859 374507 570342 657454 750443 668412 477225 556869 652016 658386 709500
6731 709500 528203 430490 459111 393290 425668 607309 653131 516517 425817 690918 724783
6720 724783 828119 627131 526340 619706 776192 977924 1149927 1199043 837115 654945
6710 654945 676834 779689 711647 914555 947225 1128150 1051817 1044893 1100360 1164648 1254730
6699 1254730 1174589 1059985 872031 815611 938581 917117 1055688 582877 845367 1039964
6689 1039964 791838 658210 626109 1016414 967939 868355 674967 673465 940614 903185 772409
6678G72409J98350j41992r3003L8380N8674J45735r623K30628L6815P4673j90920
6667A120126Q7528k46066j77382O0058M4672N4321J58243n7512K1324R5891j22140
6656A039063j59795Q89n8724J30169m7961j01821M3163n0720j12622K165Q4827
6645G68633Q7791j69641J32146P6920k9755O318j89348J6201j83912j02679J37758
6634E50432j22403J2106N4217j6026M2893J11513J23702k21225L3303J00979Q2554
6623G52045o6840j78978j4746M6954l2574J37507M5302N3869K845k3925j01478
6612F19981Q270j08670O310q583j07117K37580j06486L3785L4944m2671J90510
6601G57853m4188j18569O6171J28917j66940K95275j11679J27724L526J77232
$$ plain form
6678 772409 970759 828767 735764 774144 832818 978553 968930 1199558 1236373 1311046 1120126
6667 1120126 1207654 961588 784206 844264 888936 943257 1101500 1043988 1065312 1161203 1039063
6656 1039063 879268 880157 821433 951602 903641 801820 844983 794263 681641 683806 768633
6645 768633 856424 686783 818929 895849 866094 872412 683064 699265 515353 412674 550432
6634 550432 428029 440135 494352 478326 521219 632732 756434 535209 568512 669491 752045
6623 752045 685205 506227 491481 538435 505861 643368 688670 742539 745384 721459 619981
6612 619981 628251 519581 525891 517308 410191 647771 541285 575070 610014 567343 757853
6601 757853 713665 595096 661267 790184 623244 918519 806840 934564 938090 1115322
6591A115322L5059j22427J45841n4701J18608K32449l1232J1253j24078M02976
6581A729070k65217j16989K08390J7777K53937J11246j7897j19506J26264Q9992
6571B017067L979l7220P7531j20015K34372R1398r6232J29060J89438J29927J33520
6560B752825P7671J86256N7020K1851K27329K55461J89100J18266M76461L60276
6550D722516L23370N75689M20049N06450P09674N40231N27925M83704K51243J86866
6540I247717J76211J63880J709k19421m71111m59464l96841j69851j65545J0941
6530G718225J2664l3328J3089L05030M70498M07254O68272P78554N14647P94617
6520A1649522R52431N12263M47528N0599n2571Q7099k44353m96326l62352q28752
$$ plain form
6591 1115322 1150381 1027954 1173795 1119094 1237702 1470151 1438919 1450172 1326094 1729070
6581 1729070 1463853 1346864 1555254 1573031 1826968 1938214 1920317 1800811 1927075 2017067
6571 2017067 2021046 1983826 2061357 1941342 2175714 2267112 2170880 2299940 2489378 2619305 2752825
6560 2752825 2830496 3016752 3073772 3095623 3322952 3578413 3767513 3885779 4362240 4722516
6550 4722516 5045886 5621575 6041624 6548074 7257748 7797979 8325904 8809608 9060851 9247717
6540 9247717 9423928 9587808 9589517 9370096 8898985 8439521 8042680 7872829 7707284 7718225
6530 7718225 7730889 7697561 7710650 8015680 8486178 8893432 9561704 10340258 10854905 11649522
6520 11649522 12601953 13114216 13561744 13612343 13559772 13646871 13402518 12906192 12543840 11715088
6510A1715088m71365n23747p55483m36012k45242l79010l62110k31438o23078
6501G687603m26689k11856j60462m06118m79709k63744N0445k81384p6873j31776
6491E299437l96268k33729r0398l74528j94522m8065k83044l26696j6872P4854
6481C410169q5466l24095l28940l79327O3238O9104p9704R095j93410j97927l0352
6470A932385n2175R2742n2162n7616J52658k23778p2668j29912j65781j01474
6460A322219L1925j41842J37334j79035n3304l1426R5209J74025q7539O1631j1776
6449A317421j7046j73490O3703n2291o5420M9781q8953J09347R4631m0681j8598
6438A178404M2335K8857N799j1618P1659o902q8312j06498M0194K37783K43293
$$ plain form
6510 11715088 11243723 10719976 9964493 9528481 9283239 8904229 8542119 8310681 7687603
6501 7687603 7260914 7049058 6888596 6482478 6002769 5739025 5789470 5508086 5431213 5299437
6491 5299437 4903169 4669440 4579042 4204514 4009992 3961927 3678883 3352187 3335315 3410169
6481 3410169 3324703 3000608 2671668 2292341 2355579 2424683 2344979 2354074 2160664 1962737 1932385
6470 1932385 1880210 1972952 1920790 1863174 2015832 1792054 1719386 1589474 1423693 1322219
6460 1322219 1354144 1212302 1349636 1170601 1117297 1085871 1181080 1355105 1267566 1329197 1317421
6449 1317421 1300375 1126885 1190588 1138297 1072877 1122658 1033705 1143052 1237683 1197002 1178404
6438 1178404 1220739 1249596 1255395 1243777 1315436 1308534 1220222 1113724 1153918 1391701 1634994
6427A634994R5697k1216o6741M00916J88548r8933K30084M0285L17278K83700
6417C004612J73589K75529M4457J34733N66575O25442P19641M99271N83453N65496
6407G192798J82711j14883K46914J28715j67399n31006o03357o19717q68188n57199
6397D289389l85922m32785j52449m68659n50590k14947J92390j6753l33994j25581
6387A800099r3781l1737k0269K380k28182L1560j40423j73857q6054j23608J26950
6376A063078m2482J36995k09481p8255O0666j35803J14208j91827J4023q5877
6366F45245N3129N5205M955q5044j16862j84507q5929Q8322q0159K398Q6153K32585
6354F15491O112j06323q6304k84786R1078l04L38718j58755k31156P1365P1085
$$ plain form
6427 1634994 1730691 1709475 1642734 2043650 2232198 2133265 2363349 2403634 2720912 3004612
6417 3004612 3178201 3453730 3498187 3632920 4199495 4824937 5544578 6043849 6627302 7192798
6407 7192798 7375509 7260626 7507540 7636255 7468856 6937850 6334493 5714776 4846588 4289389
6397 4289389 3903467 3470682 3318233 2849574 2298984 2084037 2276427 2259674 1925680 1800099
6387 1800099 1706318 1674581 1654312 1656692 1428510 1460070 1319647 1145790 1059736 936128 1063078
6376 1063078 1020596 1157591 948110 869855 930521 794718 908926 717099 731122 645245
6366 645245 698374 753579 758534 673490 556628 372121 286192 374514 294355 296753 382906 615491
6354 615491 621603 515280 428976 144190 235268 234964 573682 414927 183771 255136 326221
6343C26221K65454l21312J46763k0972k91243J27843R2423J21097j95010j11350
6333A39914O7628j20308K25825L1043k53950m5138P6306j37340J20375K17605
6323C21960j36320J75444K618O9620N5997k91413j6506J20935L2253o9265k70126
6312d803K32068k081R5623L1335j03409q9339r2362K31465n0480p4787R3258L4788
6300C01276o0322k49936m2626J52395o1163n6200k3042J32735J03705J99138j86551
6289B09409l02534K6411K45780Q8393n9971j14977r6547j14993J01651l6816k04442
6278b58636R1899r0669K58713o232j34418J29163J2021j0144q1212J16788J22008
6267A49281R0493n3021m2716j423q1080j7951P9351J43460r1198j50243J04933
$$ plain form
6343 326221 591675 270363 417126 396154 104911 232754 325177 446274 251264 139914
6333 139914 207542 87234 313059 344102 90152 45014 121320 -16020 104355 321960
6323 321960 185640 361084 363702 433322 489319 197906 181400 302335 334588 265323 -4803
6312 -4803 227265 225184 320807 352142 248733 159394 67032 298497 248017 173230 266488 301276
6300 301276 240954 -8982 -51608 100787 39624 -16576 -39618 93117 196822 395960 209409
6289 209409 -93125 -66714 179066 267459 207488 92511 -4036 -119029 -17378 -54194 -258636
6278 -258636 -166737 -257406 1307 -4925 -139343 -10180 1841 -8303 -89515 27273 149281
6267 149281 239774 186753 144037 142614 61534 43583 122934 266394 175196 24953 129886
6256A29886o9380M8982j54219J1092j36952m7783M150j01945K70985j51739J8285
6245a78638J47199j763r8344J60664n2596r1778J32227J69473n7942o3719K5856
6234I0639j12192l9732J7001J90257J9843R4231j77150l33636Q5777q3355K01722
6223d6595J96363j43092K2125J16249R6160r3475L1360n8850j09378J01780Q828
6212A21475q7527j32377r1377J53586J33953j15438k8077n001P6364L4094j41628
6201h1953k1322O0276J24592J39309p3132j91303j29842J44390K0368j16050j3424
6190a38091Q5196K46679j08889l8496P8798L861n4044J49117m04635J18484L54537
6179B92517k36431J90328j64924m3038J16003l4714J4295j8387j68589o7353K0997
$$ plain form
6256 129886 60506 109488 -44731 -33639 -170591 -218374 -214224 -316169 -45184 -196923 -178638
6245 -178638 -31439 -33202 -131546 29118 -23478 -115256 16971 186444 128502 64783 90639
6234 90639 -21553 -61285 -44284 145973 165816 260047 82897 -250739 -164962 -248317 -46595
6223 -46595 149768 6676 28801 145050 241210 147735 179095 120245 10867 112647 121475
6212 121475 33948 -98429 -189806 -36220 97733 -17705 -45782 -50783 25581 59675 -81953
6201 -81953 -103275 -42999 81593 220902 147770 -43533 -173375 -28985 -8617 -124667 -138091
6190 -138091 -52895 193784 84895 46399 125197 129058 75014 224131 -180504 -62020 292517
6179 292517 56086 246414 81490 38452 154455 119741 134036 115649 -52940 -120293 -99296
6168i9296P556o4771j26931R9036J53045M9401j25448j4661K57949L15471m09358
6157D1993M1246K5428k05059m3848L27211o4670j15733J6717q4590l6319J50588
6146E2964J54065j08174j5639j10111J40456k3921l8017j93009J18701K6151k06323
6135b02857J37184o39K08974k3673k9495J82700l6341k18001k79058j8567K37951
6124d1822m842k5702O0830J80707k11747M5742J08303q1836k10390N1698M48925
6113C19866J4169k77441j47455m2617J74795P1091q0628K7491j11127J06557j17046
6102f2345J53465q1755J98103k53196k0455j12173M6808J74895j34571J44792
6092E3568O1335j02662J66097l4896O8218j0138j30991J3748j62867m2876J16861
$$ plain form
6168 -99296 -91740 -156511 -283442 -184406 -31361 18040 -107408 -122069 135880 451351 41993
6157 41993 83239 108667 -96392 -140240 186971 122301 6568 23285 -61305 -97624 52964
6146 52964 207029 98855 83216 -26895 113561 89640 51623 -141386 -22685 3466 -202857
6135 -202857 -65673 -66312 142662 118989 89494 272194 235853 17852 -261206 -279773 -41822
6124 -41822 -46664 -72366 -11536 169171 -42576 3166 111469 29633 -180757 -129059 319866
6113 319866 334035 56594 -90861 -133478 41317 112408 31780 59271 -51856 54701 -62345
6102 -62345 91120 9365 207468 -45728 -66183 -178356 -131548 43347 -91224 53568
6092 53568 114903 12241 178338 143442 211660 201522 70531 84279 -78588 -121464 -4603
6081d603K08357J0441l42739J63464Q0455J41106j80108k6364J55490j45557J29570
6070A89512L1733j29463l3402k3489R6340k47446J88726m0065J22561J44551l14316
6059a4758l9144L1036k0528j68336L03692J45785R7223o7486J78106j02176K3790
6048C67204j65689k74847K67473R7029j05549o2952r5565K07235J44513k61134
6038A17718P8035J74014r1640r2974J30761p4039j30033J79355l48011P679K04467
6027A55332q7776J01770Q4150j39770k93024N7660Q2418j71656L21971J53767
6017B64842r4137k60378N518K03782j48992l5167N5007j26711J91142n5793J07411
6006A06524l4275O7831j03960j74268J35117j8626O5918q170p4226m0265r9292
$$ plain form
6081 -4603 203754 214195 -128544 34920 115375 256481 76373 50009 205499 59942 189512
6070 189512 221245 91782 58380 34891 131231 -116215 72511 32446 155007 299558 -14758
6059 -14758 -53902 -22866 -43394 -211730 91962 237747 334970 267484 445590 343414 367204
6048 367204 201515 -73332 194141 291170 185621 122669 27104 234339 378852 117718
6038 117718 195753 369767 278127 185153 315914 241875 111842 291197 -56814 -49135 155332
6027 155332 67556 169326 253476 113706 -179318 -121658 -39240 -210896 111075 264842
6017 264842 170705 -89673 -84155 119627 -29365 -64532 -9525 -136236 54906 -887 106524
6006 106524 72249 140080 36120 -138148 -3031 -21657 44261 36091 -38135 -78400 -177692
5995a77692o3220K67844q938r0821J03910L9384J22061o1938J81607k0216r4424
5984A97557l2528K29740j16968o1365J52375k15711R2962r2576J15912j00187
5974A69211l37007N8617R362m584J82513l4883K50027n1167j88248O8167j34508
5963a2500j86938L44770m1023j2952j29823r3463K12646j72585J97332J35325
5953B40789k96751Q7597O430Q2712J09216L8892l1002j19703n2860J0189J86168
5942B61677N0085k66609J774j51075J54531M3802k07095J05215l8190K09602K4504
5931A88221m5460j0975o5614J14168R5818o3422m1507r4088p6129Q3485K2628
5920A07125j77046J36898J21625J36759k62911K41869K9261Q7956k66165r4070
$$ plain form
5995 -177692 -240912 26932 17994 -72827 31083 70467 192528 130590 312197 291981 197557
5984 197557 165029 394769 277801 216436 368811 153100 246062 153486 269398 169211
5974 169211 -167796 -109179 -99817 -104401 78112 43229 293256 242089 53841 122008 -12500
5963 -12500 -199438 145332 104309 91357 -38466 -131929 80717 -91868 105464 240789
5953 240789 -55962 31635 38065 120777 229993 268885 237883 118180 65320 75509 261677
5942 261677 311762 45153 46927 -104148 50383 94185 -112910 -7695 -45885 163717 188221
5931 188221 142761 131786 66172 180340 276158 212736 171229 77141 1012 84497 107125
5920 107125 -69921 66977 188602 325361 62450 304319 333580 421536 155371 61301
5910F1301l32700K96328K91499R1411l5491k45077j9752Q8869n1265k95756R5597
5899e5036j28347J19068K51766l6598k23879J06263O8105l6763q096k19501p0063
5888b33081K45255j21092j32517K22125L6948k95502K19944K41925P3444Q5048
5878C42497j49064k46441J82279j09650j0953J27444J16059J14308R8480j54141
5868C10818j36426m0929O969n7065P7022L4904J31918J1297j00038P4494Q9022
5857D01986j09794p746J52429p3259q6914q1976j37838J38890p1137j47709q1947
5846a05015J54886J68990k67784j68115J85639J71628J25792k32679l109J41723
5836A71956n7038M1203K3983M0275j12481n8661L1987l6073J64024k84020Q2014
$$ plain form
5910 61301 -271399 24929 316428 407839 372348 127271 107519 196388 145123 -150633 -55036
5899 -55036 -183383 -64315 187451 150853 -73026 33237 101342 64579 56483 -163018 -233081
5888 -233081 12174 -108918 -241435 -19310 17638 -277864 -57920 184005 257449 342497
5878 342497 193433 -53008 129271 19621 8668 136112 252171 366479 464959 310818
5868 310818 174392 133463 140432 83367 160389 195293 327211 338508 238470 312964 401986
5857 401986 292192 284446 436875 363616 276702 194726 56888 195778 124641 -23068 -105015
5846 -105015 49871 218861 -48923 -217038 -31399 140229 266021 33342 30233 171956
5836 171956 114918 156121 180104 220379 107898 49237 81224 45151 209175 -74845 7169
5825G169L2997l8501L6970n1931J57409O9213L653K4207Q7023o2500K0580L3925
5813C20214k47329j6571O0244k5086p8302K69444o3600l3835m3681r1392O8810
5802A18916m6420k9574J3612M4915J27577J32198m0420r4564m8779m6375p887
5791A23199R7647J53812O5256j47086q8592j2968R5804j34892Q5522l5882P6055
5780B77875k39097j81545n7421K65105O6547M4519L7187J82829l13134m1765j11100
5769g0000r1081K09440J85092Q1084O6701k5344k03277j68402r3046k896J88140
5758G6411l5176J81747L3899k18275j59060q7769K87278L99216j25841j4929j32529
5747B04972p1878J16110j21253m0544M8041J29402n3847K3295k4705k62089M3236
$$ plain form
5825 7169 40166 1665 38635 -13296 144113 213326 216979 241186 328209 265709 286289 320214
5813 320214 72885 56314 116558 91472 13170 282614 219014 185179 141498 50106 118916
5802 118916 72496 42922 56534 101449 229026 361224 320804 226240 177461 131086 123199
5791 123199 220846 374658 439914 292828 204236 191268 287072 152180 237702 201820 277875
5780 277875 38778 -142767 -200188 64917 131464 175983 213170 395999 82865 41100 -70000
5769 -70000 -161081 48359 233451 314535 381236 355892 152615 -15787 -108833 -111729 76411
5758 76411 41235 222982 256881 38606 -120454 -208223 79055 478271 352430 337501 204972
5747 204972 133094 249204 127951 87407 135448 264850 211003 234298 209593 -52496 -9260
5736i260K59138m198j03863J64294O5737m59203N6883L8718p543O50J36930K37518
5724C75801k528L6992j87768k11165m7943J07602J52465j37654J5551K0582J51488
5713B73423P6348j53319l8631Q3924j30094j33047J51044K34850j72866J4959
5703B06591L2729j36380k6609M24909j09446k50178K51931M0551k5837j95780
5693B12481l1421J1593j02542K40853O4854k06396K9133k5028J42011r4394l6289
5682B04855j70308K9172J61086o9792o9925k04710J78865K68156k92389M9360
5672H4370K3532k4942O7274n7508J60747J56694j4798j6580j66418J8548q0542
5661A50377l664J64810J46627j82829j89156r3747o691J89138K811q2452l2201
$$ plain form
5736 -9260 249878 245680 141817 306111 371848 -87355 -30472 8246 703 1353 138283 375801
5724 375801 373273 410265 222497 11332 -36611 70991 223456 85802 101353 121935 273423
5713 273423 349771 196452 157821 241745 111651 -21396 129648 364498 191632 206591
5703 206591 239320 102940 76331 501240 391794 141616 393547 434098 408261 212481
5693 212481 181060 192653 90111 330964 395818 189422 218555 193527 335538 241144 204855
5682 204855 34547 63719 224805 155013 85088 -119622 59243 327399 35010 84370
5672 84370 107902 82960 150234 92726 253473 410167 395369 378789 212371 230919 150377
5661 150377 146713 311523 458150 275321 86165 -7582 -14273 174865 177676 95224 63023
5650F3023K30128j02856k1682J19283p8305K51974P8591k49733N286k5869q8040
5639A81800J32697J5497o2449p3788m5012L8518j15733J89548M6707J55182j24262
5628C38705o9120k37812K06563R2687J205j54188J05425r6913Q1047Q9119M0753
5617C97471J12598l27982n8296K45229k18108J58964K5851p2663J04450L8313
5607D05827n0368j23865j52477K1550K40923P5989j38523m6377j23339M0726J19694
5596B69760J0100K17996N5690J45590j79228j04545K6799j444J6429J64522q1949
5585E39720j7290p6041J81308K23949k10935M791k56655K39526m2078l87173J29460
5574C28582J15192j38701K48794j4737j58258M6213j74438K31246J00830j42962
$$ plain form
5650 63023 293151 190295 168613 287896 209591 461565 540156 290423 295709 269840 181800
5639 181800 314497 329994 267545 193757 148745 187263 71530 261078 307785 462967 338705
5628 338705 269585 31773 238336 331023 332228 178040 283465 186552 267599 356718 397471
5617 397471 510069 182087 123791 369020 150912 309876 335727 263064 367514 405827
5607 405827 355459 231594 79117 100667 341590 417579 279056 232679 109340 150066 269760
5596 269760 279860 497856 553546 699136 519908 415363 442162 440718 457147 621669 539720
5585 539720 522430 446389 627697 851646 640711 645502 388847 628373 586295 199122 328582
5574 328582 443774 305073 553867 539130 380872 427085 252647 483893 584723 441761
5564D41761K127J77884m6708k57047R1349J93803k36594L87721Q8592P0541Q5657
5553I99086K3100K24505R6520j45248j15636k05251J35581k0546J70601k35182
5543I27530R0615J04738k88198K24933k4097j25478K11301k7239k44596j80386
5533F69123K18822K53622J20824J6343J32346q1734O2181J99695j01720J71200
5523A660702L22120K84114J16166l0596j67735j83210l34471j92829L8642l4623
5513A478280k23070j60559J79609r8004l2531r7260p9246K23253K11020K7010
5503A428502j74748L21107M7736j76886K51214K28786J0849j03067K28253J90466
5493B252212J55435L56690J5792k57870j36892l26122o7179m4118n6453k08780
$$ plain form
5564 441761 443888 621772 575064 318017 409366 603169 366575 754296 842888 913429 999086
5553 999086 1022186 1246691 1343211 1197963 1082327 877076 1012657 992111 1162712 927530
5543 927530 1018145 1122883 834685 1059618 1035521 910043 1121344 1094105 849509 669123
5533 669123 887945 1141567 1262391 1278734 1411080 1329346 1391527 1591222 1489502 1660702
5523 1660702 1982822 2266936 2383102 2352506 2184771 2001561 1667090 1474261 1512903 1478280
5513 1478280 1255210 1094651 1274260 1176256 1143725 1046465 967219 1190472 1401492 1428502
5503 1428502 1253754 1574861 1622597 1445711 1696925 1925711 1936560 1833493 2061746 2252212
5493 2252212 2407647 2764337 2780129 2522259 2385367 2059245 1992066 1947948 1891495 1682715
5483A682715o5619k9454o5313P0000J16365J13780j28275M5108p2930K75868j09714
5472A832531j59594J65528Q5212O4822R2716J03549k13823K09584J35195r7992
5462B217728j6032J97433l7817m9964o9227O7543J9231N6172Q5198p7851J94737
5451B587151K64584j8300J8040o3776L7194P4826m8687j0627l2040J39493j45496
5440B802362J38269q4223m0798J7150j17780j12413J6767j37826J94439J98392
5430B874339Q4137Q7627K99719j92039M04376J46354j09425K28647L43235r2352
5420D074618L28618q9147K5459K56320k13967L57537K86158N2341N3285J76291
5410E307513l96493k33500j86303k86215j65260j09167k45008J35121n6901j1766
$$ plain form
5483 1682715 1617096 1587642 1522329 1592329 1708694 1822474 1694199 1739307 1666377 1942245 1832531
5472 1832531 1672937 1838465 1923677 1988499 2081215 2184764 1970941 2180525 2315720 2217728
5462 2217728 2201696 2399129 2361312 2311348 2242121 2309664 2328895 2385067 2470265 2392414 2587151
5451 2587151 2851735 2833435 2851475 2787699 2824893 2899719 2851032 2840405 2808365 2947858 2802362
5440 2802362 2940631 2856408 2815610 2832760 2714980 2602567 2619334 2481508 2675947 2874339
5430 2874339 2958476 3046103 3345822 3153783 3558159 3704513 3595088 3823735 4166970 4074618
5420 4074618 4403236 4314089 4339548 4595868 4381901 4739438 5025596 5077937 5131222 5307513
5410 5307513 4911020 4677520 4491217 4205002 4039742 3930575 3685567 3820688 3763787 3752021
5400C752021L8291q8851M3426j00159L96016J16295j25889M2640L25674R2916
5390D492380L13147J24804L4039J80174L3819J47053J1739j16775j57612j70502
5380D892266m56900l39971N3930j58898m08321l36146j00507j10412M0864J40011
5370C215916P1195j95033r9924k2921L5859m2379J96085J05354j0928N2571K58864
5359C564659J17207j56729k68009L5709R6627j32973l15546p0260o2630J3766
5349B821821o707j48939j80959K0780o5343l64781j09521l4151k1795r7351J59652
5338A972706j47000L6658l2260L2287j24648K07004J22124J14780r7906n8836
5328B024909R8505l01569q0677j04540j37131J60412J32075Q8678j17458M7982
$$ plain form
5400 3752021 3790312 3701461 3744887 3644728 4040744 4157039 4031150 4073790 4399464 4492380
5390 4492380 4805527 4930331 4964370 5144544 5178363 5325416 5337155 5220380 5062768 4892266
5380 4892266 4435366 4095395 4149325 3990427 3582106 3245960 3145453 3035041 3075905 3215916
5370 3215916 3287111 3092078 2992154 2969233 3005092 2962713 3158798 3264152 3253224 3305795 3564659
5359 3564659 3681866 3525137 3257128 3292837 3389464 3256491 2940945 2870685 2808055 2821821
5349 2821821 2815114 2666175 2485216 2505996 2440653 2075872 1966351 1932200 1910405 1813054 1972706
5338 1972706 1825706 1862364 1830104 1862391 1737743 1944747 2066871 2181651 2083745 2024909
5328 2024909 2123414 1821845 1741168 1636628 1499497 1659909 1791984 1880662 1763204 1811186
5318A811186k13508l9328K9100o5703k90194K36537L32292m6024k85698J27770
5308A596430r1345K5908J87535J74872l72431K09193j2003j06142l8668K82152
5298A855501n4065o7909J17438q6186L9810J5223N6169L1875J80625l01617j30023
5287A656841K39424o8934K72316q5359j00518k3395N0791K66039Q5986J68056
5277B461247q9488k3463p6661Q860r1231J46288j51540n9614j5664J20149J9794
5266B248677m7596N0431M9836p374K77742N4604r9583J07219j10351N2230P3470
5255B649305N3771L5027r6344K5619K07699K47020R3099J22280J97824n2745j16460
5244C366095K81895K27115J40573J64513o4989M4468M64393K08654K41223J82473
$$ plain form
5318 1811186 1597678 1558350 1587450 1521747 1231553 1468090 1800382 1754358 1468660 1596430
5308 1596430 1505085 1530993 1718528 1893400 1520969 1730162 1718159 1612017 1573349 1855501
5298 1855501 1801436 1733527 1850965 1764779 1804589 1819812 1875981 1907856 2088481 1786864 1656841
5287 1656841 1896265 1827331 2099647 2014288 1913770 1890375 1941166 2207205 2293191 2461247
5277 2461247 2371759 2348296 2271635 2280495 2189264 2335552 2184012 2124398 2108734 2228883 2248677
5266 2248677 2201081 2251512 2301348 2293974 2571716 2626320 2526737 2633956 2523605 2575835 2649305
5255 2649305 2703076 2738103 2641759 2667378 2875077 3122097 3215196 3337476 3535300 3482555 3366095
5244 3366095 3647990 3875105 4015678 4180191 4115202 4159670 4624063 4832717 5073940 5256413
5234E256413K47685L75837N76660J59847N07942L18087L95592j9433k73506j87498
5224G357626l61012l99879j42515n4146k23020q8488k04889j19291j45568L26943
5214E945761K24235K68004M12226k9090K61317J78906N89423N84817L85805O73996
5204I495400L83808P16358O33795M53716N61169J26682j24589k86608o21235j100874
5194A0237622o68479o95576n60080m39633l56588j75343j81778k63601k96924
5185F599620k59886K24332j55822j33701L74336J01453J80349K93977J80435P470
5175G412563L85038L60571L54602M98136J8264J91283j99883n75286n57195o82872
5165G205221l48191m04095l47472l21008j64484m55553j40180r9031r3839k22637
$$ plain form
5234 5256413 5504098 5879935 6456595 6616442 7124384 7442471 7838063 7818630 7545124 7357626
5224 7357626 6996614 6596735 6454220 6400074 6177054 6088566 5883677 5764386 5618818 5945761
5214 5945761 6169996 6438000 6850226 6821136 7082453 7261359 7850782 8435599 8821404 9495400
5204 9495400 9879208 10595566 11229361 11683077 12244246 12370928 12246339 11959731 11338496 10237622
5194 10237622 9569143 8873567 8313487 7873854 7517266 7341923 7160145 6896544 6599620
5185 6599620 6339734 6564066 6408244 6274543 6648879 6750332 6930681 7224658 7405093 7412563
5175 7412563 7797601 8158172 8512774 9010910 9029174 9220457 9020574 8445288 7888093 7205221
5165 7205221 6857030 6452935 6105463 5784455 5619971 5164418 5024238 4925207 4831368 4608731
5155D608731k12462K73644p7895r2665l89875j71391o1939J18481l5603J17301
5145D076327J3867j92858j6740r0557R5154p4048j54408J71713n2789k79565K20370
5134C716466j84255K8398K92128N2010j78354l56088K24816K20499m0821m0169
5124C734630Q4314K3290j91885l1068J74621J4213k39027J39440j31002o0775
5114C516751J24268K3544j07865J17911j56206L91143J11246K844r3298j65246
5104C765092J46396L30275L11747K420J94458K79162K84119M02638q2850M82244
5094F115701J68151L83636J62816J8556k45155l90813k2166l70547R8795j14305
5084E804669l89011K083l2319m1573q5601R5557K38263R6833O1585J50786L08892
$$ plain form
5155 4608731 4396269 4669913 4592018 4499353 4109478 3938087 3876148 3994629 3959026 4076327
5145 4076327 4090194 3897336 3880596 3790039 3885193 3811145 3656737 3828450 3775661 3496096 3716466
5134 3716466 3532211 3560609 3852737 3904747 3726393 3370305 3595121 3815620 3774799 3734630
5124 3734630 3818944 3842234 3650349 3619281 3793902 3808115 3569088 3708528 3577526 3516751
5114 3516751 3641019 3664563 3556698 3674609 3518403 3909546 4020792 4023636 3930338 3765092
5104 3765092 3911488 4241763 4553510 4555930 4750388 5029550 5313669 5716307 5633457 6115701
5094 6115701 6283852 6667488 6830304 6848860 6603705 6212892 6190726 5820179 5918974 5804669
5084 5804669 5415658 5417741 5385422 5343849 5258248 5353805 5592068 5688901 5750486 5901272 6210164
5073F210164K78440J08861L24153N85069J10596N57097M80096N19270O07957K0040
5063I801743k7663l53859m62215m82497m67596m94988o17229m87407n4188j32847
5053F221254k37309k67767q2224j79223j76998M806P7692J66067N1772j43711
5043E434359p1664J55683k9072K81379K34561K49708N40195J64715k68979N8199
5033F749084m89829m21484l20031j67182m73036k98955j21624j88695l30364J6646
5023C954530j85880k19473q7552j91065k77007J21644k8404m2054M928n8571l6811
5012B954285k62305r1698r6842Q8972m3183j52858L1436J518k66958l9375K6328
5001B149320L63591n5018k28824J31746p8025L5275p9571J21682N2163l23599
$$ plain form
5073 6210164 6488604 6597465 6921618 7506687 7617283 8174380 8654476 9173746 9781703 9801743
5063 9801743 9774080 9420221 8958006 8475509 8007913 7512925 6895696 6408289 6354101 6221254
5053 6221254 5983945 5716178 5633954 5454731 5277733 5282539 5360231 5526298 5578070 5434359
5043 5434359 5362695 5518378 5489306 5770685 6005246 6254954 6795149 6959864 6690885 6749084
5033 6749084 6259255 5837771 5517740 5350558 4877522 4578567 4456943 4268248 3937884 3954530
5023 3954530 3768650 3549177 3461625 3270560 2993553 3115197 3086793 3044739 3049667 2991096 2954285
5012 2954285 2691980 2600282 2503440 2592412 2549229 2396371 2427807 2429325 2162367 2122992 2149320
5001 2149320 2512911 2457893 2229069 2360815 2282790 2318065 2238494 2360176 2412339 2088740
4991B088740Q5398K03912j85873j80297N072j64114L8293J23642j45653j48009
4981A721111K2736N133q8359j67404J72198K64850o4720j56126m2297J81902j48967
4970A700057n0493p7563J01850L2868l19031j3253J66750L389L1762l9556O2678
4959A599458k8238R874j33710J63131R1453Q9707M3139k83647r5529R8266M1751
4948A595655l6975P1315J15n303j4715L86978l31827q5253r3676j00468P3142
4937A458988j29520L38268j5014N6774P2189J22835q8525j50756K29238j00042
4927A794435R3123O0409J72962K3261r4887r9120j2129J15048j62155Q2985J36116
4916B110048J61051J31093j39589j52939m0314M3500N1658r7350q2839M5937K40382
$$ plain form
4991 2088740 2174138 2378050 2192177 2011880 2016952 1852838 1891131 2014773 1869120 1721111
4981 1721111 1743847 1748980 1660621 1493217 1665415 1930265 1865545 1709419 1667122 1849024 1700057
4970 1700057 1649564 1572001 1673851 1706719 1387688 1374435 1541185 1544574 1576336 1536780 1599458
4959 1599458 1571220 1581094 1447384 1610515 1701968 1791675 1834814 1551167 1455638 1553904 1595655
4948 1595655 1558680 1629995 1630110 1624807 1610092 1997070 1665243 1579990 1486314 1385846 1458988
4937 1458988 1329468 1667736 1652722 1709496 1781685 1904520 1815995 1665239 1894477 1794435
4927 1794435 1887558 1947967 2120929 2144190 2049303 1950183 1938054 2053102 1890947 1973932 2110048
4916 2110048 2271099 2402192 2262603 2109664 2069350 2112850 2164508 2067158 1984319 2030256 2270638
4905B270638L1439j9334M7530l7949L7177J53948M0761j8072J94707J58337j31309
4894B727873K01166O3147K52076p0170l3286j97855Q0657L70900m0690J89243
4884C543061j4665M8442J73222K60541J6254M9898j8953K42576L38970L12132
4874D951478L56831N07543K77729L09380K95822M45855O87117Q46184P85761R06068
4864A0369768J013325J255696J177012J511816J665289J391895O80330L72119
4856A9437250l16138p10692j261605j604923j628802j756342j319085j322605
4848I517058j212135p85497n21520m51299p73389k23901O5630l12785j94965j02938
4838E004259j27383j60824q1931n6679j69590M3640j23997j57576j04930k61116
$$ plain form
4905 2270638 2302077 2282743 2330273 2292324 2329501 2483449 2524210 2506138 2700845 2859182 2727873
4894 2727873 2929039 2992186 3244262 3174092 3140806 2942951 3023608 3394508 3353818 3543061
4884 3543061 3528396 3576838 3750060 4010601 4026855 4076753 4057800 4300376 4639346 4951478
4874 4951478 5308309 5815852 6093581 6402961 6698783 7144638 7831755 8677939 9463700 10369768
4864 10369768 11383093 12638789 13815801 15327617 16992906 18384801 19065131 19437250
4856 19437250 19121112 18410420 17148815 15543892 13915090 12158748 10839663 9517058
4848 9517058 8304923 7519426 6997906 6546607 5773218 5549317 5614947 5302162 5107197 5004259
4838 5004259 4876876 4716052 4634121 4577442 4407852 4451492 4327495 4169919 4064989 3803873
4828C803873L7223K19760k59754k26489q653q5250j93726J8232O5912M0704j37535
4817C274297Q2444J08120j89461j61191j41069J65536Q1203q3214k9840L17501
4807C424326J7507k7573k76910J15607O0033j47758l1832k03320Q191M0418L6941
4796C015630K0590l88193K6748J55998j76082J59441J16195R7254j73317q9856
4786B764408K62631j77757Q1258j77286J47938j41697q7838J09481j5746o8508
4776B696884o574J73803O362k01765j4219K02516J61590j94816J4866n3430J5999
4765B801216j06106K0162O4712j52442k01241J63468J32529N3070J46158k00873
4755B720653N5776j88858j18934Q6870k10303J21793j3884J51194O9874q4903
$$ plain form
4828 3803873 3841096 4060856 3801102 3574613 3565960 3480710 3286984 3305216 3371128 3411832 3274297
4817 3274297 3356741 3464861 3275400 3114209 2973140 3138676 3219879 3136665 3106825 3424326
4807 3424326 3441833 3414260 3137350 3252957 3312990 3165232 3133400 2930080 2938271 2978689 3015630
4796 3015630 3036220 2648027 2674775 2830773 2654691 2814132 2930327 3027581 2854264 2764408
4786 2764408 3027039 2849282 2930540 2753254 2901192 2759495 2671657 2781138 2765392 2696884
4776 2696884 2690310 2864113 2870475 2668710 2654491 2857007 3018597 2823781 2838647 2785217 2801216
4765 2801216 2695110 2715272 2779984 2627542 2426301 2589769 2722298 2775368 2921526 2720653
4755 2720653 2776429 2587571 2468637 2555507 2345204 2466997 2453113 2604307 2674181 2589278
4745B589278P376j43479k15977Q8140L48327P6920P6765j60618j88825K1098n9143
4734B439862N6094J08238k25962K1772R9302P6421j56313n6044K20715J52921
4724B737006l27317n6933K40484k9489Q8973k52468R9911K33380j21779j59936
4714B451832l5956j22293J01223j1773p9419K75058j36291J88812p234n1501k6921
4703B545537J08700R1101K26957j42242j89145j51979j20907j75533J18696L44792
4693B655977j01800j30l7749j92277K42284J54183J53374Q0858k75698j02452
4683B576570l6973J69326O494K8255R4450j51450R6336O6154p3453N0661J31460
4672B957830Q559M6153r3335r5185k10401M7558j5685r4708p7553P0533J12847
$$ plain form
4745 2589278 2596654 2453175 2237198 2325338 2673665 2750585 2827350 2666732 2477907 2499005 2439862
4734 2439862 2495956 2604194 2378232 2400004 2499306 2575727 2419414 2363370 2584085 2737006
4724 2737006 2409689 2352756 2593240 2563751 2652724 2400256 2500167 2733547 2611768 2451832
4714 2451832 2415876 2293583 2394806 2383033 2303614 2578672 2442381 2631193 2623959 2572458 2545537
4703 2545537 2654237 2745338 2972295 2830053 2640908 2488929 2368022 2192489 2311185 2655977
4693 2655977 2554177 2554047 2516298 2324021 2566305 2720488 2873862 2954720 2679022 2576570
4683 2576570 2539597 2708923 2715417 2743672 2838122 2686672 2783008 2849162 2775709 2826370 2957830
4672 2957830 2966389 3012542 2919207 2824022 2613621 2661179 2645494 2550786 2473233 2543766 2656613
4661B656613j08034L2475j14812O564R899M3660J16178K37151R2712k10628r1699
4650B670079K543j8594j4011K59832L8268J26219j97245N5148Q8828p7748J87944
4639C121263r5743m4336k12495j40875K04238P5340N7147k69176q2469J83313
4629B796207R8959J18370j11743j03851j04343K50661m1414K35307P5052K08982
4619C422187p0243k95624P4930K25213j29970R7444Q3659m1662K05868j93186
4609C378616m9022L7692o7613K4977m5627j27802J37954j19479j59995J46436
4599C156137Q4669O2715q419J95074m5186j11481l43735K23540J47903j71011
4589C190206o8979J57187M0152L38438j58127n2689K24310J85918k8885r5687
$$ plain form
4661 2656613 2548579 2581054 2466242 2472806 2482705 2526365 2642543 2879694 2972406 2761778 2670079
4650 2670079 2672622 2654028 2640017 2899849 2938117 3064336 2867091 2922239 3011067 2933319 3121263
4639 3121263 3025520 2981184 2768689 2627814 2832052 2907392 2964539 2695363 2612894 2796207
4629 2796207 2895166 3013536 2901793 2797942 2693599 2944260 2902846 3138153 3213205 3422187
4619 3422187 3351944 3056320 3131250 3356463 3226493 3323937 3407596 3365934 3571802 3378616
4609 3378616 3329594 3367286 3299673 3324650 3279023 3151221 3289175 3169696 3009701 3156137
4599 3156137 3240806 3303521 3295102 3490176 3444990 3333509 2989774 3213314 3361217 3190206
4589 3190206 3121227 3278414 3318566 3657004 3498877 3446188 3670498 3856416 3827531 3731844
4579C731844J72091P4947J0405l4453k24439r5478K29156q5106R8040l1880m6988
4568C798139J52520J10895k20804N8353N995j1235N0241J98074k42453J39544
4558D039269J76488j08626j06651M19860M4609J78012m0093K98792k3885J12246
4548D990021L34405l8752L27845J3137J65065Q4635k43749L45968O805q9187k5041
4537E871152j42439o5633L3388K68260j85092O7296J90767L3423j7417k1952L0931
4526F062684K44859K48039K32232l7726K70470M76358L50396J76134K75038M57697
4516H756181J56693L64727K98450J41018J13677j24797j20590k36347l23293k57027
4506H768692J10006k30125m18238j09727P121K11655J47402n3467J88831r7776
$$ plain form
4579 3731844 3903935 3978882 3989287 3954834 3730395 3634917 3864073 3778967 3877007 3845127 3798139
4568 3798139 3950659 4061554 3840750 3899103 3905098 3893863 3944104 4142178 3899725 4039269
4558 4039269 4215757 4107131 4000480 4420340 4464949 4642961 4602868 4901660 4877775 4990021
4548 4990021 5324426 5285674 5613519 5626656 5791721 5876356 5632607 5978575 5985380 5896193 5871152
4537 5871152 5728713 5663080 5696468 5964728 5779636 5846932 6037699 6071122 6053705 6031753 6062684
4526 6062684 6307543 6555582 6787814 6750088 7020558 7496916 7847312 8023446 8298484 8756181
4516 8756181 8912874 9277601 9576051 9717069 9830746 9705949 9585359 9349012 9025719 8768692
4506 8768692 8878698 8648573 8230335 8120608 8127729 8339384 8486786 8433319 8622150 8524374
4496H524374J26919J52132K37525J51168K79795J20094J62789L80407M82942M24721
4486A1042866K96313J29995R1586L47870l8711K9233p9710j99097p3645l11299
4476A1235401N061k6803q3282k89317n6422M8296n6734J65827J64833L31875K38636
4465A1677371M48151L9991K9990L21129J52408L70274L79532N97719N81105K82482
4455A4880152O27662N35913M92424Q10877M99180K45486R65256Q58062J036449
4446B0951461J152241J103792J516784Q11451j16562k28699m96647l39267J23262
4437B4477816L98818P82475J007062J481077J783376J830279J865069J765828
4429C5391800J134146l47605o93561n5221N24503R91867O58622N50791K46497
$$ plain form
4496 8524374 8651293 8803425 9040950 9192118 9471913 9592007 9754796 10135203 10618145 11042866
4486 11042866 11339179 11469174 11560760 11908630 11869919 11899152 11819442 11620345 11546700 11235401
4476 11235401 11240462 11213659 11130377 10841060 10784638 10832934 10776200 10942027 11106860 11438735 11677371
4465 11677371 12125522 12165513 12195503 12516632 12669040 13039314 13418846 14016565 14597670 14880152
4455 14880152 15507814 16043727 16536151 17347028 17846208 18091694 19056950 19915012 20951461
4446 20951461 22103702 23207494 24724278 25535729 25419167 25190468 24693821 24354554 24477816
4437 24477816 24876634 25659109 26666171 28147248 29930624 31760903 33625972 35391800
4429 35391800 36525946 36178341 35484780 35429559 35954062 36945929 37604551 38155342 38401839
4420C8401839p25117k43506K00818M97629J056906J279720J582698J993480K758237
4411D6802704L056986L430315M223082N140640N999667P114434P386728O238566
4403H9393122L174997n52540o075692q874576q002453n623265l327640j936495
4395E8175458j040477j41138P32129J389267K103323L069156L651606M388186
4387G2327510N537622O490459P047824O503928M163581J266077L73235m80436
4379A03229800k128264n618201q183275q481072p269262n154116l524462k422244
4371F0448904j500855q28193k34249M19524J088505J674456K570275L006095L621190
4362G0265652M524279N508840O423628O736487N819894L827191Q12985j571282
$$ plain form
4420 38401839 37676722 37433216 37634034 38131663 39188569 40468289 42050987 44044467 46802704
4411 46802704 49859690 53290005 57513087 62653727 68653394 75767828 83154556 89393122
4403 89393122 92568119 92015579 85939887 77065311 69062858 63439593 60111953 58175458
4395 58175458 57134981 56993843 57725972 59115239 61218562 64287718 67939324 72327510
4387 72327510 77865132 84355591 91403415 97907343 102070924 103337001 103710236 103229800
4379 103229800 101101536 95483335 87300060 78818988 71549726 66395610 62871148 60448904
4371 60448904 58948049 58119856 57885607 58305131 59393636 61068092 63638367 66644462 70265652
4362 70265652 74789931 80298771 86722399 93458886 99278780 103105971 103918956 102347674
4354A02347674l241085l774425n341438o740355p018028o116739n030086l558579
4346F1526939k528775j129437n31568j64853M50115J443540K169434L018148M178226
4337F8431769N024130N641650N474348L463498n08318m785557p261751p934185
4329F7545584p351915n970318n062915l906282k941201k077902j864342j186270
4321C7184439r02149n02238m26473q5672L22264N96633N16537L18246k07921q59758
4311C5953908p43216p04207k65800N8872o26037o95651j328940j813904j912627
4302B7922398j696096j145205p12249o75985j99686j20298M56635K64447O1234
4293B4155195j24540o66457q89093j249627j434968j315242o24623o38418m49811
$$ plain form
4354 102347674 99106589 95332164 89990726 83250371 76232343 70115604 65085518 61526939
4346 61526939 58998164 57868727 57337159 57172306 57622421 59065961 61235395 64253543 68431769
4337 68431769 73455899 79097549 84571897 88035395 87527077 82741520 75479769 67545584
4329 67545584 60193669 54223351 49160436 45254154 42312953 40235051 38370709 37184439
4321 37184439 36282290 35780052 35353579 35267907 35590171 36186804 36703341 37021587 36813666 35953908
4311 35953908 35210692 34506485 34240685 34299557 33673520 32977869 31648929 29835025 27922398
4302 27922398 26226302 25081097 24368848 23692863 23493177 23372879 23829514 24093961 24155195
4293 24155195 24030655 23364198 22475105 21225478 19790510 18475268 17850645 17212227 16762416
4284A6762416m92022j48285k13121k57483M0802m55897q0024l28453m23638m05453
4274A3998842m76375k16437l00156j95046l10255k33310k86113k04021j89731
4265A1587398k19891m8260k13963l27107j57989j46037P2564m7109j22386p2596
4255A0304624j70927o5202K70228J79231j24438J7026k74441L2653j07345l0304
4245A0031105K3829J88697o0653L0047J3816N9336m7885n3859J22318J13985K74783
4234A0695519P7956J28042J99214R6978R8326n2434P5701p4048j05325q7616J19362
4223A1171675k48418K0111M8410j15661M7530m4742J8944M4049J25422l5916j6736
4212A1014668R5935K6028o0095r3209R1449J90465k14700L27945J62148J77554
$$ plain form
4284 16762416 16270394 16122109 15908988 15651505 15692307 15236410 15156386 14827933 14404295 13998842
4274 13998842 13522467 13306030 13005874 12810828 12500573 12267263 11981150 11777129 11587398
4265 11587398 11367507 11319247 11105284 10778177 10620188 10474151 10546715 10499606 10377220 10304624
4255 10304624 10133697 10068495 10338723 10517954 10393516 10410542 10136101 10168754 10061409 10031105
4245 10031105 10054934 10243631 10182978 10213025 10226841 10286177 10238292 10184433 10306751 10420736 10695519
4234 10695519 10773475 10901517 11100731 11197709 11296035 11243601 11319302 11245254 11139929 11052313 11171675
4223 11171675 10923257 10943368 10991778 10876117 10923647 10878905 10897849 10941898 11067320 11031404 11014668
4212 11014668 11110603 11136631 11076536 10983327 11074776 11265241 11050541 11378486 11540634 11718188
4202A1718188L1269M3735J45892M50379K88299l5237K0242L67386K83065M02335
4192A3715553J19202K14242L99704L54592J86842q3273J3284L25788K18298K39659
4182A5703891J27671q6968l3287o8613j35634j40049p1590j98526k02231N1992
4172A4946656K07271r9256r600K76929M3591J96800P123K40971M24419M04212
4162A6639116k4908J87156K32447j08122o5161m4296j40527K68229K40634J79849
4152A7364417K14703J6415K01696J25462L53392L98526J86012L61900P60539N31660
4142B0514722L53739L82529P15954N06652O08655O60209O94673R60365J188566
4133B6586064J066250J207123J145044J226479J436898R80962O72686L21643M379
$$ plain form
4202 11718188 11749457 11793192 11939084 12389463 12677762 12642525 12662767 13030153 13313218 13715553
4192 13715553 13834755 14048997 14448701 14803293 14990135 14906862 14920146 15245934 15464232 15703891
4182 15703891 15831562 15744594 15711307 15642694 15507060 15367011 15295421 15096895 14894664 14946656
4172 14946656 15153927 15054671 15045071 15322000 15365591 15562391 15569514 15810485 16234904 16639116
4162 16639116 16614208 16801364 17033811 16925689 16860528 16816232 16675705 16943934 17184568 17364417
4152 17364417 17579120 17595535 17797231 17922693 18276085 18674611 18860623 19222523 19983062 20514722
4142 20514722 20868461 21250990 21966944 22473596 23082251 23742460 24437133 25397498 26586064
4133 26586064 27652314 28859437 30004481 31230960 32667858 33648820 34321506 34643149 34647528
4124C4647528J26748m11237o35253n52992k17776j56421k22681J90863K00646
4115C2969425K74086O58070J013169Q88302J287821J327570J509881J676010J975592
4106D3579926K136682J612645Q72401k40371q62056p75828j324877k181143k492790
4097D0324589k725598k379894j794280j196204p79475m24402m63832j99844M0175
4088C0401235K36762m12975j33338k24022n68792q52540q29318p17814p14014
4079B6185184m70355l82775o6111k47584j85114r0937M19886L1487J15010N2404
4069B5361095J2255O0734Q6908K66611N94807M23878M86637N45472R07860O60213
4059B9406470O48647M21713J21391l50604m25681n49644p57088q70745n00827
$$ plain form
4124 34647528 34774276 34363039 33727786 33174794 32957018 32800597 32577916 32768779 32969425
4115 32969425 33243511 33901581 34914750 35803052 37090873 38418443 39928324 41604334 43579926
4106 43579926 45716608 47329253 48201654 47961283 47099227 46323399 44998522 42817379 40324589
4097 40324589 37598991 35219097 33424817 32228613 31449138 31024736 30560904 30361060 30401235
4088 30401235 30637997 30225022 30091684 29867662 29298870 28446330 27617012 26899198 26185184
4079 26185184 25714829 25332054 25265943 25018359 24833245 24742308 25162194 25193681 25308691 25361095
4069 25361095 25373350 25434084 25520992 25787603 26382410 26806288 27292925 27838397 28746257 29406470
4059 29406470 30055117 30476830 30598221 30247617 29821936 29272292 28515204 27644459 27143632
4050B7143632o58186m06951J09132l29283l17423k9213o5767J54399L21788J82050
4040B6104178q641o8543L26269K73572M07839K82977P33157N96062Q34226N58455
4030C0039551O68284N35490J04988j65136K04500l00541l39484m7650K76980j44311
4020C0832671L96370R0833M66268L57145L8426M49109M64359O35160M42675L86329
4010C4559345N54328N72305P38124Q47227J014483R17531R13959J064295J026396
4001D2207993J081811J109503J199890J471373J487008J833641J974625J737772
3993E4103616K020464K397088K482727L071562L582100L892179M242435M927337
3985H0719508N368950O457390P022935Q097703R179403J0315525J1445667J2959257
$$ plain form
4050 27143632 26485446 26078495 26187627 25858344 25540921 25511708 25445941 25600340 25922128 26104178
4040 26104178 26095537 26026994 26353263 26626835 27034674 27317651 28050808 28646870 29481096 30039551
4030 30039551 30707835 31243325 31348313 31183177 31387677 31087136 30747652 30700002 30976982 30832671
4020 30832671 31229041 31319874 31786142 32143287 32181713 32630822 33095181 33730341 34173016 34559345
4010 34559345 35113673 35685978 36424102 37271329 38285812 39203343 40117302 41181597 42207993
4001 42207993 43289804 44399307 45599197 47070570 48557578 50391219 52365844 54103616
3993 54103616 56124080 58521168 61003895 64075457 67657557 71549736 75792171 80719508
3985 80719508 86088458 92545848 99568783 107666486 116845889 127161414 138607081 151566338
3977A51566338J4993837J6834852J9316946K3506793K9225858L5828908M0196950
3970C31470482L6420808J8171433j1383533l7001173n1153530m6509741l6125376
3963B03889370k5904190j8842962j4016938j0903274q339245o086410m497640
3956A15298711l063587k350993k052543j479537j195641o28519J16217J267709
3948A05911817J874799K631365L457120L347524K674137J581953J177522R53666
3940A23609903O75018m33524k566508m490121n911339n906570n265671m588192
3932I5122996l612059k677669j797218j122954n18620k85219r4867P61987O91452
3923H6467829J109167J804231K201609K253327K436653L394355L987973N249483
$$ plain form
3977 151566338 166560175 183395027 202711973 226218766 255444624 291273532 331470482
3970 331470482 367891290 386062723 374679190 337678017 286524487 240014746 203889370
3963 203889370 177985180 159142218 145125280 134222006 125882761 119796351 115298711
3956 115298711 112235124 109884131 107831588 106352051 105156410 104527891 104644108 105911817
3948 105911817 107786616 110417981 113875101 117222625 119896762 121478715 122656237 123609903
3940 123609903 124284921 123851397 121284889 116794768 110883429 104976859 99711188 95122996
3932 95122996 91510937 88833268 87036050 85913096 85394476 85109257 85014390 85776377 86467829
3923 86467829 87576996 89381227 91582836 93836163 96272816 99667171 103655144 108904627
3915A08904627N873533O870371P556486Q897216J0363543J2046859J3931086J6487043
3907A90930764K0232763K5672455L1322727L4403065K8687123J0373884j9317893
3900C22304888m2369008m6194053l8523870k8545902k0879260j5722936j2124741
3893A17945118r799160q148245o466312m806798l922555l553775k795066k710254
3885G5742953k716461k423176k326625j750921j623579j030522o61811p77144
3877F2432714n35302m20118K011P10344P31609R79927J210265J446514K345553
3868F8903517K315749K326683J441053K37170n65200j361397k164474l278698
3860F7854403l768257l104673k354252j980275j401325j177907j028054r37205
$$ plain form
3915 108904627 114778160 121648531 129205017 138102233 148465776 160512635 174443721 190930764
3907 190930764 211163527 236835982 268158709 302561774 331248897 341622781 322304888
3900 322304888 279935880 233741827 195217957 166672055 145792795 130069859 117945118
3893 117945118 108145958 99997713 93531401 88724603 84802048 81248273 78453207 75742953
3885 75742953 73026492 70603316 68276691 66525770 64902191 63871669 63209858 62432714
3877 62432714 61897412 61477294 61479305 62189649 62921258 63901185 65111450 66557964 68903517
3868 68903517 71219266 73545949 74987002 75224172 74658972 73297575 71133101 67854403
3860 67854403 64086146 60981473 58627221 56646946 55245621 54067714 53039660 52102455
3852E2102455o34840m11748K60352P99399J232643J407025J563572J694145J026245
3843E9039248N8417r99357k205217k947738l037420l088586l126055k822346j832081
3834C9038865j420615j340202q87990j095843r64326o58340q81012j090599j026752
3825B9673186q74681q97733n42936p30729m12798m69740l74671O1685j44213j87609
3815B5099761k60765n02391m21568k35097l83389l32074m71792k89522n2012j89094
3805B1962057j30625M7819o0680j39706K9649l69324k24250k02692q4390J1821
3795B0839679K864l4202k19367J04060K2720J05838R4078J49711M3993J91185
3785B1300559L43400L19795M34754P32041N54792M37419J79281L07335J94118
$$ plain form
3852 52102455 51467615 51055867 51316219 52115618 53348261 54755286 56318858 58013003 59039248
3843 59039248 59097665 58098308 55893091 52945353 49907933 46819347 43693292 40870946 39038865
3834 39038865 37618250 36278048 35390058 34294215 33329889 32671549 31790537 30699938 29673186
3825 29673186 28798505 27900772 27357836 26627107 26214309 25744569 25369898 25431583 25287370 25099761
3815 25099761 24838996 24336605 23915037 23679940 23296551 22964477 22492685 22203163 22151151 21962057
3805 21962057 21831432 21879251 21818571 21678865 21708514 21339190 21114940 20912248 20827858 20839679
3795 20839679 20842543 20808341 20588974 20693034 20715754 20821592 20915670 21065381 21109374 21300559
3785 21300559 21643959 21963754 22398508 23130549 23685341 24122760 24302041 24609376 24803494
3776B4803494j06811L7001J62108P07037P17356P16652P04921J176833J529376
3767C0447967J889486J804105K148427K651990L029676K803967K750685J623122
3759D9149425q3675j204616k488225l411948l937398l527931k892148k121981
3751B9481503j690811j486679j089765q32138o00694l56692l52393j04038l23308
3742B2644985k96048l41815J75848R3964k8458n3170K06972m8367r8180k37931
3732B2017800m33091o73573n46815m11319l68354m35197n47696k38647l7530k45694
3722A8079884k55888K9982J14577J21518J00868K81950N14155J76586l04543l29162
3712A8529927n45815j76625j02658q2752q044j7162q9355j63701j36847o18137
$$ plain form
3776 24803494 24696683 24733684 24895792 25602829 26320185 27036837 27741758 28918591 30447967
3767 30447967 32337453 34141558 36289985 38941975 41971651 44775618 47526303 49149425
3759 49149425 49065750 47861134 45372909 41960961 38023563 34495632 31603484 29481503
3751 29481503 27790692 26304013 25214248 24382110 23781416 23424724 23072331 22968293 22644985
3742 22644985 22348937 22007122 22182970 22276934 22248476 22195306 22402278 22353911 22255731 22017800
3732 22017800 21584709 20911136 20364321 19953002 19584648 19149451 18601755 18363108 18325578 18079884
3722 18079884 17823996 17853978 17968555 18090073 18190941 18472891 18987046 19163632 18859089 18529927
3712 18529927 17984112 17807487 17704829 17622077 17614033 17596871 17507516 17343815 17206968 16588831
3702A6588831n58835j27205l37184k35231k29473q3924l14634q7749O6728m6945
3692A4634379q908l6729o3484n8332j90645j53137k21381p4605l0982M2548j60176
3681A3678548k53925j01039K1016j0237J00588l11459k11108k21600L08306k22405
3671A2776685j37492k23914l61124K9211k32789k90490k03018P7147J9644J89191
3661A1643051l724K7390R4628l92142o4192R3654K57538k00491J98697P1495K89372
3650A2015276J91420J44015N9645m87244j95893m3140n2532l2981j47874K5879
3640A1476571q8578j24951M1212k80941m2911m38123k8754l7245j34040r0694
3630A0251546J13132j00660j42481P9790l7960k77603q5127j48126j86314K7170
$$ plain form
3702 16588831 16029996 15902791 15565607 15330376 15100903 15016979 14702345 14614596 14681324 14634379
3692 14634379 14625471 14588742 14525258 14466926 14276281 14123144 13901763 13827158 13796176 13838724 13678548
3681 13678548 13424623 13323584 13344600 13334363 13434951 13123492 12912384 12690784 12999090 12776685
3671 12776685 12639193 12415279 12054155 12083366 11850577 11560087 11357069 11434216 11453860 11643051
3661 11643051 11639327 11666717 11761345 11369203 11305011 11398665 11656203 11455712 11654409 11725904 12015276
3650 12015276 12206696 12350711 12410356 11923112 11727219 11684079 11631547 11598566 11450692 11476571
3640 11476571 11387993 11263042 11304254 11023313 10980402 10542279 10513525 10476280 10342240 10251546
3630 10251546 10364678 10264018 10121537 10201327 10163367 9885764 9800637 9652511 9466197 9493367
3620I493367J26494k03391M7293q9892J04961k35497j45793N6440L6108J50131
3610I340221J85848j07878J65267Q0823J2996M52424P2339K3087o7964Q0015J27906
3599A0365084O7575Q7791L899J78442K95542L14253K4452j51378k80824n56591
3589A0348245o21000k16551k37871j33537j89571n0638K07731N9575N2757K20156
3579I439296J71892J91675J53718L12652L17932O04802M52881N51354L48300K27070
3569A2771572j38167p88382j169842q04964o41180m25713k59455k70226n33816
3560G739827k87631l37121q1049k01099k80240j91225l69011p8394l0539k12031
3550E671487k48397p7422j15567j0758j03645r2834k79011k9594k7196k21006
$$ plain form
3620 9493367 9619861 9416470 9463763 9373871 9478832 9243335 9097542 9153982 9190090 9340221
3610 9340221 9526069 9418191 9583458 9664281 9677277 10129701 10202040 10225127 10157163 10237178 10365084
3599 10365084 10432659 10520450 10524349 10702791 10998333 11312586 11337038 11185660 10904836 10348245
3589 10348245 9727245 9510694 9272823 9139286 8949715 8899077 9106808 9166383 9219140 9439296
3579 9439296 9611188 9802863 9956581 10269233 10587165 11191967 11644848 12196202 12544502 12771572
3569 12771572 12633405 11845023 10675181 9870217 9229037 8803324 8543869 8273643 7739827
3560 7739827 7452196 7115075 7034026 6832927 6552687 6361462 5992451 5914057 5883518 5671487
3550 5671487 5423090 5345668 5230101 5219343 5115698 5022864 4743853 4714259 4687063 4466057
3540D466057k68768j3287J46458J02535l20751l22864l5283K85818p2159j62120
3530C805636j03546j55414k08132J09889K6400J04076l6997p6023L8897k07043
3520C297743j02715J83442n35514j52358J29237L14531k0003L6324j60756k44882
3510B745049m3415L2104n405l3777N808K5343j02494l27379K4476j25692L69672
3499B564290Q6464j94291j04379l8460j37104n485R224N2917n2968l580J71270
3488B347898l12094P554K34731o8093j18683k739r0180Q7979k56945l8814j02634
3477A687980J27459J78553l26803J35450R5103P7823n1118k24196N4676k08068
3467A546859J91292J65002O7527p2750J9149j45966k49677j4080J40590k3192
$$ plain form
3540 4466057 4197289 4184002 4330460 4432995 4112244 3789380 3754097 4039915 3967756 3805636
3530 3805636 3702090 3546676 3338544 3448433 3474833 3578909 3541912 3465889 3504786 3297743
3520 3297743 3195028 3378470 2842956 2690598 2819835 3134366 3114363 3150687 2989931 2745049
3510 2745049 2701634 2733738 2728333 2694556 2700364 2725707 2623213 2295834 2320310 2194618 2564290
3499 2564290 2650754 2456463 2352084 2313624 2176520 2171035 2180259 2233176 2180208 2176628 2347898
3488 2347898 2035804 2043358 2278089 2209996 2091313 2088574 1998394 2086373 1829428 1790614 1687980
3477 1687980 1815439 1993992 1667189 1802639 1897742 1975565 1924447 1700251 1754927 1546859
3467 1546859 1738151 1903153 1970680 1897930 1917079 1771113 1521436 1507356 1647946 1624754
3457A624754L0923k13588J2489r9364O3331J63626M1277j14345j61424L65631
3447A713310l8291m07657Q6427M8761p053J42326o8225l0090M528p534R0518l4189
3435A492831J1808J19882r7737O3158q1450K28949j87618k19507J71497J86025
3425A687838R930j03707n2263j28528J97452k8872p9251M65239p9210J75694R0485
3414B154807P2636q0790K54658J51952L1652L35393K39809J54179Q3297P0559
3404C468152j05485k49942j32161m07592m2994M1760k56085j11768n6917J13156
3394B260124r6736j28470j48274k3232K49917p1902j55721N7391j63311j50847
3384A628939J86665j20289k0715P5362j64894j81066K38856M0108m6896J92110
$$ plain form
3457 1624754 1655677 1442089 1454578 1355214 1418545 1582171 1623448 1509103 1347679 1713310
3447 1713310 1675019 1267362 1353789 1402550 1395497 1537823 1469598 1439508 1444036 1436502 1527020 1492831
3435 1492831 1504639 1624521 1526784 1589942 1508492 1737441 1549823 1330316 1501813 1687838
3425 1687838 1697768 1594061 1541798 1413270 1610722 1581850 1502599 1967838 1888628 2064322 2154807
3414 2154807 2227443 2146653 2401311 2553263 2584915 2920308 3160117 3314296 3397593 3468152
3404 3468152 3362667 3112725 2980564 2572972 2529978 2571738 2315653 2203885 2146968 2260124
3394 2260124 2163388 2034918 1886644 1863412 2113329 2041427 1885706 1943097 1779786 1628939
3384 1628939 1815604 1695315 1674600 1749962 1585068 1404002 1642858 1682966 1636070 1828180
3374A828180J10868r2040O2459p4410r5257l22030N8690k4045j47528J87288N1311
3363A543486Q6016Q7676j40483j65659o3058J84846j10936R568K16181o5616j80892
3352A401129O0782K72954O8782k46207J87346j30589m048l126P0121N743j11424
3341A571463N0747j2368r4239O2986P9047j97973k5443j01945J51747j74467R8222
3330A407777p7126j05710j13896Q8185p5798K71433K01885j33533J49395n4279
3320A558333j90474r7240o0739j3229K3102L13847k55226L3239J00342K305j4739
3309A399521p4644l53335j6231P8827p3140J65287q6933K29993J44655r9329k16152
3298A098519J81191m5161j87759l509k61270K19936L12428j97613k9969j60242
$$ plain form
3374 1828180 1939048 1847008 1909467 1835057 1739800 1417770 1476460 1452415 1304887 1492175 1543486
3363 1543486 1629502 1717178 1576695 1411036 1347978 1532824 1421888 1431456 1647637 1582021 1401129
3352 1401129 1461911 1734865 1803647 1557440 1744786 1614197 1610149 1607023 1677144 1682887 1571463
3341 1571463 1622210 1609842 1515603 1578589 1657636 1459663 1434220 1332275 1484022 1309555 1407777
3330 1407777 1330651 1224941 1111045 1199230 1123432 1394865 1596750 1463217 1612612 1558333
3320 1558333 1367859 1270619 1209880 1196651 1219753 1533600 1278374 1311613 1411955 1414260 1399521
3309 1399521 1324877 971542 955311 1034138 960998 1126285 1039352 1269345 1414000 1314671 1098519
3298 1098519 1279710 1234549 1046790 1043281 782011 1001947 1314375 1116762 1086793 926551
3288I26551n0690J87641J3663K05004j87699j17642j30427L91310n5210n5608
3278A126893m6973k225J18987R5481k86083l3177Q9355k48063K00368J01366K3486
3267A139415j11224L190k1688J5509O5560L9641J74208j96207R3684L275K53895
3256A459258r2645J05825p2954j98780J67135k13538p0519o06j1479J3317J56387
3245A241401r9690j30520j57774J99509K01006J65465k90178Q984j28706j6289
3235I93208J62559N4673k07058K41192J07989Q482j0847J55603Q8014k35515M8959
3224A407259j06285j34567o1440K11639M3984J0137q7007j08660o6144J12910
3214A221826J25199R3902k22836O7200Q7756O0054j29976M6443J77950L2057m3653
$$ plain form
3288 926551 875861 1063502 1077165 1282169 1094470 976828 846401 1237711 1182501 1126893
3278 1126893 1079920 1077695 1196682 1292163 1006080 972903 1062258 814195 1014563 1115929 1139415
3267 1139415 1028191 1031381 1009693 1025202 1090762 1130403 1304611 1108404 1202088 1205363 1459258
3256 1459258 1366613 1472438 1399484 1200704 1367839 1154301 1083782 1083176 1071697 1085014 1241401
3245 1241401 1141711 1011191 853417 1052926 1253932 1419397 1129219 1138203 1009497 993208
3235 993208 1155767 1210440 1003382 1244574 1352563 1361045 1350198 1505801 1593815 1358300 1407259
3224 1407259 1300974 1166407 1104967 1316606 1360590 1370727 1283720 1175060 1108916 1221826
3214 1221826 1347025 1440927 1218091 1285291 1373047 1433101 1303125 1349568 1527518 1559575 1515922
3203A515922l9977J55751J55715P3663k09198o0241J7851P5732K06484K4552o283
3192A909971j32247k83850K24296q3162J9895k055P9282P9268r9030K21024K49496
3181B182888N6018Q4604j09589j6391j28519J94613J48470Q7036J64652K03088
3171B866870j00707N3468J74937k5750J14130j77791J25164L58673R3511J14477
3161C596982O0065K99395k3688M2729K89820J71017K13247K47258M44949N11039
3151E852813K07562O62564q1248J10790J47452J13472n8251K74776N49351L22131
3141H101412J35288O3736M20104L54340p8462j61551J40047k33283k47633j49844
3131H344154K5547p8339J73243K36797L55907J72928K39299J86457N98955O20378
$$ plain form
3203 1515922 1475945 1631696 1787411 1861074 1651876 1591635 1609486 1685218 1891702 1916254 1909971
3192 1909971 1777724 1493874 1718170 1635008 1654903 1652848 1732130 1811398 1712368 1933392 2182888
3181 2182888 2238906 2323510 2213921 2197530 2069011 2263624 2412094 2499130 2663782 2866870
3171 2866870 2766163 2819631 2994568 2968818 3082948 2905157 3030321 3388994 3482505 3596982
3161 3596982 3657047 3956442 3932754 3975483 4265303 4436320 4649567 4896825 5341774 5852813
3151 5852813 6060375 6722939 6641691 6752481 6899933 7013405 6955154 7229930 7779281 8101412
3141 8101412 8236700 8300436 8720540 9074880 8996418 8834867 8974914 8741631 8493998 8344154
3131 8344154 8369701 8291362 8464605 8701402 9057309 9230237 9469536 9655993 10254948 10875326
3121A0875326N09900L58248j55689l27167Q7735L61063J94999M01160P15833N67062
3111A3588470P48868M80437N02593J18856k13559j82290o18176p80620n60976
3102A3083603o18446k24326k05352j91048k14415j85248r4165J03032L8172M61568
3092A1953375O94186J29467j49780N1931J60956M14372K74272N2541J71691k44798
3082A3508213k53120J27684J25849P005k27753J4428n80257m70984o0086m93517
3072A1697462o06361j96137q5154j61939l5207j24280l5275j34123P0207j7353
3062A0371840k97872m98322n28962J11529k65191k83526j18318Q5402Q325j1606
3052H573299J10428j7963M9924R4648M4236K9351M57911J76578K5393K08398k3560
$$ plain form
3121 10875326 11385226 11743474 11587785 11260618 11348353 11709416 11904415 12305575 13021408 13588470
3111 13588470 14337338 14817775 15320368 15439224 15225665 15043375 14425199 13644579 13083603
3102 13083603 12465157 12240831 12035479 11844431 11630016 11444768 11350603 11453635 11491807 11953375
3092 11953375 12647561 12777028 12627248 12679179 12840135 13254507 13528779 13581320 13753011 13508213
3082 13508213 13255093 13382777 13508626 13515631 13287878 13302306 12722049 12251065 12190979 11697462
3072 11697462 11091101 10894964 10809810 10647871 10612664 10488384 10453109 10318986 10389193 10371840
3062 10371840 10073968 9575646 9046684 9158213 8893022 8609496 8491178 8576580 8584905 8573299
3052 8573299 8683727 8665764 8715688 8810336 8854572 8883923 9341834 9518412 9543805 9752203 9728643
3041I728643j57235K40949J28216J57858L69081N54415L69830J81375k79729o68233
3031A0625170q97601p60082m25657m58090p4369j28508j97951j3279j65405j88263
3021G315965k2457J53640p9105K95737K81747J40712M0017j85042l74857j07318
3011G459039o1533p1347M5453K02701J35402J26486m3912J27052k58188m42939
3001G218214n98609m52032k07350j63149l18483j24750l09376j51619k88514J16764
2991D721096J30462J19126j5426L13452m30840k80866J97284k45610m2142k72909
2981D193627J76423j22457O1055q6005q9369n5808j22716J71034K3735m00968
2971C748551K08123J5549N7136n7987j86370k35761m0103P9058O2552l5257l7408
$$ plain form
3041 9728643 9571408 9812357 9940573 10098431 10467512 11021927 11391757 11573132 11293403 10625170
3031 10625170 9727569 8967487 8541830 8083740 8009371 7880863 7682912 7669633 7504228 7315965
3021 7315965 7293508 7447148 7368043 7663780 7945527 8086239 8126256 7941214 7566357 7459039
3011 7459039 7397506 7326159 7371612 7574313 7709715 7836201 7792289 7919341 7661153 7218214
3001 7218214 6619605 6167573 5960223 5797074 5478591 5353841 5044465 4892846 4604332 4721096
2991 4721096 4851558 4970684 4955258 5268710 4837870 4557004 4754288 4508678 4466536 4193627
2981 4193627 4370050 4247593 4308648 4222643 4133274 4077466 3954750 4125784 4149519 3748551
2971 3748551 3956674 3972223 4029359 3971372 3785002 3549241 3509138 3588196 3650748 3615491 3578083
2960C578083r1875J4224k30500Q3429J66480q3852j29211K01815q5372q2789k71184
2949C069248O5075L23545j21266J96836J04884j75830l3509j50538J81424p3340
2939C386529k67781J30925l8327r6107K84604L8120k08954n1098k63240K82614
2929C197285N2574j68238l0638j49546k2679j49536j96863k1519J03618J83882
2919B798340K727j36496J9268J95215Q5852J1922j26251p04n3320l99N2987k06886
2907B642255l1519K1211k37123k3541j54884j1904j1666k49403O012P9751o9514
2896A959675r4108p8182j9555L38259J57570j79297j91678Q0056J65903j83795
2886A954848J76248J56955l00904j03276J9931J0123L008l1282J60502k00720
$$ plain form
2960 3578083 3486208 3500432 3269932 3353361 3519841 3435989 3306778 3508593 3423221 3340432 3069248
2949 3069248 3134323 3457868 3336602 3533438 3638322 3462492 3428983 3278445 3459869 3386529
2939 3386529 3118748 3249673 3211346 3115239 3399843 3437963 3229009 3177911 2914671 3197285
2929 3197285 3249859 3081621 3050983 2901437 2878758 2729222 2532359 2510840 2614458 2798340
2919 2798340 2801067 2664571 2683839 2879054 2964906 2976828 2850577 2849873 2796553 2796154 2849141 2642255
2907 2642255 2610736 2631947 2394824 2371283 2216399 2204495 2192829 1943426 1949438 2029189 1959675
2896 1959675 1865567 1787385 1767830 2106089 2263659 2084362 1892684 1972740 2138643 1954848
2886 1954848 2131096 2288051 1987147 1883871 1903802 1913925 1916933 1885651 2046153 1845433
2876A845433m8422n9936M0326O0129l6053L04507j53056j71408l7388r8452m6130
2865A599550j04074J99080j56016j1139J87340q3743o0984J55244J94434l28800
2855A590892q0438J28706M6006J42420J60760j20912j59063K56129N8892J40302
2845B163694m1916K01502K8369k12495K53125J50535k45802j78921j08361k3545
2835A986185J23436k75085J23116J43226k74888J15839N8961j70879J0627L3242
2825A873780J05885l4203L9658r5104r5585q303Q3541J32248M7854P5606J12124
2814B237501p6349j54008M3078j68691N3043L45140j0417j46627j25935j11778
2804A884957O9K15974N7963n8432J27946j55458k19338j67322l26615N0598n0972
$$ plain form
2876 1845433 1797011 1737075 1777401 1837530 1801477 2105984 1952928 1781520 1744132 1645680 1599550
2865 1599550 1495476 1694556 1538540 1527401 1714741 1630998 1570014 1725258 1919692 1590892
2855 1590892 1510454 1639160 1685166 1827586 1988346 1867434 1708371 1964500 2023392 2163694
2845 2163694 2121778 2323280 2351649 2139154 2392279 2542814 2297012 2118091 2009730 1986185
2835 1986185 2109621 1834536 1957652 2100878 1825990 1941829 2000790 1829911 1840538 1873780
2825 1873780 1979665 1945462 1985120 1890016 1794431 1786128 1869669 2001917 2049771 2125377 2237501
2814 2237501 2161152 2007144 2050222 1881531 1934574 2279714 2269297 2122670 1996735 1884957
2804 1884957 1885026 2101000 2158963 2100531 2228477 2073019 1853681 1686359 1359744 1410342 1359370
2793A359370K37354L39583k36073k38654n4665K12455k16621k68525J65246J16843
2783A416313o9982J59773q3274N8208K8445n5205q1540r7711Q1729j23126J35978
2772A369608R9432k33563j91359n4714r2741P1541l5378J21405J25046j69318
2762A009959L3532j28664R2813J28750j33462J32652r528L4067k34802m4608j86652
2751F94057J87275n1634N0117o0238p8151J05244q347Q961N2761J04491k21920
2740G82616j34558J00575p148p2353j22547Q9036K76369J28512k39989k21440
2730E79073k69965O0232K17272j44771K34111o4880k08604N3473M24192r3192
2720G86941j9022j78678o5066J7005j19624j73505j21301m7145j4153j7404N8372
$$ plain form
2793 1359370 1596724 1936307 1700234 1461580 1406915 1619370 1402749 1134224 1299470 1416313
2783 1416313 1346331 1506104 1422830 1481038 1509483 1454278 1372738 1275027 1356756 1233630 1369608
2772 1369608 1469040 1235477 1044118 989404 896663 968204 932826 1054231 1179277 1009959
2762 1009959 1043491 914827 1007640 1136390 1002928 1135580 1126052 1160119 925317 880709 694057
2751 694057 881332 829698 879815 819577 741426 846670 838323 847284 900045 1004536 782616
2740 782616 648058 748633 741485 669132 546585 635621 911990 1040502 800513 579073
2730 579073 309108 369340 586612 441841 675952 611072 402468 455941 880133 786941
2720 786941 767919 589241 524175 541180 421556 248051 126750 79605 65452 48048 106420
2709A06420K16526J6517K8943k35786j23196J06611P5278j13070K4718O8176N8230
2698B29367n0978m1326p9723j09131J05032L7592K00564j99224q0484M5701M4232
2687A01622J39333Q6091Q1525M7241j79771j73848j69395O0105J16295m1412L1772
2676I9558Q9612n365k01538J16023j0265M7455k8452L4345J47447k0802k79773
2665a1755N1440J41365j2069r7688j22032J2364p4330J39453p6218R8005N4321
2654A02856n1281n5914r8291J09006Q6467q9533J42712Q5257Q3843o0212j92511
2643F2399j46588j59749M3610L10334r4550j40470J00823Q180k4423k00355k66574
2632e07363K69692P1487l0232q3855Q7065K71324O2166j38835j90687q1654J11522
$$ plain form
2709 106420 322946 339463 368406 132620 9424 116035 191313 78243 102961 171137 229367
2698 229367 178389 137063 57340 -51791 53241 90833 291397 92173 11689 57390 101622
2687 101622 240955 327046 408571 455812 276041 102193 -67202 -7097 109198 67786 99558
2676 99558 189170 183805 -17733 98290 88025 135480 107028 141373 288820 268018 -11755
2665 -11755 39685 181050 168981 71293 -50739 -38375 -112705 26748 -49470 48535 102856
2654 102856 51575 -4339 -102630 6376 92843 3310 146022 231279 315122 254910 62399
2643 62399 -84189 -243938 -200328 110006 15456 -125014 -24191 -16011 -40434 -240789 -507363
2632 -507363 -237671 -166184 -196416 -280271 -193206 78118 140284 1449 -189238 -270892 -159370
2621a59370J07292o6481Q8706M3169j12245o1241Q4945j40422N3852K55214j64545
2610g1126j45426Q3969K5416k4925L613P2317J61854n7742m3473J78795k18521
2599c5249M3710k10786R7536J3518J6349l3208O7498N2400k32643J25188J39444
2588D3757n3118p3155j1256O3162n5438l6020j59161j16660J21614Q9582J20788
2577f5905j32500j20258L00501L3218k84452Q4525K63927l7995k03103j38142
2567c00184J98425K18919o1095K43737o7658j85823O3383n4926n7051j62359R2820
2556g1812Q5389K10203N5594k80975M8090P6777K37421M8074j98519j06795N8046
2545A61493k39796J60502n8152q5708K30371n8678J50366l1905J14014o2287J13506
$$ plain form
2621 -159370 -52078 -118559 -29853 13316 -98929 -160170 -75225 -215647 -161795 93419 -71126
2610 -71126 -216552 -132583 -107167 -132092 -128479 -56162 105692 47950 4477 183272 -35249
2599 -35249 8461 -202325 -104789 -91271 -74922 -108130 -40632 11768 -220875 -95687 43757
2588 43757 -9361 -82516 -93772 -30610 -86048 -122068 -281229 -397889 -276275 -186693 -65905
2577 -65905 -198405 -318663 -18162 15056 -269396 -184871 79056 41061 -162042 -300184
2567 -300184 -101759 117160 56065 299802 232144 46321 109704 54778 -2273 -164632 -71812
2556 -71812 13577 223780 279374 -1601 46489 123266 360687 408761 210242 103447 161493
2545 161493 -78303 82199 24047 -61661 168710 110032 260398 228493 342507 280220 393726
2534C93726k27720j08149J90515J6257K9044m2639K04391j34869j21589J48923
2524C47890l24783K5993J50304K7857J48335j49764l7233J10478M9784O385M6671
2513D01917M7703k25558k08729M66259l7786k65807l0627J6993J45882P169K45995
2502E63411n5914j17312j04306J92833J18945k27322J52205K2311j62468k54465
2492A27918J34634K67408K1124k45918Q5746K3594j07206r8068N7750J92125r2599
2481C66508j7008O9479j97625k71695k131J73799M4963j99073J01329J94j4690
2470E4050L6777m7122J05577L28419k96314j10332J85417J22942n476o0695j62082
2459A51161r4823p8100l3989L54957j9584q6523P5137o0652Q618q8763j82307
$$ plain form
2534 393726 166006 57857 248372 264629 293673 251034 455425 320556 198967 347890
2524 347890 23107 49100 199404 227261 375596 225832 188599 299077 348861 355246 401917
2513 401917 449620 224062 15333 481592 443806 177999 147372 164365 310247 317416 563411
2502 563411 507497 390185 285879 478712 597657 370335 522540 544851 382383 127918
2492 127918 262552 529960 551084 305166 390912 414506 307300 209232 266982 459107 366508
2481 366508 349500 418979 221354 -50341 -52472 121327 166290 -32783 68546 68740 54050
2470 54050 90827 43705 149282 477701 181387 71055 256472 379414 373938 313243 151161
2459 151161 56338 -21762 -55751 299206 279622 193099 268236 207584 216202 127439 -54868
2448e4868K98646k4362m4654p158j94665q182J7269K48420j3713j38745L2393
2437A10381P9796r3412r0658O0383J0631k9599J6145L6295L7479j11404j64249
2426a38212l28560j48764J02986J44910L16021j56674j17617J5158J25999L2148
2416a52605j212n2435K67952l5227j59833j5305L17407k22151J32012J55190J7892
2405B51685m7878k87533O8624K2485j07330k02923J09665N5453P8374Q2116j59999
2394a37261K71611R4590m7970k20553k34280K23974J62135o6849n5026k86066
2384b95695L35162J22381r1294j15614j56471O5326J83858K68181k22227j54808
2374f1201k56805J22948O1424O3649O0873n5324p285J8582j4155o7589J02130
$$ plain form
2448 -54868 243778 219416 174762 167604 -27061 -35243 -17974 230446 216733 77988 110381
2437 110381 190177 96765 6107 66490 77121 47522 63667 99962 137441 26037 -138212
2426 -138212 -466772 -615536 -512550 -367640 -51619 -208293 -325910 -310752 -184753 -152605
2416 -152605 -153817 -206252 61700 26473 -133360 -148665 168742 -53409 78603 233793 251685
2405 251685 203807 -83726 -15102 7383 -99947 -302870 -193205 -137752 -59378 22738 -137261
2394 -137261 134350 228940 180970 -39583 -273863 -49889 112246 45397 -9629 -295695
2384 -295695 39467 161848 70554 -45060 -201531 -136205 47653 315834 93607 -61201
2374 -61201 -318006 -195058 -133634 -69985 -9112 -64436 -71721 -53139 -67294 -134883 -32753
2363c2753q3370O2737n2862j00085M1871k97853K06617J9589m9973j66729K81976
2352a70835M3202Q8439q746K4145l1458p6374R0489J39233M4700k32776J2681
2341g7300j64832L2184M2559N2777n7196j51387K39692l5765j94931j77211J11293
2330c80117K13387o8432O3210J04336j49654R1554M1917J22822k44735J59527
2320d6185K79977j71789j34232L2201O4978p5775K26771R9054l68999P8187J22363
2309A06551q8591Q8478M1447k52794L0397J96171K0291J13995k0725j58375R8724
2298A75569J49818k67073k10045J58608J03628l1095J13663O7000j88483k3754
2288D7836J06644j79437l1528J58011O5948j06942N3354j55587R7326J14576j83511
$$ plain form
2363 -32753 -116123 -53386 -106248 -206333 -164462 -462315 -255698 -236109 -286082 -452811 -170835
2352 -170835 -127633 -39194 -47940 -23795 -55253 -131627 -41138 98095 142795 -89981 -77300
2341 -77300 -242132 -209948 -167389 -114612 -171808 -323195 -83503 -119268 -314199 -491410 -380117
2330 -380117 -166730 -235162 -171952 -67616 -217270 -125716 -83799 39023 -205712 -46185
2320 -46185 233792 62003 -72229 -40028 24950 -50825 175946 275000 -93999 -15812 106551
2309 106551 17960 106438 147885 -104909 -74512 121659 141950 255945 235220 76845 175569
2298 175569 325387 58314 -151731 6877 110505 79410 193073 260073 71590 47836
2288 47836 154480 -24957 -56485 101526 167474 60532 113886 -41701 55625 170201 -13310
2277a3310M6438N4284k11324J43940J17592j4059l6673L37992k81261j15633K23860
2266B51846j02108N6870q8323l6827k1569o6041j66904J8915J64699k4238m1705
2255e5385j4725P6547M04017r3406q0370r0206K1694l6587k969R6581k33379Q7056
2243G8868K2773j0349n6537Q1766m9495o6861Q3178j16731N3018P4223j30215
2232c6362J45097K15552r7337k86204k40145j21187M81141O6895o7397l431J70611
2221B27233p9455M4293J27220P1941J5179j83764q1940j1629J59490P0542j02214
2210B56896K4021J31660l03062O1354o1754l9658m9843K53508o0518Q2453J3356
2199C08413k45316J63869J27834J46757k61590K5425j5390k1681J20247L4112
$$ plain form
2277 -13310 33128 87412 -123912 20028 137620 123561 86888 424880 143619 27986 251846
2266 251846 149738 206608 118285 81458 59889 -6152 -173056 -154141 10558 -13680 -55385
2255 -55385 -70110 6437 410454 317048 236678 146472 168166 131579 128610 225191 -8188 78868
2243 78868 101641 91292 34755 116521 67026 165 83343 -33388 19630 93853 -36362
2232 -36362 108735 324287 226950 -59254 -299399 -420586 60555 127450 60053 56622 227233
2221 227233 147778 192071 319291 391232 406411 222647 140707 129078 288568 359110 256896
2210 256896 280917 412577 109515 170869 109115 69457 19614 273122 212604 295057 308413
2199 308413 63097 226966 354800 501557 239967 265392 250002 228321 348568 382680
2189C82680p5290j04845k8152J10490k1081L1417K31019n3860j18259j35211J12852
2178C31760K05036k43550L13342M0238q8384n6423p7499o0508k2928L0513J44954
2167E16551j29400j12524K1278J00799M22341J19357k72827j15677J05288K0177
2157F75363K00463L8537Q6792j90529Q1960Q0874k35593K17054J10893M207j17145
2146I52876J39913J8318j25977J03128r670k65553p3548J95110J98513K0392Q3413
2135A236915K94497K9210k12281k73294J23431J98174J37836j19149R6838K09222
2125A721399K91673j33552J73922Q5618L6686r5016K03038q8297N456K79522K64289
2114B744738o3878k26877J40911J2544J91272J01364J94041M9371J48013J95994
$$ plain form
2189 382680 307390 202545 174393 284883 263802 295219 526238 472378 354119 218908 331760
2178 331760 536796 293246 606588 646826 558442 502019 424520 364012 341084 371597 516551
2167 516551 387151 274627 295905 396704 819045 938402 665575 549898 655186 675363
2157 675363 875826 914363 1001155 810626 892586 973460 737867 954921 1065814 1070021 952876
2146 952876 1092789 1111107 985130 1088258 1078588 813035 739487 934597 1133110 1153502 1236915
2135 1236915 1531412 1560622 1348341 1075047 1198478 1396652 1534488 1415339 1512177 1721399
2125 1721399 2013072 1879520 2053442 2139060 2175746 2080730 2283768 2195471 2200927 2480449 2744738
2114 2744738 2680860 2453983 2594894 2607438 2798710 2900074 3094115 3143486 3291499 3487493
2104C487493p8958K38058Q4739J4503J54959R0874L72855j5840j8280M94565p8548
2093D746420K58066K12420M14662K52533J86221L75895K60639N31000M75613K83219
2083G996688K20434O32638R20528N42364Q29687Q47592R16243J239941R92938
2074A5139053J496920J819174J790350J712789J807081K217710K793417L348483
2066C2124977L455658M268793N343611P278058Q846292J0320828R238234K886942
2058H3763393q949267j4578314j2637384r467981o321731m874391l369285l087878
2050B0477162k162418j949306j120736j017378p09625j087978r73890q32255q84648
2041I738928p67380m97816n54296k80058k94878k71592m13088l15804l56760m6069
$$ plain form
2104 3487493 3408535 3646593 3731332 3745835 3900794 3991668 4364523 4348683 4330403 4824968 4746420
2093 4746420 5004486 5216906 5631568 5884101 6070322 6446217 6706856 7237856 7713469 7996688
2083 7996688 8217122 8849760 9770288 10312652 11142339 11989931 12906174 14146115 15139053
2074 15139053 16635973 18455147 20245497 21958286 23765367 25983077 28776494 32124977
2066 32124977 35580635 39849428 45193039 52471097 61317389 71638217 80876451 83763393
2058 83763393 74814126 60235812 47598428 38130447 31808716 26934325 23565040 20477162
2050 20477162 18314744 16365438 15244702 14227324 13517699 12429721 11455831 10623576 9738928
2041 9738928 8971548 8473732 7919436 7639378 7344500 7072908 6659820 6344016 5987256 5941187
2031E941187k65429l71507k90362j77974n53532j63134j58617l20919j50908p7270
2021C411535J43723k13728l13039J02719l90077k92123J49766l5347q1849l53851
2011B127729l88573J65603P5345q3839N9561j86172j0094j87378L6080p6252J49746
2000A681756K2369j43871K1772p2602l51755r6366K25460j35368r887j0972P6880
1989A207416n0487k40054J57878j42447n2121Q6774J31575l80107K26528L6235
1979I81190j00198j42005K29441J37122l08064m4884J06057k98453l010Q1149
1969F38345j54223P1634j12556J47281j84063l9457R8082M2409l55060J9693K47317
1958D19402Q8324N5204k62073n5784J28732J32075n3428k56360o5839K06196k0810
$$ plain form
2031 5941187 5675758 5304251 5013889 4835915 4282383 4119249 3960632 3639713 3488805 3411535
2021 3411535 3555258 3341530 3028491 3131210 2741133 2449010 2598776 2563429 2481580 2127729
2011 2127729 1739156 1904759 1980104 1896265 1955826 1769654 1759560 1572182 1608262 1532010 1681756
2000 1681756 1704125 1560254 1582026 1509424 1157669 1061303 1286763 1151395 1141508 1130536 1207416
1989 1207416 1156929 916875 1074753 932306 880185 966959 1098534 718427 944955 981190
1979 981190 880992 738987 968428 1105550 797486 752602 858659 560206 557196 638345
1969 638345 484122 555756 443200 590481 406418 366961 465043 507452 152392 172085 419402
1958 419402 507726 562930 300857 245073 373805 505880 452452 196092 130253 336449 315639
1947C15639l55327j21793J51012J27263J71989K24022l64800r3364J49823K5889
1937B30353R7203k33383P2786R8251j00804j97223r0435j8886J9741n1814J23179
1926e1032j07670J16913R9899q1617J05977j16J11870Q0662r9269j19610j14602
1915e8595j49455m7822P9367J67287J74689K04018k89098j87134o9411J05221
1905g0933O2483M5690J14364j79094j50331j31351m0337K22576L7150j34411K29919
1894E725k65294L59271J87325j45650l86597K461Q3375l6034J16870J18692n8218
1883a8074k24059O7452k11782J22972k3895M3763J31831j09295P0771O0737m4920
1872a34499J1141J60479J83916j06398L6915J7398o3420p3363k42180J19941K40305
$$ plain form
1947 315639 -39688 -161481 -10469 116794 288783 512805 148005 54641 204464 230353
1937 230353 327556 94173 166959 265210 164406 -32817 -123252 -142138 -122397 -174211 -51032
1926 -51032 -158702 -41789 58110 -23507 82470 82354 194224 274886 175617 56007 -58595
1915 -58595 -208050 -255872 -176505 -9218 165471 369489 80391 -106743 -176154 -70933
1905 -70933 -8450 37240 151604 -27490 -177821 -309172 -349509 -126933 -89783 -224194 5725
1894 5725 -259569 99702 287027 141377 -245220 -242759 -159384 -195418 -78548 40144 -18074
1883 -18074 -242133 -174681 -386463 -263491 -287386 -243623 -111792 -221087 -150316 -89579 -134499
1872 -134499 -123358 37121 221037 114639 151554 168952 105532 32169 -210011 -90070 150235
1861A50235k7429p989j55996k15272q2808J83029K03655k33044k42804J02678
1851c25745K86445M7117k0611j56502n6487K71128k14701j6222L63512q8855k27368
1840a38289q8845j17348K00553k5822M1527Q7952j08674K26019L1562O1953Q6038
1829B56626k53705q8663j04192m7150o2796J66888L23506J8536k39100q7310J0749
1818a06611M06244L9388m255J00509k38819J15341J01577n43351k9634j42939
1808c02550j00303K80409O6240m3818l6497m6083O8906j2195K68460K08860k32723
1797A18706J1852j45829p4894o1017L924M6905K4558J59973O9182j75086k24302
1786b46028L02524o3903j72181Q3568k3617o720K7936N956k15412L29671j44489
$$ plain form
1861 150235 122806 114817 -41179 -256451 -339259 -156230 47425 -185619 -428423 -325745
1851 -325745 -39300 7817 -12794 -169296 -225783 45345 -169356 -185578 177934 89079 -138289
1840 -138289 -227134 -344482 -143929 -169751 -128224 -40272 -148946 77073 108635 170588 256626
1829 256626 2921 -85742 -189934 -237084 -299880 -132992 190514 209050 -30050 -117360 -106611
1818 -106611 299633 339021 334766 435275 196456 311797 413374 -129977 -159611 -302550
1808 -302550 -402853 -122444 -56204 -100022 -136519 -182602 -113696 -125891 142569 351429 118706
1797 118706 130558 -15271 -90165 -151182 -147258 -100353 -75795 84178 153360 -21726 -246028
1786 -246028 56496 -7407 -179588 -96020 -119637 -126357 -98421 -92465 -307877 21794 -122695
1775a22695L0475J26291o2747j25835J13019J15752k04683M7666o0161j34255
1765b77173R8811k9164j2699Q9191R2470j38663Q9582J08318n9215J8204n3991
1754g4329j696m6780l666J90019k22483j27969K7214J17283q5623J34033Q4195
1743i802k5831m1897K7735k75700J40420J79979Q3860Q8794k59039r8929n986
1732a96396n3118p8177J91909L20405j66034m67066L14035r4430J17805k8964
1722a40031L2316j22780j7263K33963N6306j83238Q592j82362r758J24071K19822
1711A9638j27721j77898J07914N2980K27517l65438m4561J92615j75945J19925
1701a70974K8928L07560j31943o3836k3016M9930q0839k05363N9925J72241k4038
$$ plain form
1775 -122695 -92220 34071 -28676 -154511 -41492 74260 -130423 -82757 -142918 -277173
1765 -277173 -178362 -207526 -220225 -131034 -38564 -177227 -87645 20673 -38542 -20338 -74329
1754 -74329 -76025 -122805 -126471 63548 -158935 -286904 -259690 -142407 -228030 -93997 -9802
1743 -9802 -35633 -77530 -49795 -325495 -185075 -5096 78764 167558 -91481 -190410 -196396
1732 -196396 -249514 -327691 -135782 184623 18589 -448477 -134442 -228872 -111067 -140031
1722 -140031 -107715 -230495 -247758 -13795 42511 -140727 -132135 -314497 -324255 -200184 19638
1711 19638 -108083 -285981 -178067 -125087 102430 -263008 -307569 -114954 -290899 -170974
1701 -170974 -142046 165514 33571 -30265 -53281 -3351 -84190 -289553 -229628 -57387 -81425
1690h1425l6753J26736k4552k725o7132o6564l1698J25806l4930r7377n9794K32515
1678a7893k5442k56694k06647q1863J66230L37908k9124k07576q2755L45729Q3712
1667B5585k13001q0919L41973R0079j19415k19444J13038j9013j6624J00178k09754
1656b07317l946j1012J15658P3890N4706N1368j8472n543r5987r7411r8193J32915
1644a09344o6191K31740j2750J0939q8774N5050j11429J96616L8931m19199L36614
1633F2203J7141j47393r4232P1380J92247p3779j73228J8656J81259j93695j84896
1622c24337K63070j35950m8443J30602r0729O4848k2732N2709k67575L2449Q4301
1611b61787l7521J06645L5928K00835o1414J534j42422Q6720K13553m3628m57336
$$ plain form
1690 -81425 -118178 8558 -15994 -18719 -85851 -152415 -184113 -58307 -93237 -190614 -250408 -17893
1678 -17893 -43335 -300029 -506676 -588539 -422309 -84401 -113525 -321101 -403856 -58127 25585
1667 25585 -187416 -268335 73638 163717 44302 -175142 -62104 -81117 -97741 2437 -207317
1656 -207317 -211263 -222275 -106617 -32727 21979 73347 54875 49332 -46655 -144066 -242259 -109344
1644 -109344 -175535 56205 43455 54394 -34380 20670 -90759 105857 144788 -274411 62203
1633 62203 79344 -68049 -162281 -90901 101346 27567 -145661 -127005 54254 -139441 -324337
1622 -324337 -61267 -197217 -245660 -115058 -205787 -140939 -163671 -110962 -378537 -346088 -261787
1611 -261787 -299308 -192663 -156735 44100 -17314 -15780 -158202 -71482 142071 98443 -358893
1600c58893O7049P6697J98839J27867j3177k46215k24619r5542N0221K91201p5607
1589b02179P9083j31593j90945J51519M9097J05670O417j92635L2283K03867l236
1578i2652m7832p3781J15977n441k86839J21633O4761k8973J59985k9811n3174
1567a56147k66548J34825k5138K04202Q4522j8273l01255J86194J71205k01590
1557a88003j8522m7766N3084j98600R7703L37700K23347j91726K3121k04447j6673
1546a30782j39202J3131M0171N1697r3591n7545R7758K14940m8326K3421j06584
1535a34912M2740K10531j44266k1250j49544Q9669J93387j35203j63396R7866
1525a14378J2423J06216q4003j08784N5051p4091M2455n8099J43490P3183j00617
$$ plain form
1600 -358893 -291844 -215147 -16308 111559 98382 -147833 -372452 -467994 -417773 -126572 -202179
1589 -202179 -123096 -254689 -445634 -294115 -245018 -139348 -132931 -325566 -293283 -89416 -92652
1578 -92652 -140484 -214265 -98288 -103729 -390568 -268935 -204174 -233147 -73162 -102973 -156147
1567 -156147 -422695 -287870 -313008 -108806 -24284 -42557 -343812 -157618 13587 -188003
1557 -188003 -206525 -254291 -201207 -399807 -302104 35596 258943 67217 90338 -114109 -130782
1546 -130782 -269984 -256853 -216682 -164985 -258576 -316121 -218363 -3423 -51749 -28328 -134912
1535 -134912 -92172 118359 -25907 -47157 -196701 -107032 86355 -48848 -212244 -114378
1525 -114378 -101955 4261 -79742 -188526 -133475 -207566 -165111 -223210 -79720 -6537 -107154
1514a07154m2663j14393J955K22047M3774J2170j57533r1454J56913k18321P7452
1503b17207L9955q7071J46910M1756p2725j50865K0160K8772j22352M7579R919
1492c15169M06904j34185q4474P5538m3974P33J34623r3236k87346O5976m6961
1481c21571K18230K37651j53055K9501Q8653k69623K61845j42763Q7960q0788
1471d3960j39860K22955j36380j59973j05552J39865K6983J0352J09552j20385
1461a96403R1441K08672k81746J30139j71381l3993K88661j64616n5103L06039
1451A21710Q3856J1995j24841r3800j67148J02033K7422Q2588q0531n7319O8498
1440b5537k48069J75081j73351Q629K16580K5408m4020j8352j26138n7437N9665
$$ plain form
1514 -107154 -149817 -264210 -262255 -40208 3566 15736 -141797 -233251 -76338 -294659 -217207
1503 -217207 -177252 -264323 -117413 -75657 -148382 -299247 -279087 -250315 -372667 -325088 -315169
1492 -315169 91735 -42450 -126924 -51386 -95360 -94627 39996 -53240 -340586 -274610 -321571
1481 -321571 -103341 134310 -18745 10756 99409 -170214 91631 -51132 36828 -43960
1471 -43960 -183820 39135 -97245 -257218 -362770 -222905 -195922 -185570 -76018 -196403
1461 -196403 -104962 103710 -178036 -47897 -219278 -253271 35390 -129226 -184329 121710
1451 121710 205566 217561 92720 -1080 -168228 -66195 -38773 43815 -36716 -94035 -25537
1440 -25537 -273606 -98525 -271876 -263247 -46667 -21259 -65279 -83631 -209769 -267206 -207541
1429b07541Q3532R3174j65637m3440J98064J2919L995j63479L9396m2780K43804
1418E2007k73525K12651l8925Q352j9300q4663J48655N842J2076k04903J28772
1407e2961R123k40744Q4793O0052K20458K6154k89600J24893O6626o1932J75929
1396A22791r7482l90607K6875J75954J7144J37495J10236k0095j59382j04237
1386a81308k2965m1857J32740n3137J1351q9839Q9500k87055Q8984p1707K59971
1375a65322J52948P9906N5619k7260k38604j01798J1754r7476Q1436r0792M085
1364c35504L04481o3029m4414J15151n6635j1037R0978j30159J22678p585j95792
1353b10867L7679j36715L7583J42647J26239N9508n2507j73197J19017q8156J60518
$$ plain form
1429 -207541 -124009 -30835 -196472 -239912 -41848 -28929 -24934 -188413 -149017 -191797 52007
1418 52007 -221518 -8867 -47792 -39440 -58740 -143403 5252 11094 23170 -181733 -52961
1407 -52961 -43838 -284582 -199789 -139737 80721 106875 -182725 -57832 8794 -53138 122791
1396 122791 25309 -365298 -338423 -162469 -145325 -7830 102406 82311 -77071 -181308
1386 -181308 -204273 -246130 -113390 -166527 -155176 -245015 -155515 -442570 -353586 -425293 -165322
1375 -165322 -12374 67532 123151 95891 -142713 -244511 -232757 -330233 -248797 -339589 -335504
1364 -335504 -31023 -94052 -138466 -23315 -79950 -90987 -9 -130168 -7490 -15075 -210867
1353 -210867 -173188 -309903 -272320 -129673 -3434 56074 3567 -169630 -50613 -138769 21749
1342B1749J09991j33064m9932j43398O3247N5638q2117m9881Q0266N0426J81627
1331A04552j47412r8396J04629J34271j98188K5743K13286k37030R2235Q7642
1321H1332j50406p944m2612Q9516K66639j32203n4208J70763K2203q9762r5844
1310E7474j89606K09625o4870K9651J11405J50075Q383k61074j42751p094K6986
1299g1796n6406m9562N203j46409N3502M0885P6320m7676K2844r2048J04407j40720
1287c01456J29730P3948j82842J09382K13356K23514j86188r6585j41646K3854
1277a34933p959j93314M1774J5965J17949J21901k72375J1612R5143J5209J33581
1266e5447n998N3986N0141j24090M9510j8149q2714q5713R7826K2409j08207M1027
$$ plain form
1342 21749 131740 -1324 -51256 -194654 -131407 -75769 -157886 -207767 -127501 -77075 104552
1331 104552 -42860 -141256 -36627 97644 -100544 -74801 138485 -98545 -6310 81332
1321 81332 -69074 -77018 -119630 -30114 236525 104322 50114 220877 243080 153318 57474
1310 57474 -132132 77493 12623 42274 153679 303754 312137 51063 -91688 -98782 -71796
1299 -71796 -128202 -177764 -172561 -318970 -265468 -224583 -148263 -195939 -173095 -265143 -160736 -301456
1287 -301456 -171726 -97778 -280620 -171238 42118 265632 79444 -17141 -158787 -134933
1277 -134933 -142892 -336206 -294432 -278467 -160518 -38617 -310992 -299380 -204237 -189028 -55447
1266 -55447 -61445 -7459 42682 -81408 -31898 -50047 -132761 -218474 -120648 -98239 -206446 -165419
1254a65419l9604P7414J33445j02766J83298k16206m3453Q0116j58691J78888
1244g2978N5945n8232J43071p5855j78533L2638J14571K82802j47779J9966k9310
1233H6306m29798J23889J57620O7619k24492K47623J8469k23887q010J0927l2353
1222b06087Q1666J84031J32035k13050k9518J6400j1682j06820o5526L933L11952
1211I7334j99728J86486N1898l21284r838J08766J05003j53931J466K219J60793
1200B9184j38890K291n1743J23117K3752p8938J04898l477M7590j73735k2155
1189a38106J77928k58834Q5668o365K18226k25896L0402P7323j02244J91001O5354
1178A14457L5445P7236j65328j67330j89714J75109j1269L5689j16121p2433J02286
$$ plain form
1254 -165419 -205023 -127609 5836 -96930 86368 -129838 -173291 -93175 -251866 -72978
1244 -72978 -17033 -75265 67806 -8049 -186582 -153944 -39373 243429 95650 115616 86306
1233 86306 -343492 -219603 -61983 5636 -218856 28767 47236 -176651 -184661 -173734 -206087
1222 -206087 -124421 59610 191645 -21405 -50923 -34523 -46205 -153025 -218551 -214618 97334
1211 97334 -102394 84092 135990 -185294 -195132 -86366 18637 -135294 -133828 -131609 29184
1200 29184 -109706 -107415 -159158 -36041 -12289 -91227 13671 10194 57784 -115951 -138106
1189 -138106 39822 -219012 -133344 -139709 78517 -147379 -116977 -39654 -141898 49103 114457
1178 114457 149902 227138 61810 -105520 -295234 -120125 -131394 -95705 -211826 -284259 -181973
1167a81973k6863j44940M9491J23745J36474M8633j95928q5044J20436L8207O8179
1156d9583o717N2830k47385J22636P2707O4089j31626J6326J88333q0149j1803
1145a0342j91214j06281K18727J25729n7719m0803Q4970j1079j97959K37095o9904
1134a8780o9065m158M7458P5376r8792j01488Q610K06961j18753k41374L55484
1123D1479k12223P6459n3911l9001N0153R2747j31077J08776K2266J86851k91291
1112a48772j04589J39529P0959j39775J72847N1550n3003J49344j44752Q71l5983
1101d1774K36319j25592k6174j56810m3047J30802j44177J79640J44499o7064
1091H6622L5055j70256o6528J89403j62430n5321O0206j32561J71805J23390k10819
$$ plain form
1167 -181973 -208836 -353776 -304285 -180540 -44066 4567 -191361 -276405 -155969 -117762 -49583
1156 -49583 -56300 -3470 -250855 -128219 -55512 8577 -123049 -106723 81610 1461 -10342
1145 -10342 -201556 -307837 -89110 36619 -21100 -61903 23067 11988 -185971 51124 -18780
1134 -18780 -87845 -92003 -44545 30831 -67961 -169449 -160839 46122 -72631 -314005 41479
1123 41479 -170744 -94285 -148196 -187197 -137044 -44297 -175374 -66598 -44332 142519 -148772
1112 -148772 -253361 -113832 -42873 -182648 -9801 41749 -11254 138090 -6662 -5791 -41774
1101 -41774 194545 68953 42779 -114031 -157078 -26276 -170453 9187 153686 86622
1091 86622 121677 -48579 -115107 74296 -88134 -143455 -83249 -215810 -44005 79385 -131434
1080a31434M596o0357R7527j39796P9630K6129L5669N46J3680J1408p8812q4672
1068b25886J55978N7005M7412n8874k11419L01029n6885l8315j62349L2332L27990
1057A68018j04187l45750Q8046o5190L30072P3066k90004q7789K34215N1123L3019
1046H4639o2611l0181J61307j36925r8504J87058j48522n0840K63285m0383k50317
1035a21994P0861j39512N4090K13999Q8201j72599J76120l5301n6238p7141j67822
1024a67336L1662j03113K24068J44201j64730n4399M6197k07293J10401Q0738
1014e9604J36547L4236r6191Q4787J06734j48825K1868O0148k3182j83258k59492
1003c26232K0775K52927J9812j5414O4312k0009P3473j35159m341N6919j06406
$$ plain form
1080 -131434 -126838 -187195 -89668 -229464 -149834 -123705 -88036 -87490 -73810 -62402 -141214 -225886
1068 -225886 -69908 -12903 34509 -24365 -235784 65245 8360 -29955 -192304 -159972 168018
1057 168018 63831 -281919 -193873 -259063 71009 144075 -145929 -233718 497 51620 84639
1046 84639 22028 -8153 153154 16229 -82275 104783 -43739 -94579 168706 128323 -121994
1035 -121994 -51133 -190645 -136555 77444 165645 -6954 169166 133865 77627 486 -167336
1024 -167336 -135674 -238787 -14719 129482 -35248 -89647 -43450 -250743 -140342 -59604
1014 -59604 76943 111179 14988 99775 206509 57684 79552 139700 116518 -66740 -326232
1003 -326232 -305457 -52530 -32718 -48132 16180 -3829 69644 -65515 -69856 -12937 -119343
992a19343J65972K25608k83138m6205J15536k59634R0885J37196j51201q7851
982b12175j64285M4593P3529K17760J58466M6537k08758j85374M4613p563K04735
971A2078K4800J68361l6551j88502q6012K67904l1998r5429J68172J8199o7819
960A53203j86755j28358N181L47346J34179j76401k92223j33501o1224o5310j0088
$$ plain form
992 -119343 46629 272237 -10901 -57106 58430 -201204 -110319 26877 -124324 -212175
982 -212175 -376460 -331867 -258338 -40578 117888 164425 -44333 -229707 -185094 -192657 12078
971 12078 36878 205239 168688 -19814 -105826 162078 130080 34651 202823 221022 153203
960 153203 -33552 -161910 -156729 190617 324796 148395 -143828 -277329 -338553 -403863 -413951
$$ [...]
##END NTUPLES=NMR SPECTRUM
##END=
