##TITLE=1H_CA-8908-2
 CDCl3, 8 sc, 
 3.08.2021
##JCAMPDX= 6.0         $$ Bruker NMR JCAMP-DX V2.0
##DATA TYPE= NMR SPECTRUM
##DATA CLASS= NTUPLES
##ORIGIN= UXNMR, Bruker Analytische Messtechnik GmbH
##OWNER= root
$$ XWIN-NMR		Version 3.5
$$ Tue Aug  3 12:12:19 2021 Russian Standard Time (UT+4h)  she@DPX200
##.OBSERVE FREQUENCY= 200.131506
##.OBSERVE NUCLEUS= ^1H
##.ACQUISITION MODE= SIMULTANEOUS
##.ACQUISITION SCHEME= undefined
##.AVERAGES= 8
##.DIGITISER RES= 18
##SPECTROMETER/DATA SYSTEM= spect
##.PULSE SEQUENCE= zg30
##.SOLVENT NAME= CDCl3
##.SHIFT REFERENCE= (INTERNAL, CDCl3, 0, 17.4934)
##AUDIT TRAIL= $$ (NUMBER, WHEN, WHO, WHERE, WHAT)
$$ ##TITLE= Audit trail, XWIN-NMR		Version 3.5
$$ ##JCAMPDX= 5.01
$$ ##ORIGIN= Bruker BioSpin GmbH
$$ ##OWNER= she
$$ F:/spectra/data/she/nmr/H-F/1/pdata/1/auditp.txt
$$ ##AUDIT TRAIL=  $$ (NUMBER, WHEN, WHO, WHERE, WHAT)
(   1,<2021-08-03 12:09:55.68 +0400>,<she>,<DPX200>,
      <created by zg, POWCHK disabled, PULCHK disabled
       configuration hash MD5:
       00 E9 B6 7A A2 85 ED C7 34 08 36 98 17 FE 4E 26
       data hash MD5: 16K
       FC 5A B5 54 38 14 26 45 D9 AF D7 B6 8F 75 C3 64>)
(   2,<2021-08-03 12:10:58.04 +0400>,<she>,<DPX200>,
      <Start of raw data processing
       efp BC_mod = 2 LB = 0.24 FT_mod = 6 PKNL = 1 PHC0 = -13359.1 PHC1 = 18.80099 SI = 16K 
       data hash MD5: 16K
       C7 2F 62 BE 6E 57 CB 97 92 64 AC D1 C2 BA E6 8E>)
(   3,<2021-08-03 12:11:23.28 +0400>,<she>,<DPX200>,
      <pk PHC0 = 2.928972 PHC1 = -6.6 
       data hash MD5: 16K
       96 BA 39 46 A7 C0 59 96 06 45 B9 21 7F 44 27 30>)
$$ ##END=
$$ 
$$ hash MD5
$$ 26 FB F9 75 C3 C9 1D D9 3C 36 25 02 6E 30 EC 6B
##$RELAX= 
##$RELAX= 
##$RELAX= 
##$RELAX= 
##$RELAX= 
##$RELAX= 
$$ Bruker specific parameters
$$ --------------------------
##$DU= <F:/spectra>
##$EXPNO= 1
##$NAME= <H-F>
##$PROCNO= 1
##$TYPE= <nmr>
##$USER= <she>
##$AMP= (0..31)
100 100 100 100 100 100 100 100 100 100 100 100 100 100 100 100 100 100 
100 100 100 100 100 100 100 100 100 100 100 100 100 100 
##$AQSEQ= 0
##$AQ_mod= 1
##$AUNM= <au_zg>
##$AUTOPOS= <>
##$BF1= 200.13
##$BF2= 200.13
##$BF3= 200.13
##$BF4= 200.13
##$BF5= 200.13
##$BF6= 200.13
##$BF7= 200.13
##$BF8= 200.13
##$BYTORDA= 1
##$CFDGTYP= 0
##$CFRGTYP= 5
##$CHEMSTR= <none>
##$CNST= (0..31)
1 1 145 1 1 1 1 1 1 1 1 1 1 1 1 1 1 1 1 1 1 1 1 1 1 1 1 1 1 1 1 1 
##$CPDPRG= <>
##$CPDPRG1= <>
##$CPDPRG2= <>
##$CPDPRG3= <>
##$CPDPRG4= <mlev>
##$CPDPRG5= <mlev>
##$CPDPRG6= <mlev>
##$CPDPRG7= <mlev>
##$CPDPRG8= <mlev>
##$CPDPRGB= <>
##$CPDPRGT= <>
##$D= (0..31)
0 1.2 0 0 0 0 0 0 0 0.06 0 0.03 0 0 0 0 0.0002 0 0 0 0 0 0 0 0 0 0 0 0 
0 0 0 
##$DATE= 1627978195
##$DBL= (0..7)
120 120 120 120 120 120 120 120 
##$DBP= (0..7)
150 150 150 150 150 150 150 150 
##$DBP07= 0
##$DBPNAM0= <>
##$DBPNAM1= <>
##$DBPNAM2= <>
##$DBPNAM3= <>
##$DBPNAM4= <>
##$DBPNAM5= <>
##$DBPNAM6= <>
##$DBPNAM7= <>
##$DBPOAL= (0..7)
0.5 0.5 0.5 0.5 0.5 0.5 0.5 0.5 
##$DBPOFFS= (0..7)
0 0 0 0 0 0 0 0 
##$DE= 6
##$DECBNUC= <off>
$$ [...]
##$SUBNAM2= <"">
##$SUBNAM3= <"">
##$SUBNAM4= <"">
##$SUBNAM5= <"">
##$SUBNAM6= <"">
##$SUBNAM7= <"">
##$SUBNAM8= <"">
##$SUBNAM9= <"">
##$SW= 20.0188882624521
##$SWIBOX= (0..15)
0 0 2 0 0 0 0 0 0 0 0 0 0 0 0 0 
##$SW_h= 4006.41025641026
##$TD= 16384
##$TD0= 1
##$TE= 0
##$TE2= 300
##$TE3= 300
##$TEG= 300
##$TL= (0..7)
0 120 120 120 120 120 120 120 
##$TP= (0..7)
150 150 150 150 150 150 150 150 
##$TP07= 0
##$TPNAME0= <>
##$TPNAME1= <>
##$TPNAME2= <>
##$TPNAME3= <>
##$TPNAME4= <>
##$TPNAME5= <>
##$TPNAME6= <>
##$TPNAME7= <>
##$TPOAL= (0..7)
0.5 0.5 0.5 0.5 0.5 0.5 0.5 0.5 
##$TPOFFS= (0..7)
0 0 0 0 0 0 0 0 
##$TUNHIN= 0
##$TUNHOUT= 0
##$TUNXOUT= 0
##$USERA1= <user>
##$USERA2= <user>
##$USERA3= <user>
##$USERA4= <user>
##$USERA5= <user>
##$V9= 5
##$VALIST= <valist>
##$VCLIST= <CCCCCCCCCCCCCCC>
##$VD= 0
##$VDLIST= <DDDDDDDDDDDDDDD>
##$VPLIST= <PPPPPPPPPPPPPPP>
##$VTLIST= <TTTTTTTTTTTTTTT>
##$WBST= 1024
##$WBSW= 4
##$XGAIN= (0..3)
0 0 0 0 
##$XL= 0
##$YL= 0
##$YMAX_a= 118228
##$YMIN_a= -196825
##$ZGOPTNS= <>
##$ZL1= 120
##$ZL2= 120
##$ZL3= 120
##$ZL4= 120
##$ABSF1= 0
##$ABSF2= 0
##$ABSG= 0
##$ABSL= 0
##$ALPHA= 0
##$AQORDER= 0
##$ASSFAC= 0
##$ASSFACI= 0
##$ASSFACX= 0
##$ASSWID= 0
##$AUNMP= <proc_1d>
##$AZFE= 0.1
##$AZFW= 0.1
##$BCFW= 0
##$BC_mod= 2
##$BYTORDP= 0
##$COROFFS= 0
##$CY= -3
##$DATMOD= 1
##$DC= 0
##$DFILT= <>
##$DTYPP= 0
##$F1P= 0
##$F2P= 0
##$FCOR= 1
##$FTSIZE= 16384
##$FT_mod= 6
##$GAMMA= 0
##$GB= 0
##$INTBC= 1
##$INTSCL= 1.334414e-10
##$ISEN= 128
##$LB= 0.24
##$LEV0= 0
##$LPBIN= 0
##$MAXI= 10000
##$MC2= 0
##$MEAN= 0
##$ME_mod= 0
##$MI= 1.114404
##$NCOEF= 0
##$NC_proc= -9
##$NLEV= 6
##$NOISF1= 3.799351
##$NOISF2= 2.8
##$NSP= 0
##$NTH_PI= 0
##$NZP= 0
##$OFFSET= 17.49344
##$PC= 1
##$PHC0= -13356.17
##$PHC1= 12.20099
##$PH_mod= 1
##$PKNL= yes
##$PPARMOD= 0
##$PSCAL= 0
##$PSIGN= 0
##$REVERSE= no
##$SF= 200.130008242649
##$SI= 16384
##$SIGF1= 3
##$SIGF2= 2
##$SINO= 5.538805
##$SIOLD= 16384
##$SREGLST= <1H.CDCl3>
##$SSB= 0
##$STSI= 16384
##$STSR= 0
##$SW_p= 4006.41025641026
##$SYMM= 0
##$S_DEV= 0
##$TDeff= 16384
##$TDoff= 0
##$TI= <>
##$TILT= no
##$TM1= 0
##$TM2= 0
##$TOPLEV= 0
##$USERP1= <user>
##$USERP2= <user>
##$USERP3= <user>
##$USERP4= <user>
##$USERP5= <user>
##$WDW= 1
##$XDIM= 16384
##$YMAX_p= 422643683
##$YMIN_p= -3121322
$$ End of Bruker specific parameters
$$ ---------------------------------
##NTUPLES= NMR SPECTRUM
##VAR_NAME=  FREQUENCY,     SPECTRUM/REAL,   SPECTRUM/IMAG
##SYMBOL=    X,             R,               I
##VAR_TYPE=  INDEPENDENT,   DEPENDENT,       DEPENDENT
##VAR_FORM=  AFFN,          ASDF,            ASDF
##VAR_DIM=   16384,         16384,           16384
##UNITS=     HZ,            ARBITRARY UNITS, ARBITRARY UNITS
##FACTOR=    0.24454680195387, 1,            1
##FIRST=     3500.96241708429, 0,            0
##LAST=      -505.447839325971, 0,           0
##MIN=       -505.447839325971, -3121322,    0
##MAX=       3500.96241708429, 422643683,    0
$$ Real data points
##PAGE= N=1
##DATA TABLE= (X++(R..R)), XYDATA
$$ [...]
9036 12100065 12935149 12534234 12075797 12066468 12513743 13002710 12768572 12520547 12665972 12199894
9026 12199894 13157401 13122713 12917581 13341283 13727029 14708014 14121513 14604105 14367205 13998052
9016 13998052 14353551 14116033 14271135 14152860 13319378 13798962 13854164 14429694 14255087 14724618
9006 14724618 14596485 14804831 14388581 14616647 14652078 15124335 15868161 15270739 15620185 17099988
8996 17099988 17633936 16837538 17436262 17220530 17879501 18029538 18376504 18283396 18206235 18139190
8986 18139190 18234000 18011879 18042951 19019606 19278412 19483555 19625931 19987745 20326666 20833148
8976 20833148 21092500 21079236 22480425 22413212 22575484 22311654 23272591 23547725 23566752 25014970
8966 25014970 24792014 25304629 26121313 25757217 26633221 26522554 27475177 28749937 29542470
8957 29542470 28732996 28950930 29828204 30469219 30629638 31361389 31312410 30892240 31585829 32201794
8947 32201794 31051807 31616347 31891116 32542112 32009039 31157538 31352802 30881045 31747919
8938 31747919 32587557 32113721 32172555 32322103 31290018 30481098 30462088 30708045 28845497
8929 28845497 29234266 29466946 28218936 27740207 27618447 27423073 26760045 26157242 25974376
8920 25974376 25575058 24203475 24367375 24576093 24095714 24062235 22444848 21951404 20852403
8911 20852403 20962551 21663789 20988979 21065376 21882444 20553628 20216271 20848749 21030169
8902 21030169 20090709 19860219 19545823 19915620 19835545 19579396 19293004 18811390 19816580
8893 19816580 19669293 19705317 20832807 22212117 22375926 22302449 21774479 21123605 21864292
8884 21864292 21231904 19370612 18478097 18150187 18049731 17364588 15914341 14802952 15539512
8875 15539512 15444316 15379385 14926683 14585297 15052196 14720622 13981695 13979581 14467748 14922563
8865 14922563 14582308 14567910 14191212 13609050 13862056 13349773 13133202 13749091 13355813 12721464
8855 12721464 12732446 12882486 12859133 12140546 12052914 12134624 11723626 11381363 10998277 10812907
8845 10812907 10379021 10422554 11409946 11281055 11248853 11159520 11486589 10689219 10788068 10244122
8835 10244122 9757974 8925552 9391279 10318750 10376022 10585992 10964286 10187911 9949915 10150788
8825 10150788 10467995 10599544 9940299 10364120 10586409 10259461 9720674 9386464 9953643
8816 9953643 10649574 9864724 9406517 9407277 9271890 9997627 9197592 8967052 10535257 10586362
8806 10586362 10421222 9253911 9085053 10172050 10408914 10020534 10314914 11269276 10759034
8797 10759034 10445162 10570418 9266197 8804676 8741574 9660236 10007062 10162317 10266645
8788 10266645 10583020 10003453 9926984 9941493 9942271 9681237 9410208 9396829 10232595 10045610
8778 10045610 10787619 10512959 10251897 10931080 10942873 10720200 10171814 11236838 10056873
8769 10056873 10480734 10539144 10146054 10410359 9927917 9634548 10159709 10741457 10893645 10407038
8759 10407038 9646740 10136520 10703790 11412248 10502200 10455576 11191772 11302733 11475521 10461857
8749 10461857 11313476 11444608 10637708 10891700 10336076 10005598 11200043 11796320 10694128
8740 10694128 10502508 10514784 10515881 10947864 10385141 10953369 10813662 10201541 10418051 10755166
8730 10755166 10616336 10692364 10581425 10643850 11772356 11336082 10926698 11493277 11483987 10668664
8720 10668664 10765121 10540855 9665500 10718596 10620555 11130995 11617101 10775318 10093207 11176927
8710 11176927 11539957 11467565 11960232 11850815 12277024 11798838 11900034 11747599 12342673 12080576
8700 12080576 12852617 12516393 12268674 11746847 12410145 12211412 11388448 11950297 11805317
8691 11805317 12095155 12530068 13239233 11911352 11568153 12201212 12342753 11838991 12410114
8682 12410114 13166998 13414572 13468316 13024143 12477894 11730167 11833302 12799021 12877064 12864384
8672 12864384 12920940 12337028 13191691 13203090 13066248 14206557 14373962 15268517 14608638 13730125
8662 13730125 15021398 15234141 15420664 15215022 15792913 15810924 16199123 17186813 16563762
8653 16563762 15606616 15781474 16720892 17875883 18754743 17917318 18369269 19073538 19360920
8644 19360920 19428929 19651313 20074156 21742995 22363667 21732673 22405106 22534864 22924082
8635 22924082 23466157 24702221 25593055 27475781 28296501 28858065 30411308 32310840 34340219
8626 34340219 36876662 39752645 42775160 45670947 48593047 52092568 55392875 58166377
8618 58166377 60068321 63009631 63563942 62893048 61475293 59835641 56395990 53057239
8610 53057239 49268934 44960626 41773675 38890874 35670144 34636583 32570975 30347399
8602 30347399 29377628 28899608 27599764 26308425 25945292 24843601 23811737 23085935 22318278
8593 22318278 22171768 22815952 22219926 22418875 22628029 21641179 20235606 19727856 19948170
8584 19948170 19769861 19750332 19306967 19098877 19169853 19383357 18747895 17727003 17494408 18803531
8574 18803531 19617313 19175156 18601430 18451213 18520530 18005175 17488434 16789020 16561145 16898148
8564 16898148 17874861 17696508 18946636 18166039 16894600 17751052 18738478 19461921 19587177
8555 19587177 17993088 18179752 18733600 19112892 19568383 20333918 20943084 20862236 20449780
8546 20449780 19706362 18977829 19699043 19082245 21041726 21466440 19672610 19617958 19414204
8537 19414204 19864850 19393531 18995783 18603498 17863797 17323670 18386092 18214465 18704352
8528 18704352 19088565 18772097 18619004 19900654 19557030 19552328 19421551 20119961 19961491 20322416
8518 20322416 20609131 19924003 20421293 20375822 20867570 20941720 20455971 20207449 20811307 20041665
8508 20041665 19663945 20361149 20121707 19402988 20558909 20559977 19670871 19871179 20404306 20180276
8498 20180276 20097173 19923002 19996507 19373232 19746503 18944818 19022124 20257544 20088749 19897076
8488 19897076 19231934 20272421 19588953 18487691 19045263 20174118 20272824 20909602 20752819
8479 20752819 20725533 20484782 20384154 20639796 20825900 19937636 19998340 20388444 20974147 21401306
8469 21401306 20004797 20678912 20834408 22392350 21902388 21632567 21777130 21973478 22359979
8460 22359979 22182383 22543400 22951078 22860923 23075061 23047489 23570333 23940482 23509041 23653783
8450 23653783 23402575 23874923 24285230 24458916 23909283 24483681 25447439 25554066 26257444
8441 26257444 27140377 27181066 27247756 27159215 27677729 28398195 27954440 28001369 28103809 28257228
8431 28257228 28637107 28318999 26984812 26857073 27499578 27907032 28711592 28775387 29250322
8422 29250322 28467002 29022765 28771773 29633086 29465208 29773126 30989189 31493392 32142157
8413 32142157 32551673 32940259 33412610 33814698 34511286 35208147 34604395 34098169 34284251
8404 34284251 34693223 35340142 35992212 36720959 36813596 37462053 37590654 36638217 37418076 36816347
8394 36816347 36283292 35870777 36236461 36594908 37211651 37180043 37037969 37416920 38755077
8385 38755077 38884284 39075511 39535026 40235292 41435908 41883638 42587943 42434153 43381100
8376 43381100 43972379 45481685 45921258 46008163 47032207 47175785 47707251 48100868 49342884
8367 49342884 49553746 49846655 51675462 53931411 54238034 54108339 54888545 55825820 57419641
8358 57419641 57619931 58449292 60754547 61354742 61954097 61853283 63162906 65032451 64991398
8349 64991398 65582737 66569225 68449855 69633074 71001834 71978362 73367865 75363163 75502341
8340 75502341 75759371 77120795 78178693 79198725 80854660 83854968 86264872 86874313
8332 86874313 88390325 91104176 93423558 94836138 96900283 98293957 99857462 101090629
8324 101090629 102516099 104211569 106040239 108725812 109972842 110969232 112542983 113264464
8316 113264464 115234419 118594361 120840986 122990538 124507554 125361155 127397639 129770719
8308 129770719 132725204 134559416 134756947 136397558 135970067 135823149 134916544 131341889 129605719
8299 129605719 126632785 124622328 124308774 123405788 122426196 121985865 121668276 121433959 121958504
8290 121958504 122759396 122690622 124316732 124962650 124657939 127053355 127216679 126851298 127178003
8281 127178003 127742236 128568212 128905539 129109173 129669821 130140763 131672810 132329507 132988983
8272 132988983 135800058 138602706 139888478 140711608 140093697 138926208 136212906 132798930
8264 132798930 128749547 125554611 122297200 120277027 119616932 118045904 116867150 115767262
8256 115767262 114963509 114668658 114395245 113664223 114342550 115429681 115615101 115432544 115473903
8247 115473903 115540653 114865695 114944044 115086800 114014857 113641538 113465166 113541701 112578572 112437756
8237 112437756 112676708 113110439 114231763 115852820 117268095 118332859 118424838 118671572 118094852
8228 118094852 118293996 118059163 116766451 116010974 114715244 113458904 112284208 110330282
8220 110330282 108305963 107018680 104393661 101250143 98756648 96960092 93921404 91487084
8212 91487084 89795224 88112293 85966701 84237995 84260921 82498089 81081933 79483751
8204 79483751 80232454 80235280 79016761 78698670 79501022 79589170 80368939 79790274 80366513 79688914
8194 79688914 80483566 77184281 76777590 86034110 85887532 87515647 89080301 91429514 91516478
8185 91516478 94585312 97986529 100413654 103306180 106415106 109797198 112832214 115630857
8177 115630857 119700455 123346931 126032859 129172399 131408257 133750644 135349442 137531186
8169 137531186 139162576 141055906 141225010 141494058 140952459 139392670 136748067 134398024
8161 134398024 131219152 127716922 123535640 120175929 116042911 112920617 110317135 107756360
8153 107756360 106725789 105584678 103943613 104457253 104396049 105464498 106327459 107078990 108163925
8144 108163925 110245330 111946128 113940827 116071634 118087097 121395217 122784653 124832393
8136 124832393 126878544 128876816 130290849 132014883 134174375 136526867 137706743 139099743
8128 139099743 139699520 139719378 138085081 136061210 132582899 128679797 124035023 119676899
8120 119676899 116385350 114129375 112666089 109765369 108075185 106468049 105482769 105858406
8112 105858406 104576738 103613816 103380728 102254719 101659781 101276935 101620276 101735558 102470965
8103 102470965 101694251 101110062 100950661 102324569 104259965 105157094 106714160 107410548 108070832
8094 108070832 110349478 112431003 114360262 116598994 119227278 121646951 123332564 125377222
8086 125377222 127811324 130266389 132357677 134017409 135541832 137380762 138746056 140773782
8078 140773782 143733148 146336872 148562266 151465756 154580917 156652019 158300489 160178957
8070 160178957 161692756 163659347 165159121 167546521 168302879 169713973 169915862 169305733
8062 169305733 170351912 171306928 171808277 172543828 172188511 172699221 174428889 176390684 178032099
8053 178032099 178923482 180056231 182736466 186170246 188253960 190834041 193538666 195415052
8045 195415052 196994542 196884486 195501131 194430078 192938058 191095657 188700675 187180619
8037 187180619 185405469 184315368 183412748 181752074 180042991 180363932 178986322 177125458
8029 177125458 176860259 176327109 176339879 175731501 176797267 176902975 177799830 178235323 179407249
8020 179407249 181273059 183962360 187414941 191046737 196511138 201646582 208671491 216448924
8012 216448924 224506794 230811407 236783155 243356490 244885828 236645662 223505103 212396744
8004 212396744 205668014 200027042 196560007 194006676 191829411 190482250 188924712 187836933
7996 187836933 187972790 187460818 188197732 188951382 189626962 192020951 192482712 195075513 198329017
7987 198329017 201556776 204898960 208389440 214255479 220276794 225846923 233587973 240266310
7979 240266310 247209392 254631272 261772637 268201468 273447653 278064017 279386814 280257469
7971 280257469 278738642 276394627 271867626 265689404 258512223 252774029 246286343 239320659
7963 239320659 232878532 226897294 221176683 216155054 210919603 205790608 202737310 199118905
7955 199118905 195626677 193292024 191051015 188530093 187253204 186632083 184672040 182676378
7947 182676378 180957995 179312261 179035294 177515325 176902531 175359302 173501527 171943779
7939 171943779 171054030 170843820 169623143 168740258 168168265 167647865 166227490 165640744 165609443
7930 165609443 164733804 164254513 163457704 162435743 162166402 162105244 162143494 160919074 159936904
7921 159936904 159762811 158639383 157476521 157367436 156519746 156894173 156519624 156605311 157379634
7912 157379634 157554331 158083335 158105418 159269873 159962035 161342186 161609510 161930363 162748272
7903 162748272 164729332 165130820 166448460 167157795 167998256 169334116 168733791 169069402 170131838
7894 170131838 169797516 169772716 168874129 167644712 166304995 164976852 164831148 163225218 161646491
7885 161646491 161109360 159438313 158525604 157647598 157352866 156496302 156015649 155377726 156325811
7876 156325811 158039879 158177187 158406477 159100111 160530193 161644036 161876268 161317268 160406444
7867 160406444 160284337 159838232 158072888 156520845 154876275 152813003 150209555 148745385
7859 148745385 146652541 145277339 143579055 142071343 142175555 142088235 141844996 142191676 142791231
7850 142791231 144162737 145937663 146199051 147542143 148641006 149766982 150311897 150364279 148162777
7841 148162777 147923711 148787883 147389111 146682583 144195093 142353766 141110564 139828187
7833 139828187 138071612 137440144 135534403 135055203 133758462 132793914 133178051 132798273 132244364
7824 132244364 131863553 131777365 132138375 131609466 132217973 131734130 130532135 130230028 129236656
7815 129236656 128106668 125922228 124076703 121789004 119244367 116997984 115092779 112216083
7807 112216083 108792661 105255397 102622340 101175240 99535581 98236063 95066867 93725237
7799 93725237 92520175 92032537 90786738 90434662 90426388 89407862 88380380 87818435 88072458
7790 88072458 86729002 85245021 84453053 83709743 82788993 81143944 78401519 76896421 74263221
7781 74263221 71366799 68729544 66662643 64432717 64019402 62450703 60279612 58729550
7773 58729550 58255549 56620869 54720207 53955010 52338056 51498372 50377860 49791845 48997387
7764 48997387 47772325 46492839 46151464 45432683 45098936 43632996 43017589 42923646 42531040
7755 42531040 42476270 40901839 40611300 40346637 39613436 38513041 38549171 38265788 36786223
7746 36786223 35652221 35596262 35731492 36438829 36549743 35911944 35164281 34954519 34636959
7737 34636959 34115864 33303318 32067557 31205059 30878961 31664999 30455773 30857773 30422396
7728 30422396 30908876 31080889 29769352 29405850 29353216 29933856 28488103 28383233 28880077
7719 28880077 28577106 27804429 27916872 27525324 26949093 27234644 27167492 27267077 27412609 26821455
7709 26821455 26557692 26699902 26983188 27570319 25961636 25941040 26316369 26352939 25274595
7700 25274595 24655095 25043438 25417379 25120881 24590374 24401479 24544482 25784498 25474561
7691 25474561 25317778 25881571 26162849 24901458 23490858 22827017 23406129 23736103 23527618
7682 23527618 22926290 22852778 21589969 21967207 22158010 22477224 22375099 22154923 21670200
7673 21670200 22136370 21758273 21206022 21423487 21451178 21353962 21949498 21211634 20525519 20905797
7663 20905797 20701254 19951512 20129237 20871939 20595059 19360424 20377512 20256538 20249167
7654 20249167 20281411 20351970 20313755 20010653 20148660 18873900 19884258 19668015 19864219 19632842
7644 19632842 20786835 20090101 19290024 19972559 20517757 18910541 19365622 19372943 19063211
7635 19063211 18703082 19200466 19830296 19421462 18287316 19206289 19158194 18447897 19578451
7626 19578451 20441804 19827426 19996762 19891313 19749321 19205459 18764544 19313021 17954824
7617 17954824 18444881 19177830 19683865 19660554 19246073 19609056 18417091 18282423 18434057
7608 18434057 18106365 17638673 18213104 18512781 18343887 18653361 17828600 18647397 18906892
7599 18906892 19082169 17694819 17740867 17923541 18563303 19133681 19161710 19200794 17746943 17202143
7589 17202143 17140572 17218743 17351687 17570390 17732698 17808197 17565041 17181058 17119738 16940829
7579 16940829 17185532 16353781 17172694 17164377 17072294 16595010 17595371 17344115 17462539 18016982
7569 18016982 17573697 16472143 16586303 16519616 16389793 16345835 15875158 16869811 15842178
7560 15842178 16172948 15891785 15811542 15138621 15159686 15248493 15665825 15979933 15093785 14563891
7550 14563891 14573074 15115161 14828456 15007239 16019803 15043580 15056743 15398152 15819280 15784587
7540 15784587 15572744 15986077 15418665 15808962 14995489 14506356 15417774 15790436 15450868
7531 15450868 15553351 16221256 16251765 15563784 14273217 14850088 14645668 15316892 15772410
7522 15772410 14309494 14155933 15113651 14854526 14876216 14743154 15285904 15916289 15366380
7513 15366380 14835996 14820009 15088987 15516734 15054909 14473571 14749973 14949111 13595944
7504 13595944 14389348 13771068 14188768 15083168 15939062 15348047 14341887 14250027 13744012
7495 13744012 14066357 13914924 14065104 14413937 14185779 14107199 14345321 14119501 14279374 14112984
7485 14112984 14823210 14641564 14337321 14090776 14347230 13943116 14274975 13799757 14247400
7476 14247400 14365291 14582649 14912934 14985184 14718743 14530114 14553880 14267851 13135948 14006861
7466 14006861 14483181 14113412 14233771 14420698 13538431 14048001 13061993 13551868 14619522
7457 14619522 15192971 15070785 14080129 13771399 13134175 12807654 12883046 13180104 13704615 13835874
7447 13835874 13503529 13876303 13032001 13618611 14321385 14186556 15142414 14371041 14029886
7438 14029886 14739905 13989702 13703041 13908432 14050200 14340482 14771224 14348787 14474327
7429 14474327 14404898 13791890 13979932 14056006 13726699 13977034 14331640 14581261 14233103 13978213
7419 13978213 13740679 13159585 12659845 12988396 13982079 14576571 13525865 13327471 12956761
7410 12956761 12934350 13854502 13505311 13475043 13301237 13772045 13379942 12946038 13456036 13718699
7400 13718699 13465315 13562646 13621825 13985830 14001697 13508736 14194895 13783734 13913160 13908123
7390 13908123 14230693 14446065 14278669 14769786 14777726 14296778 14854211 14135793 13628215 14135077
7380 14135077 14505801 13896925 12988024 13382538 13581625 13330845 12977896 12638322 12744025
7371 12744025 12943887 13612508 13242005 12772946 13423447 14008350 13144093 13048133 12500747 12014813
7361 12014813 13539368 13753602 13418569 13790764 12604276 12911424 13494366 13292049 13683853
7352 13683853 13785187 13724504 13743490 12934214 12767003 13767634 14286294 13437641 13348449 13440555
7342 13440555 13491207 13379768 13415524 13596488 13502587 13316040 12692432 13244836 12707498 13606490
7332 13606490 14688071 14008318 14381887 14362984 14141153 13842678 13423435 13568828 13966667
7323 13966667 14348660 14236904 14096436 14619734 14409701 12845205 13248542 13468381 13058888
7314 13058888 13224744 13424111 13604277 13318746 12575531 12996131 13052502 12937235 12325321 12515216
7304 12515216 13492280 13826347 12999456 13615951 13375211 13092298 12960462 13288009 13789191
7295 13789191 13716698 13648731 13325648 13056669 13798270 13770753 13366986 14362751 14155804 14320248
7285 14320248 13484134 13450931 13743799 15207805 14495037 13448804 13611916 13664626 12913806
7276 12913806 13439081 13838185 13193829 14624260 14322730 13695561 13996503 14343306 13275816
7267 13275816 13556727 13579760 12795084 13025785 13584835 13785502 13530196 13157237 13314795 14319395
7257 14319395 13255181 13611027 13143883 13146195 13871893 14802777 14197028 13334924 13973546 14316653
7247 14316653 14557966 13207820 13669486 13888688 14433918 14470530 13931820 13480705 13423901 13363727
7237 13363727 13373271 13739025 14135227 14890312 14734346 13787506 14439070 13647614 14107722 14263191
7227 14263191 13649797 13241935 13016413 13322880 14492175 14101616 13589214 14127447 14166934
7218 14166934 13856467 13425420 14609739 13752661 13747680 13917067 13888685 13310714 12933436 13500387
7208 13500387 13914853 13896206 13889010 13710399 13435024 14156530 14112969 15115627 14675550 14447686
7198 14447686 14724610 14588999 14591074 14227966 14335627 13897147 13522044 13496640 13791406 13640340
7188 13640340 13827041 14885198 14882222 13895187 14018988 14240216 14545842 14702718 14599524 14739750
7178 14739750 14946909 14480990 14294142 14234306 14165292 14485239 14939810 14945810 15284064 14577835
7168 14577835 14345642 15507100 14495113 14748978 14917058 14622334 14460687 14935696 14337819
7159 14337819 13758561 14781044 14512122 13779482 14382771 13471735 13320836 13788090 14757529
7150 14757529 14822047 14151662 14542683 13426564 14450115 14874445 15317476 15070125 15718370
7141 15718370 14818416 14106503 13666558 14202612 14156840 14572335 14709677 15127236 15386821 15098662
7131 15098662 15377500 15659929 14950269 13781733 14358129 14833544 14408128 14326883 15008667
7122 15008667 15119687 14813948 15132981 15174828 14308307 13697771 13811342 14477707 14740023 14570340
7112 14570340 14684334 15220227 15001597 15157601 15222964 14695852 15100298 14452208 14232800 14426994
7102 14426994 15417156 15688952 15618935 14875729 13511071 13510841 13595517 14860912 14634443 15169837
7092 15169837 15298322 16102570 16373165 15267173 15823112 15398003 15572032 15587478 14678807
7083 14678807 14476091 14679458 15320657 15614473 15259377 14599257 14917236 14354799 15059966
7074 15059966 15165250 15444974 15786208 15671909 15339971 15298119 15123910 14718125 15965546
7065 15965546 15871199 14793915 14583465 15890854 16594003 16365860 16219779 16141707 15405673
7056 15405673 14837173 15379297 16138944 15494611 15500041 15710207 15237173 16059050 15732914 15484973
7046 15484973 15675781 16096023 15942553 15054828 14928774 15722608 15087448 15571822 15743227
7037 15743227 15582058 15546731 14934210 14401913 15561935 15338078 14697811 14493348 15208360
7028 15208360 16121917 15991481 15279011 14925483 15011703 16027801 15674624 15963098 16232419
7019 16232419 15949845 16323875 15855665 15124504 14657080 15733856 17160653 16386638 16055664
7010 16055664 15480024 14714547 16004412 16641728 16648394 15967034 15804269 16096520 15894072 15715553
7000 15715553 17909069 16598305 16808659 16553997 17175302 16365949 16378107 16582814 16037093
6991 16037093 17164877 17003966 16440961 16320926 17671321 17305914 17614638 17997240 16918301
6982 16918301 17554447 17140294 16755508 16598808 16300793 16999390 17623682 17843861 17295581
6973 17295581 17330436 16885065 17658343 17565542 17342823 18351964 17952820 16770216 16763006 17294554
6963 17294554 17364355 17431556 17030314 16435745 17144406 17326618 16512706 17226055 18345171 18348559
6953 18348559 17356657 16850624 17828433 17850173 17680775 17874472 17088048 16931056 17233693 17811818
6943 17811818 17658999 17641965 17760134 17593300 17999601 17415454 17191927 17790421 17516126 16224956
6933 16224956 16993956 17398969 16877236 17082513 15842694 15861185 17133105 16866797 16377799
6924 16377799 16832758 17858075 17213505 17735162 17897071 17890998 17778044 17956853 18739586 18049519
6914 18049519 18083193 17934058 17122974 16706793 17479615 17007585 16839501 16916740 17531782 17781241
6904 17781241 17848635 17466183 17674575 17079732 16999500 17649219 17298463 17034722 17213854 17102005
6894 17102005 17840476 17133254 16318721 17034268 17032204 16686548 16775285 17026114 16729633 16376522
6884 16376522 16156391 16836415 17189000 16783899 16934359 17265141 16476269 16092487 15725929
6875 15725929 16189373 16451812 17758390 17459569 16869504 16677503 17311430 17041306 16223746
6866 16223746 16984339 17293575 16760918 16698888 16748656 16560907 17180606 16932094 16792441 15495627
6856 15495627 15815290 16602447 17247822 17494929 17027718 16739558 16415482 16272515 16417732
6847 16417732 16288170 16665058 16681267 16248397 16115694 16804038 17006735 16806014 16244311 16584921
6837 16584921 17322614 17319381 17265178 16457515 15997089 15885176 15632474 15901258 15895104 15579904
6827 15579904 15612960 15380347 15433552 16230811 16232685 16277205 16440768 16485089 16050252 16120475 16691976
6816 16691976 15442003 15851396 15235056 14813391 15036988 14686952 14606771 15507972 15247529
6807 15247529 16040888 16065007 15641997 15366927 15037222 16023262 16271656 16142875 15602819 13981947
6797 13981947 14255643 15188858 15198272 14687953 14577007 14165486 14356387 13885650 15033335 14533577
6787 14533577 14541107 14674653 14719420 14440139 14225701 14498401 13822439 14682111 14010578 14921055
6777 14921055 14343676 15040639 15298618 14523488 14791915 14256694 14703461 14382841 14343957 14569226
6767 14569226 14178596 14359729 13580899 13514921 13717141 14054820 13981844 13971568 15101205 14284279
6757 14284279 13860158 12278449 12495807 13274173 13775062 13948883 13651078 13243515 13363858
6748 13363858 14886095 14670434 14265860 14511262 14322146 13697764 13771682 13838093 14024553 13468722
6738 13468722 13568974 13147314 13624093 14319051 14583869 13758730 14695772 13850421 13919599 13318223
6728 13318223 12804532 13230215 12995839 12570373 13143862 13458670 13412536 13370090 13363522 13553100
6718 13553100 13773898 13415727 12645950 13011245 12489563 12607039 13657505 13968506 13211131
6709 13211131 13264733 12995165 12612033 13438138 14484546 14203797 13111382 14493058 14356921
6700 14356921 12986387 13276140 14006848 14162002 13490504 13403385 13424575 13627602 14114402 13836684
6690 13836684 12750231 12723586 13021232 13886156 13456238 13276563 12578298 13005707 13253869
6681 13253869 13155736 13160812 13299272 12963970 12699332 13688872 13005236 12684422 11825439 11584813
6671 11584813 11658609 11741022 12138526 12642679 12310865 12717601 12537319 12557909 12254539 12465916
6661 12465916 12055025 12248487 12182590 11516378 11762478 11910281 12545976 12632289 12624252 11889817
6651 11889817 11844801 12035773 12388027 11670662 11419706 11831703 12504883 11715754 12219244 11565662
6641 11565662 11255654 10468618 11162414 12486648 11323790 11258921 10974180 11391735 11380539
6632 11380539 12121328 11419520 10446972 10812191 10746192 11484770 11702391 11772347 10713477 11429474
6622 11429474 11889434 11435020 11789446 11224598 10727643 10737206 11156784 11339240 10205007 10837363
6612 10837363 12073035 11813259 11371591 10964134 10657502 10313122 10856915 10745020 10556008
6603 10556008 10387040 10489738 10165438 10808639 11879281 10844492 10645643 10331262 10396861
6594 10396861 9926032 10953186 10738207 10698990 10991171 10782001 9722621 9732242 10487364 10366496
6584 10366496 10754669 9686528 9467122 10066484 10690008 10277433 10905970 11401419 11029002
6575 11029002 10187968 10031028 9748456 9773202 10815773 10722276 9416627 9284699 10252380
6566 10252380 10337498 10385099 9832292 10094999 9705961 9418844 9878580 10480883 11286771 10113784
6556 10113784 9686112 9463097 9707128 10712611 10627958 10194253 10218264 9998844 9446430 8903586
6546 8903586 10196931 10222043 9300612 9612853 9561518 9243539 9870720 10435889 10428528 9876308
6536 9876308 10233056 10244331 9768308 9515481 10506312 10915936 10468674 10401633 9709492 10075312
6526 10075312 10553764 9877188 9561913 9573300 9476543 9537205 9652938 9703921 10214087 8926258
6516 8926258 9071669 9146320 8782860 9907681 9942514 9830936 10217758 9447856 9166806 9517500
6506 9517500 9837777 9960372 9437507 9229304 9715738 10401875 9973873 10539326 10290649 9918255
6496 9918255 9551854 9550222 9875918 9574595 9004989 9199745 8678006 8935756 9092080 9376545
6486 9376545 9231408 9314604 9373618 10124566 10157177 9333925 9115635 8625030 9227098 9136967
6476 9136967 8749983 9101214 9620589 9809054 9521996 9493729 9847796 9698755 9962736 9817307
6466 9817307 9705885 8876149 9401030 9660888 10059446 10721852 9986405 9871938 10377960 10128436
6456 10128436 10464520 11074304 10682357 10287391 10764658 10022115 10775629 9934324 9866138 9740853
6446 9740853 10585920 10170907 9036664 9768569 9574138 9200193 9247250 9735952 9631432 10621796
6436 10621796 10433774 10060144 9239727 9461956 9964516 9786848 9221001 9763157 9756068 9591789
6426 9591789 9585616 9632027 9190207 9372826 9480749 10688664 10194338 9592566 8324209 8446230
6416 8446230 8747601 9612437 9576230 9695523 10119866 9063243 8239884 8135017 7737781 8073391
6406 8073391 9012042 7912017 7697373 8479048 9822832 8489349 8381951 8916637 10099451
6397 10099451 9834235 8838685 9110083 8978511 7883152 7866735 7980146 8001152 8268553 7681644
6387 7681644 7468460 7256567 7557129 6949521 7495283 8034871 7638656 9100335 9511675
6378 9511675 9754049 8478293 8260215 8387259 8152295 8449785 8170912 8739165 8749928 9222609
6368 9222609 9567017 8936537 8252644 8988139 8997387 8373001 9579065 10552080 8523349 8885873
6358 8885873 9159142 8785367 8851088 8092370 8716676 8573126 8146145 7921322 8088332 8599618
6348 8599618 8284504 9349843 8496019 8270698 8328077 7435254 8729507 8432105 7984288
6339 7984288 8604390 8387919 8263164 8141674 8112533 8506897 8409971 7988224 7418552 7272901
6329 7272901 7705418 8427633 8390182 8172431 8088062 7311501 8305995 9100241 8319422 8285520
6319 8285520 7969905 8405946 8135609 7964500 7383506 7309459 8139875 8136866 8230022 8866272
6309 8866272 8702760 8999664 9413310 9046848 9419359 9253714 8726616 8895664 9383998 8808253
6299 8808253 8747534 8516003 8589121 9045393 8797818 9578659 9818229 10725049 10569345 10300138
6289 10300138 9669609 9258775 9620918 9419705 10215407 10849271 10366444 10326397 11022802 11087805
6279 11087805 11448656 11074833 10326217 10773213 11237363 11741733 12066828 12318591 11384327
6270 11384327 11744021 12259046 12143269 11465208 10801058 11042329 10516910 10994312 11648531
6261 11648531 11795360 11801777 11231027 11275329 11561703 12067868 12396934 11176049 11176883 12074960
6251 12074960 10851396 9875433 10025787 11000506 11086063 10544131 10529003 10998007 10838997 10532322
6241 10532322 11105472 11774542 11984278 11038269 10159934 9890575 10983709 11696503 11273160
6232 11273160 12177260 12399835 11676895 11337726 11868594 13213691 13315173 13781758 13434099
6223 13434099 12417780 11747840 12440708 11899954 11557647 11630386 11289283 10329252 10119134
6214 10119134 10112560 10188645 10217934 8928570 8598703 9117282 9984829 9689384 9542173 9497905
6204 9497905 9292556 9071019 9261336 9255662 8663715 9120467 9144950 8975140 8903025 8670995
6194 8670995 8871416 9452498 9524979 9681216 9958849 9743192 10089524 10837798 10807654 10684138
6184 10684138 11138503 10937525 11360710 10840721 10605588 11027812 10597270 10359962 10169927
6175 10169927 10709914 10923344 10888954 10602097 10278728 10230650 9116937 8945385 9886718 9795755
6165 9795755 9839947 9569713 8600611 8408906 9846256 9697259 8544950 8840135 10102441
6156 10102441 9842715 9429995 8792844 8908282 9803573 9875122 9504540 9866973 9981126 9604375
6146 9604375 9633445 9477876 8625980 9096255 9355096 9220803 9009679 8512782 8885868 10247616
6136 10247616 9980567 9602240 9488219 9900478 8837337 8382549 9400347 9179363 9165964
6127 9165964 8968619 8212878 8582266 8678183 9010704 9058847 9051290 10294395 9653218 9179915
6117 9179915 9642547 9866032 9859826 9808308 9501293 10076279 8981405 8509391 9091499 8900488
6107 8900488 8741852 9536796 8568894 8954821 9525739 9973050 8969139 9226394 9099378
6098 9099378 8034591 8557603 8796008 9223281 9603757 8986205 9976961 10160489 9099046
6089 9099046 8972039 9124499 9467835 8894809 8338607 8774954 9360577 9666368 9439310 9259356
6079 9259356 8464431 8995140 8936603 9270626 9707607 10102295 8526029 8483922 8220518 8410336
6069 8410336 8571492 8488404 8579874 8717069 8974309 9008149 9202814 9441194 9349774 7789875
6059 7789875 8383654 7714649 8852595 9979169 9980465 9879658 8362334 9480961 10017869
6050 10017869 9314713 8982863 9258383 10649582 10066678 9796228 9199621 9011831 9017439 9653535
6040 9653535 9625012 9127421 9074071 8852040 8277273 8841390 9201490 9736277 8358429 7943566
6030 7943566 9739038 9105105 8404128 9149467 8513369 8851092 9231654 8762321 9183358
6021 9183358 9432771 9049313 9639467 10159792 9460678 8768779 9095742 9380558 9511436 8804938
6011 8804938 9789540 9545436 9839784 10659892 11034186 10770747 10542778 9328342 9206166
6002 9206166 9477242 10364195 9854765 9788664 10024732 9073674 9849267 10562519 10467476 10412908
5992 10412908 11439071 11164374 11225698 10860658 11112683 10777176 10931108 11376288 10310932
5983 10310932 10332541 11110667 11919712 11786663 10927647 10200056 10137161 10531076 9900501 10977479
5973 10977479 10925623 10295296 10702074 10239016 11070001 11544699 12504130 12701736 11195010
5964 11195010 11222294 12853010 12909553 12258363 13108527 13104996 13186919 12968004 13982944 13095145
5954 13095145 12753243 13879350 14498370 13572701 13779868 14179590 14676601 15103941 15189788
5945 15189788 15443947 14886535 14400026 14527211 15631435 17181286 17380244 17257297 16880224
5936 16880224 17365531 17239401 17087728 18270514 18387929 18298041 18360272 18669946 19048150 19299837
5926 19299837 18243587 18290029 18362991 17378191 17260044 17162207 17111926 17724609 18276897 17860790
5916 17860790 17401350 16943691 16529521 16366037 17945250 18761277 18826793 18909239 19159092 19836992
5906 19836992 21174059 20951199 20660624 21736029 21352578 22246183 22648413 23084781 23613770
5897 23613770 24816990 25313594 26110385 26435961 27374679 27988937 27963329 28029456 27743132 27995139
5887 27995139 27876435 27973201 27532032 26857044 25744521 25475767 24644026 24859488 24523308
5878 24523308 24752959 23680007 22868190 22957581 23025290 22216269 22598151 22320359 22515099 23440159
5868 23440159 23165052 22901292 22266919 22773493 22944764 22957676 23014120 23362761 23447157 23985071
5858 23985071 23365547 22511797 21833379 21770135 22407617 22325510 20771343 20762405 20330019 20037574
5848 20037574 20086913 18939810 19177335 19068356 18832014 19676944 19759256 19746327 19807390 20495843
5838 20495843 21200210 22116763 22177890 22635379 24026423 24534384 25026362 26344207 27708611
5829 27708611 28683305 29485619 30280641 31399557 32985708 32646736 32491109 30997413 30794678
5820 30794678 30782144 29218589 27794691 26519797 24430059 23132691 22477209 21676424 20838276
5811 20838276 19314990 18748011 18826957 17974916 17678437 17500477 16355525 16312507 17564576
5802 17564576 16901497 15630850 16145867 15965934 15845044 16175214 16089133 15580019 15633845 15281856
5792 15281856 15199348 15074503 14782366 13925449 13541324 13689812 13926434 14397797 14569631 14728881
5782 14728881 14927712 15235798 14542530 14092371 14384560 14265978 14100896 13984481 14821514
5773 14821514 14942334 15112663 16123632 16126342 14896840 15404803 15638174 15830354 15852573 15581818
5763 15581818 15433786 14987197 15412293 15470185 15079938 15629046 15928185 16452190 17515797
5754 17515797 17161154 17215515 17415302 17836760 16907908 17275575 18379215 18602657 18322281
5745 18322281 17610494 17438782 18300164 17907534 18090237 18821234 18526420 17511405 16782105
5736 16782105 16848384 16884917 17167774 16916015 17206295 17360905 17630823 17956658 17689330 16645728
5726 16645728 16705503 16942444 18654596 18315823 18072797 17968788 17869022 17732578 18191497 18333151
5716 18333151 18494853 17779531 17890668 18378236 17965975 18242334 18601966 19125686 19425589
5707 19425589 20512910 19803785 20188454 21582855 20687502 20511964 20526929 20415098 21313000
5698 21313000 21483339 21231719 22066435 21720724 22603936 23343584 23629648 24468715 24633477
5689 24633477 24502653 24694537 25280705 25464667 25611364 26576954 28100874 28133472 29167357
5680 29167357 30146143 30594388 31232035 31985696 32522727 32678164 32504947 32861671 33512355
5671 33512355 33649452 33966095 34574210 35739398 35898512 34886905 35348878 37529443 38582740
5662 38582740 37886790 38265068 39022338 39321188 40154966 40011420 39878546 41001182 40832577
5653 40832577 42015119 43130899 43012386 42959036 43430110 43382472 42803770 42135270 41449584
5644 41449584 41138830 41777123 40893427 38897448 37846804 37283693 37365864 36924479 36423646
5635 36423646 35986725 35164514 34801179 34216417 33920333 33363094 32628508 32230315 32188254 31078758
5625 31078758 31394626 31356661 30462571 29630976 28359501 28536225 29322409 28318399 27807916
5616 27807916 26635327 25664303 24791208 23680231 23414359 23533524 22900672 21889533 21167063
5607 21167063 20862111 20631201 20163422 19561778 18375344 18047953 17861679 18216651 17419358
5598 17419358 16507578 15974019 16439345 16526055 16403663 16572267 15062667 15071430 15478881 15594287
5588 15594287 14906338 15384268 14882056 14206907 14219667 13686569 13316797 13292409 14557853 14677702
5578 14677702 13781263 12880480 13143211 12482521 12575674 12915270 13107889 13596740 12846756 12389291
5568 12389291 12055172 12456513 11920108 11291716 12865175 12358055 12012297 12154971 11725788
5559 11725788 11376737 11963556 11807599 12010924 11033687 11421084 12081311 12156791 11106198
5550 11106198 10250075 11097747 10845429 11424392 11080260 10759965 10134136 9768906 10856894
5541 10856894 11107408 11192323 11828462 11109586 11681931 10888990 9826390 10009579 9442648
5532 9442648 9761375 11092562 10726912 10046808 10737021 11122376 10440641 9993658 10724907
5523 10724907 10962865 10552749 10551631 10933342 10093911 10851887 10601176 10914874 9992753 10361767
5513 10361767 10459091 10396654 10359201 10886706 10377833 10774545 11337773 11078642 11284598 11154352
5503 11154352 11247368 11609776 11286848 11314221 11704688 10883954 11315223 11505023 10783353 10369311
5493 10369311 10885050 11048851 11820788 11647684 12171030 11679638 12216225 12095395 11598983
5484 11598983 12077999 11108416 10474386 10393868 11349402 11386507 10736021 11359866 12165476 12165148
5474 12165148 12050770 11647341 11216133 11893124 12404696 11676850 10933797 11255449 11792983
5465 11792983 12082111 11759355 12070654 11802681 11507151 11903073 12275490 12363219 12779683 12805208
5455 12805208 13103392 12316871 12364808 12255688 13167735 14086753 13715225 14051101 14215157 14378282
5445 14378282 13428329 13511764 15137411 14807331 14443233 14721267 14165816 14194923 14391796 14102229
5435 14102229 14513010 14789051 15239080 14937203 14308852 14140198 14040175 13559000 13494838 14483104
5425 14483104 14464096 14893221 14820461 13534324 13077846 13641638 14512523 14201695 13833107 12986570
5415 12986570 13650859 14453589 13879166 12911143 13949168 14868738 14438986 13784993 12994906
5406 12994906 13037796 13456930 13993384 13597105 13714399 13721862 13494305 13267444 13564747 14666362
5396 14666362 14399879 14167927 15005222 13626068 13778366 12412147 11773764 12496661 12568327
5387 12568327 12724554 12099997 12190943 12770602 12096314 11481402 11622175 11493578 11315047 10513205
5377 10513205 11646062 11391503 12231663 12524114 12783716 12255710 11312453 10645315 11269474
5368 11269474 11210285 10997439 11867565 12183241 12601946 12695987 12484303 12413408 12606304 11854444
5358 11854444 11939712 11676310 11596601 11711408 11800593 11462997 11242306 11356042 11338944 11944374
5348 11944374 12455161 11336335 11002075 12146188 12743054 11155668 10734410 11029414 11702912
5339 11702912 11688529 11683658 11519931 12130358 11915805 11362078 11708170 12377675 12640619 12904699
5329 12904699 12986029 12216602 12828894 12981004 11989410 12005798 12173825 13459316 13024987 13461316
5319 13461316 13073300 12877719 11812192 12048890 12213137 12482057 12719275 12396071 13550902
5310 13550902 13412092 13021145 13319108 14004189 13061537 13857073 13976996 13528585 14224892
5301 14224892 14844958 14892374 14532168 14711723 14853639 15198540 14352335 14649063 14467828 14110723
5291 14110723 14683558 14220674 14990856 15312568 15476352 15006158 15451875 15034982 15613539
5282 15613539 15387017 14694240 14783592 15196452 15801800 15082895 15942503 15171614 15159540 15794432
5272 15794432 16234475 15955063 15186059 15670271 16336039 15814551 16077604 16830156 16684506
5263 16684506 16389034 15733600 16975953 15876893 16764678 17331159 16626790 17123448 17156755
5254 17156755 16861704 17045210 16496133 16692225 16412505 16806901 16765925 17123722 16860489 16517433
5244 16517433 16854899 17528964 18012299 17497177 17446318 18327483 17667909 17390555 18476533
5235 18476533 17495501 17559803 18604342 18756150 18336604 18321608 18985498 19008801 18891018 19647483
5225 19647483 19986496 19962778 20624420 20681708 20516522 20293345 20707435 20616630 21403081 22217086
5215 22217086 21475162 21951139 22693264 22614017 22849635 23606581 23509793 23641096 23448241 23887793
5205 23887793 24548959 24854943 25501339 26039471 26010444 25764103 25456447 25744012 26823844
5196 26823844 27809270 27926600 28518535 28689893 29198543 29770447 29180807 29188595 29820775 29149390
5186 29149390 29596394 30050589 31638130 32725958 32245260 32245959 32537707 33818060 33373698
5177 33373698 33519102 34860872 35523647 35620523 36484755 37975591 39231252 39662668 39940992
5168 39940992 40723804 41390637 42500306 43335262 43754711 45495645 46264583 47135975 48538299
5159 48538299 49725137 51035258 52692828 53337443 53917444 56243318 57245314 59395870
5151 59395870 61358237 63234998 64825819 67348112 69759007 72313015 74947950 76521169
5143 76521169 79546506 82630407 86251585 89908890 94262756 97880864 101382367 105174638
5135 105174638 109455894 115105047 119445415 123744095 128183097 133013743 137306631 142651243
5127 142651243 147444838 151804800 155386741 157979349 159787285 161439161 161944028 163072144
5119 163072144 161900973 160691653 159846786 157820269 155250395 153144562 150482556 146889815
5111 146889815 145642777 142949011 140839340 139299028 137593464 135943189 134250879 132983286
5103 132983286 132468288 132090225 130959444 130121429 129253051 128995563 128324381 127319873 127544013
5094 127544013 126813719 126403325 126040667 125417580 126404472 126571536 127162111 127510436 127093716
5085 127093716 127417682 127099295 126443155 126252628 126454866 126470711 126185313 125856743 125656620
5076 125656620 124738734 123587362 121156065 119701174 117675947 115167019 111800499 109064905
5068 109064905 106567757 103365991 100730488 97833373 95427826 92422592 89470365 87434419
5060 87434419 84307336 81728104 79959875 77257148 74192040 72524386 70715615 68813054
5052 68813054 66866061 65776076 63887767 63204931 61650944 59868453 59258039 58634365 58008977
5043 58008977 55833705 54945624 54362906 53880186 53100418 52161943 52335596 52030324 51675339
5034 51675339 50279567 49972445 49411826 48302698 46147530 45042485 45797931 45280408 44821808
5025 44821808 44591840 43029546 42224887 41503409 39961706 39616549 37969507 36910451 36208970
5016 36208970 35794270 35132316 34107257 34938711 34261653 33805838 34035873 33182945 32711530
5007 32711530 31394486 30578035 30301629 29957241 29271622 28597450 29497819 29013060 28022052
4998 28022052 29149085 27835909 28583888 28607053 27834046 27475446 28501579 27835586 26493204
4989 26493204 26895145 26450756 26086268 26165558 25981938 25651034 26667038 25164812 25188056
4980 25188056 25497303 25516957 25217786 24388062 24502857 24067338 24414991 23193647 24052318
4971 24052318 24271957 23868387 22723698 23418538 23515598 23465741 23401189 22258271 22214125 22172933
4961 22172933 21854842 21605860 21433362 21396830 21775084 20535830 21472203 20925418 21153170
4952 21153170 22682045 22320150 20998389 20612735 20459427 19546987 19951667 20433553 20337813
4943 20337813 20892020 21046318 20817242 21340971 20870767 20267227 20380033 20789713 20870576 20199132
4933 20199132 20118833 18975471 19213108 19632832 19383888 19878020 19556495 19381401 19508784
4924 19508784 19184110 19242109 19251836 19181299 19240365 19401282 18919169 17890216 18406947 19630709
4914 19630709 19032070 19321870 18836304 18933994 19046481 19047531 19408743 19273264 18813058 18476438
4904 18476438 19294015 20119245 19840597 19243293 20678801 19930510 19328160 20239418 20583915
4895 20583915 20515650 19551115 19473576 19520129 19727642 19340654 19665950 20080138 19795183 19879142
4885 19879142 19583566 20567626 19896485 19233555 19548013 19434400 18539652 18494388 18073005 17795578
4875 17795578 18325516 18317744 19079819 18947080 18117811 17883547 18711946 18935419 18567379 18169239
4865 18169239 17776107 17940294 18323788 18358303 17893988 17752947 18076106 18040267 17539254 17422599
4855 17422599 16589192 16927507 17200273 17065631 17348682 17640980 17834652 17545591 17212573
4846 17212573 17150420 17843263 17841562 17644924 17158058 16662004 17364251 17477635 17092382 16218207
4836 16218207 16633632 16383846 16231199 16334625 15957310 17049059 17080178 17233114 16999602
4827 16999602 16241514 15607157 16455001 16789457 17302532 16799838 16829889 16728827 17247127 17527515
4817 17527515 17229800 17362485 16968832 16886734 17005706 17373587 16728291 16388285 16822492 16970500
4807 16970500 16502314 17015955 17210064 17486946 17532628 16515018 16126100 16962021 16693117
4798 16693117 17418852 16983699 17011466 16911875 17214162 16794013 16233531 16281707 16758374 16741168
4788 16741168 16374706 15747627 16197171 16377529 16683845 17141138 18116198 17552582 16303360
4779 16303360 17655403 17466151 17465888 17149752 16915638 16641912 18157795 17449209 17626932 17674794
4769 17674794 17143761 17097488 17344350 16818000 16470095 16191842 16318658 17336582 17414586 17083209
4759 17083209 17770400 18017774 18117927 16731342 16959466 17630664 17286051 18067029 18237354
4750 18237354 18036590 18158265 18964257 17667988 17620931 18109308 17741663 17796605 18761326 18685854
4740 18685854 18249588 18451842 17842396 17294802 17288127 18387269 18019408 18019200 18157034 17122682
4730 17122682 18095768 17900524 19305509 19600690 19157856 19544629 19383478 19780065 20268719
4721 20268719 19876116 19232470 19293599 20298582 20426857 20770401 20469152 19482628 19293757
4712 19293757 19466428 20420354 20151310 19497587 20099064 20673089 20926259 20441929 20983203
4703 20983203 21186315 21126446 21174755 20853757 21919984 22102525 23144595 23663245 23434771
4694 23434771 23697985 23486564 23655632 24117759 24105123 25276340 25505509 25908060 24991849
4685 24991849 25841004 26403786 26083972 26000788 26730307 26647037 27020050 27431084 27960707 27667539
4675 27667539 27797079 28376556 29084487 29296423 28356020 28857738 29943882 30845307 30916241
4666 30916241 30597962 30997669 31443929 31991526 32396702 32983264 33783248 34350294 33868289
4657 33868289 33639115 33208704 33395276 35052261 35027730 35590054 35636488 37256463 37464911
4648 37464911 38207482 38361938 40023475 40927816 41124751 42623240 44800474 45613179 47238131
4639 47238131 48606745 50733536 52710108 54850912 56723633 58101582 59555777 59843386
4631 59843386 57869051 55258693 53159724 52872783 52523010 51851113 51953811 52016456 52040289
4622 52040289 52626128 53979393 55710919 57597737 58764317 60206368 61399314 62664156
4614 62664156 63977716 63309718 62832815 60997003 59562191 57080666 53234752 51686568
4606 51686568 49637939 48615669 46996055 46623402 46617795 46865646 46200332 46224931 45227906
4597 45227906 45610826 45933277 46445763 46246470 45679253 46060170 45746563 45784089 47035118
4588 47035118 46642804 45372768 46147998 46586820 46937301 46814037 46969488 47661033 47008040
4579 47008040 47441750 48662645 50358029 50274000 50305032 52449027 53070255 53827094 53319616
4570 53319616 54803607 55028080 54788981 54211674 54746658 55581855 55085490 55031239 54453392
4561 54453392 54461089 54534419 54498046 53590612 55204305 56092256 56754897 58222497 59582527 60678932
4551 60678932 62278418 62804774 63386349 64876161 66348141 67037648 66588598 66653348 65659388
4542 65659388 64059650 63403064 63303737 62255399 61190503 61421886 61611471 61989759 62362743
4533 62362743 62411610 62808671 63989125 64703102 64515595 64257411 65336269 65808303 66115516
4524 66115516 67351451 67583307 68566226 69068848 68574583 68559742 68911407 70231503 71146580
4515 71146580 71472556 71393389 71724344 71720919 72924957 74680157 75916470 75835691 77859836
4506 77859836 79137275 80141816 81752404 82119283 83451135 84413546 85648375 87784865
4498 87784865 88985370 90025445 92264538 94254436 96625562 98613320 101569581 104479717
4490 104479717 105984284 109851941 114301419 117131542 122646235 128879036 134489422 141052984
4482 141052984 149893752 159901984 171456514 184629929 198942983 215496510 233466478
4475 233466478 252271233 271995854 289975590 305189621 314104296 310719316 294162968
4468 294162968 269417356 244086813 222632243 206851085 195556768 186669756 181053638
4461 181053638 176412688 172201980 169971558 168149902 166395161 165647947 166082807 166541300
4453 166541300 167248545 168482998 169575481 171548081 173881651 176392136 177489238 179940471
4445 179940471 183173994 185603414 186982519 189321937 192105908 194921846 198160719 200623097
4437 200623097 202961572 206393767 210858679 214561470 219298078 224135601 227734098 232251392
4429 232251392 238588847 245842080 252957604 262381834 271962988 284115453 297283114 311402929
4421 311402929 328888891 347146935 365269766 383941627 401684287 416944024 422643683
4414 422643683 416495291 402162761 380242079 354472878 332718990 315111609 302287942
4407 302287942 292589010 284059594 277011616 271504777 267555766 262925766 258854120 256277563
4399 256277563 253380434 250394466 247700760 245164230 243381453 242080262 239667035 236514594
4391 236514594 235514874 233978167 233038910 230274926 227168709 224645211 222235740 220096690
4383 220096690 217720824 215105103 212276421 210266738 207602095 205328374 203796937 200245807
4375 200245807 198252732 196708440 194115365 192907082 191526250 189930173 187870788 186620415
4367 186620415 185444923 183525471 182571518 180204460 179436990 178471585 177535660 176038831 175209064
4358 175209064 174775653 173712085 172016996 170455274 169049775 167361772 165151959 162549860
4350 162549860 159356721 156894089 155130451 153221593 150670852 148647156 146692781 145981180
4342 145981180 145313538 144588425 143914384 142863401 141799084 140978915 140054985 140860654 141410913
4333 141410913 140860347 139920881 140554987 140877962 140696745 141510021 141867446 139924151 139944322
4324 139944322 139280862 138153505 137607124 136599053 136303867 136285175 136389467 135842277 136562259
4315 136562259 135120725 134362385 133540922 134507014 133479454 132699069 133030740 133027620 132629953
4306 132629953 132739393 132941138 132282429 130888152 130186695 128451760 127597815 127096020 125157046
4297 125157046 124278331 122847792 121887613 120583267 118828304 117681979 115911571 114344008
4289 114344008 112901884 111088734 110330779 109756545 108897210 107560099 106836946 105084959 102885311
4280 102885311 102573498 101123593 98852313 97727586 96369151 94944733 93980965 91843579
4272 91843579 89993784 88592004 87683433 86815730 84605337 82485642 81575507 80145743 80395565
4263 80395565 80818140 80913294 79873424 79684336 80190852 80414918 79884197 79674488 79328673
4254 79328673 79823240 79956759 78864200 79020179 77617907 76669792 76790777 76380844 76913792
4245 76913792 75815246 76015962 75794381 76358330 77046826 76693952 77508884 77943181 77976398
4236 77976398 78094342 78770562 78621646 77962284 77605930 79052438 77762356 77442985 77730558
4227 77730558 77657250 78166558 79290216 81124107 80883477 82109140 83191744 83727164 84377771
4218 84377771 84589349 85552677 86825956 87311370 89266764 90012244 91451525 92721518 94770214
4209 94770214 96491179 97826584 99784118 101787943 105497081 108698692 111922481 114558435
4201 114558435 118588141 121639396 125345770 129345090 133635076 138761248 143922916 150046730
4193 150046730 156213986 161446136 168168629 174464218 182231972 188168314 195072713 202224686
4185 202224686 207332404 211176024 214423005 217050557 218789311 218608641 217245802 215678967
4177 215678967 211650970 207609474 203026301 199056881 194030944 189430980 184911535 181249431
4169 181249431 177828639 175302130 172748337 170472677 168684199 167346460 167572732 166654101
4161 166654101 166013521 166166756 165929429 164658696 163610549 163537013 162453684 159557357 157474401
4152 157474401 155435696 152914715 148912304 145026899 140947282 137543096 133976363 129968450
4144 129968450 125688899 123603307 120608956 116853589 112809505 109568353 106793277 104566539
4136 104566539 101685112 99623209 97755703 95933661 94745601 93723773 93106981 92443639
4128 92443639 91358368 89514121 87055831 86111867 84957945 82451555 79945535 77661211
4120 77661211 76006254 74316802 71825672 69798178 68849846 68398676 68078211 67224968 66043839
4111 66043839 64731451 63573208 63324227 63602927 62508263 63336211 62595644 63284750 65073372
4102 65073372 65479058 65509650 66774774 68435556 70021921 71446094 73476724 73924254 76072757
4093 76072757 77806237 77336788 75980098 74518118 70857846 67479069 65519812 63985040
4085 63985040 60876384 59212158 57594143 55635621 54530566 52638484 51002940 50111120
4077 50111120 50060205 49422741 49021893 48313087 47093970 46632245 46617782 45952040 44030020
4068 44030020 45511394 46139253 44797401 44280012 44224650 44506963 44923429 45222253 45187807
4059 45187807 46072991 46896496 47050316 47642119 48312759 50176711 51604294 52385367 54152534
4050 54152534 54997185 57915100 59457019 62179299 64225138 66860106 70729832 74047694
4042 74047694 78000928 80428189 82399453 82674183 79555587 75281587 69057671 63285356
4034 63285356 58855244 54744239 52445581 50108621 48234151 46299788 44402581 42549027
4026 42549027 40690832 39802938 38824427 37995860 37211518 36041721 35231739 35652869 34940435
4017 34940435 34976712 34545342 35592182 35139730 34631739 34459729 34074661 34884534 34432752
4008 34432752 34904069 35388924 36084872 37199561 37992198 38611671 40481712 42078728 42995084
3999 42995084 42447204 42807199 43511571 44123727 44127218 44015473 44605136 43786151 41985813 41000359
3989 41000359 39444224 38095647 35673684 32854272 32142300 31238807 30006008 29840035 29095616
3980 29095616 27917796 28083090 27602697 27367712 27517621 27652792 26964540 26668620 26254818
3971 26254818 25865058 25494573 26069177 26687401 26507960 26634834 26784429 27390574 27527544
3962 27527544 26379920 27082468 26947377 26325310 26830782 27835133 27964391 27670949 27708465
3953 27708465 26765180 26884039 27136253 27929994 26813408 26668716 27719715 26030011 26067407
3944 26067407 26584784 26696331 27169616 27618561 27164751 28220570 28455486 28748678 28671728
3935 28671728 29564154 30380321 30858650 31741823 31126316 31475874 32820692 33979738 35980263
3926 35980263 37835687 40324584 42838908 44207909 45813686 48777601 51966647 54561731
3918 54561731 57282606 57812271 58133090 54323601 49323841 44554828 41422095 38835761
3910 38835761 37503792 36595616 36304331 35466183 35310559 34186232 33277831 32971022 33435162
3901 33435162 33820559 33436086 34350233 34737718 35382931 35671628 35540516 36152113 38095169
3892 38095169 38483202 37622606 37706567 36602468 35385033 32690269 31864654 31535380 29979206
3883 29979206 30100768 28319613 29285684 28009898 26993284 27218066 26979906 25995229 25031951
3874 25031951 25160713 24906516 24379995 23570353 24138731 23834332 23351330 23600080 22524806
3865 22524806 22846047 22582683 23064751 23370387 23398414 23044713 22825414 23272704 23225716 23885200
3855 23885200 23869075 22963140 22943727 23283580 23916804 24920083 24555658 25167623 25238536 25545051
3845 25545051 24929603 24551395 25339123 25730015 24874034 24426187 23460566 23703722 23974411
3836 23974411 24693509 25090886 24700745 24599170 25154630 26359769 27516838 27263073 26956888
3827 26956888 27824286 29174518 29152264 29333471 29971035 30379888 29454584 29063583 29647090
3818 29647090 28517582 28734710 28662704 28365643 27683975 27367223 25916147 24782679 25036708
3809 25036708 23852518 23562487 23354219 24198148 23440892 22120012 22169977 22696884 22563414
3800 22563414 22012932 22367911 22182297 22038088 22847891 22521193 22662868 23218369 23076888
3791 23076888 23253839 23298277 23945857 23775859 23702364 23409707 22961459 22300831 22231138 23025984
3781 23025984 23617143 24338140 24889427 24174445 25223828 25844918 25637945 25012072 25102033
3772 25102033 24839205 25469112 25371251 26523218 26772541 26112635 26647637 27502247 28331528
3763 28331528 28540381 29359043 30299581 29991900 30499344 31509215 32178139 33088518 34890109
3754 34890109 34821641 35874446 36866130 38154259 39478152 39384892 39116106 39128929 39686877
3745 39686877 39326430 39495869 39408246 40540476 41203760 41754531 40995097 39557913 39711000
3736 39711000 38886281 36729225 34518534 33686829 32915727 31236566 30264631 28888862 28158781
3727 28158781 27535615 26350696 25175495 23885235 23401978 23325322 22548244 21362519 21014481
3718 21014481 21004481 20511263 19620172 19607524 20240316 19352788 18726506 18362845 18472606 17707997
3708 17707997 17529793 16763812 16932589 17792774 17511187 16969107 16886667 16767810 16447714 16218964
3698 16218964 16945607 15895234 14610907 15172779 15265423 15246772 14748487 14163044 14092873 13898459
3688 13898459 14510905 15020401 14604991 14876428 14992527 14970037 14307820 14498366 14202156 14994913
3678 14994913 14396955 13910531 14021403 14191904 15343820 15596373 14793415 14495902 15609513
3669 15609513 15319822 15592163 14736929 16429954 16174942 15447860 15329019 14674745 14971190
3660 14971190 15109864 13968229 13859245 13303302 12592525 13311115 13052350 12183319 12084257
3651 12084257 12185867 12180457 12687526 12878512 12327240 12346636 13564152 12789877 12144422 11726840
3641 11726840 10863952 11012219 11464549 10752893 11197776 10958003 10394808 10664232 10731680 10691091
3631 10691091 11075741 10907188 10111795 10845393 10615199 10738988 10314190 10093283 10439720
3622 10439720 10172810 10834589 10558116 9075186 10147306 10447896 10553116 10676560 10383836
3613 10383836 10618887 10741028 11221541 10142888 10482743 11454130 11112158 10960928 10908320
3604 10908320 10474313 10901712 11714210 10771767 10603935 10693941 10051688 10100266 10633681 11473327
3594 11473327 10842275 10476926 9445917 9636624 8942698 9311574 9417258 9033588 8801823
3585 8801823 8936009 9059070 9980729 9729877 9480730 8925614 8776833 9754712 8968288 8827056
3575 8827056 9991907 9671688 8636783 8822752 9435231 8175367 8907723 8623934 8998604
3566 8998604 9165182 8832164 8651134 8711461 8446189 7828774 8604041 8932330 9639044 8895033
3556 8895033 9401394 8863141 9192179 8848872 8208186 9298155 9523480 8399093 8733874
3547 8733874 8757680 8461434 7781721 8234900 8710324 9116386 9085444 10038866 10389998 9430482
3537 9430482 8696031 9123692 9433163 8856645 8155134 8151569 8362137 8006560 8174553 8017748
3527 8017748 8022389 8596274 9031493 9439867 9280419 8731692 8772209 9317882 9724716 9352626
3517 9352626 9253658 8754281 8072291 7317760 8236795 9042770 9527289 8439715 8919799 9528060
3507 9528060 9412817 9163680 8618102 9280502 9723566 9765264 9655326 10081746 9237776 8792204
3497 8792204 8994540 9495582 9775521 9993753 10769180 10516818 9406734 9339079 10135550 9492508
3487 9492508 9862996 10961088 10294489 10792259 11063100 11108236 11965750 11806179 11127277 11555734
3477 11555734 12406271 11985351 11046673 10784206 11134963 11090316 11235977 12677336 13784301
3468 13784301 13540345 13352238 12824662 13133555 14452260 14941818 15618844 15764294 16223145
3459 16223145 16908438 17429425 18691458 20137331 21285072 23191949 23468058 25757992 27518233
3450 27518233 27934054 28882182 30086446 30905176 31076355 31546605 30023146 29419607 28105093
3441 28105093 27918653 27107353 25284932 23870868 21927839 21398368 19386076 18722699 19661178
3432 19661178 18541831 16073434 15606819 15831371 15802967 15031699 14726279 14617945 14113635
3423 14113635 13801062 13809789 13034438 13915173 12616743 13007923 12669971 12393740 12063177 11501431
3413 11501431 11858610 11251044 9948866 9968976 11867177 11696762 11391556 11677905 11554848
3404 11554848 11656915 11619356 11440393 11575396 11352826 11864316 11241617 11263248 11024254 10417870
3394 10417870 10625571 11898895 12465646 11871192 10891043 11620253 10968044 10550113 10661883
3385 10661883 11623267 11491865 12171848 11093369 11930588 11738687 11698059 11849133 11412226
3376 11412226 12047982 10976682 10226663 10765721 11041326 10761856 10822192 11425091 10313454
3367 10313454 10639266 10597025 11575385 11280138 11172614 10986275 11192902 11481775 10876692 10220586
3357 10220586 10371415 10411390 9415011 10110541 10966264 10508538 10912950 10585653 10073905 11522907
3347 11522907 10736677 9766911 10914597 10871667 10016501 10310786 10091176 9876804 9845260 11027960
3337 11027960 9580053 9681300 10609205 10597600 10136903 11091593 10138847 9609788 9418522
3328 9418522 9531648 8998463 9174146 9704533 9911282 9827576 9296453 9492621 9755656 10273375
3318 10273375 10589749 9761242 9798928 9294699 9915945 10001536 10101497 10092495 9935404 10412412
3308 10412412 11059339 10660681 10142548 10569849 10021292 9714381 9662347 9161148 9145554 8945593
3298 8945593 9009097 9531353 9639795 9343287 9344999 9570916 8847668 9017287 9546440 10097281
3288 10097281 10094715 10531869 10180245 9997922 9803480 10120624 10596819 9974623 9552775 9654992
3278 9654992 9791131 9318776 9325684 9803454 9119865 9319999 8830585 9390769 9925732 10599750
3268 10599750 9856397 8923380 9329699 8915199 8541927 8874298 9882320 9257104 9181131
3259 9181131 9444598 9647479 9773296 10370292 9746204 9536142 9442056 9844500 9324777 9605535
3249 9605535 9573281 9389291 9406693 9975427 10580964 10526681 9953116 9698879 10344349 11773426
3239 11773426 11585026 10887575 10670998 10862358 11492225 10918577 10784755 10369529 9864745
3230 9864745 10496867 11453724 11154638 11005714 11723797 12345003 11583196 11086537 10963324 11142908
3220 11142908 11940160 10980607 10013137 11074951 11348407 12246989 11896331 11792033 10940748
3211 10940748 11558807 12575734 12601816 12691107 12502707 12389499 12983274 12796982 12534457 12840441
3201 12840441 13538316 13156200 13219066 12996666 13386330 13248138 13576515 13587357 12929986 13247831
3191 13247831 13042851 13640747 13200873 13738285 14160985 13751564 13730272 13974490 14119545 13746283
3181 13746283 14625413 14440650 15556835 16234368 16243113 16112334 15928827 16533855 16743795 16752302
3171 16752302 16579715 17872463 17500110 17485219 18184664 17813090 18269951 18397252 19066563
3162 19066563 19440972 19798360 20673896 20483442 21349117 21226767 20218582 19326410 20699714
3153 20699714 20399260 21642562 22863328 22737634 22590013 22987972 23338493 23641399 23341529
3144 23341529 23152953 24368374 25005375 25448232 25129059 26114107 26603389 27364158 27825849
3135 27825849 28646463 29455132 29709520 30332810 30510893 31360664 31902288 33471199 34083863
3126 34083863 34503952 35047771 36062313 38275782 38606136 39532657 39896328 41654321 42606775
3117 42606775 44252144 45934686 46714430 48743978 50096685 52335412 54462997 56695629
3109 56695629 59408875 61885791 64850009 68763540 71696706 75278026 79281107 83340896
3101 83340896 87853010 90942956 94614549 97636900 99239087 99268134 98683831 95918631 90653658
3092 90653658 86199608 81536465 76271337 71953947 68204850 64213431 61303439 59208002
3084 59208002 58049487 56044920 53746564 51507276 50510977 49511530 48012323 46706617
3076 46706617 45546056 44361619 43207656 42662559 42805850 41361009 40504581 39789590 38771632
3067 38771632 38920427 37758433 36528814 35742908 34346115 33241902 31967825 31947935 31963661
3058 31963661 30781726 29662454 29120500 28683760 27641487 26590021 26004787 25648575 25026924
3049 25026924 24983535 25853185 25815085 25205999 24397302 22546535 23042911 22701372 22198771 22212921
3039 22212921 21352410 21160277 20844763 20636320 20307411 19722071 19860945 18677574 17928009
3030 17928009 17481472 17628269 18358489 18071563 17865336 18002298 17554691 16757184 16945007
3021 16945007 16569179 16038010 15485811 15234393 15080969 14799918 15526127 15093696 14933109
3012 14933109 14760635 14518964 15307846 15242110 15593535 15348043 14199297 13463045 13638038
3003 13638038 13844271 14526886 14864937 14331950 13567868 13870933 13911274 13103581 11927331
2994 11927331 12724973 14195913 13354675 12406021 12406851 11901064 12201062 12441458 12634348 13586403
2984 13586403 12800132 12914761 11709851 11488804 11715717 11955335 11059550 12021879 12321832
2975 12321832 11318722 10855218 10995950 11463529 11747122 12175059 10448527 11062618 11103897
2966 11103897 11276728 12091849 11490052 11141054 11680066 11449510 11517006 11567705 11935505 11285504
2956 11285504 10692545 11118621 11342987 11122851 11632047 11896571 11582093 11374327 10980791
2947 10980791 11094452 10864436 11717346 11726954 12014155 11518830 11405512 11625855 11444448 12689232
2937 12689232 13406340 13120678 12479074 12683296 12516068 12442685 12572001 12592554 12770624 11908689
2927 11908689 12959106 13908367 14033692 14162987 13318860 13673026 14715619 15698378 15507283
2918 15507283 15854096 15904538 15955039 15509470 15373084 16335753 16980784 16278040 17572299 18854342
2908 18854342 18854573 19224713 20117363 20789628 19807781 20858244 22468113 23255896 23707942 23467904
2898 23467904 24247503 25191952 25697869 27513685 28867083 30449662 31709126 34220671 35039589
2889 35039589 37589271 38894554 40626783 43762133 45963213 46787550 48603630 50388006
2881 50388006 51749370 53262608 53174719 53512293 53960139 54509342 52925785 52666695 51773353
2872 51773353 50805483 50176389 49953104 51093441 49803282 48903050 48645327 49401375 49747070
2863 49747070 51273843 53584380 55879094 58741815 59973348 62414632 65384352 69139895
2855 69139895 73157761 78297630 82700363 86999394 91751400 94633659 96675481 98372844
2847 98372844 97990479 95895439 92716742 89321365 85817900 82381758 79932926 77347484
2839 77347484 73532152 71738860 68675383 65479213 60162836 57335697 55553715 54451326
2831 54451326 53985460 53403979 53134607 53022361 54221854 54536319 55752609 57966089 59868144
2822 59868144 61788863 64320144 66140198 68539053 70029585 71397106 70874360 70031355
2814 70031355 68877266 66024071 64353209 62086715 60423376 58178199 56298692 53619006
2806 53619006 50807720 48056785 45040565 42439591 40570473 39388835 38338435 37557089
2798 37557089 36079484 34936739 34769795 33810894 33619165 34099248 33886837 33403044 32828133
2789 32828133 32139355 31334748 31019691 29966413 29247217 29487394 29837012 28506813 27052729
2780 27052729 27173519 27092812 26868651 26032247 25695588 25820619 26604587 27231588 25946602
2771 25946602 26519286 26295449 25058212 24509944 26177535 25100065 25288194 25177049 24790021
2762 24790021 24423093 23785272 22121332 21643763 21842217 21679594 21332412 20673570 19588926
2753 19588926 19877807 20386854 20312256 19393889 19071455 19411562 18950971 18542159 17526008
2744 17526008 17176720 16935952 16806649 16850932 16399515 14666934 14693385 15669880 15249194 14571088
2734 14571088 13565365 12691096 12619550 12218478 11934474 12554133 12272345 11600734 10876931
2725 10876931 9794587 10250846 9378448 9332040 10647262 10833512 9842978 9171043 10116117
2716 10116117 10092411 10408382 10430710 9437438 9313933 9405899 9528229 9195846 8731363 8615863
2706 8615863 8327626 7963259 7383218 7855724 7891682 7055965 7883379 8172347 7463472 6624125
2696 6624125 6236467 6136840 6772129 6464613 7381387 6810301 6206760 6377892 6645469 6570438
2686 6570438 6738831 7371098 6706754 6119151 6486407 5914952 5813218 5512277 6017242 5898009
2676 5898009 5371902 4487691 4559478 4873574 4669114 4790392 4253469 4719073 4574689 4551831
2666 4551831 5042864 5198189 5551250 5555078 5042864 4875654 5303832 5409154 4913738 4681035
2656 4681035 4698079 5343128 5464487 4864143 4572697 5674524 5872562 6147187 6336673 6082767
2646 6082767 6150945 5832596 6743773 5871910 5025860 5288761 6385701 6597817 5953776 5511843
2636 5511843 4872063 5057486 5403303 4999113 5000341 4575967 5239670 5117035 5166464 5328108
2626 5328108 5017665 5898836 6121674 5834551 5039607 5904062 5910853 5688919 6297813 5700469
2616 5700469 6006717 6108582 5018013 5389696 5899983 5728918 5084927 5621285 5389256
2607 5389256 6541688 6443848 6623307 6466063 6373152 6785515 6506752 6272093 7123736 7630744
2597 7630744 7605126 7491505 8001457 8310512 7784276 7821369 8149471 8158435 8731663 8579098
2587 8579098 8341689 7633215 8639254 8862940 8789385 9555098 9529531 10030880 9707648 10070761
2577 10070761 10681246 11472285 11851631 12519206 12458463 12410698 13164786 13032500 13308034 13307274
2567 13307274 13704912 14991986 16168271 17200997 18113027 18523137 17805712 19127185 19618467
2558 19618467 19434358 19182037 19441890 20020817 19056070 19968238 21230051 21564696 21370930
2549 21370930 22037170 23478968 24216492 25664997 25669924 26599111 26989144 27738375 27865403
2540 27865403 28824971 29755646 29095271 29414467 30383450 30745057 31080037 31561781 32484623
2531 32484623 32133903 31731735 32398292 31957791 32274632 33119464 33648564 33132606 32725105
2522 32725105 34756932 34678242 34691947 35048755 35224816 36720928 36802808 37759812 39087706
2513 39087706 40113592 39295243 39935439 42253489 43190593 43512042 42835973 41404815 40325901
2504 40325901 39062115 38812732 38632264 37413438 35812504 35637040 34670421 34764331 34104814
2495 34104814 33368482 33731299 32903554 33219566 33722212 33334337 33625936 33881707 32492450
2486 32492450 32452788 32878052 32492969 31773304 32804853 32520811 32372388 32365826 32369721 33034615
2476 33034615 33330132 31868750 30736158 29789699 28604321 27146811 25462941 24736762 23551415
2467 23551415 22687331 21075058 20932915 20298919 20462380 19867768 19433535 19619914 18770033
2458 18770033 18207091 18106781 18368845 16926624 16636830 15726951 15071594 15234097 14532461
2449 14532461 14119060 13584431 13457681 13209590 13310592 13453211 13356745 13552048 12935242 11506156
2439 11506156 11079453 10055314 9703385 10488220 9195190 9211192 8991585 7680908 6552434
2430 6552434 6966958 6870966 6811745 7015115 7129544 6922108 6056876 6419527 6203069 5551717
2420 5551717 4686988 4915349 5438713 5381223 4716724 5324801 4759949 3957347 3701625 4159796
2410 4159796 4181459 3428753 3300030 3354585 3823716 4195175 4030739 3904333 4275228 4130678
2400 4130678 4260307 4096271 3876829 4575268 4288279 3992233 3884374 3230111 3026481 2724442
2390 2724442 2940610 2623608 2078061 2976551 2740944 2898300 2627173 1970285 2286257 2378653
2380 2378653 2388326 2349882 2715115 2499296 2253370 3048166 2498405 1684705 2036495 2488913
2370 2488913 2028964 1597218 1740441 1226855 1673956 1419111 1360614 1795936 1806452 2433685
2360 2433685 2691383 2689447 2238718 2073363 1993177 2628335 2520887 2689263 2197838 1802928
2350 1802928 1966063 1445396 1779398 1607248 2002576 1808388 1369670 1617510 1663935 1322388
2340 1322388 1838890 1425408 1040522 1630135 1200488 1752363 1082646 1098867 1731669 2055099
2330 2055099 2486925 2626373 2069048 1834851 2063627 2125923 1389079 932683 1552456 1485131
2320 1485131 1620512 1880858 2450269 2153262 2544727 1993020 3092229 2337801 2545728
2311 2545728 2937802 2838120 3334538 2941806 2587428 2127796 2052889 2480710 2659583 2113456
2301 2113456 1903845 2260867 2228627 2356218 1735775 2441272 2038284 1980857 1906164 1895452
2291 1895452 2816192 1972420 1094520 1557033 2311768 2348341 2568314 2536627 2905300 2211401
2281 2211401 2254792 2418382 1507846 1135828 2321988 1918516 1760355 1947526 1607152 1742090
2271 1742090 2090819 2542444 2053824 1215067 2230243 1898197 1923449 2137553 2336650 2081100
2261 2081100 1886781 1458873 1698612 2077454 2015417 2227570 2210246 2169492 1510996 1334841
2251 1334841 2449934 1798282 1424357 2014095 1519947 1036353 2283848 1776908 793957
2242 793957 1290424 595414 1221568 1819885 1800789 1666916 2296433 1634645 1075091 1096799
2232 1096799 1166288 834627 1974409 2196828 1597756 1486212 1667734 1763725 1920707 2291811
2222 2291811 2208217 1842623 1970793 2835167 3026107 2092430 1312322 1583139 1367758 1980195
2212 1980195 2110275 1717464 1824467 1938036 1188767 1227187 2330559 2180492 2803919 2359249
2202 2359249 2043463 2411580 2688771 2697083 2250685 1928358 2532204 2445161 2855857 4133392
2192 4133392 4109106 3405501 3259194 3543361 3885973 3572009 2917637 3585593 4403083 4321083
2182 4321083 3496729 3821041 3749315 4288990 3939520 3934482 3395118 4207849 5352035 5836328
2172 5836328 4034050 3493728 4757553 4758469 4338898 3935746 4149799 4384332 4145833 4132968
2162 4132968 4503668 5264838 4434912 3628403 3761178 4204114 4925910 5387814 5658517 5510853
2152 5510853 5682253 4949288 4713472 5742806 5930953 5931872 5448857 5194807 6353885 7444086
2142 7444086 7551319 7643369 8085732 8095537 8126285 7957006 8137464 8141594 8335780 9857488
2132 9857488 9308585 9194193 9399499 9928158 10824798 10546346 10426654 11198527 11539667 11054310
2122 11054310 11427815 11774787 12409641 12947221 14121676 14527035 14629535 14091943 15021006
2113 15021006 14850842 15415015 16967064 17811610 16971593 18211104 18600249 18880928 18729464
2104 18729464 20206902 20799993 22341599 23683399 25633282 26864300 27495292 28405345 30169388
2095 30169388 31375942 32098346 34572485 35543047 37173054 39432465 43101775 45345469
2087 45345469 47718466 51294688 55477097 59186196 64611245 69758821 76221271 83237932
2079 83237932 91237679 101645205 114324489 128640404 144650313 164587702 187646286
2072 187646286 213217320 239163262 262414391 282784786 303761887 305068842 269143133
2065 269143133 217770330 175904101 146846388 125229477 109061251 97031352 86851901
2058 86851901 78431536 71558549 67200315 62976162 57902169 53870538 50531955 46150810
2050 46150810 43516172 41059667 37854441 35204647 32979556 31996888 30903468 29437581
2042 29437581 26912315 26161754 24826216 23596222 21302788 20880218 20776826 19956738 19640224
2033 19640224 18849983 17361059 17123028 16020649 14873201 14827885 14690054 13833685 14214634
2024 14214634 13585827 12643769 11606723 10985130 10066333 9846696 9894888 10002770 10239812
2015 10239812 9843354 9518858 9885807 10265618 9553067 9362069 8602414 8632625 7959933 6811050
2005 6811050 7083326 6568423 6103103 6007537 6253614 6523526 6319178 7196405 6944395 5393190
1995 5393190 5611711 5490268 5691454 5370767 4915022 5070981 4647995 4641874 5246153 4276865
1985 4276865 4138882 4159796 3842428 4276688 3522622 3989275 4494863 4768354 4115056 4345546
1975 4345546 3767100 4339397 3981028 3139997 3370931 4401707 3699861 3398972 3479439 3853746
1965 3853746 4117334 3766503 3576656 3326968 3016298 3462916 3407056 2659250 2298362 2425962
1955 2425962 2363434 2593826 3013213 2716044 2590804 2591627 2723065 2866091 3224672 1937269
1945 1937269 2463052 3050035 2569102 1658133 1996370 2150246 2248319 2641242 1706103 1705643
1935 1705643 1131796 1290965 2127690 2384949 2095586 1542262 1640411 1759174 1403297 1851499
1925 1851499 1430479 1969068 1440674 720461 1696175 1212661 2081286 1656789 1261190 2236718
1915 2236718 1300334 2377392 2442644 2028532 2691806 2589348 1538363 1559870 2469258 1681446
1905 1681446 1807498 1383831 970861 885696 1076081 1034898 1466856 1938859 1566289 1320551
1895 1320551 795693 779019 949182 824325 -21276 436220 1549907 1465684 2281104 2356576
1885 2356576 1891190 1264342 786634 1474593 1215629 1173109 993357 641786 693616 1056310
1875 1056310 1066151 1612771 869240 1085495 1349444 2008905 1704883 1328215 1336320 1775149
1865 1775149 2588963 2282614 1823619 909828 1490207 567905 841229 948399 1157223 1398940
1855 1398940 930470 1377394 1136112 755318 1638611 2313844 2474364 1545291 1643349 1764342
1845 1764342 1313447 1010516 1465554 1620834 1240506 465171 1044017 1571182 1680468 1037049
1835 1037049 1276742 1893771 1558503 2298796 2169507 2149059 2696539 2655135 2956386 2877304
1825 2877304 2989812 3681123 3283511 2002630 1606969 1573376 1719896 1097271 -240907
1816 -240907 963127 1156541 284660 230012 963574 1814260 1332460 867877 1585581 548724
1806 548724 721219 885244 1325879 1130886 1253414 193458 305161 1776279 1826123 1851516
1796 1851516 1585134 1887047 2212326 1228718 979993 1078890 967683 1494021 744222 183186
1786 183186 266778 717522 510077 697475 785975 1082687 -348328 96740 -194193 840742
1776 840742 1223834 385962 262427 114979 595763 9028 584784 1437112 737982 648384
1766 648384 85014 527738 374521 851688 776541 275988 123340 20243 1154343 613951
1756 613951 448045 255127 999249 196271 290780 -206548 83095 -38884 689891 1498940
1746 1498940 1363490 1488180 1294709 970934 366347 255797 161965 914980 506480 880649
1736 880649 962140 954053 862502 1136777 639020 780337 384814 -452896 -223044 598796
1726 598796 961440 1361783 1628493 1682528 1868078 1354488 1349913 -203572 188816 1250365
1716 1250365 177921 -482873 43713 202464 153863 243246 -122476 259867 507067 998374
1706 998374 1763448 1150715 1217516 262019 238146 210472 730248 -29316 195396 645680
1696 645680 298580 -114948 -121994 -95063 872708 959660 1257351 1267100 1291971 1726344 1296429
1685 1296429 1439022 807008 1328503 272510 -14193 -174241 457967 308890 525082
1676 525082 482191 83388 -507723 149961 898568 1215662 1242642 565268 365228 929073
1666 929073 669977 984340 1198334 468653 652964 445469 1412585 333540 641891 1483638
1656 1483638 816330 1199418 1154744 -240664 -234687 259110 -518880 -189716 498310 389655
1646 389655 -137703 148992 -454971 -78471 1159825 928018 914040 578035 525215 1010841
1636 1010841 1189336 1249360 448288 309513 -99905 249070 1386558 603074 638017 517978
1626 517978 261912 449297 512133 -58319 823837 846546 632189 976749 1898376 1246092
1616 1246092 752285 81643 59128 956195 269521 303029 365361 784654 1132927 908226
1606 908226 386659 -345413 1182797 1353529 407964 760842 -888070 -407553 473881
1597 473881 -35180 -154400 -790632 -377395 356060 -413573 -188075 -315292 272309 -623588
1587 -623588 -454535 702501 361372 478768 754569 584401 259872 971378 1178436 120776
1577 120776 519706 197749 -9431 161470 1344689 2238990 1125466 750574 492717
1568 492717 665479 123623 -105554 151340 655086 1502793 1172797 1144378 1267266 1401605
1558 1401605 1208176 264607 992242 457356 -67340 -107976 533923 766577 -21769 860250
1548 860250 256612 540828 -286220 248226 884948 457980 285657 776767 947573 458859
1538 458859 291617 396881 687666 948392 662737 618603 617984 462045 539417 407072 471611
1527 471611 346303 927377 16551 759995 1301136 472676 1296034 457778 160732 -134076
1517 -134076 -15756 87847 922520 577971 -192554 405956 575817 1294409 1098217 320907
1507 320907 344904 1075604 725030 1112355 -44200 198435 -50518 960534 1278221 292595
1497 292595 659197 277072 877736 1072636 835133 1618059 1736491 1124793 676560 607203
1487 607203 1242180 1585939 463256 668184 941850 1347985 1098529 1079248 1272155 909771
1477 909771 966787 601190 255204 517224 277286 370292 579511 499489 375738 32351
1467 32351 401274 948039 1179122 199626 -671604 441852 692767 114076 133470 782910
1457 782910 930447 395254 463835 159304 1016261 1198569 852564 527474 195816 949411
1447 949411 1516124 335066 808285 1262268 1559104 482378 19315 109533 90894 1066189
1437 1066189 1391430 1253603 1157903 1673017 1169448 495201 -164666 588052 1140983 257174
1427 257174 -340112 5292 -202415 -437414 -961372 49447 -68819 -105341 -717502 -555346
1417 -555346 -338211 89192 -334937 -734057 180447 137308 352758 298726 1258398 756055
1407 756055 21418 -98232 324699 197770 251805 1021062 942988 1459697 2261859 2036568
1397 2036568 1404997 283436 -45250 351999 597924 913398 -7705 523740 870537
1388 870537 1135976 921569 -207917 -765172 -1241696 -1031866 80233 42227 80704 812110
1378 812110 678959 -67765 -434517 996037 809434 584869 1088725 1110607 1180691 565510
1368 565510 68946 738724 134897 -107315 924740 1798914 670984 666037 95919 77787
1358 77787 817299 68 -621725 -285512 591673 956968 627717 775621 -1117557 -605947
1348 -605947 -576963 -585901 374796 1194269 1245920 1273962 874505 923156 318309 156570 1582909
1337 1582909 1520281 1262615 903005 -277755 285068 898016 664164 480868 476254 1291190
1327 1291190 997415 242538 437121 683049 65690 828869 1004694 -194265 -177405 -93143
1317 -93143 457983 964817 1708229 1201124 699335 209451 35181 537299 -352760 -33093
1307 -33093 439957 982191 596044 892079 1269139 1685790 1145312 763712 552484 523421
1297 523421 207462 -223775 247343 1230818 1148291 1169802 1266925 1149085 446077 -421923
1287 -421923 195382 2231600 1000014 1317800 1164082 1010252 107760 -307364 285336
1278 285336 667890 31771 205949 473391 -548488 -440768 -463850 -786835 94691 1079974
1268 1079974 619848 -628378 -340142 1472265 2076995 1856030 892673 726481 1138313
1259 1138313 632923 673230 735066 575760 -139658 -235924 730594 904232 -76093 -305311
1249 -305311 85439 -465349 -10999 761167 -309841 -87004 147586 394443 652706 1526248
1239 1526248 1413975 1114327 795686 254857 -244267 -594502 207735 -627833 365595 402419
1229 402419 689406 111062 -61348 -259451 348503 1211339 905914 -105648 -50076 -278840
1219 -278840 -129604 132897 396536 676641 615986 490272 1293621 666099 658840 633379
1209 633379 1023179 1043010 649882 288712 606274 717705 681085 1160674 348591 367654
1199 367654 873939 1146762 945882 589362 -85209 -530660 -3601 627735 1537245 1275677
1189 1275677 845187 672094 -522038 93626 -172621 315451 701264 -123569 -194115 501130
1179 501130 255888 1196188 1421731 600596 510195 470349 485943 681174 -267590 714046
1169 714046 1100000 -211644 -154355 1127653 1504860 134153 -325034 31569 370012
1160 370012 893730 763339 816021 -474796 -570851 816893 -49698 324394 689115 388769
1150 388769 969 28357 152196 -393487 -675416 865215 199045 84470 748621 -125145
1140 -125145 -388960 -272881 -641999 239556 -184362 580888 -785807 -387681 549830 -755616
1130 -755616 332126 -305906 -104405 240495 566247 -356918 -360714 -82054 663802 981143
1120 981143 270546 -198089 142799 -270830 -1120615 1721 39954 -39122 -8242 476302
1110 476302 410745 272054 923355 105650 -51503 358111 237527 342507 416922 346671
1100 346671 787141 435821 1419025 1726179 670194 -355241 -244890 -140219 -282535
1091 -282535 -91680 213549 30050 521171 1135738 1153816 930511 287366 751901 742714
1081 742714 1633821 2173647 2282807 1478199 1208056 865457 -117298 252816 -810865 -895971
1071 -895971 -457274 478253 -322323 -687408 976999 578067 147130 731793 178520 -421101
1061 -421101 -518857 51864 694829 -291035 -840419 -1125970 -664990 -434566 363240 469042
1051 469042 634644 868536 583040 -595405 331665 485572 263534 294526 1079516 213113
1041 213113 675018 1234295 1183984 1048901 410173 1441312 618025 1017164 1457084 1228603
1031 1228603 705102 897155 1132452 992924 870629 712079 241268 200155 681177 1136983
1021 1136983 792445 51541 398811 269106 -122160 -95356 -377794 -7361 -780318 -763555
1011 -763555 -543825 -48721 463010 19287 13033 30503 -267440 666381 687890 1144513
1001 1144513 778966 -280587 -754362 -127792 -325406 -266450 648094 1224112 565150 542839
991 542839 1115885 1177551 663800 881808 1288671 943078 550434 853313 788065 1357888
981 1357888 1766512 974936 584033 1032898 603991 615108 366641 999542 537555 -313467
971 -313467 222925 -1598 307734 583069 1748459 1833488 2002551 1337360 1187710 214922
961 214922 503603 -456714 43857 577461 -523329 -187015 1111835 953285 749195 510621
951 510621 421909 24491 -68213 -720446 -201822 165001 -139922 -414884 -377806 560217
941 560217 401058 150728 982937 919568 -962784 -305779 -353138 324996 355089 437325
931 437325 1792260 1415671 1003058 1144322 1054649 109325 381352 316734 -345622 477276
921 477276 84900 338700 190984 129274 1739314 2086340 -74973 287590 893609 766818
911 766818 65643 581357 600090 318537 451524 -472041 367845 272405 43921 -59165
901 -59165 891108 223009 1016893 112111 -432859 623906 1047361 1007008 724713 287461
891 287461 540382 -16992 997884 1983947 1513795 90004 292765 626089 -274439 -239514
881 -239514 1003151 378389 787132 392190 630541 1081662 1114526 668405 -616394 -178
871 -178 338932 121744 -508192 592465 327169 1347447 955711 814268 467272 631970
861 631970 -18925 -168064 -208914 834234 583905 601524 77833 288813 635585 386931
851 386931 -54143 618228 588212 -790204 -310980 -17430 878275 747122 338699 948807
841 948807 -216451 -658766 16863 101369 135223 122359 981954 1114775 707814 576747
831 576747 1205706 396377 757869 992855 -419565 548847 637025 226284 182927 193090
821 193090 -168498 -127054 233992 834346 303643 -172025 1012814 633726 7834 1396818
811 1396818 1859285 468963 322350 725707 304016 -195496 -29184 42464 553574 -630101
801 -630101 -929434 -548579 198860 875077 890799 845904 549238 672942 469419 1465000
791 1465000 688761 -38443 125801 355391 740878 1034912 119414 -332299 -969071 -329930
781 -329930 -143132 -436287 929969 1373379 1076258 182233 1234298 708745 520514 1193377
771 1193377 1144730 106101 -579185 -78473 629772 999172 521823 -45783 296104 1191749
761 1191749 1284583 701511 759629 394579 318498 -107402 652600 1278606 1269940 982595 1329012
750 1329012 934294 384951 1008706 618667 -109066 549501 -130605 -149900 73129 864075
740 864075 591729 -188220 -384263 -1043472 -1141849 -67553 -243362 -991848 80183 -53842
730 -53842 -277662 -258712 513400 818404 547464 631090 570626 -225496 -30378 -717568 -394389
719 -394389 -332135 116383 -227317 577463 245187 562059 913700 -482142 -373634 619532
709 619532 -344831 8384 301520 1039906 1624762 439689 -301775 -413718 418854 839427
699 839427 757754 -65235 322283 404567 573175 762024 1200119 377180 485407 144623
689 144623 796887 633352 -71654 193980 713033 458481 786619 1165709 1447900 303471
679 303471 -612800 -102714 238269 211696 602986 273716 173934 162187 425244 584256
669 584256 261813 337215 684558 405260 -173528 -621549 -276725 599939 -396247 166796
659 166796 111311 -108003 315219 1030861 1223547 552438 431110 981127 1084134 1190264
649 1190264 849168 512341 680171 433150 120094 740736 1200144 2068486 1998744 1853522
639 1853522 766578 447974 1439167 1595745 731273 491513 47035 -81738 -41496 -649924
629 -649924 252248 1280823 964438 835735 771948 985848 823742 287929 69848 444636
619 444636 490823 565306 -78536 573109 1413823 578219 160653 892957 1559852 1738566
609 1738566 406839 -596012 311570 199345 -317917 -874657 -365628 -94679 -76878 -482248
599 -482248 -241247 -1163441 478701 808085 -19064 663248 379966 -211457 -307772 -430417
589 -430417 1031125 1353913 -107454 -135207 -258742 383377 1033950 1187058 930559 764281
579 764281 331338 370331 -467438 542243 1080100 431452 640903 156547 402356 1045289
569 1045289 824086 612178 -146968 -400723 -715265 -561601 170273 371240 323016 763188
559 763188 1278790 1484356 1330459 413421 -295564 -336311 241594 1000112 1331832 1262568
549 1262568 1420274 432251 547894 637448 961591 834841 283225 -100419 1148595 900484
539 900484 352418 585004 242912 -293887 198027 -486382 -1219301 -1319259 -342741 945499
529 945499 75252 106966 1147023 925978 750373 572122 260203 648703 843658 134285
519 134285 -104581 -7128 299340 1023676 766204 1290735 770919 238118 -30998 7190
509 7190 640443 534792 -697882 -142496 580649 609441 548438 1098793 1066920 604086 -92857
498 -92857 497186 273282 -155172 -76691 -373190 -291258 867877 369972 -858677 -1366356
488 -1366356 -1380522 -1264497 -653476 277598 634645 854924 1435038 643390 680310 1275441
478 1275441 351984 1037248 539836 719723 593513 315973 1097475 705333 -454480 -1015913
468 -1015913 -132872 1082567 1022235 585401 -358634 536846 635153 1055067 1281759 603254
458 603254 843337 1274146 637996 1273574 1121881 -286854 791180 1130740 1563954 602550
448 602550 192667 715084 483802 131702 830690 1058373 497227 660033 291533 -288353
438 -288353 -45871 725974 351494 250555 316106 841312 549867 -530790 -418776 859363
428 859363 692507 627287 944555 230869 721541 181692 167373 380868 52346 -217538
418 -217538 473160 1049716 316430 262924 1425753 1521912 622264 36895 468420 49908
408 49908 406383 802828 814862 7685 245064 372160 606761 1150638 1208165 1389478
398 1389478 536317 872974 953167 890663 -31467 213618 729933 933427 -645047 193994
388 193994 642193 110521 942112 251686 -277166 762453 1103678 1174773 1506391 750294
378 750294 1151731 918429 -685974 392444 368222 668519 1042916 425601 373749 744194
368 744194 1048150 770006 328560 -100952 179150 -423365 -19985 1125771 1242029 -672647
358 -672647 -740081 89314 -724713 14664 753409 509216 1067009 332582 159372 -59112
348 -59112 -173354 509135 224601 711744 1114550 917185 27962 -123399 -578235 -1176805
338 -1176805 -1375827 -203453 535414 658436 200242 68523 340015 175526 42276 44026
328 44026 155910 835267 1129450 350351 127425 -17444 480881 576117 836798 443966
318 443966 461566 526567 -86499 -601614 -333733 -241911 -395413 -768769 -331186 -507499
308 -507499 -398435 1075881 960178 527375 1174394 802258 634002 881688 1268814 1228049
298 1228049 955038 911802 1149218 1003988 203201 690740 1087849 1011618 428281 231227
288 231227 621076 402498 459019 1195639 999216 -111309 342347 579949 731213 80511
278 80511 333352 1068701 912011 519900 713128 77488 143701 457605 734627 76606
268 76606 12768 34590 -448551 163029 222063 -696208 -642192 -269141 29446 349460 605118
257 605118 -122084 -422655 -918408 -814411 -453275 -124500 507190 174911 57389 269223
247 269223 -186821 280091 945324 544646 288910 -130125 1200773 969839 1372217 390484
237 390484 191249 -299803 -863724 -859936 -24916 327376 635176 -503681 -301596 836173
227 836173 981623 272823 -62701 304514 -686041 -5204 532836 829026 339870 337291
217 337291 1388951 1144147 1042353 1002070 794245 420436 779271 811732 -97748 -69533
207 -69533 103941 805118 943092 392383 1117342 1028051 644820 20212 288645 1067359
197 1067359 1545711 1205471 1970908 1547607 346710 10193 42252 -1085682 200973
188 200973 327352 245299 912256 243584 733119 782671 278902 -83996 -474483 -1340099
178 -1340099 -109896 -170364 -775240 366110 733497 -283808 -509189 418467 555381
169 555381 -237594 -476960 252563 147581 -318018 3064 -139143 -795932 -1078030 -571800
159 -571800 -950103 -24075 -80904 -580974 -115747 202122 -209935 273286 290371 199629
149 199629 768889 3109 344716 451954 551049 487012 284980 640928 63985 -334699
139 -334699 -133396 332933 596135 497312 -389586 -156143 477052 34639 -1023725 -656662
129 -656662 -708720 -885346 -254280 -47989 139574 412966 98910 -252920 -642338 -966445
119 -966445 -1009361 -810557 -485098 -332792 -326349 -84147 -808374 -278651 -495483 -315905
109 -315905 -563991 -153733 -534047 -391357 294339 367664 4592 -98439 -820601 -1224188
99 -1224188 -727146 23743 350225 258410 413254 69054 196518 -1223079 -696278 -36359
89 -36359 229986 342542 337259 214844 -308921 -32943 -32779 -621796 -1098677 -476344 -477018 -738408
77 -738408 -600326 -400947 -169995 493811 -12525 -622674 -744213 -292041 -37858 -375903
67 -375903 -765674 -445371 -180848 -394062 -112195 -686870 -471231 250753 161364 -210881
57 -210881 -450807 -496218 -1061237 -810688 -7143 -442755 -633915 -645081 -27406 -1010710
47 -1010710 -1120742 -628310 -889873 -951542 -739298 -978607 -575950 -1265323 -1385364 -944400
37 -944400 -952241 -1066079 -46859 50788 342247 -308633 -740720 -829967 -581959 -399150 -954573
26 -954573 -1579133 -937939 -1042268 -1295644 -845234 -821478 -1182937 -1039834 -762626 -658166
16 -658166 -1516284 -1835730 -1128314 -1468441 -1528866 -501195 -821671 -950169 -667971 -807266
6 -807266 -628061 -744258 -1106624 -672176 -718192 -777448
0 -777448
$$ Imaginary data points
##PAGE= N=2
##DATA TABLE= (X++(I..I)), XYDATA
16383 -4426360 -4198414 -3991840 -3589612 -3951117 -3528843 -3460938 -3272014 -3263686 -3347055 -3374273
16373 -3374273 -3124600 -3214997 -3432667 -2966982 -3697200 -3625920 -3085966 -2685257 -2036904 -2759639
16363 -2759639 -2873554 -2666841 -2006767 -1885539 -1735001 -2180708 -2444035 -2639093 -2627051 -1994664
16353 -1994664 -1330991 -2236271 -1525057 -1138126 -731308 129749 -458274 -333693 -32801
16344 -32801 -837653 -528658 -224576 -823480 -560935 -372190 -8683 337149 636081 468843
16334 468843 1204428 1058745 715723 1093413 615283 252285 307899 387390 1038062 436326
16324 436326 462987 738847 358462 474044 1619615 1696623 980962 1736476 1666151 2156812
16314 2156812 2606328 2940783 2281382 1995304 1941972 1829156 2290526 2061532 2054665 1786281
16304 1786281 1816892 1599731 2229231 1484724 1434400 1766065 1586691 1808127 2719273 3092049
16294 3092049 2857252 3789157 3961678 2857439 2357536 3047701 3231060 3109021 3176849
16285 3176849 2984623 3669369 3333110 3053364 3059399 2710297 3219096 3928316 3443798 2925260
16275 2925260 3271015 3755386 4019142 4601582 4513880 4468108 4310045 4483919 4612906 4330814
16265 4330814 4586667 5129880 4832358 4488471 5053313 5265639 4460342 5084146 5094166 4998788
16255 4998788 5283887 5141385 5612901 5693977 5429729 5056875 5066964 5631298 5498848 5390243
16245 5390243 5714474 6132216 5465520 6293453 5779880 5493512 5487470 6044483 6197056 6124168
16235 6124168 6648931 6557698 6352824 5624446 5734811 5932403 6019371 5684230 6112780 7147182
16225 7147182 6864018 7137096 6248989 6113611 6741462 7210288 6383032 6162076 7129806
16216 7129806 6535498 7234691 7085928 7133996 6792433 7625056 7635817 7930807 7870965 7632034
16206 7632034 6411062 7756198 8061373 7738007 7900012 8164487 7568220 7245271 7563498
16197 7563498 8162867 7336571 6703217 7311642 7730333 7974703 7957552 7687007 8072827 8685313
16187 8685313 8420973 8485382 7567829 6921691 6583840 7332751 7512992 7298361 8094701 8146546
16177 8146546 8309760 8778609 8604683 9328379 9241811 8895649 9619272 9273406 8001808
16168 8001808 7735994 8440193 8054985 8969883 8716300 8487356 8474730 9513803 9565967 8158855
16158 8158855 8625513 8787337 8694651 8496676 7822094 8132932 8446607 8740348 8644781 8590686
16148 8590686 8630764 7553390 8114128 8345106 9142299 7932199 7950214 8507788 8294159
16139 8294159 9505250 10084751 8945344 8760093 8896961 8257277 7545957 8447784 8799228
16130 8799228 9684027 8940000 8119121 8425193 8057156 8836450 9694216 9522087 8648664
16121 8648664 9535375 8938566 9019311 8924466 8632250 8662604 8574957 9366296 9431909 9743934
16111 9743934 8826817 9494207 9448057 8958477 9339712 8945246 9770748 9319307 8272930
16102 8272930 8390024 8443478 8619667 8625896 10361654 10459294 9280722 9184903 9651791 9988536
16092 9988536 9679565 8941891 9075631 9633803 10066368 9884527 9021955 8878162 9270287
16083 9270287 9199557 9475687 9414242 10126473 10718545 10405992 10180081 9379479 10256742 9318724
$$ [...]
##END NTUPLES=NMR SPECTRUM
##END=
