##TITLE=1H_CA-8907-2
 CD3CN, 8 sc, 
 30.07.2021
##JCAMPDX= 6.0         $$ Bruker NMR JCAMP-DX V2.0
##DATA TYPE= NMR SPECTRUM
##DATA CLASS= NTUPLES
##ORIGIN= UXNMR, Bruker Analytische Messtechnik GmbH
##OWNER= root
$$ XWIN-NMR		Version 3.5
$$ Fri Jul 30 10:09:51 2021 Russian Standard Time (UT+4h)  she@DPX200
##.OBSERVE FREQUENCY= 200.131506
##.OBSERVE NUCLEUS= ^1H
##.ACQUISITION MODE= SIMULTANEOUS
##.ACQUISITION SCHEME= undefined
##.AVERAGES= 8
##.DIGITISER RES= 18
##SPECTROMETER/DATA SYSTEM= spect
##.PULSE SEQUENCE= zg30
##.SOLVENT NAME= DMSO
##.SHIFT REFERENCE= (INTERNAL, DMSO, 0, 17.5423)
##AUDIT TRAIL= $$ (NUMBER, WHEN, WHO, WHERE, WHAT)
$$ ##TITLE= Audit trail, XWIN-NMR		Version 3.5
$$ ##JCAMPDX= 5.01
$$ ##ORIGIN= Bruker BioSpin GmbH
$$ ##OWNER= she
$$ F:/spectra/data/she/nmr/H-F/1/pdata/1/auditp.txt
$$ ##AUDIT TRAIL=  $$ (NUMBER, WHEN, WHO, WHERE, WHAT)
(   1,<2021-07-30 10:08:22.51 +0400>,<she>,<DPX200>,
      <created by zg, POWCHK disabled, PULCHK disabled
       configuration hash MD5:
       00 E9 B6 7A A2 85 ED C7 34 08 36 98 17 FE 4E 26
       data hash MD5: 16K
       7B 26 A1 8C 89 F4 10 9F 55 AE F2 6E C7 44 31 93>)
(   2,<2021-07-30 10:08:24.84 +0400>,<she>,<DPX200>,
      <Start of raw data processing
       efp BC_mod = 2 LB = 0.24 FT_mod = 6 PKNL = 1 PHC0 = -13001.39 PHC1 = 18.60099 SI = 16K 
       data hash MD5: 16K
       00 69 53 C1 C1 0C 29 93 98 8F B4 DF AF F8 19 2C>)
(   3,<2021-07-30 10:08:50.29 +0400>,<she>,<DPX200>,
      <pk PHC0 = 0.8980913 PHC1 = -2.6 
       data hash MD5: 16K
       F4 3A 44 E1 1C 0D 0B B6 82 06 CB 5F 8F 2F D0 EB>)
(   4,<2021-07-30 10:08:53.79 +0400>,<she>,<DPX200>,
      <abs ABSG = 5 
       data hash MD5: 16K
       BB 4D 20 D1 4F 17 5D B6 F2 88 1C FE C2 95 90 68>)
$$ ##END=
$$ 
$$ hash MD5
$$ 04 22 EC A5 6C D9 E6 E2 CB 2E 67 C3 5B DA A4 78
##$RELAX= 
##$RELAX= 
##$RELAX= 
##$RELAX= 
##$RELAX= 
##$RELAX= 
$$ Bruker specific parameters
$$ --------------------------
##$DU= <F:/spectra>
##$EXPNO= 1
##$NAME= <H-F>
##$PROCNO= 1
##$TYPE= <nmr>
##$USER= <she>
##$AMP= (0..31)
100 100 100 100 100 100 100 100 100 100 100 100 100 100 100 100 100 100 
100 100 100 100 100 100 100 100 100 100 100 100 100 100 
##$AQSEQ= 0
##$AQ_mod= 1
##$AUNM= <au_zg>
##$AUTOPOS= <>
##$BF1= 200.13
##$BF2= 200.13
##$BF3= 200.13
##$BF4= 200.13
##$BF5= 200.13
##$BF6= 200.13
##$BF7= 200.13
##$BF8= 200.13
##$BYTORDA= 1
##$CFDGTYP= 0
##$CFRGTYP= 5
##$CHEMSTR= <none>
##$CNST= (0..31)
1 1 145 1 1 1 1 1 1 1 1 1 1 1 1 1 1 1 1 1 1 1 1 1 1 1 1 1 1 1 1 1 
##$CPDPRG= <>
##$CPDPRG1= <>
##$CPDPRG2= <>
##$CPDPRG3= <>
##$CPDPRG4= <mlev>
##$CPDPRG5= <mlev>
##$CPDPRG6= <mlev>
##$CPDPRG7= <mlev>
##$CPDPRG8= <mlev>
##$CPDPRGB= <>
##$CPDPRGT= <>
##$D= (0..31)
0 1.2 0 0 0 0 0 0 0 0.06 0 0.03 0 0 0 0 0.0002 0 0 0 0 0 0 0 0 0 0 0 0 
0 0 0 
##$DATE= 1627625301
##$DBL= (0..7)
120 120 120 120 120 120 120 120 
##$DBP= (0..7)
150 150 150 150 150 150 150 150 
##$DBP07= 0
##$DBPNAM0= <>
##$DBPNAM1= <>
##$DBPNAM2= <>
##$DBPNAM3= <>
##$DBPNAM4= <>
$$ [...]
##$SUBNAM3= <"">
##$SUBNAM4= <"">
##$SUBNAM5= <"">
##$SUBNAM6= <"">
##$SUBNAM7= <"">
##$SUBNAM8= <"">
##$SUBNAM9= <"">
##$SW= 20.0188882624521
##$SWIBOX= (0..15)
0 0 2 0 0 0 0 0 0 0 0 0 0 0 0 0 
##$SW_h= 4006.41025641026
##$TD= 16384
##$TD0= 1
##$TE= 0
##$TE2= 300
##$TE3= 300
##$TEG= 300
##$TL= (0..7)
0 120 120 120 120 120 120 120 
##$TP= (0..7)
150 150 150 150 150 150 150 150 
##$TP07= 0
##$TPNAME0= <>
##$TPNAME1= <>
##$TPNAME2= <>
##$TPNAME3= <>
##$TPNAME4= <>
##$TPNAME5= <>
##$TPNAME6= <>
##$TPNAME7= <>
##$TPOAL= (0..7)
0.5 0.5 0.5 0.5 0.5 0.5 0.5 0.5 
##$TPOFFS= (0..7)
0 0 0 0 0 0 0 0 
##$TUNHIN= 0
##$TUNHOUT= 0
##$TUNXOUT= 0
##$USERA1= <user>
##$USERA2= <user>
##$USERA3= <user>
##$USERA4= <user>
##$USERA5= <user>
##$V9= 5
##$VALIST= <valist>
##$VCLIST= <CCCCCCCCCCCCCCC>
##$VD= 0
##$VDLIST= <DDDDDDDDDDDDDDD>
##$VPLIST= <PPPPPPPPPPPPPPP>
##$VTLIST= <TTTTTTTTTTTTTTT>
##$WBST= 1024
##$WBSW= 4
##$XGAIN= (0..3)
0 0 0 0 
##$XL= 0
##$YL= 0
##$YMAX_a= 188242
##$YMIN_a= -231280
##$ZGOPTNS= <>
##$ZL1= 120
##$ZL2= 120
##$ZL3= 120
##$ZL4= 120
##$ABSF1= 17.52277
##$ABSF2= -2.496269
##$ABSG= 5
##$ABSL= 3
##$ALPHA= 0
##$AQORDER= 0
##$ASSFAC= 0
##$ASSFACI= 0
##$ASSFACX= 0
##$ASSWID= 0
##$AUNMP= <proc_1d>
##$AZFE= 0.1
##$AZFW= 0.1
##$BCFW= 0
##$BC_mod= 2
##$BYTORDP= 0
##$COROFFS= 0
##$CY= -3
##$DATMOD= 1
##$DC= 0
##$DFILT= <>
##$DTYPP= 0
##$F1P= 0
##$F2P= 0
##$FCOR= 1
##$FTSIZE= 16384
##$FT_mod= 6
##$GAMMA= 0
##$GB= 0
##$INTBC= 1
##$INTSCL= 1.334414e-10
##$ISEN= 128
##$LB= 0.24
##$LEV0= 0
##$LPBIN= 0
##$MAXI= 10000
##$MC2= 0
##$MEAN= 0
##$ME_mod= 0
##$MI= 1.114404
##$NCOEF= 0
##$NC_proc= -6
##$NLEV= 6
##$NOISF1= 3.799351
##$NOISF2= 2.8
##$NSP= 0
##$NTH_PI= 0
##$NZP= 0
##$OFFSET= 17.54232
##$PC= 1
##$PHC0= -13000.49
##$PHC1= 16.00099
##$PH_mod= 1
##$PKNL= yes
##$PPARMOD= 0
##$PSCAL= 0
##$PSIGN= 0
##$REVERSE= no
##$SF= 200.129998461855
##$SI= 16384
##$SIGF1= 3
##$SIGF2= 2
##$SINO= 5.538805
##$SIOLD= 16384
##$SREGLST= <1H.CDCl3>
##$SSB= 0
##$STSI= 16384
##$STSR= 0
##$SW_p= 4006.41025641026
##$SYMM= 0
##$S_DEV= 0
##$TDeff= 16384
##$TDoff= 0
##$TI= <>
##$TILT= no
##$TM1= 0
##$TM2= 0
##$TOPLEV= 0
##$USERP1= <user>
##$USERP2= <user>
##$USERP3= <user>
##$USERP4= <user>
##$USERP5= <user>
##$WDW= 1
##$XDIM= 16384
##$YMAX_p= 493737739
##$YMIN_p= -317097
$$ End of Bruker specific parameters
$$ ---------------------------------
##NTUPLES= NMR SPECTRUM
##VAR_NAME=  FREQUENCY,     SPECTRUM/REAL,   SPECTRUM/IMAG
##SYMBOL=    X,             R,               I
##VAR_TYPE=  INDEPENDENT,   DEPENDENT,       DEPENDENT
##VAR_FORM=  AFFN,          ASDF,            ASDF
##VAR_DIM=   16384,         16384,           16384
##UNITS=     HZ,            ARBITRARY UNITS, ARBITRARY UNITS
##FACTOR=    0.24454680195387, 1,            1
##FIRST=     3510.74452494303, 0,            0
##LAST=      -495.665731467233, 0,           0
##MIN=       -495.665731467233, -317097,     0
##MAX=       3510.74452494303, 493737739,    0
$$ Real data points
##PAGE= N=1
##DATA TABLE= (X++(R..R)), XYDATA
$$ [...]
10585 -125375 -44453 -4702 -42213 5975 113903 34610 -54974 -11474 -49341 -65674 -162029
10574 -162029 -140736 -128899 39197 -63248 -132876 -81540 -101545 -80984 23807 -14931 -107371
10563 -107371 -59457 44658 42082 -24016 6839 20238 29231 30941 57273 114007 -8217 -95834
10551 -95834 30053 43758 -12589 -34270 -31294 28376 -42941 -78121 -124104 4860 38209
10540 38209 52112 19859 61281 25039 -29225 29752 38652 -28240 23048 -11974 26488 45574
10528 45574 -1936 94496 -6939 -16810 -45288 -29935 -64650 14612 12195 514 -139820 15208
10516 15208 -36035 -9716 64732 99662 78605 31096 -8857 -6486 2179 30084 98955 32981
10504 32981 -70867 -117135 -84314 -31468 55174 98383 117789 -2801 10640 100804 -13660
10493 -13660 -37792 -199603 -167049 -60116 -171943 -106278 -14739 -182653 -52797 -64624 -54146
10482 -54146 -21151 103589 -49087 20738 -36716 -122505 -37357 -20064 -73183 -71118 17115
10471 17115 -61433 -16339 1434 -68917 -47880 -69230 4297 -56483 -68043 -23887 12977 -9371
10459 -9371 -64067 -103910 -118848 -31268 -25957 -11339 -76410 -28878 11763 -10444 -156399 -155565
10447 -155565 -104037 -69826 -105335 -172388 -147760 -53005 -155835 -194767 -190665 -180712 -174692 -44055
10435 -44055 -11362 -61983 85789 53097 20388 14419 49288 34338 -17801 51748 6790 -29698
10423 -29698 -26486 79206 -60500 -55463 -13724 52914 -40445 -37063 -51867 -19571 -137845 -50281
10411 -50281 -107095 -37936 -170728 -143898 275 -113 11190 106498 17109 -43759 30082 -16101
10399 -16101 -17936 -57014 -45141 -53947 -107083 -13514 -47637 -137807 -132641 -12294 17834 16566
10387 16566 74560 96175 63364 -34266 102701 78552 -84271 -80519 -108429 -99129 -58313 -91116
10375 -91116 12004 -33805 -14159 -82555 -132600 -102411 -85703 -89905 -63932 -67807 -140975 -171117
10363 -171117 -46886 -5089 -36844 -165158 24384 90721 -77239 -118584 -8326 -2341 6170
10352 6170 -21113 -90300 -128688 -94602 -119379 -100288 45195 71021 -130071 -143752 -81513
10341 -81513 -15502 20809 32908 8178 81416 30624 -63307 -21750 5360 -5158 140135
10330 140135 134771 28099 -94997 -78819 -26775 -84428 -103367 -57674 -10427 -38177 -51450
10319 -51450 -136934 -60655 -72560 -47253 8216 -105797 29182 48091 56084 36844 -56204
10308 -56204 7668 -1836 -43941 -34679 29869 -53277 -742 -52382 -41735 25194 63475 16014
10296 16014 37484 -4538 -73691 57841 158398 31122 -75717 -112620 448 26947 -54482
10285 -54482 -118970 -65756 -111960 -6451 29820 6944 126249 54934 4452 7527 -93976
10274 -93976 -41463 63637 89681 10024 -90115 -47061 31623 30811 -129140 -39053 -69758
10263 -69758 -139744 -137706 -21234 3203 39540 -34593 -115245 -44136 -75922 -180897 -70688
10252 -70688 -48088 -28736 9217 -2273 24073 -24517 -14093 -43019 -16947 -50307 -110148 36714
10240 36714 70785 2103 -47130 -22582 -159989 -83418 -13344 -67047 -95852 -47259 -94733
10229 -94733 -92112 -33409 -160268 -159616 -111375 2964 -42201 -127485 -101587 -154227 -100572 -128534
10217 -128534 -215182 -155574 -94554 -74479 -67559 -54953 -91179 31005 39747 14434 53505 102642
10205 102642 23569 34596 -33611 -22983 -27296 31734 -38026 30151 82293 -27136 -115331
10194 -115331 -121773 -115942 -75120 28203 13673 46447 62809 -18227 -89380 -78865 130219
10183 130219 40680 -62127 -15413 -122015 -131654 47487 7429 -181458 -27394 85101
10173 85101 -35934 -28111 -60613 -38519 -59784 -168492 -168858 -195322 -108963 12391 -78287 -143674
10161 -143674 -97301 -89428 -34557 6716 57876 10763 24479 75930 49597 -17914 -38106 -93242
10149 -93242 19496 73267 -23887 -76039 -117864 -59622 -37162 -41235 16522 18847 -122029 -192553
10137 -192553 -64442 -73636 -36448 -65606 -92776 -146518 -120472 11724 66731 -14627 74681
10126 74681 91429 33800 -154266 -101140 -97141 -166597 -154483 27390 -2569 -67895 15283
10115 15283 -17875 61545 -22178 -42543 71408 27337 -54321 -23380 12879 56165 -13311
10104 -13311 -26477 -44112 26313 -24621 77374 28539 -44335 -65294 -104979 -106645 -161200 -174070
10092 -174070 -73302 -114961 -70365 55388 -8496 -49562 -151169 -119723 -27304 -148388 -111479
10081 -111479 27603 12653 -90892 21228 11281 -52896 -42095 -84805 68007 31493 -37508
10070 -37508 -9581 55777 87598 6194 -52100 -10843 73372 28003 -1449 -97119 -65045 -10841
10058 -10841 -102398 -117345 -57964 -44981 -142241 -124066 -182539 -65319 1893 -1918 -36099 2896
10046 2896 -113659 -130556 -142815 -4815 39434 -9074 -16235 35970 25284 56541 7263 -97835
10034 -97835 -141976 -154507 -14675 -73834 47838 -8257 -69403 -146318 -48143 -59798 5649
10023 5649 -88997 -33988 -17548 84389 65312 -135183 -81451 -63412 990 143 -3220 -69114
10011 -69114 -25589 48133 -21667 50424 16397 -87531 -130952 -162779 -150195 -133640 -64988
10000 -64988 10604 13082 -66351 -8989 64274 -43254 -129283 -79916 3550 -63980 -47164 -65905
9988 -65905 -125527 -32743 -10833 74844 -52331 -194837 -92550 42575 -1548 -8926 50478
9977 50478 72880 139256 104500 2722 -143557 -166129 -78556 -55494 -54946 -74053 -16071 -48281
9965 -48281 -57819 -38869 -141800 -163486 -36977 -124627 -70513 -28681 -14551 -16832 -44345 -73745
9953 -73745 37194 57160 38339 -52357 -110254 -23960 -32641 61725 173448 11576 33107
9942 33107 -32122 -45051 -62829 -140143 6742 -58663 50487 41620 -31110 -40931 9955 38467
9930 38467 17482 6670 -105035 -80768 28268 4359 31412 3470 25818 63005 -11395
9919 -11395 -67326 -84637 -80643 -46249 -24753 85446 76140 35012 42974 -76633 -109841 -111057
9907 -111057 -100042 -76539 -72440 62291 -15878 -24559 17291 3319 35237 -76677 -69579 -50057
9895 -50057 -81270 24538 -46254 -89202 -25016 -92854 -225723 -104869 -49193 -96747 -61011
9884 -61011 -4455 -85952 -56754 36458 -10562 -32541 -25657 -147516 -188221 -136676 -30697 72966
9872 72966 69255 5628 13687 -28328 -55731 -99637 -150277 -78374 -49423 -38990 -109559 -125565
9860 -125565 7261 86102 -15944 55706 -15368 -50448 -47614 -34109 -32947 57693 -10074 -79852
9848 -79852 -61363 -102346 -29769 69688 -11843 30392 -7057 -52498 46083 70472 1263 -41671
9836 -41671 -64894 -41843 -12989 -78577 -91535 22941 -16645 -21873 20806 -6543 -110183 -141395
9824 -141395 -40722 -4678 57827 -33306 -39880 -38553 -2381 -63263 -71989 -65515 -157977 -133943
9812 -133943 -3352 27356 -87173 -145169 -180419 -158678 -74235 -82082 -49318 16097 -45855
9801 -45855 -144825 -47924 34916 74251 -28626 -32585 112840 23513 -2996 55915 -26352 -3236
9789 -3236 13251 -36205 -19187 1480 -27351 -62619 -63177 -8663 89658 45653 -29051 15373
9777 15373 8176 9283 -42258 -51460 -37121 13211 -16182 -78089 49602 -28585 -65385 -30430
9765 -30430 52377 -46974 -50990 90169 27809 -24798 -15307 -104961 -28844 58620 -81552 -122698
9753 -122698 -38268 -102301 -135409 -74030 -33374 -20179 -44959 -43913 -99573 -39903 -79936 31031
9741 31031 26301 -49142 -157560 -175520 -184812 -121871 -58758 17517 70001 -30242 -127978 -169639
9729 -169639 -30509 -25663 -85137 -36443 -59960 -125104 4183 94245 10306 -1585 57333
9718 57333 102386 29192 45350 92451 -56455 -51821 -65882 -32125 50796 100883 33028 18032
9706 18032 -9207 4884 -71167 -140294 -39232 78058 -2364 -133376 -116814 46994 135919
9695 135919 98889 58156 80469 20959 -21158 -55685 -83902 -78398 -105589 -127481 -141138 -150522
9683 -150522 -154542 -29584 -78706 -94965 -48153 -96552 1442 54537 -19101 -70934 -20990 26642
9671 26642 -76852 -27065 -103604 -179004 -32026 -37987 98694 66243 31995 -21146 -63426
9660 -63426 -48404 5739 -30961 -36176 -28898 -26022 -4439 -86187 -86666 -100055 -51086 -107576 32361
9647 32361 136422 -2894 3787 -52628 -65372 30483 -39374 -46895 -44747 33229 47175 144771
9635 144771 -8505 -36103 -7667 -84355 -21485 -31823 5909 -38623 -88944 -116376 -164322
9624 -164322 -42199 -58645 -42894 4052 -17717 79880 -19920 15986 32118 8932 -49217
9613 -49217 -88311 -121161 -134710 -607 -75655 -92473 -107755 -23084 -41954 40269 32596 100354
9601 100354 95450 4456 42524 81187 49498 -65039 -213514 -71578 61925 40858 6753
9590 6753 -44334 -43405 -153367 -111300 48111 94892 82980 53267 46344 69305 -45913 -167503
9578 -167503 -90486 49039 89892 103510 19737 -8630 -66765 27560 -6150 -59210 -87701
9567 -87701 -4407 -30330 -34419 74885 6600 -74551 41282 28127 23565 -39203 -92123 -87455
9555 -87455 -95799 22372 42608 111199 57788 17598 -29399 -36209 8413 -53009 38332 85391
9543 85391 56105 112162 5626 13219 104006 46245 81854 44137 -45907 -84057 19527 12061
9531 12061 12234 -40212 -75051 -123915 -169554 -66514 -13893 -20534 -129631 -37326 87661 134232
9519 134232 -2920 -7213 10989 77428 23759 92068 28915 22719 48970 -126404 -109498 -102591
9507 -102591 -106738 -142044 -15138 -15217 -52470 -35139 62808 87689 96256 36979 62465 4657
9495 4657 -16207 -9782 125089 78271 -141583 -154630 -69411 -79608 -32182 17208 -35235 30264
9483 30264 45835 -153902 -188848 -196543 -54875 -35270 -84636 -91131 -4177 70763 -661 -13517
9471 -13517 -75760 -163387 -140567 65824 64814 -35828 -158272 -94275 -101747 -39956 -11487 -7352
9459 -7352 32539 115555 25944 6821 23852 52080 15861 -64036 -39528 -72043 -196998 -140176
9447 -140176 -155449 -162182 -107517 17848 68758 53768 926 -21466 66068 -9552 -55798 -151837
9435 -151837 -43110 24213 -7541 30292 -71978 -72094 -71912 -139035 -23168 25892 44404 91072
9423 91072 12284 12713 37616 60698 9061 -6998 -8568 15857 75801 19363 -49088 -115923
9411 -115923 -115226 -114623 -50573 -121544 -12776 2292 7340 -38894 -63967 -9929 -71120 -76394 -24011
9398 -24011 -95070 -61162 50279 94421 60174 -9732 50905 -47618 269 -42169 -7385 10199
9386 10199 -17730 33705 112064 149316 46077 -32992 30894 -22035 -77927 -147958 -100033 613
9374 613 31717 33254 16685 -10098 -91424 -52234 94614 -17345 -71277 -26547 34908 108367
9362 108367 -44761 -144532 -86736 -137781 -49605 14063 24685 -56432 -145417 34720 110589
9351 110589 -29824 32073 23379 -74596 -69597 -96910 -74070 -75407 -75968 -82587 10505 -70328 -105939
9338 -105939 -85439 20180 14160 -82228 -60833 -12999 8191 -6377 29228 130607 72790
9327 72790 63284 -114380 -61586 32985 35343 77158 -31789 -37507 168041 90339 73930 86666
9315 86666 -17212 -67485 -125744 -67592 -41313 -2772 -766 -6678 -9558 -7854 -47012 -4762
9303 -4762 15293 -64624 -71184 105758 57622 -57478 -10109 -21229 17709 16793 3025 28383
9291 28383 55811 -19994 59381 38887 -30735 -76700 -92705 -6094 -42447 -73633 -75072 -6925
9279 -6925 -9642 129738 120395 60590 52813 133691 74890 -88371 -56098 -52535 6413 47216
9267 47216 113817 20294 -97571 -126195 49187 39562 6203 -11156 11448 -9774 -98058 -102436
9255 -102436 -30345 9700 -51915 85266 56722 32312 122656 163590 13082 -2113 -6628
9244 -6628 -58274 74883 177030 66016 4589 178626 94351 80032 -15342 -147847 -144067
9233 -144067 -103754 33934 94049 22677 56989 69370 26212 3577 72973 31367 13430
9222 13430 73253 23455 26425 31573 56585 -48994 -37843 39082 38795 26101 46256 -12505
9210 -12505 66156 83292 -24290 -112094 -57665 61953 93872 50610 49353 -29220 57277 108280
9198 108280 84983 107465 94850 124455 135695 4737 79069 59950 48775 155808 71839
9187 71839 74658 157164 106419 76005 -35213 -82913 -40414 72609 112063 189105 91232 -5497
9175 -5497 59585 31378 25802 79576 76170 -97404 -138290 -83651 -2531 114073 142652 89875
9163 89875 76043 134751 15169 -38497 27963 29429 50070 -25545 -48628 -4714 -692 77731
9151 77731 114262 126255 48360 -14014 59173 90118 50599 29149 2301 -116066 -98798 -32903
9139 -32903 -8832 15238 8712 110132 99441 29641 54882 45057 138306 164274 44866 -56928
9127 -56928 72825 31286 65904 114102 22577 -57058 -36974 -59886 59228 12438 36432
9116 36432 125905 104727 128100 78109 106901 47762 -42595 19752 60010 31815 51254 92511
9104 92511 48639 52793 -25762 -35383 18569 138250 40338 43782 114060 -96318 30862 93720
9092 93720 69939 65639 54926 172585 265828 261485 84229 8749 -13114 113228 113830 43599
9080 43599 132968 107084 25666 112724 46758 104144 51748 56784 -8578 -64146 6696 30271
9068 30271 -41701 983 76290 27114 33375 93752 162632 117109 203439 200876 151205 152929
9056 152929 246814 175702 84549 164740 273649 128230 86260 95147 96515 216544 160861
9045 160861 196074 344566 240860 160308 76237 133904 94475 -23736 40366 169135 117629
9034 117629 93899 77812 8430 84021 80513 50503 133898 100479 170433 239297 137511 5195
9022 5195 -50912 17371 63656 156102 157341 54999 69177 30662 206578 161294 95533 154870
9010 154870 96658 126372 191818 183574 111395 62549 87828 62508 94739 139140 124705 171349
8998 171349 176850 162937 46175 132278 239139 213552 118639 110474 143368 108477 48723 -1687
8986 -1687 60984 37789 202452 197842 110663 86077 59997 53834 -6099 73894 88358 91076
8974 91076 210695 215786 162928 178495 286961 217645 128164 99841 103285 144124 196300 106197
8962 106197 105565 89814 45756 147478 204505 109199 69048 -38575 3272 152130 126706
8951 126706 113625 66807 160089 164525 282970 206088 62296 86353 50685 36102 72850
8940 72850 190964 234615 196500 154667 106357 210298 187592 163671 1757 99899 255598
8929 255598 152999 209410 197782 231940 281702 225785 110379 121233 20276 -13206 143209
8918 143209 83315 155974 145329 99173 191219 228736 261597 287804 319221 358265 222238
8907 222238 268485 260737 261035 207870 243855 298929 391519 313767 270018 172391 247370 192033
8895 192033 150178 245723 136027 174262 136106 194601 186520 243059 271224 246902 295253 228843
8883 228843 159005 199436 202678 155591 190316 333545 421490 431216 321327 309782 317381 349398
8871 349398 288379 195344 184089 245057 269163 250799 276201 349069 389155 438191 389790 299355
8859 299355 338631 292924 266008 348673 380848 451842 330681 374043 438745 399258 372702
8848 372702 372178 479214 412225 511878 514597 446821 530711 523739 448722 483395 530552 543597
8836 543597 458571 533797 486808 567606 612301 538821 614719 540540 541979 436193 565088
8825 565088 586730 520236 592390 630730 508694 604111 737575 670432 752573 841329 736044
8814 736044 482717 585992 668559 702398 571436 629687 752927 740414 813774 784565 826254
8803 826254 724457 721302 865927 870480 761990 796565 854498 888889 810491 956012 1036127
8792 1036127 1010644 994359 1021315 1027477 1045560 1128411 1118869 1087387 1205655 1275152 1335436 1418789
8780 1418789 1365017 1252379 1247523 1263542 1335828 1464825 1349107 1333233 1418178 1427548 1515576
8769 1515576 1536315 1649497 1669590 1706569 1726590 1793455 1863054 2017492 2058354 2002672 2062996
8758 2062996 2153423 2239524 2299940 2358318 2352242 2492561 2487616 2582834 2758891 2888129 2917930
8747 2917930 3077087 3128834 3214651 3395991 3575595 3664724 3723461 3918910 4083548 4209465
8737 4209465 4406351 4614133 4766501 5071776 5360661 5541058 5854507 6176926 6448943 6837526
8727 6837526 7274141 7622495 8156310 8675712 9147850 9835124 10615533 11253234 12069044 12987558
8717 12987558 13833832 14742923 15809726 17010801 18172176 19293350 20587826 21739502
8709 21739502 22621730 23707756 24518088 25205659 25857660 26162751 26349106 26374065 26268204
8700 26268204 26055152 25810047 25346533 24812088 24052489 23031087 22035749 21018629 19789532
8691 19789532 18460718 17221298 16063026 14955177 13917487 12855851 11774637 10754390
8683 10754390 10105293 9584995 8898430 8405960 7986128 7495576 6979201 6686640 6230914
8674 6230914 5978256 5825774 5518879 5330392 5066024 4823284 4653392 4610997 4442580 4370457
8664 4370457 4159861 4036651 3850124 3666879 3590890 3425921 3381963 3257559 3150402 2928966
8654 2928966 2820890 2731254 2543695 2561721 2465972 2380443 2304327 2168973 2159382 2128423 2020792
8643 2020792 2093892 2163352 2150392 2064488 1929114 1826181 1767012 1829549 1701020 1558497 1536197
8632 1536197 1583743 1584632 1545619 1554314 1525230 1422421 1460392 1465689 1306640 1296318 1372590 1310896
8620 1310896 1346911 1275532 1395669 1256981 1199751 1218572 1174124 1158553 1237084 1207452 1250065
8609 1250065 1256286 1168611 1141231 1068690 1173698 1083379 899022 942932 984929 1034074 1061972
8598 1061972 989061 918186 968856 949574 968803 1018284 1041317 1068992 989076 952967 980836
8587 980836 1131943 1026767 969628 1054677 1011793 962667 990358 922693 908906 1099037 1135737
8576 1135737 1075533 1137573 1199736 1157252 1105031 1114099 1014002 1014359 1013894 1075030 1109482 1201453
8564 1201453 1271770 1155403 1019954 984895 1076057 1099428 1154195 1131128 1178911 1212890 1229218
8553 1229218 1289357 1413894 1348371 1261713 1345841 1268814 1236867 1212528 1349905 1382159 1401106
8542 1401106 1455217 1477979 1489164 1557023 1502618 1554105 1682582 1795020 1760968 1769027 1740339
8531 1740339 1770140 1767531 1754738 1855922 2024125 2076458 2145960 2238227 2240588 2295852 2283033
8520 2283033 2266914 2387323 2530376 2641242 2735936 2837720 2948672 2977666 3142370 3320565
8510 3320565 3382010 3530502 3751634 3885288 4003603 4249062 4404515 4537374 4778812 5053502
8500 5053502 5386532 5648054 5940010 6280910 6790012 7101503 7494529 8069096 8627685 9140674
8490 9140674 9686543 10432199 11197891 11936329 12696578 13556842 14606661 15500913 16428693
8481 16428693 17251337 18041817 18810294 18973370 18913263 18431748 17585812 16648566 15723751 14881025
8471 14881025 14076377 13177717 12489398 11997473 11711986 11473813 11292764 11084558 10831729
8462 10831729 10954738 11053783 11254638 11429224 11827427 12170750 12532286 12942402 13472644 14013314
8452 14013314 14770703 15464335 16283288 17188715 18129214 19130664 20231159 21187712 21926811
8443 21926811 22468674 22573331 22250774 21519167 20294625 18848996 17350012 15907135 14636156
8434 14636156 13428370 12320158 11400370 10480484 9581618 8980468 8320193 7797834 7344433
8425 7344433 6852670 6464349 6280988 6050018 5824457 5682013 5556180 5310908 5072595 4881144
8415 4881144 4790580 4583993 4403681 4249877 4054770 3885362 3729518 3665151 3612243 3471642
8405 3471642 3378341 3276561 3202939 3086004 2847598 2768363 2631829 2595091 2697752 2663411
8395 2663411 2561515 2383098 2374338 2274421 2230799 2224264 2229173 2119205 2009296 2156672 2218755
8384 2218755 2173506 2136805 2045885 2105187 2109455 1933337 1906536 2008015 2040849 2056520 2155004
8373 2155004 2207414 2177319 2130228 2138226 2118623 2020458 2163630 2181722 2076562 2259221 2239088
8362 2239088 2149938 2286714 2223626 2262835 2295877 2155790 2105364 2073567 2097389 1986309 1919179
8351 1919179 1919761 1912763 2018745 2066415 1880792 1899995 1808514 1836186 1881676 1906193 1915598 1919478
8339 1919478 2080104 2079752 2092340 2068580 1992884 1876957 1971781 2014958 1959283 2009777 2061563
8328 2061563 1996750 1899423 1890790 1882852 1772725 1792125 1502772 1433465 1470513 1323115 1326286
8317 1326286 1338225 1278720 1259056 1089651 1091047 1087232 1088604 1073224 1021630 1076655 981878 897784
8305 897784 862221 848307 731651 883954 938910 837458 829632 890476 803315 732064 659508
8294 659508 715845 792061 932883 820451 749314 785120 723783 640707 603109 610194 661979
8283 661979 711952 639644 657877 677793 604994 578723 557078 549879 544337 578037 696641 595918
8271 595918 561274 677944 765422 735971 607008 655644 691551 671409 576672 641467 619739
8260 619739 633535 686890 612746 675327 725041 618576 622755 723650 775287 794779 851895
8249 851895 683104 641995 717253 721697 735026 749431 730529 631414 745603 779155 774181 729795
8237 729795 667557 760200 835685 781248 715713 766354 968172 916182 913248 907342 925383 917866
8225 917866 966971 937246 859125 821769 821593 991210 1100239 933360 913492 1160294 1132934
8214 1132934 1175834 1286003 1199307 1251517 1305274 1347617 1380915 1254522 1311568 1359642 1476708
8203 1476708 1539929 1531434 1559118 1481001 1542821 1753735 1729481 1671799 1755003 1804595 1698171
8192 1698171 1285753 1564143 1979934 2046767 2148697 2246974 2316602 2358115 2545079 2585836
8182 2585836 2719462 2782039 2827101 2933436 3104272 3167641 3165181 3409048 3561384 3729453
8172 3729453 3830304 3988505 4236993 4439499 4705126 4834043 5182046 5467188 5654009 6032949
8162 6032949 6474906 6875741 7179440 7527435 7891568 8370770 8959892 9678622 10287678 10921849
8152 10921849 11726699 12527797 13221499 14018983 14812669 15606217 16306302 16927955 17469496
8143 17469496 17798068 18172778 18270720 18491354 18681618 18523697 18451230 18367368 18145907 17802168
8133 17802168 17497976 17190035 16880293 16396580 15787130 15258486 14823290 14355863 13944967
8124 13944967 13608965 13344683 13208683 13084191 13186956 13458650 13551590 13697329 14001045 14370932
8114 14370932 14736819 15199931 15569633 15895330 16209803 16507687 16654049 16732187 16687236 16677460
8104 16677460 16532787 16244689 16113747 15737660 15486215 15141564 14814313 14333747 13658376
8095 13658376 13030649 12372908 11833006 11150898 10628003 10042015 9446038 8831741 8148499
8086 8148499 7654513 7190379 6905533 6648633 6463840 6220512 5914702 5550302 5346636 5112496
8076 5112496 4932447 4797809 4576977 4269175 4200138 4111446 3884600 3635940 3417921 3345239
8066 3345239 3174338 3021500 2923778 2902877 2788732 2748522 2578875 2534654 2398965 2322460
8056 2322460 2293215 2228854 2204994 2146969 2006207 1869225 1857510 1812966 1687180 1597376 1637134
8045 1637134 1618102 1564452 1561744 1598510 1510534 1524601 1354180 1295769 1261997 1255452 1183410 1186034
8033 1186034 1174986 1156050 1111828 1159059 1236032 1257536 1118029 979807 942509 866376 948844
8022 948844 866883 831076 917900 934289 910950 782353 773357 753167 815180 868947 763102
8011 763102 771557 780147 638101 672105 648615 655539 624097 635762 637025 570041 645869 611690
7999 611690 562337 462972 514297 576846 516314 560838 566200 457247 602121 583935 490628
7988 490628 531571 513950 510476 575340 621709 598480 635411 552970 595174 649519 753509 695355
7976 695355 598408 635781 576712 599980 613991 658518 735400 819327 734861 804144 773395 882880
7964 882880 826960 847709 780164 798500 831007 782781 905888 875551 797752 734211 796632
7953 796632 745450 647848 823696 684431 657134 660435 820656 838092 733005 810909 799026
7942 799026 851757 897205 820594 880388 878877 947615 988931 1008239 1026997 1041917 966894 980096
7930 980096 1053176 953072 875840 801948 885310 843953 865905 940989 863933 806036 818514
7919 818514 720241 715810 683204 782533 748978 671282 624784 610292 524324 532193 582389 698277
7907 698277 714163 734690 755113 646978 544267 580048 640015 663261 598411 632949 687054
7896 687054 593211 623036 531450 398510 415794 533734 493092 414398 297273 248931 395250
7885 395250 439838 427901 362687 431924 391960 453882 418026 432985 381564 287875 321517 321157
7873 321157 378390 286425 339085 337249 313694 311676 225518 236402 305317 325871 264387 181386
7861 181386 172533 123140 140706 155392 178348 224486 301087 156828 90231 160586 132358 112846
7849 112846 73115 138783 101763 87895 194068 223461 135350 185566 211972 77835 89707
7838 89707 74231 220576 336630 171679 170518 172464 122933 178478 133421 106838 159625 201406
7826 201406 257617 114968 151376 155958 93684 123232 155765 100738 139539 226855 163488 133795
7814 133795 187813 55113 183102 193245 136640 138559 141940 170485 125786 160718 241064 174300
7802 174300 189637 197357 104681 106824 16228 65300 146246 120785 116738 247412 258489 268222
7790 268222 171027 50436 54796 69113 59013 136819 168738 25121 47994 204974 178986
7779 178986 122076 220898 310310 231193 237780 151719 221291 236441 289635 256734 147907 233140
7767 233140 253019 269266 278210 226621 233013 209285 207850 153804 236292 266467 340284 213178
7755 213178 187022 289386 235701 262784 301204 200611 146448 225410 280818 216704 218775
7744 218775 103542 90497 186515 140230 175596 171892 169631 27645 89153 192566 295063
7733 295063 176583 111544 49158 176958 229334 48285 23365 98190 171359 90711 148062
7722 148062 116709 42663 106711 190264 159754 249947 282403 288797 127970 49202 85028 117827
7710 117827 186790 234066 267902 188589 192223 212617 144544 98233 105883 96815 143581 193055
7698 193055 45899 2700 147474 197646 222687 186843 160250 138402 65410 51030 131124
7687 131124 57115 11895 19770 75777 -502 137220 184017 188254 198977 226449 230130 116611
7675 116611 171507 154964 194683 93560 138704 177816 244691 349715 225294 132629 193400
7664 193400 219183 123910 154786 217224 234993 206475 228986 167834 138169 143205 195114 242496
7652 242496 251104 126941 159471 282382 368778 250598 269386 322081 336215 267755 338989
7641 338989 236686 246043 227107 54180 130833 292723 296271 265062 366223 295989 223877
7630 223877 208796 160020 193472 206024 223590 252545 173179 245174 231294 289905 301934 298301
7618 298301 308990 333766 196178 275614 393921 366992 347665 340304 254955 244285 266736
7607 266736 257403 278524 392322 350070 293189 276169 288684 380264 300815 305747 364295 348717
7595 348717 334578 236533 209173 216096 339713 398672 319541 375281 468855 431754 423003 417445
7583 417445 475361 379585 488454 443630 409358 410341 240572 362543 308729 332554 410492
7572 410492 388179 466033 427994 359227 391163 466827 554663 493622 414435 495158 492853 425767
7560 425767 464273 607100 665852 645990 831769 751623 652502 756099 772561 756112 714770
7549 714770 727973 859828 826409 808343 906993 955059 947625 1064162 1063945 1069471 966439 1022596
7537 1022596 1077666 1072272 1076411 950506 891587 985313 1070858 1196711 1240009 1145848 1189274
7526 1189274 1343198 1457231 1557634 1599867 1600599 1706686 1854620 1864125 1780876 2035485 2023723
7515 2023723 2079774 2191587 2288157 2430042 2439018 2513148 2685746 2891001 3112628 3277738
7505 3277738 3320424 3502328 3687850 3933105 4217851 4345861 4487453 4531317 4502318 4544600
7495 4544600 4623065 4568386 4330650 4148767 4029865 3893310 3855988 3848961 3825277 3678778 3685310
7484 3685310 3533662 3479168 3498835 3571896 3585165 3547638 3639570 3706787 3698018 3766077 3998106
7473 3998106 4051923 4085638 4250013 4387112 4524722 4734195 4886986 5035554 5262341 5498652
7463 5498652 5692436 5947209 6074915 6205906 6370392 6488533 6422781 6369272 6341986 6248375
7453 6248375 6374924 6455290 6553111 6660081 6833089 7082124 7161018 7336003 7555729 7910317
7443 7910317 8305543 8729451 9045359 9426031 9782456 10340599 10985647 11608722 12150620 12853205
7433 12853205 13529722 14408850 15239604 15908616 16392037 16721457 16911690 16704670 16404518
7424 16404518 15937548 15332189 14733775 14227531 13694725 12977859 12522322 12211831 11946435
7415 11946435 11785467 11675644 11724646 11761591 11760584 11767807 11945130 12110904 12543407 12932487
7405 12932487 13301918 13811522 14396289 14996679 15634792 16430240 17264793 18087033 18976233
7396 18976233 20043551 21183169 22216381 23341590 24472335 25322851 26042403 26544490 26831597
7387 26831597 26772451 26602760 26388107 26184840 26134665 26162986 26323020 26507485 26852784 27320275
7377 27320275 27746635 28085604 28374027 28424301 28331216 28009490 27680626 27356655 27101116 26846470
7367 26846470 26708647 26358894 25917143 25301304 24329065 23221598 21953861 20764504 19423432
7358 19423432 17899802 16719383 15749491 14668315 13661796 12702941 11973588 11333922 10665415
7349 10665415 10288645 9757253 9176504 8752988 8578122 8275237 7909819 7640556 7281640
7340 7281640 7069679 6812386 6595642 6353745 6182690 6151239 6049965 5927205 5804245 5699011
7330 5699011 5631789 5538887 5330855 5256752 5228988 5189990 5243553 5320400 5255004 5254302 5266095 5359213
7318 5359213 5430024 5495500 5565424 5621529 5704747 5904784 6021916 6071820 6418671 6618482 6669702
7307 6669702 6813798 7016319 7062102 7104002 7063323 6794733 6606233 6520624 6269508 6114896
7297 6114896 5859115 5797020 5678703 5603935 5356722 5047320 4763938 4449029 4285228 4074038
7287 4074038 3857574 3585016 3452215 3291246 3025092 2908967 2781125 2606701 2564765 2535411
7277 2535411 2416613 2296854 2193462 2088789 2057153 1995200 1794697 1736569 1684189 1597527
7267 1597527 1619884 1634203 1587883 1631618 1621105 1489896 1506283 1398001 1327748 1249448 1219344
7256 1219344 1116920 1183351 1197234 1127614 1112932 1057057 1014436 950651 1005737 896456 872731
7245 872731 929985 990675 943128 933442 780042 914069 958480 857592 748793 752110 705729
7234 705729 728117 662201 663568 665946 503845 560041 598148 645742 648128 672952 579671 565549
7222 565549 569807 559379 618647 535180 553678 569094 421620 430673 468085 481132 421839 366546
7210 366546 413762 520423 418324 418232 454574 499590 487906 488575 406901 468330 400831 347883
7198 347883 436599 286596 379556 412861 384170 380113 303286 295744 282612 313415 347588 220727
7186 220727 163794 253441 332658 375128 353159 340840 369657 340832 236750 185967 184281 346918
7174 346918 280701 359333 428537 460930 396318 241230 203632 205199 244368 323122 257560 339704
7162 339704 436553 423955 481405 383256 320463 199067 141278 261740 284371 253720 386760
7151 386760 372074 339584 380632 375183 338484 346005 317318 306409 350502 284265 267652 297904
7139 297904 245088 202468 208057 199489 245022 290821 323557 402252 397024 270178 257685 250266
7127 250266 199272 273900 301283 342209 241875 220451 248860 278542 370973 367224 269829 275575
7115 275575 281028 258570 222112 321401 482848 318717 397013 360072 291645 475107 424456
7104 424456 476809 431701 393067 325320 293189 311480 270247 283254 372897 464762 399863 414714
7092 414714 413389 426484 472862 438328 505185 416264 318483 353225 517128 453731 354941 465281
7080 465281 420775 517704 458287 489097 456853 577994 582725 444982 587882 653012 740794
7069 740794 739221 627852 598507 706420 577402 649362 635584 686919 811517 712201 684513
7058 684513 764657 799240 828630 874293 804485 878358 904548 919590 935170 963635 954073 953035
7046 953035 964952 857457 906266 1027316 991390 1041273 984667 994619 952443 1064218 1149573
7035 1149573 1107669 1138497 1177366 1204116 1136321 1193468 1208894 1139436 1172447 1253966 1239624
7024 1239624 1298617 1336356 1346377 1388206 1539967 1497175 1548108 1551481 1542290 1688871 1805569
7013 1805569 1918404 1934129 1924686 2040838 2059030 2040270 2151164 2277936 2345240 2421457 2534266
7002 2534266 2727557 2798047 2803713 2925365 3078627 3156437 3361845 3422862 3627311 3782266
6992 3782266 3965167 4086618 4331823 4677553 4927600 5164396 5482033 5814863 6140548 6500148
6982 6500148 6876158 7262679 7775279 8355648 8939178 9578300 10219189 10995460 11789812 12534725
6972 12534725 13299039 14057923 14828673 15397721 15785618 16269283 16458352 16498121 16374413 16218810
6962 16218810 16034874 16190424 16160349 16102646 15927602 15726037 15314946 14987968 14332960 13735060
6952 13735060 13005794 12563955 12082398 11643158 11360349 11027997 10865897 10799287 10820975 10778749
6942 10778749 10858781 11059658 11224555 11524032 11775818 12020598 12447012 12889568 13266556 13699720
6932 13699720 14068968 14328777 14568926 14710132 14538136 14392050 14409776 14159357 14108313 14053370
6922 14053370 13834607 13547310 13406850 13106440 12610726 11901751 11207851 10486513 9784968
6913 9784968 9131992 8451815 7949241 7390828 6779924 6373284 6020876 5779898 5387804 5161827
6903 5161827 4876653 4634194 4408021 4185571 3935855 3823111 3726740 3565530 3459887 3254983
6893 3254983 3057688 3019666 2872904 2722286 2822989 2801957 2620825 2482125 2361454 2227029
6883 2227029 2157013 2163924 2073386 1890032 1875622 1755527 1590730 1633372 1690934 1579382 1474088
6872 1474088 1518522 1478596 1332424 1381788 1475171 1387398 1316912 1217138 1168131 1179088 1302064
6861 1302064 1185243 1171461 1101255 1048587 1043750 908614 865901 871108 864913 920953 829912 700577
6849 700577 653580 776128 846287 816995 811864 725943 644619 737783 734064 653883 763318 699430
6837 699430 651836 653026 536816 617197 696803 699628 601777 586786 598935 526851 603809 498318
6825 498318 430289 501924 434771 419830 451389 379158 317461 335439 355669 392905 429120 397446
6813 397446 378128 409437 506177 378547 357309 373302 399419 426423 330779 186803 197867
6802 197867 226276 234253 210516 254113 129274 129757 186562 163114 292816 210040 130021 134057
6790 134057 208143 168878 136620 98037 87486 160531 115502 201595 189043 257153 247605 215060
6778 215060 180234 164183 121539 141809 50581 59318 121856 114671 92040 151535 224754 68704
6766 68704 45714 38166 40173 254189 247732 60664 29924 35463 7219 92413 38696 1460
6754 1460 69750 9942 -41986 -13017 8034 -21819 -78395 -23089 91937 52608 25265 209303
6742 209303 160049 44009 83340 142441 112468 175557 176374 78293 46829 40022 142938 11775
6730 11775 45435 191687 34780 45379 43938 -101738 350 -4652 46555 35294 72494
6719 72494 -14079 -104159 -121281 -91971 70561 39988 -103610 -6344 -22153 -87369 -153346
6708 -153346 -162995 -114000 -62233 -2912 -30882 -64823 -27854 -10898 -44352 3930 38935 77000
6696 77000 -99461 -137529 6431 61214 -91297 -96031 -12383 -131055 -5781 -11745 -3711
6685 -3711 45795 -13761 -50790 12281 -70251 -97550 -52757 -1966 -9641 -76350 -22578 8100
6673 8100 -11519 -77395 -98599 -8884 42837 -55487 52167 40449 -113496 -178754 -67813
6662 -67813 -30362 -173248 -32286 125055 1860 -13140 -55149 -130576 -113614 -123581 6259
6651 6259 -15019 48577 36919 18447 76631 29864 -47537 21498 -56894 -90149 -6416 51935
6639 51935 114065 82111 -6273 21124 187923 86118 66281 106795 87459 49628 113739
6628 113739 121248 101274 57018 14478 56176 26545 40021 12333 22080 -2389 32828 53024
6616 53024 79921 11928 -106336 -70976 -22211 27823 55304 -4152 31070 37556 27435 13518
6604 13518 40102 121202 111695 96501 54163 -11317 -61142 42714 55255 107401 71954 62453
6592 62453 106808 76596 -4474 24044 32924 -18283 -21720 -28905 -75118 -101451 54126 124247
6580 124247 -25337 42058 76124 3775 36984 102555 -12829 23491 -6671 -102501 -118500
6569 -118500 -61075 -95926 -80418 72474 84332 22592 -103862 4544 43282 -33595 -56807
6558 -56807 23972 2200 -619 -36381 -5768 -110669 -124468 -80522 -69169 -37985 -36037 21015
6546 21015 -11825 -35599 -146057 -112589 -66622 -39713 -66394 -88209 -159899 -188990 -141960 -56266
6534 -56266 -34744 84210 -8855 -54082 -48082 -34978 -27149 -65458 -44140 58978 -42202 -52428
6522 -52428 -87945 -156505 -83118 -170447 -88992 -63278 -89773 19011 -10618 -58405 -38088 -181836
6510 -181836 -65730 40476 -18963 -28921 -60643 -49891 -67119 -54760 -33331 -90663 -81863 -48803
6498 -48803 -14280 13971 74887 4348 12031 -60327 -138234 -129376 -80968 -62309 34141 28460
6486 28460 -47281 -18832 72117 15486 3821 12472 100650 -15334 -49540 -24238 -23574 31735
6474 31735 15824 22703 32787 99429 31293 -15347 103493 228796 251395 129775 164681
6463 164681 155360 179833 254355 153137 137983 41325 100577 174197 192278 285601 250901 251742
6451 251742 207190 228204 375383 305753 265566 329227 345487 313947 282345 301344 416749
6440 416749 324932 315723 300043 399105 469379 386436 335177 307516 271615 287908 311644 386088
6428 386088 427211 379441 358446 483653 482482 394884 346178 271125 330141 302452 309386 287963
6416 287963 273155 313177 238920 205219 245424 234658 328685 206963 189580 116550 134921
6405 134921 163564 123624 145522 195357 150078 -8279 -8922 180339 201583 157786 57035
6394 57035 27614 174213 196485 130078 43351 61077 -4986 36452 -44347 -34168 39893 -13654
6382 -13654 -5737 101147 94618 116881 64448 28783 -31455 10823 29780 -27765 -15223 -21012
6370 -21012 50041 70279 154206 113599 94697 77211 21996 10172 25702 30126 -37416 -123654
6358 -123654 -158747 -42476 55163 41614 28259 -149658 -89064 -9470 16917 12299 -48848
6347 -48848 27730 -158065 -114521 -52328 -52516 -20672 -94054 11782 9595 112884 52192 -38904
6335 -38904 -38541 -45398 -231 -13071 79592 -16038 92534 75524 73953 -40434 -33845 -23025
6323 -23025 13362 -84974 -69362 91570 134138 69418 -70155 -160510 -163929 -129246 -19441
6312 -19441 -276 -40191 -60904 -174234 -128943 -112444 -149986 -220292 -91718 38881 54037
6301 54037 37503 52421 111503 -18584 -53677 -117439 -209693 36594 2577 -57888 -68618
6290 -68618 -84480 -16364 -22847 -79768 -38466 -77032 -122135 -107973 -21690 -29038 -46335 -76642
6278 -76642 -80136 -15505 -7083 15069 -49673 -94101 54318 157733 53839 851 -6754 -115113
6266 -115113 -67875 -15899 39607 -129049 -196498 -138444 -78370 -102963 -83014 -65203 -72472 -52636
6254 -52636 18700 -38954 -82508 -55114 -4528 -69512 -195117 -188963 -146880 -113937 -99862 -81452
6242 -81452 -37126 -42076 -17137 -31202 44592 47106 -24058 -6372 36115 61293 -139127 -17252
6230 -17252 -12064 1933 -74214 -129855 -41500 80546 82598 12867 -65337 -113632 54065 68480
6218 68480 -25582 -76158 -125806 -100039 -124729 -113796 -110090 -96361 -58679 -10006 -60516 -106148
6206 -106148 -26030 13165 -99480 -120802 -91039 -102761 -14094 -67117 -58827 -55666 -146320 -147661
6194 -147661 -141161 -78817 -55513 -35073 34082 43793 -71325 -92282 -142805 -166475 -142871 -110979
6182 -110979 -22674 70926 3465 -82282 -60391 -32064 -53959 3955 -78279 -72783 -124999 -64880
6170 -64880 -131093 -130786 5515 402 -14121 -23943 -44897 -62420 -31178 42661 14234 -24198
6158 -24198 48371 -121046 7755 15512 1650 -55857 -75388 -88750 -92849 -64171 31426 -35873
6146 -35873 -72264 -14858 -22939 -43685 -70926 -80589 -69036 -104609 -91176 41360 -8235 -130826
6134 -130826 -199796 -203900 -77428 -87250 -25220 -46752 -39642 -51655 -60726 19990 -9536 42191
6122 42191 18485 -32861 3462 -137098 -97079 -76033 -1637 -28351 -128922 -39214 28483
6111 28483 -24410 -66408 6934 -153972 -35022 8337 9129 -100568 -64867 30567 -41215 -73201
6099 -73201 -41733 -19015 -33177 55632 50766 -113893 -85192 64357 16459 10412 6186 117617
6087 117617 55275 -45412 -73411 -64746 -111636 -19023 64931 28432 112663 56703 88517 29073
6075 29073 32942 -1840 30483 -83152 -124785 22824 187960 54459 8480 165524 174660
6064 174660 33936 -54850 -55101 -55732 -37625 -90069 -2738 -49817 -56756 65380 -32267 -8776
6052 -8776 77401 -24969 -88408 2959 -21050 -75971 11851 65568 -36581 -51295 -29335 -101967
6040 -101967 -81312 -49034 29681 108811 -17133 16552 82972 43822 14691 -27384 -52481
6029 -52481 7912 31384 -63973 -38151 43602 16429 -69155 -53819 -56788 56681 56613 65670 -17241
6016 -17241 -40276 -55026 -102173 -104084 -52433 14737 36466 -58977 -85161 36962 -2903 -82083
6004 -82083 25073 17012 28617 91394 167819 99469 69549 40739 2109 26259 -64049 -81689
5992 -81689 -89786 -33349 36878 35321 -65372 -119494 -26163 24346 -21851 40788 -100012 -26570
5980 -26570 -89391 -22957 27172 -67955 -11574 -81037 -47506 -87898 -83004 -21627 -53917 -41225
5968 -41225 58841 95715 111462 12743 -24907 36719 192531 140961 29050 -89639 -11785
5957 -11785 -5047 -7695 -101310 22393 38288 69005 -16283 -15437 81098 55434 109389 101413 62890
5944 62890 2490 21221 -5142 11442 85678 78467 -42435 20079 -75481 -8792 36447 -883
5932 -883 -476 11538 -102063 -46559 -10409 -13576 -63018 -1953 90508 140784 100995 83215 89507
5919 89507 53268 34666 528 9972 142073 129340 69737 39827 63910 -12703 58736 1592
5907 1592 56010 73631 158409 131595 -1180 -3117 -17584 -59420 22063 53906 -5794 18434
5895 18434 7014 133298 122682 78291 51412 114251 90600 99228 -3070 45051 14526 4385
5883 4385 -68381 51438 186714 215843 253006 101401 6751 -8680 -34897 48884 22000
5872 22000 119735 226658 163999 125025 87055 38477 117462 100758 -17601 -73097 46466
5861 46466 38211 -9876 91972 39292 -63103 -127029 21624 170516 27840 41052 -20896
5850 -20896 -1310 -11725 -59277 126820 102676 11535 12283 132600 3200 56566 34017 38008
5838 38008 74620 16168 -1812 309 63779 81122 160326 136499 11041 88427 128057 36144
5826 36144 98394 103377 57481 131070 143318 102542 -3799 -75499 17195 128331 113051 19195
5814 19195 87799 83997 -51671 107191 85049 -19826 5116 85142 32722 -31851 12581
5803 12581 27167 258858 222971 116165 77766 63282 65570 110715 85577 44554 -35675 -48540
5791 -48540 -45494 51613 116928 53634 103243 114363 124548 128779 10223 -15678 -9195 43746
5779 43746 59753 -34801 75985 91639 5834 -27360 -7621 41086 35057 -1165 110497 106344
5767 106344 51907 -34671 -32880 -14730 85683 101128 28740 -93774 -108090 62267 106062
5756 106062 34458 15256 79154 78359 73039 117511 110496 116886 136912 152128 156960 74793 127519
5743 127519 35299 52174 83280 76153 -66843 -19070 -47073 24048 90140 69232 137909 38155
5731 38155 133985 89854 132091 687 40577 102942 129368 8747 24102 -38464 -12246
5720 -12246 45176 -61621 -15199 65865 95592 6797 21763 80973 129694 78494 120064 187450
5708 187450 173038 96464 143933 126211 49989 -29317 94564 4193 40126 57129 69230
5697 69230 36159 37017 76756 63915 72766 32166 117387 100722 42963 74366 198514 211653
5685 211653 102956 57263 83357 91061 32831 108733 -9750 7735 64296 131198 167873
5674 167873 53247 -114904 -49851 98693 175197 231664 255290 135538 80277 99047 -49262
5663 -49262 95187 96529 147007 161673 161623 62984 136596 -52982 2375 89991 122291 32846
5651 32846 60556 177012 111001 -28915 -8140 162532 88394 84351 32344 28912 -51048 106077
5639 106077 97698 58029 68058 191122 126185 187820 278971 177075 123793 133876 168865
5628 168865 72707 95642 180788 223605 75428 120386 135406 97577 135181 115458 71212
5617 71212 48065 152100 142530 113555 72709 69870 113766 90699 151631 63682 102523 142625
5605 142625 140300 87123 187978 83826 14675 31435 135930 189741 80364 -4449 21062
5594 21062 194510 110152 177539 243083 105850 91256 63956 113670 116059 85782 -34729
5583 -34729 39196 109931 20209 7357 29977 171614 110598 189257 223425 257190 318309 339836
5571 339836 301297 119625 181339 311669 274206 146433 -35456 37929 110566 185248 143453
5560 143453 153254 187969 162127 239721 122018 63468 115527 67998 161372 203108 119425 173654
5548 173654 157480 132565 211593 281028 189881 94890 127030 165465 210939 288020 342480 317332
5536 317332 192786 137740 188518 155312 160092 132603 114816 100352 157481 24021 31669 50589
5524 50589 247064 235313 174048 311122 328044 322675 297584 215549 154753 133900 101180 153090
5512 153090 341835 235743 218489 164068 232008 259999 256947 297104 265190 263513 217531 224898
5500 224898 149148 235742 250911 172078 305888 333193 196341 195926 160634 216849 238509 236620
5488 236620 187142 228242 249743 336648 229288 257345 264471 252861 275404 212542 266536 301692
5476 301692 232785 155324 161637 198679 182052 146606 111878 143209 158343 196502 176077 154102
5464 154102 237656 251688 160010 161912 309563 339988 285122 300282 284881 271487 203369 168643
5452 168643 216400 172198 132271 183140 251188 395114 366692 352974 278115 250821 201581
5441 201581 213632 260607 193473 207399 383652 298233 164222 201961 307251 350023 309741
5430 309741 257540 283640 229772 312818 409249 369061 282343 308641 375939 375796 386485 313110
5418 313110 268063 371242 302366 215562 240082 275452 387142 260699 212955 305101 282549
5407 282549 288843 310123 208488 311813 440557 417144 341071 296642 306017 316939 195973
5396 195973 222861 248626 225552 267713 320183 354714 342873 338463 269101 280083 299719 242669
5384 242669 336808 349131 333788 290386 373269 426055 439393 346061 337639 297328 349749 337894
5372 337894 378968 310813 278206 348173 330536 326251 325153 418543 359345 398524 407739 429154
5360 429154 411627 405596 382790 364646 396098 406530 558749 484573 435872 417576 377180 386255
5348 386255 398130 374619 424902 397998 465410 482405 597076 404215 396951 434187 405729
5337 405729 507993 532984 476026 463646 366102 494652 531093 451706 487879 545680 543369
5326 543369 494404 501865 478350 478111 408925 381169 376586 377835 345713 431220 441378 441831 301746
5313 301746 452759 586893 545975 550027 589317 526511 518188 492641 492991 516623 532902 436913
5301 436913 402147 413865 555044 454955 525116 523251 568094 537442 448405 464526 448361
5290 448361 462380 474101 443459 468389 489556 401763 344059 399559 483150 519451 532440 616329
5278 616329 614775 585959 622988 673810 549239 699793 666987 557015 552192 637972 667041
5267 667041 601455 512570 454882 435844 478280 596574 590188 569875 589971 635336 612415 640441
5255 640441 531332 490779 577025 703391 636927 685654 688874 718745 716751 616879 588466 619280
5243 619280 657556 701430 668811 672903 649477 606117 561177 613011 625638 663586 761235 728099
5231 728099 768289 679023 660729 669945 790510 801265 742181 688394 672366 642891 691439 757380
5219 757380 689147 829573 853866 835516 714968 661713 728557 595231 635670 790964 679327
5208 679327 760919 708564 726901 783477 684537 640991 731192 785234 780609 755718 794723 836667
5196 836667 812589 762945 658854 645767 716966 748971 808000 837937 851917 890096 937809
5185 937809 747005 724223 776100 768871 855142 932166 839587 906532 946043 1043366 934213
5174 934213 1055704 960489 901894 974461 996054 990692 1036397 1030446 1034468 1028474 954874 924976
5162 924976 856306 976784 985017 1005923 1118799 1072661 1016409 1198418 1149158 1108824 1113529
5151 1113529 1140371 1058423 1085430 1072926 1233551 1276958 1195299 1208133 1218238 1170665 1218446
5140 1218446 1125649 1191819 1239600 1295110 1351698 1283427 1283216 1244990 1272461 1398470 1425982 1455502
5128 1455502 1411873 1455928 1490327 1351987 1349726 1489188 1518676 1475385 1431065 1467830 1448878
5117 1448878 1542191 1648091 1581225 1512835 1653772 1672678 1698006 1693278 1833755 1734756 1729734
5106 1729734 1745765 1780613 1819241 1817659 1903798 1952780 2122693 2049079 2047753 2086140 2156378 2116366
5094 2116366 2063192 2241229 2287944 2212293 2284408 2267689 2230500 2263351 2325773 2376686 2382047
5083 2382047 2505910 2556000 2488267 2591495 2650159 2739564 2738940 2777451 2807822 2795578 2828521
5072 2828521 2810395 2763169 2869484 2996567 2950888 2959304 2921628 2974144 3104607 3034344 3057150
5061 3057150 3105369 3136115 3146037 3289945 3269886 3338099 3317777 3296082 3403898 3396752 3422222
5050 3422222 3431279 3550694 3574213 3608608 3650691 3756883 3811964 3754453 3693216 3797891 3993781
5039 3993781 4092570 4057677 4119976 4110394 4052142 4224638 4234686 4237609 4237697 4402063 4526754 4669051
5027 4669051 4712613 4698658 4687541 4814097 4914241 4973384 4993664 5099802 5197812 5199378 5272880
5016 5272880 5404387 5455674 5504059 5638663 5693057 5796017 5795621 5810334 5833276 5790984 5844836
5005 5844836 6014286 6131125 6249692 6373946 6429597 6535729 6572075 6780709 6875473 6942158
4995 6942158 7107787 7280641 7397518 7380244 7674453 7882561 7937403 8138936 8274075 8317865
4985 8317865 8511556 8547564 8770890 8851900 8960571 9086897 9317725 9527252 9705801 9905568
4975 9905568 10162783 10268377 10363029 10520786 10627518 10839731 11066986 11328979 11504586 11700766
4965 11700766 11882423 12114171 12380921 12528449 12819786 13140657 13406042 13704926 13954086
4956 13954086 14235599 14424366 14670851 14855201 15290774 15633244 15902268 16207017 16535311
4947 16535311 16833960 17246859 17598511 17943881 18350849 18761615 19344032 19689584 19942530
4938 19942530 20433904 21097643 21555287 22097096 22690497 23355102 24018518 24491449 25141646
4929 25141646 25887525 26641095 27399199 28104332 28963475 29900229 30949843 31949001 32904541
4920 32904541 33913242 35000518 36135111 37421481 38720833 39938982 41250457 42508334
4912 42508334 44102360 45546807 47009926 48536779 50210922 52063282 53916927 55744800
4904 55744800 57762447 59774186 61956683 64196764 66440551 68935827 71451990 74101592
4896 74101592 77028467 80297464 83627240 87409211 91310764 95503429 99934719 104540984
4888 104540984 109521991 114944691 120766572 126956427 133758759 141076042 148875409 157353388
4880 157353388 166558605 176324351 187081194 198571694 211074971 224565712 238985836
4873 238985836 254394556 270616233 287833502 306038970 325453022 345636824 366493544
4866 366493544 387761092 409189193 430040198 449493223 466573850 480461469 489893719
4859 489893719 493737739 491123129 482136947 467630988 448502346 426211064 402395749
4852 402395749 377956960 353754615 330397022 308182447 287430832 268223988 250433221
4845 250433221 234229405 219443335 205956345 193769604 182661015 172526998 163449711
4838 163449711 155271489 147851454 140963275 134763075 129092621 123782078 118810112 114050722
4830 114050722 109749485 105547849 101706533 97971812 94348070 90879162 87590200 84411424
4822 84411424 81502285 78633733 75790024 73107653 70600495 68190771 65778277 63474550
4814 63474550 61169445 59057061 57040541 55136265 53321940 51504953 49890951 48296844
4806 48296844 46835745 45451296 44207065 42831797 41661205 40636206 39471929 38385709
4798 38385709 37368520 36345747 35481707 34557374 33752801 32805722 31910415 31136461 30420856
4789 30420856 29673452 28898313 28162835 27585691 27128998 26453464 25932359 25324483 24844336
4780 24844336 24157168 23643324 23065656 22554081 22064013 21566544 21027183 20666971 20155144
4771 20155144 19635149 19284787 18797189 18436632 17962139 17611212 17224448 16780304 16401051
4762 16401051 16095458 15871709 15471999 15077184 14945680 14585434 14313294 14072996 13782214
4753 13782214 13463842 13153080 12952884 12729195 12441256 12145943 11983940 11847558 11609832
4744 11609832 11454791 11318579 11053487 10803460 10690907 10578996 10367064 10078109 9928827
4735 9928827 9744003 9475975 9383221 9289522 9100354 8943031 8865643 8812938 8507918 8374525
4725 8374525 8289254 8196144 8108126 7997593 7920659 7660033 7767198 7698909 7492979 7384221
4715 7384221 7279827 7233120 7218720 7205403 7036408 6879089 6698866 6576884 6472058 6334811
4705 6334811 6186545 6117883 6082159 5937617 5891783 5767989 5588769 5512605 5498183 5478630 5346408
4694 5346408 5204355 5238861 5162863 5140767 5064903 5033052 4896937 4761063 4752646 4690748 4721363
4683 4721363 4593115 4507067 4505302 4361375 4227596 4202928 4052717 4078437 4029844 4103604 4087853
4672 4087853 3917608 4002937 4056719 3807338 3709360 3592343 3561826 3593336 3496865 3382737 3417676
4661 3417676 3433789 3313080 3415490 3366957 3216543 3100159 3089896 3195086 3180706 3081026
4651 3081026 3090024 2869601 2936224 2998707 2960669 2804570 2831295 2744638 2789442 2794995 2637681
4640 2637681 2713965 2699429 2657769 2660792 2620460 2623706 2613446 2606152 2512707 2421378 2415017 2417443
4628 2417443 2425416 2339325 2337254 2256561 2234782 2197743 2177279 2248196 2195688 2090345 2151156 2213320
4616 2213320 2100590 1984511 1925513 2010317 1931086 1961967 1881109 1935591 2031132 1899222 1873951
4605 1873951 1976366 2033716 1992215 1996101 1827619 1804447 1853539 1793902 1761086 1843339 1772049
4594 1772049 1785399 1745855 1677266 1692034 1679953 1651655 1695635 1707191 1657141 1631217 1698989
4583 1698989 1603072 1524554 1441172 1473493 1553748 1546892 1508737 1422920 1484053 1358589 1300557
4572 1300557 1434544 1371358 1283822 1386837 1424396 1425142 1329097 1281290 1302708 1298816 1324361 1162214
4560 1162214 1178550 1208414 1158397 1184485 1319177 1336441 1355221 1199377 1096402 1180642 1208117
4549 1208117 1152034 1252753 1218314 1143716 1159521 1052922 946106 1014074 1141965 1104364 1077595
4538 1077595 1160048 1059943 1092639 1166880 1277687 1199071 1229086 1087313 1026447 1030971 1104271
4527 1104271 1056054 976069 1044667 1046613 1035437 960847 1018974 1074331 1174419 1071598 1031387
4516 1031387 1025488 968934 970598 921206 874929 860569 880176 1000534 1037517 879287 751986
4505 751986 761801 816107 924859 856762 846399 934207 989093 843522 888319 753767 732731
4494 732731 839672 835481 657707 845577 907624 813295 729010 815175 755184 714782 696445
4483 696445 817383 901309 818043 769374 621717 580076 736507 706145 666614 643091 731721
4472 731721 598713 434765 482703 616389 536774 488776 707741 745119 688661 713337 700528
4461 700528 576342 578685 625348 558028 623268 523599 582781 645736 722093 648130 413887
4450 413887 412603 488426 567945 456271 564493 521625 554827 497323 493482 494240 564718 549932
4438 549932 463054 314855 472907 563799 540665 514327 512022 374622 496361 551053 441662
4427 441662 512425 515986 536658 434740 370651 439360 536498 593228 536211 477991 406061 453774
4415 453774 477015 427330 390116 398112 409113 484931 493002 477044 426388 400393 406136 365263
4403 365263 378256 505302 458373 423780 540656 489179 392940 296507 402824 434905 428894
4392 428894 477038 448982 509284 473416 590915 500275 402692 400857 451648 499803 526873 378875
4380 378875 361583 458648 418908 381472 381720 384158 360425 413086 290464 355618 433873 380960
4368 380960 271275 330147 320945 414290 326569 323638 308105 260855 364089 402496 400774 364857
4356 364857 283750 226358 272692 322617 319218 353648 295594 282834 265871 310861 310522 285450
4344 285450 237194 144233 214961 206657 259950 288677 350412 338472 339194 307990 326496 412757
4332 412757 343588 343159 383254 284351 352067 333220 319282 328428 274189 326357 242412 91922
4320 91922 87712 171515 235648 227812 184659 155510 215426 381844 364587 182133 187208 180307
4308 180307 301030 299388 209567 205395 312766 354313 283066 372374 225386 292772 324634
4297 324634 375569 392889 326359 354219 385636 292590 302271 283718 216335 251678 286166 333819
4285 333819 241224 238522 321977 335534 383120 396625 379294 418614 454102 377870 264585 252978
4273 252978 406887 393378 392593 416247 440489 409773 482953 431913 402610 393264 369898 415848
4261 415848 464982 473858 517751 409452 365152 379959 379277 478917 543051 697826 633638 444522
4249 444522 406923 469254 393071 472260 533813 438662 418341 415962 456223 433691 474207 459005
4237 459005 313452 557507 550264 494885 541241 511964 470341 537340 488115 482142 477210 413585
4225 413585 491851 524427 592948 620239 622949 617762 589709 656304 561017 467862 574637 555619
4213 555619 517888 605493 690460 739940 650037 687271 577516 569071 665625 632288 607170 600562
4201 600562 663375 668392 625913 614737 717331 827062 746384 765681 753676 673552 744897
4190 744897 811560 847331 807319 856678 916066 892716 934517 876980 897670 884543 910380 1009354
4178 1009354 1084575 997378 1013611 891883 1052937 1289418 1297864 1271979 1242657 1203574 1257414
4167 1257414 1345414 1278631 1404012 1410788 1593812 1488589 1403941 1507436 1523030 1578252 1740351
4156 1740351 1812735 1860420 1949084 1878574 1970880 2093114 2106020 2257791 2291914 2354786 2467364
4145 2467364 2531118 2660542 2683848 2778533 3025298 3128629 3331942 3465095 3671685 3855900
4135 3855900 4054107 4185371 4314285 4518981 4771906 4903448 5211635 5532495 5730753 6127997
4125 6127997 6511670 6920997 7377152 7771830 8280238 8945919 9600230 10345184 11039531 11826562
4115 11826562 12561589 13270675 14253260 15133920 15948328 16680627 17515036 18215365 19097972
4106 19097972 19890760 20559432 21263316 21724796 22084656 22512245 22837152 22921164 22999243 22963605
4096 22963605 22646424 22316466 21918062 21436485 20939764 20420610 19821815 18985614 18205454
4087 18205454 17374433 16366856 15417676 14595473 13839428 13250370 12459959 11617727 10815448
4078 10815448 10044419 9317380 8855255 8396331 7867499 7366215 6947152 6404283 6134365
4069 6134365 5896353 5691781 5459539 5250952 4863288 4769336 4504067 4376923 4258949 4026199
4059 4026199 3893232 3713811 3569922 3318591 3227630 3197252 3123316 3005558 3025948 2854015
4049 2854015 2682119 2575347 2502723 2423582 2390203 2331471 2273979 2138356 2125856 2064751 2030382
4038 2030382 2052592 1975892 1801677 1649276 1658973 1784858 1736008 1662845 1662503 1603090 1519347
4027 1519347 1400589 1352897 1455057 1473968 1328963 1300776 1327988 1271997 1267609 1241335 1212757
4016 1212757 1205827 1203591 1171999 1220825 1044607 942453 916883 900204 904692 860370 877269 828301
4004 828301 822265 722333 679414 705376 737689 815025 765413 769866 853401 781426 709614 746484
3992 746484 740755 662812 675731 625729 551682 469102 580911 519441 446861 560612 597795
3981 597795 555568 620059 629685 609738 551329 488814 558067 597794 539198 458153 471814 436994
3969 436994 334736 441831 477306 336588 410716 457351 536246 499331 533230 405472 404164
3958 404164 383947 402748 417328 377662 315653 340781 322235 456639 487500 389559 341831
3947 341831 268137 291464 306737 346803 367429 361464 414926 455210 306563 262022 279372 368004
3935 368004 359708 250842 237728 245792 380897 322002 192118 268374 222241 240796 321799
3924 321799 315163 294276 373073 322671 378213 299028 356451 422176 397454 324058 279924 235436
3912 235436 244074 249392 238673 219365 275385 340063 332822 308274 237643 147544 239489 321329
3900 321329 308787 275886 366457 415276 420051 444581 404974 327771 251459 252259 291147 295392
3888 295392 311826 349454 377677 461304 405902 344936 421208 421607 344110 402541 456826 469128
3876 469128 443626 477731 461430 408106 441479 414734 431722 533159 423605 442963 478670
3865 478670 538321 426856 421513 447358 490883 627951 633336 597910 701609 577725 517123
3854 517123 590360 571192 532599 637992 746815 765068 793153 702192 594518 642895 761374
3843 761374 725814 769161 781692 707701 651933 795671 844620 856772 943789 1050713 1056120
3832 1056120 1018756 924571 967607 1001726 936514 1142282 1319981 1367682 1405680 1313331 1419009
3821 1419009 1399608 1485411 1605395 1604089 1629721 1555277 1503781 1375690 1443063 1429526 1402143
3810 1402143 1384823 1469741 1466705 1506839 1375406 1464515 1458619 1418589 1510192 1578297 1510843 1429394
3798 1429394 1509664 1546878 1630060 1487157 1590067 1710173 1727947 1880326 1872020 1905490 2004726
3787 2004726 2025659 2207643 2333596 2471233 2661638 2756096 2852687 2968364 3031072 3196983
3777 3196983 3468509 3806858 3837041 4015570 4170357 4206290 4232983 4205054 4087824 3979127
3767 3979127 3891268 3790284 3629466 3483256 3294234 3254881 3148582 3079741 2942879 2782149
3757 2782149 2738571 2762601 2706603 2787096 2976543 2974631 2992426 3071344 3212117 3274256 3322992
3746 3322992 3538391 3669529 3758290 3992204 4076968 4069606 3913069 3696721 3456546 3328700
3736 3328700 3052417 2758527 2542327 2337588 2040840 1910300 1818625 1757807 1735803 1683915
3726 1683915 1514487 1414239 1254640 1196043 1149718 1114141 1158517 1075774 1029059 926552 984455
3715 984455 974383 928693 845311 791852 812572 758647 769241 613852 557651 659561 664147
3704 664147 626630 528096 500412 556647 523882 577885 604357 514235 527061 447445 369727 398165
3692 398165 459963 399559 312840 362860 384237 307293 222572 305367 234249 236403 307282 283774
3680 283774 199559 225746 288800 195465 265672 264338 176307 333029 446288 327116 256320
3669 256320 206716 149736 197524 210985 61098 23447 85582 135072 145185 89645 126260
3658 126260 124923 134746 187354 57578 69060 76359 45514 196151 96692 -726 38694 101109
3646 101109 90405 79298 147407 193386 21316 114085 66424 -45261 55053 154976 90660
3635 90660 11523 106949 53814 -32422 91843 122814 140358 143364 96423 52637 -9082 83807
3623 83807 42857 52 78984 84135 -66780 3678 136197 51727 143889 158261 100484 172413
3611 172413 156397 204102 182885 244347 189983 157757 45088 90014 -41622 -30712 79505
3600 79505 165652 38737 64339 53197 122476 117100 6351 47530 90693 34183 -4621 54550
3588 54550 206815 181346 177436 173376 90005 38694 59078 115956 15494 57020 112538 133695
3576 133695 89813 120985 131680 95478 101643 91372 103822 149960 131567 65436 41027 108044
3564 108044 79873 -168 -77515 -147709 -70931 460 33516 76222 -20664 20946 8974 -34245
3552 -34245 -34019 70803 89597 -25810 -168180 -189659 -155872 -37983 89143 114186 21564
3541 21564 -45053 -14104 59495 152648 152093 59659 21313 117662 96605 -77037 43472 42857
3529 42857 75136 -39405 -22522 -8327 788 -98838 -15732 11659 48976 -5288 48342 83428
3517 83428 19493 -6083 -106609 -45611 -99005 -89680 -48653 -40557 92565 113378 118820 168994
3505 168994 187372 74123 82723 118711 70594 113311 75364 98494 104464 162214 50159 34469
3493 34469 -59280 -65309 35373 87242 20015 -24652 2789 -103206 -105971 -3583 16844 64079
3481 64079 120105 122394 58497 47741 77528 33841 -10672 5890 111784 50460 -67107 -32502
3469 -32502 36794 145106 8925 -73225 -8762 68243 49546 86773 68305 71162 127902 194259
3457 194259 138670 78440 107862 61204 -3726 15487 70783 92284 80430 160681 71033 24203
3445 24203 54526 -29428 11342 11893 64335 90811 44570 36476 17902 61245 44373 46247 49325
3432 49325 46217 -31874 12953 46957 143430 110588 129311 138109 88748 10074 6929 -44723
3420 -44723 89417 135772 58770 82429 81791 -7742 64360 94289 -37325 71890 147493 116394
3408 116394 137603 209476 90237 134401 143236 47546 -29031 -108864 -47260 53641 46760 89902
3396 89902 89236 32244 12709 116240 117333 38090 -94984 19097 101059 62678 29186 111087
3384 111087 92790 103220 68928 -12303 74845 84816 161104 197920 12741 82560 39510 54652
3372 54652 55950 114720 68986 24431 17855 24642 77820 96385 128895 88915 24185 83196
3360 83196 82395 92995 145484 85284 148194 97289 20679 60533 70676 98774 52112 38574
3348 38574 58523 5196 23855 -75 -32576 9049 109258 118588 166152 48784 106097 71968
3336 71968 70788 121798 66869 30129 -37325 93651 148441 85848 -105287 2580 165896
3325 165896 42267 80034 26318 110964 84233 69307 118965 75228 120792 171469 180814 172149
3313 172149 162327 78666 22553 -57314 -24543 18782 -20528 -7581 -103686 -79811 -2664 -19165
3301 -19165 81934 -39796 9653 12883 -46675 32440 43236 163366 148344 119356 45724
3290 45724 1 111068 92922 57592 55082 107500 -13002 -90671 148028 114722 7942
3279 7942 -56177 -20031 55438 25438 68001 -64755 52952 83476 20006 23775 373 33433
3267 33433 27952 -884 3131 41194 27502 -4352 -70777 105188 44395 145813 191864 57415
3255 57415 31076 20534 -8070 -55041 12666 -82195 -147260 -106570 -15830 40836 16875 -1721
3243 -1721 -75446 40865 25654 -26747 -56900 -63017 13005 98017 79580 111452 58700 80869
3231 80869 95731 49884 28027 -20921 4086 -6076 4292 35080 -42040 39782 18125 -6463
3219 -6463 138416 -8706 25166 50620 23787 66197 9316 -33889 -81151 -102907 -61355 -42781
3207 -42781 -44021 -157916 -12086 52404 31216 12620 144815 -16741 2235 86854 -24771
3196 -24771 -43161 -83036 -52102 -20445 76236 -35870 -19705 -74083 -33205 90833 -13929
3185 -13929 9701 191391 239921 31879 -91143 -91442 4766 -46585 -94409 -125086 -37684 -116364
3173 -116364 -10206 75866 152607 218429 115922 -36128 -104579 30437 110989 193095 80889
3162 80889 -20923 -134427 -28895 -58483 40078 16815 -3155 -37653 -26469 60454 142246
3151 142246 227896 120223 57375 62545 72132 -49466 -56720 49461 17019 17850 22659 -10138
3139 -10138 63713 -54990 -27102 -8048 -173353 58603 41868 91285 69462 -62673 -86380
3128 -86380 -133194 -118605 -107385 -51806 18134 -25144 20333 101172 25357 63121 62866 90440
3116 90440 42973 80575 98473 126625 63205 -36740 6812 44428 33567 -15898 46561 75694
3104 75694 50592 13227 -14623 -47373 -8647 106863 67622 52372 72526 142245 13825
3093 13825 -1702 84324 3875 -13004 -46389 -37847 20541 70643 -8949 -50590 13163 -83961
3081 -83961 -6247 1051 -30871 34244 77307 -3688 74882 130717 -12255 655 88048 76310
3069 76310 71853 24091 98274 73217 38310 76683 33293 13974 -22062 23757 93385 146228
3057 146228 118050 91334 26293 18059 -66275 62780 50306 -48588 2141 55332 -10429 130082
3045 130082 103263 125915 239440 132376 52819 -65367 9424 70784 45729 63874 28793
3034 28793 36504 66195 4265 -94 127827 222882 119272 171519 181903 167249 182897 139497
3022 139497 150243 107224 136411 265632 323890 178772 136760 77106 87112 138436 65514
3011 65514 80869 75473 185501 204256 144463 112581 123447 240022 258989 258829 199283 220589
2999 220589 223603 164801 55606 88044 208950 194879 268539 282249 274072 292673 289743 260105
2987 260105 219508 174563 257796 387438 349926 323872 368660 336627 215989 215554 183375 136083
2975 136083 193668 238394 160817 28010 51015 177903 232366 173142 -10027 30335 177123
2964 177123 87593 28958 -70251 -39566 64440 207918 160814 126992 77292 43491 118747
2953 118747 -6323 8452 45559 76248 99185 25567 85273 -88966 -62928 78545 55374
2942 55374 84454 104970 57631 25423 45504 22487 26869 11403 15462 -2874 -3071 -36731 11653
2929 11653 -33596 -3966 201147 168400 117534 41508 -83136 16581 24829 113180 26022 12778
2917 12778 -19235 21346 92182 4232 26311 -4019 23139 59387 17805 23925 -27854 13774
2905 13774 58231 125300 136030 -23291 -115923 -94822 44173 34614 24391 15826 43334 84
2893 84 5787 35373 80075 -13751 -23839 -22877 -65060 7913 105743 98337 79202 48491 60803
2880 60803 33919 68627 142815 81602 188161 122486 -130230 -15048 210466 187094 -4049
2869 -4049 9651 -16584 -38811 -100420 -38858 -59841 -60637 31755 -15134 -21120 -29938 12200 -82971
2856 -82971 -112255 -32654 3465 -49164 -28161 51847 18902 56675 73822 -72135 57396
2845 57396 -31108 47681 29959 -60476 -119723 -8696 20460 35583 48790 -29287 45191 7949
2833 7949 22502 -28810 -24248 -148869 -84603 -4886 -79351 -174158 -93547 -31841 -120680 -10083
2821 -10083 25295 113281 70061 91988 138942 12163 -97985 -109261 -195962 -154566 -56261
2810 -56261 -91185 -105284 -71247 51337 -110238 -24243 -33944 17656 6239 -34208 -40628 -73850
2798 -73850 -90126 -112558 -27665 -153625 -36795 36157 57790 -16210 24629 54629 151541
2787 151541 82385 -107638 108796 99935 4148 80029 11405 -101663 79026 19475 17168
2776 17168 84272 -41138 -47977 -99496 -72369 -71006 -80516 -23889 -382 -7688 -8732 -39746 -64605
2763 -64605 -37147 -110299 -129206 -120377 -126910 -106087 -85493 -82490 -69936 -25471 -103369 -105629 65150
2750 65150 106545 18840 -10891 96106 116373 -78387 -65030 14930 15417 117959 26561 -20841
2738 -20841 106444 -28938 -106570 -59851 14448 -108341 -97753 -1993 109976 42881 -18189
2727 -18189 -76780 -79055 7049 -10150 -17481 -58860 -923 -45993 -24336 -923 32512 -58746
2715 -58746 3585 16664 112620 77358 76947 47956 -58487 -49019 -4778 23842 57090 8836
2703 8836 -82888 -111232 20504 -1303 -124597 -141348 -116607 -28834 29855 -131980 -110014
2692 -110014 -17567 -7431 14023 -145624 -18200 29897 -54256 -141829 -53016 -8944 -61693
2681 -61693 -161287 -235611 -77577 29197 71173 76935 94105 3455 -34035 28724 61210 -180331
2669 -180331 -97569 32136 -149233 -74410 -99031 -6638 -53480 7698 41546 53991 23740
2658 23740 -109142 -153361 -110900 -51629 -2527 -49266 -57148 63750 -31898 -107132 -79295 -98931
2646 -98931 -79574 -83329 -11897 -79844 17040 60494 17159 -90763 -94165 -41940 -37311 -22869
2634 -22869 -195695 -199524 -107129 -150895 -144129 -140981 -161871 -114579 -146070 -195350 -40244 45021
2622 45021 39819 121355 75863 14381 -119829 -77318 124915 53226 -108762 -101943 -60772 -48493
2610 -48493 -95482 -118661 35193 21784 -74144 -31560 -82026 52134 -42260 -191882 -150044
2599 -150044 -93354 -82426 -18794 -155007 -152721 -110009 -72977 -114435 -135487 8340 -25764
2588 -25764 -138595 1560 16496 83148 20862 -37009 -52102 -117598 -175080 -169605 -65284
2577 -65284 -43316 -55812 -130268 -71825 18607 138611 2043 -107520 -48400 59254 -54895
2566 -54895 14565 33845 -67367 -60403 -97345 -50589 -61676 -69086 -23181 -81750 -144723 -69744
2554 -69744 -112462 -153977 -150360 -101450 -16640 16537 -17201 -96727 -70692 -88020 -63936 -29016
2542 -29016 41365 39998 -3841 -118531 -81421 -153250 -41689 12119 -65894 -4576 -57945 -50417
2530 -50417 -65217 20728 -66931 -101158 -124017 -103448 -56427 -134754 -104400 -115925 -132467 -36009
2518 -36009 -4144 -67919 -3819 -42089 -146657 -164241 -89103 -47818 -53819 -113043 -24898 -26785
2506 -26785 -131646 -66729 42749 -61079 -29686 -118971 -161104 -17923 -52904 64329 42249
2495 42249 18741 -26949 -115195 -225738 -79592 -93288 -170016 -33415 -121439 -89939 -84530
2484 -84530 -100820 -61132 -173723 -73248 12857 -88993 -127223 -136001 -185021 -172030 -114182
2473 -114182 -94946 -96684 -228695 -198716 -45328 -42283 -117398 -102434 -35837 -44938 5231 -4607
2461 -4607 29291 -84800 -38243 -64232 -71938 -18503 -40358 346 -74954 -106205 -20485 -114975
2449 -114975 -80972 -49142 -210804 -140664 -206230 -182968 -108735 -106226 -74386 -29905 -12220 -86620
2437 -86620 -27306 -66583 -136918 -115960 -20295 -22187 -99660 -92725 -143887 -143783 -154893 -140082 -251667
2424 -251667 -138137 -110221 -123978 2512 46030 -69147 -47533 -197052 -184884 -17242 42597
2413 42597 36649 58778 35129 17957 251 -99265 -58534 -53292 -73117 -132623 -67247 -190591
2401 -190591 -82622 -102102 -48132 -73063 -146499 -70670 -127321 10348 -62167 -31527 4700
2390 4700 -44747 -82552 -78535 -64589 -76222 -94914 -88027 -26149 -67693 9175 94046 112421
2378 112421 -20713 48196 38773 103791 -24792 -17480 -18295 62354 7222 -7792 -61319 -79105
2366 -79105 -25513 -141629 -166966 -142567 -73925 54780 68522 -63009 -132435 -163489 -166211
2355 -166211 -119150 5294 -4084 -21055 -52378 -45711 -55583 -77524 -161402 -58199 -60557 10714
2343 10714 -40938 -84638 -35008 16761 11886 -64002 -71433 -110327 -206468 -122349 -134467 -49251
2331 -49251 -14867 -96230 -134018 -57067 -175141 -101864 -59716 -109570 -92691 -87803 -74069 15942
2319 15942 28012 43927 18053 74815 -82354 -69497 -2441 -102262 -76188 19794 38979 22644
2307 22644 18545 -5878 -35329 -42354 -43092 -21130 -25073 -119848 -104700 -124158 -59775 -8392 9236
2294 9236 -70589 -21467 -1210 -124069 -86221 -4879 -46700 5944 30842 101283 -7196 -58620
2282 -58620 -126414 -74263 -100416 -43244 -2119 -9976 -108975 -29757 -146550 -197825 -138563 -81119
2270 -81119 -20657 -77376 -60606 17209 -19036 7386 -31455 -92379 -104384 -87805 -53591 -66164
2258 -66164 -53949 20177 32030 -30196 -23084 -127765 -107461 -142952 -88128 -136045 -139850 -67426
2246 -67426 -125357 -98096 -59241 -49376 -4700 3527 36854 100264 -54957 -125844 -218 -57581
2234 -57581 -19423 -102186 -168083 -209058 -129952 -75742 -123574 -87957 -136033 -86499 18190 92950
2222 92950 45331 86334 -8154 -83013 -25610 53379 -57358 -21269 -67937 492 53623 -18630
2210 -18630 138835 35196 -31068 -37351 -113402 -97258 -63457 -13480 -55917 60040 -28324
2199 -28324 -100984 23290 -64561 -27246 8787 3955 -118008 -81100 -77722 -56840 -12724 -19543
2187 -19543 -15025 -2213 -27789 63822 22941 -7766 -86521 -110324 -134370 82584 147659 93319
2175 93319 -19331 -15231 50998 -31610 -46535 -103210 -45643 -154292 -138670 -23977 81839
2164 81839 27345 1415 51681 -33841 -15036 -104479 -69494 24050 -73912 -116406 -60719 61454
2152 61454 2328 -40268 -90112 -57584 -66456 -108159 -65596 -36969 -18898 -62077 -121512 -133355
2140 -133355 -108134 -34914 10624 -64754 81298 55494 59733 -39250 -39543 10781 -22383 -1248
2128 -1248 -17873 -29458 -81774 48137 -30785 15603 -9382 -158462 -89386 -14970 -49310 -71469
2116 -71469 -64834 -126007 -146636 -139219 -135579 -122043 -61664 -84624 19425 40694 -50418 -20834
2104 -20834 -28919 3333 -39093 82305 29329 -46395 -68814 -79880 -6324 46185 -69223 -67076
2092 -67076 -86110 -8871 38021 -133264 -27021 56689 73068 -78835 -86760 89500 109249
2081 109249 -11468 -80857 -27459 -46068 -78281 -10059 97319 37192 -13940 67451 66542 114119
2069 114119 117433 104819 86505 -28530 -4586 -15902 48560 92280 11207 6015 171536 87587
2057 87587 227149 223954 121958 103381 122957 201984 322853 319049 207210 226428 308463
2046 308463 427136 372979 343423 414614 496030 462556 509769 575879 672253 696060 750475
2035 750475 765777 856789 820257 851179 1030809 1193203 1212252 1298438 1278533 1208473 1108097
2024 1108097 1073584 976989 794647 765190 715520 634638 573863 491736 480872 396610 393320
2013 393320 540237 514281 426535 376795 461223 346156 226617 256413 153976 199511 236447
2002 236447 189244 157326 -7107 22883 161847 216372 114692 65280 15431 -4548 25686
1991 25686 14073 219 -48472 43440 39652 104433 40696 16649 97559 94868 172764 186125
1979 186125 141303 49067 -9817 -20081 141456 176754 34886 -148476 -140681 -110104 27361
1968 27361 36371 -38896 -160098 -181018 -138144 -103705 -34496 -45753 -27995 -52121 -121420 -82261
1956 -82261 -90640 -50056 11277 71977 83019 -11788 -34886 -89687 -57383 -82956 -53434 51442
1944 51442 118697 -39465 -48254 -40113 -99235 -85127 -22495 -17388 -10683 -49572 -25406 -75000
1932 -75000 29157 75292 40920 97050 91372 -36763 -25214 -47476 -21762 33177 -81931
1921 -81931 9020 6484 -22877 32757 20142 -22938 -6011 47546 18080 -72084 -65790 15979
1909 15979 -54596 -210514 -98913 70211 97319 -22990 -78042 -78208 154866 56227 54602
1898 54602 47020 14829 107867 113874 77432 24695 -79631 -26579 -2728 -16258 6285 -67827
1886 -67827 -48537 -70452 -121249 -3250 15874 4757 63108 -70572 -70854 55384 193259
1875 193259 61829 75238 87224 -42227 -14049 73910 -6543 -113005 -108539 -57009 -159839
1864 -159839 -144084 -156941 -119590 -161990 -20950 40364 -25347 -86866 -27030 -38670 -34
1853 -34 -27478 -202666 -84605 -117211 -83643 -43213 57495 17044 -92392 -212167 -176601
1842 -176601 -103320 -108294 -121150 -75875 -2685 -80983 -70519 -122899 -22200 -44003 -42377 38017
1830 38017 16233 -57167 30745 90942 -67833 -25147 5177 -7671 -35960 -65171 -125258 -106858
1818 -106858 10621 29210 -183896 -71842 85648 28683 27872 65449 35553 54061 78411
1807 78411 -2658 -105581 -155687 -218272 -37319 -53342 71221 105041 65684 115359 55973
1796 55973 -26705 -32996 -59001 7507 -98654 -7804 92435 90282 27212 89578 58984 680
1784 680 29180 -17178 36064 -51641 -143232 -158951 -20515 -156223 -112593 -74665 -20479 48767
1772 48767 18382 -86312 -12768 -92333 -119680 -202641 -163114 -63993 -57655 49024 76394 78662
1760 78662 105506 65145 80951 66611 86947 47091 -12639 -103146 -72810 81982 82931 123058
1748 123058 -23814 -96262 -42699 -70367 -34347 -46022 -148169 -148645 -89376 -78683 -41943 -57800
1736 -57800 -57173 -23399 -54515 1059 39898 -3460 7844 -8840 53175 78265 57279 -26354
1724 -26354 43687 94469 74861 81389 20866 35997 -2125 -18413 -60858 -56392 -30128 -148205
1712 -148205 -171709 -222158 -187902 -162514 -194325 -115053 -58332 -17491 24963 -49378 -84414 -151518
1700 -151518 -62776 55349 -28548 -61401 -97701 -58045 29651 -26393 -84370 -87870 -88388 38978
1688 38978 2250 39881 41091 74893 -17324 -52100 -21071 -23978 52893 -22597 -85802 -85737 -101812
1675 -101812 -175637 -117502 -12945 26912 -19768 -60382 -99251 -107736 20010 -46129 -118116
1664 -118116 -61906 57154 63006 73244 39874 -1184 58856 -71707 -120210 -42942 -9835
1653 -9835 -1609 58324 51559 86729 22192 -58858 -36206 -113351 -5644 -9434 33333 165593
1641 165593 86693 -27472 -41701 -11137 -25256 -48396 -6239 -68127 -60410 -1705 -50210 -20130
1629 -20130 -20006 -44258 -2613 57358 200630 65077 35666 56821 -7204 -8308 -11399 51605
1617 51605 -70775 -118960 -71936 -36987 -112433 -74091 -56078 -156506 -39232 16098 -118011
1606 -118011 -146766 -66266 -132396 -18216 -82669 -60707 -70749 -197547 -148520 -12639 35314
1595 35314 2156 -16123 53341 -45187 -122509 22741 -62204 -28376 -10546 99412 159189
1584 159189 64191 36504 -37909 -159217 46258 -1591 -64397 14608 41666 -66829 -76611
1573 -76611 60520 138187 64968 74493 34724 67519 74548 -79909 -38920 41465 35876 47603
1561 47603 -44002 -8173 -4555 -70513 -37261 -135167 -46754 4013 -12619 -127957 -80954 -61090
1549 -61090 9197 16203 -38014 -57217 -32701 4402 5665 32345 52476 -12488 -148587 -99731
1537 -99731 -101749 -87259 -47645 51001 119032 46348 -24992 23941 73380 46148 41523 93643
1525 93643 1189 -84847 -85451 1152 -69598 7465 60180 63435 76588 71798 76939 -39870 -29672
1512 -29672 14647 -36666 -89169 -45935 2379 -3453 45463 169283 87953 88217 84710 7107
1500 7107 -29204 86451 151249 -8005 79293 145112 95281 -71833 -174018 -53113 -144642
1489 -144642 -54144 -61320 27112 14602 -3008 -95070 -123980 -90096 27361 54015 64653 118468
1477 118468 142600 -90392 -94866 129258 144796 160725 -307 -5642 20775 76708 72359 56343
1465 56343 11173 -28032 21490 2097 -86192 -115321 -151328 -106011 -64264 916 -6874 2772
1453 2772 -17219 94174 96556 -37476 -99445 -33261 -102520 -163631 -127070 11121 33458 46877
1441 46877 40983 131657 -42579 -163280 17182 -50486 -71195 -22319 -37728 -8396 -8603 7132
1429 7132 14235 -20102 4644 -150576 -99053 -62800 -129393 -71899 85633 87724 69802 61718
1417 61718 77688 39714 35647 59908 -18329 -43656 -161044 -162796 -149142 -79534 -58732 57597
1405 57597 171921 120181 -34881 7703 8867 -37733 -86063 -44215 95827 7207 -37233
1394 -37233 -116001 -158149 -136839 -71586 -65103 -62368 -83265 38308 -59684 -45551 64786 46547
1382 46547 75548 -25121 -27060 40376 91478 10644 -41028 69015 -11198 -20748 117855 119330
1370 119330 29283 72786 50972 212616 125491 71918 -29931 -56805 32882 61508 17372
1359 17372 -3326 2971 55823 80847 -27140 -161705 -108453 38927 3206 -46287 -87813
1348 -87813 -172909 -135938 -103123 8567 40979 -66635 -36674 -22355 -63794 -90967 6678
1337 6678 84977 112366 -40758 -83299 -55556 5432 -38749 73989 109455 68950 -30490 -84599
1325 -84599 -69767 -11357 -40961 -104150 -45453 -70532 -126449 -116040 -174891 -137309 -206366 -95993
1313 -95993 41761 -96265 -194198 -80876 52656 41038 44114 7054 -79704 -27211 27226
1302 27226 17937 32810 41662 -12686 29905 -10096 -106507 -78250 -6155 -28829 -55940 -42542
1290 -42542 -124962 -63764 -86916 -30874 37178 -78997 -32611 -32996 81083 49227 77503 116493
1278 116493 139052 27943 -3471 58992 -20366 -70810 -69555 -120668 -198646 -94563 -649
1267 -649 5857 9798 -26035 -27226 21650 -37574 -8481 -65041 -145363 -5371 53804 -91837
1255 -91837 -23905 -93654 -43647 -23795 30199 60360 -64934 -112346 -10708 34078 -20336
1244 -20336 -42454 39838 46716 42094 -7822 20099 -21966 -119467 -21992 34469 6003 -4428
1232 -4428 69434 124027 -41323 -71776 7608 13701 119387 36987 26897 60529 77661 17898
1220 17898 34839 50222 23229 -34891 -83975 -75445 -106307 -36245 -28678 34859 62436 -14418
1208 -14418 -59851 52389 45593 58226 50753 1606 40823 -20478 -207460 -148338 -37589 -116827
1196 -116827 -46682 41044 76342 249442 160986 18608 -11015 -105055 -122505 17438 50369
1185 50369 9255 -44572 -130501 -67454 64107 142885 141008 19691 5594 21168 15196 24737
1173 24737 21517 1565 92343 -56454 -183638 53403 54265 35 -108070 -19680 30870 -78936
1161 -78936 -98427 -80117 -49443 -120154 -60764 -3 41419 7840 -82211 -61567 -136134 -41714
1149 -41714 -68505 -4970 42278 -73476 -23687 -50406 -25937 9518 -123455 -61246 -2524
1138 -2524 69918 -67196 -52456 -108359 -105462 -130575 -154350 -43016 62731 -41283 -122786
1127 -122786 -46343 34102 68705 -7781 -43715 -6465 -4150 -97341 -60932 -14097 17264 23871
1115 23871 -21083 -63274 -9226 80755 64950 -113517 -172220 -59925 -28841 -41360 15310
1104 15310 -58630 -84938 -81257 -132698 -45687 30301 27044 -53261 69178 158996 121712 110294
1092 110294 29568 -29389 -88990 -85549 -661 -40182 24764 91307 -77571 -90396 -83297 -67731
1080 -67731 -61436 -91967 -30553 113305 -17728 -118010 -19730 124353 166520 114314 43056
1069 43056 -8953 126543 80596 -36777 124282 95384 67322 25400 -5286 -75614 -64546
1058 -64546 -28469 17496 -29304 -15403 -12045 -2581 14261 91497 108774 31890 32986 106280
1046 106280 95553 -22108 24827 -9284 -23249 -76155 -111537 -31517 -35219 -25435 -41550 -106581
1034 -106581 -44434 -95193 -86295 -42506 74093 170703 79150 104520 75766 23864 32100 -50214
1022 -50214 -65675 33019 26304 179267 82397 -39617 -26966 35670 133360 100077 90509 -9186
1010 -9186 -21226 -159422 -200772 -81325 -83878 -82323 32878 44014 6139 -29710 -115737 -74280
998 -74280 -84789 -86720 73693 -5999 -89168 -53501 -95137 -77616 -43264 -2956 -83561 -11453
986 -11453 74431 -19578 77653 166422 171851 142563 169171 65902 31224 -637 -66140 -4316
974 -4316 19776 35968 103993 30005 -53606 -74343 28747 25546 1688 364 -47049 58881
962 58881 41064 -107071 82272 17995 -57122 -65625 -148628 -16384 -47008 43949 114832 -34222
950 -34222 -8509 -52361 -131852 -82843 21621 -77563 -126995 24684 23171 86026 68851 26475
938 26475 114661 -20137 -82069 -45345 -10846 -57261 2114 80417 99652 52591 -6983 61665
926 61665 -7753 6534 67869 -33148 -89226 -21103 -15245 50249 62634 137965 62664 -14042
914 -14042 60459 70089 48812 76151 -33749 -41047 -21744 -33189 -20389 -92813 -2539 58940
902 58940 28238 60565 38677 -65478 -128756 -12478 74901 -76022 -110097 -51067 24714
891 24714 879 656 94867 7389 -13765 -14773 -29045 -121218 21263 28321 102413 96198 7455
878 7455 -12424 -109659 -30160 62971 2776 -112525 -114251 -25333 28271 -24662 -39862 26235
866 26235 16999 -95620 -69986 -28035 -8891 53358 6430 11484 51628 172963 84690 49184
854 49184 -2213 -87901 -77477 -79310 -23986 47912 76817 -35744 -13100 59346 25183 18933
842 18933 51709 57131 20578 18335 -26776 -92563 -44491 -105253 -108580 -47383 76024 3648
830 3648 34405 35665 33541 21574 -4528 29449 56002 122889 30682 92103 39122 -26780 41684
817 41684 28590 14184 79411 164258 42529 3553 116680 100725 123446 87670 71052 68771
805 68771 93158 10285 19988 40344 -23948 50505 66880 30331 54008 84519 94181 108873
793 108873 1440 27998 8725 48893 142866 153374 76943 -26490 -11037 55992 -13226
782 -13226 29945 27066 -28260 -47163 -23231 111562 102209 98229 83050 50769 105131 -97865
770 -97865 1205 86334 -19542 118223 159284 165155 143065 91988 243769 82646 13286
759 13286 62686 28020 -27506 -22139 6634 13569 -11283 -6162 75326 96991 123251 160927 149937
746 149937 -16031 16387 -98266 -93152 64310 117725 132605 59974 54359 -64971 -67635 -39351
734 -39351 -11821 -15920 -48444 6656 -30693 36613 61156 75931 -12331 -60888 -27997 -33259
722 -33259 88362 96183 51067 -12374 9619 82985 92224 42895 74869 121118 53707 -19145
710 -19145 -59372 14573 -44499 26198 33829 -106049 -109147 -74243 19154 104258 69809 -6205
698 -6205 -7256 -27534 -18332 15897 18893 86991 147815 78453 -46560 77747 8510 31181
686 31181 87556 25736 95206 156782 90034 67458 24591 -71740 -56838 -49079 -37072 -108723
674 -108723 -159334 -99499 -28714 24347 -81175 19447 116812 84609 50353 136112 150099
663 150099 35276 86924 68156 99737 63778 43587 22822 -34048 43390 33725 66750 92570
651 92570 144397 -3361 -104396 -58923 33064 21392 3214 -27192 -60163 62923 21767
640 21767 -18191 59330 -5499 37496 52169 -4087 -7656 122704 23481 -29177 61558 57363
628 57363 124064 131648 20918 -61888 -3038 85039 58944 14772 -9314 112941 142035 77176
616 77176 57197 156485 93444 -27594 -10778 -3081 92414 -25465 -3141 23930 -69666 7155
604 7155 39848 53481 110308 94337 91706 -36475 -14912 1308 115186 56737 120918 31543
592 31543 49388 118540 77984 -25525 -30022 -51163 89145 18978 65642 -7567 48376 156931
580 156931 82682 -7999 80479 35877 41466 106604 142640 149262 36134 -29235 -43641 23532
568 23532 -47238 -27663 59400 159319 33352 29394 46535 -1189 87603 86246 9260 40635
556 40635 3506 34380 38817 30707 15530 149987 37751 -7009 -35189 -89227 -43524 -33980
544 -33980 85160 83872 -23407 34357 128486 153320 71431 24490 70522 17653 82800 90902
532 90902 -4899 -57733 -9561 45535 27521 32141 22079 46289 198342 287015 75850 164
520 164 -28266 -1769 127279 183858 28645 35722 -3362 -52366 -81614 -103345 110047 36903
508 36903 3970 -12407 -32469 47647 56307 36630 71370 91161 44839 27731 -26849 -8662
496 -8662 121728 167754 -19458 -29737 75140 127114 18422 37220 57185 65246 -10037 4529
484 4529 -73781 -109721 29993 85494 22986 -7602 -31272 43930 97605 96555 79704 45534
472 45534 -57338 -79798 -18972 72601 -11236 -146460 -63473 112674 200998 156650 154239 154840
460 154840 71261 -6361 98081 62851 -39362 -63982 25972 -65816 -10200 60729 174484
449 174484 43746 -54766 88529 -7474 21931 62991 124873 -141823 -134020 19394 190038
438 190038 118868 22504 72972 -12965 5847 41090 121722 28931 -39295 -136542 -51350 -46007
426 -46007 -23324 23528 50344 18704 41148 59287 78743 124697 69754 39157 99780 23219
414 23219 -13520 -40235 84942 100697 25636 81339 20371 70831 124066 91317 137852 36418
402 36418 28575 37252 29238 108418 217196 103252 15318 81437 113244 66883 63088 13984
390 13984 148613 145173 -144824 -221284 -97390 7401 168153 235161 21127 -10741 41841
379 41841 91977 127988 136736 -56427 -101923 -67122 -40128 -27246 3184 91045 89513 148334
367 148334 146109 156990 58719 -44846 -342 89844 35403 127806 157467 195387 119097 136557
355 136557 229668 166863 107194 161158 184952 64492 47133 25199 70241 22241 -14761 71957
343 71957 172743 178202 93907 122854 175981 117767 12360 -26588 72855 73510 65294 74351 139880
330 139880 81463 56638 47588 110777 54359 80966 119990 117816 20619 47635 81127 176313
318 176313 189423 159408 173945 83630 -73578 -38329 -12251 -42435 -33231 61447 80390 113113
306 113113 125002 61350 -25651 25985 53468 -44045 4061 15796 45944 119593 142254 -8716
294 -8716 54416 11637 5610 109369 125501 206471 261594 105516 -47650 -29906 -60773 7574
282 7574 89750 70161 128443 26131 -13386 4479 128157 123296 73033 -23845 -60386 -51348
270 -51348 -6363 124734 99730 -30936 12055 113621 88120 55839 80578 91769 45839
259 45839 -21 -33004 50026 52481 45180 1394 147712 165199 239223 221025 183761 192912
247 192912 111969 153015 63362 -12902 11959 9874 -41696 -98962 -29042 -22148 36689 134129
235 134129 40701 82282 155088 115300 119792 106776 65405 79180 16346 48852 23184 133207
223 133207 182804 176673 100437 17555 30261 -3264 19600 8286 -31212 78796 135610 130979
211 130979 29664 84860 88476 170505 217091 142766 120605 131645 89665 84204 7717 -30718
199 -30718 -4111 89737 13453 -11556 65738 12558 44423 36999 170704 110865 49029 29318
187 29318 17576 5019 -46255 -17687 82559 143492 20844 29267 140262 94434 98971 98567
175 98567 115373 -36211 -13430 65671 75230 65705 -6477 -55579 153125 228021 163187 102965
163 102965 77726 -17167 10318 85027 128546 49636 37997 19218 21547 66998 58688 17888
151 17888 26978 160716 121684 93524 91666 -15399 12771 56658 77496 82190 55359 53928
139 53928 48424 77949 64601 121461 78154 86150 106032 39326 46914 57893 176801 178689 63008
126 63008 105377 67802 9611 88766 89547 43166 -53173 31882 182111 133693 149975 61246
114 61246 92640 138727 143140 45773 16186 7529 -29544 -30707 18524 16954 10006 74966 198636
101 198636 101530 130885 62251 75034 134024 110416 103614 132612 122032 91654 65576 37969
89 37969 47152 -6069 39348 43950 91881 60231 28900 -5114 -70647 -49520 9748 37190 -32606
76 -32606 -1893 45070 8051 43028 77451 72404 49594 -65624 -13340 133612 66957 -10563
64 -10563 98099 56469 20748 116008 65796 10998 11505 23517 55716 94909 61866 147348
52 147348 123083 49875 36228 109656 120794 44044 4211 121987 143791 72254 -6427 49581
40 49581 74958 76050 67595 1902 17121 32685 70490 85655 105433 129276 90817 74957 77669
27 77669 59958 68435 57423 43318 102350 77890 83189 134465 110930 62929 -24396 14170 -24318
14 -24318 10014 44055 16601 33714 37320 37477 87740 61554 81008 95092 49659 137235 93805
1 93805 26516
0 26516
$$ Imaginary data points
##PAGE= N=2
##DATA TABLE= (X++(I..I)), XYDATA
16383 -428214 -427767 -316539 -390049 -442577 -419110 -404182 -299764 -314451 -336302 -355612 -216455
16372 -216455 -290104 -336020 -363593 -307676 -251680 -313853 -270994 -247446 -216554 -145497 -171625
16361 -171625 -96309 -174184 -149724 -151451 -184629 -194524 -193615 -160385 -197063 -108691 -9316 -6472
16349 -6472 -41580 -49425 -579 -4522 -57678 54023 31719 7349 26500 77166 33354 28833
16337 28833 59033 36995 10192 30171 36241 25138 125546 144846 181067 145161 108848 111920
16325 111920 142846 203597 209931 205518 233173 275722 222576 161134 178502 135159 203833 243073
16313 243073 225315 329544 375635 326718 384056 310041 337139 390313 397033 386867 364294
16302 364294 371154 328785 343559 335744 338910 418824 417990 365755 470718 545276 474807 400136
16290 400136 487380 548296 498094 510989 555601 411033 426931 416549 551246 550030 463757
16279 463757 476497 526077 613081 620086 653761 601140 547851 586893 596709 528560 603651 625069
16267 625069 648536 684294 759228 708730 683204 672757 710717 735622 579345 649202 806015
16256 806015 777810 757813 703613 688095 778223 828201 837844 839583 795641 773029 821369 777774
16244 777774 798419 821068 805718 750243 669545 771374 829543 909965 909940 848810 764701 826374
16232 826374 869142 910456 938885 872952 824492 776328 865946 947238 1015626 1047349 1023311
16221 1023311 977491 1005234 947925 955066 1040502 1028036 890839 838432 869308 947593 998766
16210 998766 905505 910800 853681 920120 979799 1043188 1140555 950131 1020493 1036694 952621
16199 952621 975777 1039561 1075908 1040101 1072604 1038777 1092059 1050279 1035486 1108639 1101173 1084720
16187 1084720 1100428 1185921 1033710 1115805 1118789 1106831 1103859 1172626 1152923 1101906 1115148
16176 1115148 1231211 1078901 1055905 1021285 995663 1027191 1090524 1155300 1105178 1154739 1178378
16165 1178378 1231444 1188376 1165318 1050367 1021494 1086084 1182663 1148836 1058128 1103958 1062022
16154 1062022 1175026 1258449 1196143 1331970 1202479 1203725 1221439 1187437 1144523 1188892 1108639
16143 1108639 1087156 1082794 1072175 1132432 1110761 1154997 1188599 1240062 1218669 1124960 1143483
16132 1143483 1205163 1145363 1002355 1020376 1028709 1002205 1052628 1014060 1054240 1067641 1101858
16121 1101858 1152975 1042434 1108814 1208473 1143880 1107683 1130440 1163295 1258992 1268833 1223811
16110 1223811 1246921 1280775 1171453 1156065 1192451 1260115 1259904 1314018 1250028 1303052 1226370
16099 1226370 1152133 1192778 1188324 1239584 1360048 1302951 1179830 1103384 1113449 1179835 1180368
16088 1180368 1143396 1058117 1151694 1235256 1259423 1275655 1071125 1149523 1227611 1147093 1159595
16077 1159595 1167072 1261325 1162764 1057107 1086657 1229738 1267755 1253130 1234710 1298517 1238325
16066 1238325 1280816 1214653 1212961 1223572 1165467 1229551 1251064 1219988 1169119 1187459 1239795
16055 1239795 1346994 1238137 1195999 1273943 1238970 1296713 1243677 1263112 1331257 1209446 1106937
16044 1106937 1178967 1206525 1276282 1238918 1261060 1291484 1308465 1254946 1141803 1152866 1206135
16033 1206135 1124053 1167885 1188164 1238394 1300870 1246834 1340391 1322187 1267864 1255271 1250207
16022 1250207 1294530 1341878 1341842 1249660 1139305 1040737 1129584 1150305 1125326 1190942 1290661 1330174
16010 1330174 1285101 1190388 1213147 1246664 1179671 1123387 1216619 1297038 1139376 1215365 1347622
15999 1347622 1336660 1273751 1174293 1144860 1270809 1226122 1150081 1135053 1136233 1206317 1215866
15988 1215866 1310257 1306558 1215468 1224388 1151559 1168442 1385616 1456994 1414123 1343853 1218854
15977 1218854 1290220 1308132 1331847 1340863 1302006 1197157 1190650 1251396 1299369 1375354 1221090
15966 1221090 1069782 1255051 1376348 1350847 1292205 1272356 1335102 1390696 1233456 1166966
15956 1166966 1223297 1241899 1239815 1208715 1168346 1260952 1280462 1216334 1193370 1232177 1345042
15945 1345042 1217215 1208812 1341619 1334700 1216286 1206481 1218584 1240380 1273975 1271350 1288494
15934 1288494 1185601 1138971 1105748 1175151 1309533 1288976 1211655 1152637 1138690 1175778 1160843
15923 1160843 1221685 1189687 1173390 1146717 1201573 1415748 1323862 1306373 1271566 1223995 1255788
15912 1255788 1361903 1353857 1307603 1359806 1257649 1184609 1226723 1268928 1286136 1258764 1282348
15901 1282348 1250426 1314500 1406346 1373862 1320111 1260017 1308740 1252894 1243810 1306334 1245132
15890 1245132 1273442 1169148 1281515 1205560 1165215 1276963 1304480 1270999 1194515 1138436 1202625
15879 1202625 1313241 1239613 1236953 1207370 1106892 1256812 1324386 1264591 1140674 1160743 1195083
15868 1195083 1021515 1046886 1162216 1261309 1265415 1233051 1266150 1288588 1322698 1201194 1220638
15857 1220638 1219207 1149185 1158164 1203733 1186704 1294102 1340769 1319778 1255369 1224203 1344313
15846 1344313 1239435 1282878 1297333 1219786 1221822 1177579 1136739 1292115 1261162 1256776 1221074
15835 1221074 1139858 1087145 1227771 1258503 1296463 1372159 1315605 1255828 1205265 1284754 1375231
15824 1375231 1327930 1378445 1280838 1398888 1280859 1393706 1401251 1350261 1220894 1246697 1267421
15813 1267421 1298648 1315083 1308225 1267615 1300724 1387546 1361485 1278469 1246158 1288567 1275128
15802 1275128 1310262 1203082 1251624 1293354 1382323 1317421 1437610 1395231 1348255 1287986 1234294
15791 1234294 1261282 1284089 1254378 1243910 1329283 1377179 1405717 1367237 1384610 1391688 1312766
15780 1312766 1380872 1333856 1354903 1405004 1387200 1397591 1401452 1271085 1309381 1335833 1394092
15769 1394092 1292734 1287748 1329839 1303675 1328262 1335337 1310694 1357235 1393461 1306333 1324071
15758 1324071 1374061 1226922 1215456 1293518 1203984 1159131 1244221 1275887 1227432 1385139 1336470
15747 1336470 1418823 1413040 1220868 1306308 1372863 1328165 1391333 1416577 1350540 1290531 1284635
15736 1284635 1349710 1267671 1222987 1245215 1334634 1317083 1201762 1238056 1325454 1408550 1310208
15725 1310208 1231995 1290709 1202726 1294356 1282794 1287530 1255318 1191186 1161809 1127129 1214297
15714 1214297 1453317 1473555 1360096 1294196 1376242 1377132 1274845 1253096 1393003 1435267 1352149
15703 1352149 1222104 1297877 1393609 1304445 1247134 1249168 1289209 1272857 1310698 1368281 1322813
15692 1322813 1349279 1391411 1309585 1313485 1394985 1334967 1319897 1285919 1367369 1281913 1259334
15681 1259334 1171452 1287487 1403207 1245022 1249286 1272305 1390456 1345013 1372960 1243613
15671 1243613 1233023 1359131 1432736 1334704 1358960 1269499 1295779 1257261 1405495 1383398 1424937
15660 1424937 1274605 1181526 1317880 1393491 1319555 1246756 1240687 1243703 1256484 1333386 1361994
15649 1361994 1230077 1374400 1345756 1223353 1206893 1291039 1286288 1287331 1323877 1304236 1307146
15638 1307146 1270226 1296453 1372329 1403341 1271577 1215781 1265960 1346275 1287163 1379884 1296102
15627 1296102 1348006 1302926 1311312 1314191 1289894 1390461 1491866 1386682 1361217 1428484 1374408
15616 1374408 1380667 1320587 1340680 1295444 1231258 1321711 1333506 1347636 1322606 1366196 1281361
15605 1281361 1200595 1329395 1381830 1251691 1172644 1272848 1231997 1323710 1361829 1373845 1310918
15594 1310918 1355108 1390823 1315179 1462627 1390414 1224839 1401469 1404753 1324235 1309231 1236729
15583 1236729 1186227 1224958 1252498 1313230 1302292 1368526 1226105 1312599 1300265 1252416 1256405
15572 1256405 1261827 1247872 1341058 1369653 1371223 1262309 1322221 1295070 1217259 1329954 1220798
15561 1220798 1267980 1365921 1319270 1231799 1252142 1350461 1229146 1197724 1342854 1372468 1315635
15550 1315635 1306976 1376678 1343850 1243142 1328672 1479094 1418093 1296444 1377655 1396913 1256555
15539 1256555 1293234 1371464 1299350 1292888 1233468 1252654 1322933 1290308 1334770 1311155 1347741
15528 1347741 1277105 1315774 1361270 1329112 1457868 1373924 1297014 1293830 1290261 1331331 1418113
15517 1418113 1311443 1346211 1367898 1394324 1351585 1324504 1352651 1314621 1447511 1454824 1368768
15506 1368768 1346530 1373504 1412497 1369553 1397523 1386500 1354448 1197201 1179723 1151259 1201959
15495 1201959 1278992 1346047 1382762 1475329 1330005 1079054 1251467 1329931 1216759 1203716
15485 1203716 1351257 1312022 1432910 1390345 1326902 1260610 1387735 1355119 1338793 1325526 1265514
15474 1265514 1384002 1279811 1189290 1316694 1291460 1332206 1446638 1439699 1353443 1351559 1364354
15463 1364354 1350253 1321149 1297797 1357794 1369981 1418667 1506702 1421418 1298762 1333061 1275680
$$ [...]
##END NTUPLES=NMR SPECTRUM
##END=
