##TITLE=1H_CA-8907-1
 CD3CN, 8 sc, 
 30.07.2021
##JCAMPDX= 6.0         $$ Bruker NMR JCAMP-DX V2.0
##DATA TYPE= NMR SPECTRUM
##DATA CLASS= NTUPLES
##ORIGIN= UXNMR, Bruker Analytische Messtechnik GmbH
##OWNER= root
$$ XWIN-NMR		Version 3.5
$$ Fri Jul 30 10:01:34 2021 Russian Standard Time (UT+4h)  she@DPX200
##.OBSERVE FREQUENCY= 200.131506
##.OBSERVE NUCLEUS= ^1H
##.ACQUISITION MODE= SIMULTANEOUS
##.ACQUISITION SCHEME= undefined
##.AVERAGES= 8
##.DIGITISER RES= 18
##SPECTROMETER/DATA SYSTEM= spect
##.PULSE SEQUENCE= zg30
##.SOLVENT NAME= CD3CN
##.SHIFT REFERENCE= (INTERNAL, CD3CN, 0, 17.5228)
##AUDIT TRAIL= $$ (NUMBER, WHEN, WHO, WHERE, WHAT)
$$ ##TITLE= Audit trail, XWIN-NMR		Version 3.5
$$ ##JCAMPDX= 5.01
$$ ##ORIGIN= Bruker BioSpin GmbH
$$ ##OWNER= she
$$ F:/spectra/data/she/nmr/H-F/1/pdata/1/auditp.txt
$$ ##AUDIT TRAIL=  $$ (NUMBER, WHEN, WHO, WHERE, WHAT)
(   1,<2021-07-30 09:59:48.67 +0400>,<she>,<DPX200>,
      <created by zg, POWCHK disabled, PULCHK disabled
       configuration hash MD5:
       00 E9 B6 7A A2 85 ED C7 34 08 36 98 17 FE 4E 26
       data hash MD5: 16K
       04 9C C2 1B 08 38 C7 29 53 0C 2B E0 5F 97 E0 A0>)
(   2,<2021-07-30 09:59:51.31 +0400>,<she>,<DPX200>,
      <Start of raw data processing
       efp BC_mod = 2 LB = 0.24 FT_mod = 6 PKNL = 1 PHC0 = -13000.15 PHC1 = 18.40099 SI = 16K 
       data hash MD5: 16K
       10 62 90 B3 CD 77 04 C8 0D FF 34 49 F0 6E A2 79>)
(   3,<2021-07-30 10:00:05.39 +0400>,<she>,<DPX200>,
      <pk PHC0 = -1.237526 PHC1 = 0.2 
       data hash MD5: 16K
       37 C5 0C 53 30 4F 71 8B 63 E5 23 74 4B C5 45 54>)
(   4,<2021-07-30 10:00:08.78 +0400>,<she>,<DPX200>,
      <abs ABSG = 5 
       data hash MD5: 16K
       4C 3D 2F 9F 43 0F 91 77 9E 07 63 81 D2 B6 7F B4>)
$$ ##END=
$$ 
$$ hash MD5
$$ 0D F6 D7 C1 FA D1 90 7C C9 1E 93 6E 16 58 D4 10
##$RELAX= 
##$RELAX= 
##$RELAX= 
##$RELAX= 
##$RELAX= 
##$RELAX= 
$$ Bruker specific parameters
$$ --------------------------
##$DU= <F:/spectra>
##$EXPNO= 1
##$NAME= <H-F>
##$PROCNO= 1
##$TYPE= <nmr>
##$USER= <she>
##$AMP= (0..31)
100 100 100 100 100 100 100 100 100 100 100 100 100 100 100 100 100 100 
100 100 100 100 100 100 100 100 100 100 100 100 100 100 
##$AQSEQ= 0
##$AQ_mod= 1
##$AUNM= <au_zg>
##$AUTOPOS= <>
##$BF1= 200.13
##$BF2= 200.13
##$BF3= 200.13
##$BF4= 200.13
##$BF5= 200.13
##$BF6= 200.13
##$BF7= 200.13
##$BF8= 200.13
##$BYTORDA= 1
##$CFDGTYP= 0
##$CFRGTYP= 5
##$CHEMSTR= <none>
##$CNST= (0..31)
1 1 145 1 1 1 1 1 1 1 1 1 1 1 1 1 1 1 1 1 1 1 1 1 1 1 1 1 1 1 1 1 
##$CPDPRG= <>
##$CPDPRG1= <>
##$CPDPRG2= <>
##$CPDPRG3= <>
##$CPDPRG4= <mlev>
##$CPDPRG5= <mlev>
##$CPDPRG6= <mlev>
##$CPDPRG7= <mlev>
##$CPDPRG8= <mlev>
##$CPDPRGB= <>
##$CPDPRGT= <>
##$D= (0..31)
0 1.2 0 0 0 0 0 0 0 0.06 0 0.03 0 0 0 0 0.0002 0 0 0 0 0 0 0 0 0 0 0 0 
0 0 0 
##$DATE= 1627624788
##$DBL= (0..7)
120 120 120 120 120 120 120 120 
##$DBP= (0..7)
150 150 150 150 150 150 150 150 
##$DBP07= 0
##$DBPNAM0= <>
##$DBPNAM1= <>
##$DBPNAM2= <>
##$DBPNAM3= <>
##$DBPNAM4= <>
$$ [...]
##$SUBNAM3= <"">
##$SUBNAM4= <"">
##$SUBNAM5= <"">
##$SUBNAM6= <"">
##$SUBNAM7= <"">
##$SUBNAM8= <"">
##$SUBNAM9= <"">
##$SW= 20.0188882624521
##$SWIBOX= (0..15)
0 0 2 0 0 0 0 0 0 0 0 0 0 0 0 0 
##$SW_h= 4006.41025641026
##$TD= 16384
##$TD0= 1
##$TE= 0
##$TE2= 300
##$TE3= 300
##$TEG= 300
##$TL= (0..7)
0 120 120 120 120 120 120 120 
##$TP= (0..7)
150 150 150 150 150 150 150 150 
##$TP07= 0
##$TPNAME0= <>
##$TPNAME1= <>
##$TPNAME2= <>
##$TPNAME3= <>
##$TPNAME4= <>
##$TPNAME5= <>
##$TPNAME6= <>
##$TPNAME7= <>
##$TPOAL= (0..7)
0.5 0.5 0.5 0.5 0.5 0.5 0.5 0.5 
##$TPOFFS= (0..7)
0 0 0 0 0 0 0 0 
##$TUNHIN= 0
##$TUNHOUT= 0
##$TUNXOUT= 0
##$USERA1= <user>
##$USERA2= <user>
##$USERA3= <user>
##$USERA4= <user>
##$USERA5= <user>
##$V9= 5
##$VALIST= <valist>
##$VCLIST= <CCCCCCCCCCCCCCC>
##$VD= 0
##$VDLIST= <DDDDDDDDDDDDDDD>
##$VPLIST= <PPPPPPPPPPPPPPP>
##$VTLIST= <TTTTTTTTTTTTTTT>
##$WBST= 1024
##$WBSW= 4
##$XGAIN= (0..3)
0 0 0 0 
##$XL= 0
##$YL= 0
##$YMAX_a= 226257
##$YMIN_a= -263992
##$ZGOPTNS= <>
##$ZL1= 120
##$ZL2= 120
##$ZL3= 120
##$ZL4= 120
##$ABSF1= 17.52277
##$ABSF2= -2.496269
##$ABSG= 5
##$ABSL= 3
##$ALPHA= 0
##$AQORDER= 0
##$ASSFAC= 0
##$ASSFACI= 0
##$ASSFACX= 0
##$ASSWID= 0
##$AUNMP= <proc_1d>
##$AZFE= 0.1
##$AZFW= 0.1
##$BCFW= 0
##$BC_mod= 2
##$BYTORDP= 0
##$COROFFS= 0
##$CY= -3
##$DATMOD= 1
##$DC= 0
##$DFILT= <>
##$DTYPP= 0
##$F1P= 0
##$F2P= 0
##$FCOR= 1
##$FTSIZE= 16384
##$FT_mod= 6
##$GAMMA= 0
##$GB= 0
##$INTBC= 1
##$INTSCL= 1.334414e-10
##$ISEN= 128
##$LB= 0.24
##$LEV0= 0
##$LPBIN= 0
##$MAXI= 10000
##$MC2= 0
##$MEAN= 0
##$ME_mod= 0
##$MI= 1.114404
##$NCOEF= 0
##$NC_proc= -6
##$NLEV= 6
##$NOISF1= 3.799351
##$NOISF2= 2.8
##$NSP= 0
##$NTH_PI= 0
##$NZP= 0
##$OFFSET= 17.52277
##$PC= 1
##$PHC0= -13001.39
##$PHC1= 18.60099
##$PH_mod= 1
##$PKNL= yes
##$PPARMOD= 0
##$PSCAL= 0
##$PSIGN= 0
##$REVERSE= no
##$SF= 200.130002374011
##$SI= 16384
##$SIGF1= 3
##$SIGF2= 2
##$SINO= 5.538805
##$SIOLD= 16384
##$SREGLST= <1H.CDCl3>
##$SSB= 0
##$STSI= 16384
##$STSR= 0
##$SW_p= 4006.41025641026
##$SYMM= 0
##$S_DEV= 0
##$TDeff= 16384
##$TDoff= 0
##$TI= <>
##$TILT= no
##$TM1= 0
##$TM2= 0
##$TOPLEV= 0
##$USERP1= <user>
##$USERP2= <user>
##$USERP3= <user>
##$USERP4= <user>
##$USERP5= <user>
##$WDW= 1
##$XDIM= 16384
##$YMAX_p= 434023339
##$YMIN_p= -273011
$$ End of Bruker specific parameters
$$ ---------------------------------
##NTUPLES= NMR SPECTRUM
##VAR_NAME=  FREQUENCY,     SPECTRUM/REAL,   SPECTRUM/IMAG
##SYMBOL=    X,             R,               I
##VAR_TYPE=  INDEPENDENT,   DEPENDENT,       DEPENDENT
##VAR_FORM=  AFFN,          ASDF,            ASDF
##VAR_DIM=   16384,         16384,           16384
##UNITS=     HZ,            ARBITRARY UNITS, ARBITRARY UNITS
##FACTOR=    0.24454680195387, 1,            1
##FIRST=     3506.83198728559, 0,            0
##LAST=      -499.578269124671, 0,           0
##MIN=       -499.578269124671, -273011,     0
##MAX=       3506.83198728559, 434023339,    0
$$ Real data points
##PAGE= N=1
##DATA TABLE= (X++(R..R)), XYDATA
$$ [...]
$$ plain form
6994 539695 606649 656149 638671 672338 641738 613701 677844 607080 644580 621468 484679
6983 484679 473712 597825 468391 496632 464524 524222 379182 395689 520529 635066 599679
6972 599679 549727 709642 852323 1047640 1116969 1238074 1109632 1007833 1223023 1194892
6962 1194892 1225317 1324415 1557567 1697392 1691663 1927366 2019591 2175553 2607425 2816392
6952 2816392 2759760 2675031 2431390 2255201 2162961 1926971 1781161 1860511 1763063 1742772 1723646
6941 1723646 1851106 1940504 1952154 1984584 1964154 1974066 2034022 2305608 2553685 2894737 3203514
6930 3203514 3579149 3782864 3826359 3716333 3276272 2831233 2581036 2256760 2130477 2025612
6920 2025612 1977239 1832626 1602430 1499321 1496492 1554389 1556068 1638782 1685636 1624259 1764327
$$ packed form
6994E39695O6954M9500j7478L3667l0600k8037O4143p0764L7500k3112j36789
6983D84679j0967J24113j29434K8241l2108N9698j45040J6507J24840J14537l5387
6972E99679m9952J59915J42681J95317O9329J21105j28442j01799K15190k8131
6962A194892L0425R9098K33152J39825n729K35703R2225J55962M31872K08967
6952B816392n6632q4729k43641j76189r2240k35990j45810P9350r7448k0291j9126
6941A723646J27460Q9398J1650L2430k0430R912N9956K71586K48077L41052L08777
6930C203514L75635K03715M3495j10026m40061m45039k50197l24276j26283j04865
6920B025612m8373j44613k30196j03109k829N7897J679Q2714M6854o1377J40068
$$ plain form
6909 1764327 1862908 1748972 1908820 2168021 2361339 2436332 2290163 1958852 1771318 1735602
6899 1735602 1728360 1606110 1502251 1280612 1199085 1113289 1007650 989870 964218 846983 651048
6888 651048 687206 730827 565878 593106 646195 694858 647444 646621 724739 722665 761481 697615
6876 697615 641141 650455 573299 448608 384044 369962 322165 509990 487598 364343 330025
6865 330025 362403 375324 337712 304080 188287 219772 301145 430693 345294 294784 336935
6854 336935 300770 333156 327242 254929 276368 190125 239270 167673 107940 262762 168820 128634
6842 128634 201101 234111 135869 107686 53096 3151 94371 104781 103995 -53812 62164 160937
6830 160937 216879 192213 69168 -35910 -16195 -24884 -34912 104014 35292 34789 94103 202493
$$ packed form
6909A764327R8581j13936J59848K59201J93318P4993j46169l31311j87534l5716
6899A735602p242j22250j03859k21639q1527q5796j05639j7780k5652j17235j95935
6888F51048L6158M3621j64949K7228N3089M8663m7414q23P8118k074L8816o3866
6876F97615n6474R314p7156j24691o4564j4082m7797J87825k2392j23255l4318
6865C30025L2378J2921l7612l3632j15793L1485Q1373J29548q5399n0510M2151
6854C36935l6165L2386n914p2313K1439q6243M9145p1597n9733J54822r3942m0186
6842A28634P2467L3010r8242k8183n4590m9945R1220J0410p86j57807J15976R8773
6830A60937N5942k4666j23045j05078J9715q689j0028J38926o8722n03N9314J08390
$$ plain form
6818 202493 119106 229803 286306 225600 40870 119580 196840 73134 56698 96950 195257
6807 195257 97487 86254 61994 45655 34510 131453 176632 186954 -7421 5167 55424
6796 55424 186223 234146 35361 55373 -41107 55188 150818 112252 73691 410 80745
6785 80745 234661 203146 213180 113494 119940 182177 66767 180822 139783 169541 105382
6774 105382 59436 86168 -3448 -1715 118970 51663 12394 274535 177674 61576 61312 23928
6762 23928 -85819 -14552 47004 27731 -13035 42633 29479 -39004 19633 -93946 -52676
6751 -52676 35710 128522 8520 21588 -15768 -62624 -90394 -106405 -71271 33403 63566
6740 63566 37353 38078 80164 48343 -66111 -238716 -208727 -38375 20038 80077 182809
$$ packed form
6818B02493q3387J10697N6503o0706j84730P8710P7260j23706j6436M0252R8307
6807A95257r7770j1233k4260j6339j1145R6943M5179J0322j94375J2588N0257
6796E5424J30799M7923j98785K0012r6480R6295R5630l8566l8561p3281Q0335
6785H0745J53916l1515J0034r9686O446O2237j15410J14055m1039K9758o4159
6774A05382m5946K6732q9616J733J20685o7307l9269K62141r6861j16098k64l7384
6762B3928j09747P1267O1556j9273m0766N5668j3154o8483N8637j13579M1270
6751e2676Q8386R2812j20002J3068l7356m6856k7770j6011L5134J04674L0163
6740F3566k6213P25M2086l1821j14454j72605K9989J70352N8413O0039J02732
$$ plain form
6729 182809 188811 165316 168211 102716 99766 68618 -24163 -36908 -74682 -1957 26854 -109149
6717 -109149 -101206 -150437 -59347 29856 1623 73995 90747 -21130 -18919 22825 -42725 -41704
6705 -41704 -5691 -20108 88223 3656 -64939 -138366 -73894 -105854 -158791 -206015 -162182 -144885
6693 -144885 -190505 -116418 -56924 -8103 -46709 -33309 -40898 37139 81983 -87706 78897
6682 78897 -38818 -127240 -102887 -27066 -79202 -155019 -101997 -77496 -35964 -117795 -102926 -161819
6670 -161819 -227322 -196916 -221616 -142840 -147934 -240066 -205195 -227522 -186122 -167377 -159782 -125057
6658 -125057 -122031 -193671 -192314 -171471 -134961 -144687 -142125 -193175 -129489 -69101 -142387 -126842
6646 -126842 -23951 -24765 -234351 -140700 -72532 -181980 -182985 -101794 -16395 -157746 -59419
$$ packed form
6729A82809O002k3495K895o5495k950l1148r2781j2745l7774P2725K8811j36003
6717a09149P943m9231R1090Q9203k8233P2372J6752j11877K211M1744o5550J021
6705d1704L6013j4417J08331q4567o8595p3427O4472l1960n2937m7224M3833J7297
6693a44885m5620P4087N9494M8821l8606J3400p589P8037M4844j69689J66603
6682G8897j17715q8422K4353P5821n2136p5817N3022K4501M1532q1831J4869n8893
6670a61819o5503L0406k4700P8776n094r2132L4871k2327M1400J8745P595L4725
6658a25057L026p1640J357K0843L6510r726K562n1050O3686O0388p3286J5545
6646a26842J02891q14k09586R3651O8168j09448j005Q1191Q5399j41351R8327
$$ plain form
6635 -59419 -78210 -141006 -22270 59133 -73730 -133973 -147606 -155759 -138683 -108586 -6000
6624 -6000 -77701 -188136 -106172 -101595 -35422 33295 -113103 -202951 -102694 -8712 -117665
6613 -117665 -85406 -122540 -130363 -89077 -43237 -36217 -139331 -98662 -76869 -140513 -172321 -228432
6601 -228432 -92668 -61966 -62411 -49386 -71741 -104053 -207508 -150983 -146083 -133806 -98011 -44350
6589 -44350 -149706 -169361 -170351 -182786 -75929 -87875 -89675 -89633 -28374 -69145 -121075 -201337 -63272
6576 -63272 -46233 -201539 -174382 -78886 -6410 -45586 -125872 -135823 -10906 -51235 -172107
6565 -172107 -90464 -66596 -170451 -48377 -40188 -95591 -71810 -84137 -32709 26712 -28132
6554 -28132 -27732 -88429 72729 -5525 -129842 -13527 -4466 -20639 -14568 -73428 -78683 -103098
$$ packed form
6635e9419j8791o2796J18736Q1403j32863o0243j3633q153J7076L0097J02586
6624f000p1701j10435Q1964M577O6173O8717j46398q9848J00257R3982j08953
6613a17665L2259l7134p823M1286M5840P020j03114M0669K1793o3644l1808n6111
6601b28432J35764L0702m45J3025k2355l2312j03455N6525M900J2277L5795N3661
6589d4350j05356j9655r90j2435J06857j1946j800M2O1259m0771n1930q0262J38065
6576f3272J7039j55306K7157R5496P2476l9176q0286r951J24917m0329j20872
6565a72107Q1643K3868j03855J22074Q189n5403K3781j2327N1428N9421n4844
6554b8132M00o0697J61158p8254j24317J16315R061j6173O071n8860n255k4415
$$ plain form
6542 -103098 -141672 23378 -719 -52867 -29899 -95183 -40457 13143 -963 -5670 41215 74795
6530 74795 88884 183469 255504 179821 52030 52384 77503 16403 55762 10224 -17757 -59900
6518 -59900 -14471 125980 191106 157971 234318 215037 158278 172962 198549 240779 234475 223900
6506 223900 205987 248485 138560 133460 178082 313129 192304 247314 312865 333570 333271 360900
6494 360900 409663 563297 532304 573583 537860 464469 598755 522582 555321 569394 553097
6483 553097 568368 620804 756454 792014 725159 792379 840424 742675 1000164 1133147 1170326
6472 1170326 1214822 1183700 1268256 1360957 1425098 1520627 1738035 1945678 2077813 2170259 2382220
6461 2382220 2714417 2926064 3273964 3626883 4019524 4541125 5102830 5817978 6574608 7350191
$$ packed form
6542a03098l8574J65050k4097n2148K2968o5284N4726N3600j4106m707M6885L3580
6530G4795J4089R4585P2035p5683j27791L54K5119o1100L9359m5538k7981m2143
6518e9900M5429J40451O5126l3135P6347j9281n6759J4684K5587M2230o304j0575
6506B23900j7913M2498j09925n100M4622J35047j20825N5010O5551K0705k99K7629
6494C60900M8763J53634l0993M1279l5723p3391J34286p6173L2739J4073j6297
6483E53097J5271N2436J35650L5560o6855O7220M8045r7749K57489J32983L7179
6472A170326M4496l1122Q4556R2701O4141R5529K17408K07643J32135R2446K11961
6461B382220L32197K11647L47900L52919L92641N21601N61705P15148P56630P75583
$$ plain form
6451 7350191 8308182 9292114 10247507 11186323 11636957 11859109 11594329 10935429 9951339 8967733
6441 8967733 7850805 6794566 5975410 5277447 4626669 4203153 3733757 3410502 3142398
6432 3142398 2932190 2640073 2481758 2481679 2312591 2005830 1864069 1846755 1673808 1729482 1685784
6421 1685784 1565432 1506300 1439027 1330493 1302849 1192964 1146470 1183701 1227476 1170927 1056757
6410 1056757 986460 929753 909323 813077 741174 862499 864993 853856 893255 877787 704747
6399 704747 793819 928251 901394 832496 887193 1016595 1059809 1065984 1027245 1059498 1079701
6388 1079701 1029018 1064526 1230973 1301596 1508216 1691351 1588112 1557523 1435407 1385665
6378 1385665 1393599 1410294 1521762 1479909 1387182 1286660 1324442 1264468 998586 931559 913611
$$ packed form
6451G350191R57991R83932R55393R38816M50634K22152k64780o58900r84090r83606
6441H967733j116928j056239q19156o97963o50778m23516m69396l23255k68104
6432C142398k10208k92117j58315p9j69088l06761j41761j7314j72947N5674m3698
6421A685784j20352n9132o7273j08534k7644j09885m6494L7231M3775n6549j14170
6410A056757p0297n6707k0430r6246p1903J21325K494j1137L9399j5468j73040
6399G04747Q9072J34432k6857o8898N4697J29402M3214O175l8739L2253K0203
6388A079701n0683L5508J66447P0623K06620J83135j03239l0589j22116m9742
6378A385665P934J6695J11468m1853r2727j00522L7782n9974k65882o7027j7948
$$ plain form
6367 913611 880327 849286 790807 686002 701047 612775 498589 522179 459572 486886 507169
6356 507169 450184 512830 500811 316384 405000 402751 345985 413264 294885 234488 278411
6345 278411 264623 326553 335963 258497 278407 286838 306018 302306 159514 273445 348584 311427
6333 311427 332273 384909 361403 247770 155667 240157 217474 349717 433387 385734 478253
6322 478253 637109 660374 656573 657522 765546 688817 728683 867558 1023384 1180532 1096183
6311 1096183 1052770 806076 695561 830631 935665 993742 998200 874384 792019 756357 720757
6300 720757 753295 760013 613456 586364 574260 474520 410973 415959 382290 350876 312620 241183
6288 241183 237684 114191 116422 208186 129442 230926 234358 303949 236321 136138 70482 130141
$$ packed form
6367I13611l3284l1041n8479j04805J5045q8272j14186K3590o2607K7314K0283
6356E07169n6985O2646j2019j84427Q8616k249n6766O7279j18379o0397M3923
6345B78411j3788O1930R410p7466J9910Q431J9180l712j42792J13931P5139l7157
6333C11427K0846N2636k3506j13633r2103Q4490k2683J32243Q3670m7653R2519
6322D78253J58856K3265l801R49J08024p6729L9866J38875J55826J57148q4349
6311A096183m3413k46694j10515J35070J05034N8077M458j23816q2365l5662l5600
6300G20757L2538O718j46557k7092j2104r9740o3547M986l3669l1414l8256p1437
6288B41183l499j23493K231R1764p8744J01484L432O9591o7628j00183o5656N9659
$$ plain form
6276 130141 133769 188506 103847 27931 109554 214472 183055 153740 168629 28571 165212
6265 165212 110993 39170 123857 118944 76246 115474 119367 173462 282284 213307 235676 283421
6253 283421 275536 320473 418460 392498 337330 334218 400144 485117 518853 665836 743596 845269
6241 845269 850264 807661 969147 1075931 1082308 1120857 1133050 1095638 1053095 1057259 1184946 1118588
6229 1118588 1100136 1072201 990551 954648 867853 875107 773615 721597 618258 566493 527015
6218 527015 504928 402851 449274 486977 365803 415344 406728 367859 318382 336209 402480
6207 402480 412100 309690 372927 500000 569550 723660 592142 658683 796073 808314 985767
6196 985767 916202 904889 1113165 1120353 1140335 1157138 1064050 1038409 1061636 1137884 1178514 1133784
$$ packed form
6276A30141L628N4737q4659p5916Q1623J04918l1417k9315J4889j40058J36641
6265A65212n4219p1823Q4687m913m2698L9228L893N4095J08822o8977K2369M7745
6253B83421p885M4937R7987k5962n5168l112O5926Q4973L3736J46983P7760J01673
6241H45269M995m2603J61486J06784O377L8549J2193l7412m2543M164J27687o6358
6229A118588j8452k7935q1650l5903q6795P254j01492n2018j03339n1765l9478
6218E27015k2087j02077M6423L7703j21174M9541q616l8869m9477J7827O6271
6207D02480R620j02410O3237J27073O9550J54110j31518O6541J37390J2241J77453
6196I85767o9565j1313K08276P188J9982J6803r3088k5641K3227P6248M0630m4730
$$ plain form
6184 1133784 1008486 843182 728933 681880 656534 603107 601319 485576 409151 327396 395363
6173 395363 305454 217393 252628 232027 240878 310527 267944 187667 163894 168186 161199 112136
6161 112136 117639 143497 153283 176099 107035 153348 113065 293 32324 4253 -5566 113922
6149 113922 259243 174106 84081 110995 -13637 19659 7144 -5245 -89087 -93800 -45047
6138 -45047 -23831 18355 -50958 -46226 -28207 -4701 -31512 73764 -1259 50688 -141000 -78846
6126 -78846 -56565 61941 -34677 2823 31008 -29386 -6227 68627 -16466 -17632 -28737 39911
6114 39911 7191 -70004 -28668 20985 89221 7834 12931 -11046 23378 23679 -118592 -240120
6102 -240120 -27062 -2256 1267 68485 57138 48303 8709 -44241 -115679 -158936 -106874 -89410
$$ packed form
6184A133784j25298j65304j14249m7053k5346n3427j788j15743p6425q1755O7967
6173C95363q9909q8061L5235k0601Q851O9649m2583q0277k3773M292o987m9063
6161A12136N503K5858R786K2816o9064M6313m0283j12772L2031k8071r819J19488
6149A13922J45321q5137r0025K6914j24632L3296j2515j2389q3842m713M8753
6138d5047K1216M2186o9313M732J8019K3506k6811J05276p5023N1947j91688O2154
6126g8846K2281J18506r6618L7500K8185o0394K3159P4854q5093j166j1105O8648
6114C9911l2720p7195M1336M9653O8236q1387N097k3977L4424L01j42271j21528
6102b40120K13058K4806L523O7218j1347q835l9594n2950p1438m3257N2062J7464
$$ plain form
6090 -89410 -34586 6707 -80311 9363 37511 40154 141135 41928 -3107 -97916 -49989 28147
6078 28147 42476 -51072 91017 72823 17312 24304 43413 99139 182786 105725 14911 -71396
6066 -71396 -36829 -131686 -55584 50690 107656 -118091 12425 19008 -205148 -197836 -194889 -10344
6054 -10344 21465 45883 -90047 102364 171647 -55190 -101870 -90115 -64041 -10044 -77268
6043 -77268 -3159 -51762 -55713 -112042 -89690 -117545 -111592 -103069 -100198 1252 -23336 41338
6031 41338 24802 3933 32498 -959 -10786 -67898 83158 53111 -61561 -60798 -113558 -93481
6019 -93481 -57427 -82211 -60113 13933 12936 5958 -70174 53466 40108 -30405 -90637 -106803
6007 -106803 -8796 147811 66302 30571 32742 118597 83452 -81772 -109790 12064 -12078
$$ packed form
6090h9410N4824M1293q7018Q9674K8148K643J00981r9207m5035r4809M7927P8136
6078B8147J4329r3548J42089j8194n5511O992J9109N5726Q3647p7061r0814q6307
6066g1396L4567r4857P6102J06274N6966k25747J30516O583k24156P312K947J84545
6054a0344L1809K4418j35930J92411O9283k26837m6680J1755K6074N3997o7224
6043g7268P4109m8603l951n6329K2352k7855N953Q523K871J01450k4588O4674
6031D1338j6536k0869K8565l3457r827n7112J51056l0047j14672P63n2760K0077
6019i3481L6054k4784K2098P4046r97o978p6132J23640j3358p0513o0232j6166
6007a06803R8007J56607q1509l5731K171Q5855l5145j65224k8018J21854k4142
$$ plain form
5996 -12078 -28217 174358 107955 37813 105487 -11491 1599 64578 144165 205645 201966 221678
5984 221678 245880 247373 174785 244407 198444 267554 232975 147508 112205 139251 120149 171465
5972 171465 225255 205924 174050 203870 205222 201912 208456 305738 365913 446185 525298 472642
5960 472642 291087 466195 588402 692940 638694 573098 381494 348723 300064 295718 252893
5949 252893 143121 249893 203175 124920 180049 227387 217860 250496 183173 201962 208238 192822
5937 192822 131160 255997 225886 142501 87148 122614 176989 212821 246500 357134 345958
5926 345958 294563 283712 302031 205040 136973 87221 146048 186684 188567 206245 128112 114953
5914 114953 199327 261616 120231 88805 57208 62337 130097 159359 14860 30307 106336
$$ packed form
5996a2078j6139K02575o6403p0142O7674j16978J3090O2979P9587O1480l679J9712
5984B21678K4202J493p2588O9622m5963O9110l4579q5467l5303K7046j9102N1316
5972A71465N3790j9331l1874K9820J352l310O544R7282O0175Q0272P9113n2656
5960D72642j81555J75108J22207J04538n4246o5596j91604l2771m8659m346m2825
5949B52893j09772J06772m6718p8255N5129M7338r527L2636o7323J8789O276j5416
5937A92822o1662J24837l0111q3385n5353L5466N4375L5832L3679J10634j1176
5926C45958n1395j0851J8319r6991o8067m9752N8827M0636J883J7678p8133j3159
5914A14953Q4374O2289j41385l1426l1597N129O7760K9262j44499J5447P6029
$$ plain form
5903 106336 134146 116686 39177 6543 150530 244119 181689 160542 120802 259118 244081
5892 244081 176043 102493 11319 -7070 46932 113513 106656 176369 193223 187257 364008 357694
5880 357694 283269 156581 134735 131963 182335 101158 62771 128650 336592 389943 350992
5869 350992 323703 232727 288161 384651 351846 343575 376003 363502 329847 306699 290964 199115
5857 199115 162401 254445 279401 406097 340634 242355 375132 352548 279886 281274 289185 320129
5845 320129 252313 287335 302166 305743 423229 379511 384435 296107 408253 478278 490309 431834
5833 431834 351947 389420 446529 448193 370993 390209 468281 330221 367709 382719 381603 402880
5821 402880 388145 379518 332335 271133 312014 388552 421057 372621 269417 318675 434335
$$ packed form
5903A06336K7810j7460p7509l2634J43987R3589o2430k1147l9740J38316j5037
5892B44081o8038p3550r1174j8389N4002O6581o857O9713J6854n966J76751o314
5880C57694p4425j26688k1846k772N0372q1177l8387O5879K07942N3351l8951
5869C50992k7289r0976N5434R6490l2805q271L2428j2501l3655k3148j5735r1849
5857A99115l6714R2044K4956J26696o5463r8279J32777k2584p2662J388P911L0944
5845C20129o7816L5022J4831L577J17486m3718M924q8328J12146P0025J2031n8475
5833D31834p9887L7473N7109J664p7200J9216P8072j38060L7488J5010j116K1277
5821D02880j4735q627m7183o1202M0881P6538L2505m8436j03204M9258J15660
$$ plain form
5810 434335 489734 491816 461130 462148 402776 217421 287737 306145 278276 402525 412775 362241
5798 362241 299127 471096 502113 333939 253689 383051 526120 434042 467014 489463 366752
5787 366752 344529 285159 415332 415374 420635 410093 293090 418574 439344 345755 336129 367599
5775 367599 372717 375456 376274 487800 402323 286708 404749 343292 394392 355865 126831 186149
5763 186149 216988 249834 203656 190769 263082 255061 225866 115769 130014 158717 104528 12132
5751 12132 55374 147173 254214 245370 179149 263675 119244 125908 214144 274031 189251 132375
5739 132375 157727 251663 262208 182039 239787 302999 352462 241588 214112 169451 216185
5728 216185 233764 220554 188427 141354 141557 178285 124522 15058 64876 96615 106967 11758
$$ packed form
5810D34335N5399K082l0686J018n9372j85355P0316J8408k7869J24249J0250n0534
5798C62241o3114J71969L1017j68174q0250J29362J43069r2078L2972K2449j22711
5787C66752k2223n9370J30173M2N261j0542j17003J25484K0770r3589r626L1470
5775C67599N118K739Q18J11526q5477j15615J18041o1457N1100l8527k29034N9318
5763A86149L0839L2846m6178j2887P2313q021k9195j10097J4245K8703n4189r2396
5751A2132M3242R1799J07041q844o6221Q4526j44431O664Q8236N9887q4780n6876
5739A32375K5352R3936J0545q0169N7748O3212M9463j10874k7476m4661M6734
5728B16185J7579j3210l2127m7073K03L6728n3763j09464M9818L1739J0352r5209
$$ plain form
5716 11758 152477 189090 202140 158549 104490 94444 145316 83386 124914 77921 123121 161668
5704 161668 114122 165048 127705 100058 115161 249296 294880 326291 285928 296321 297012 290719
5692 290719 230126 207204 296392 282662 252530 182757 108300 197834 124413 117575 114403 144489
5680 144489 259996 276418 280397 288204 332046 334707 254503 297407 253365 285926 324946 285655
5668 285655 323128 313237 211728 171723 160363 90055 183092 218748 297615 338975 299882 249220
5656 249220 200906 238288 235971 321433 312630 269857 134110 145828 166861 146434 108266 141135
5644 141135 160420 159235 209534 193617 249683 334187 266220 380513 431564 335264 281434 131998
5632 131998 157318 269554 227393 265220 317425 252160 207373 318666 286577 135514 80457
$$ packed form
5716A1758J40719L6613J3050m3591n4059j0046N0872o1930M1528m6993M5200L8547
5704A61668m7546N0926l7343k7647J5103J34135M5584L1411m0363J0393O91o293
5692B90719o0593k2922Q9188j3730l0132o9773p4457Q9534p3421o838l172L0086
5680A44489J15507J6422L979P807M3842K661q0204M2904m4042L2561L9020l9291
5668B85655L7473r891j01509m0005j1360p0308R3037L5656P8867M1360l9093n0662
5656B49220m8314L7382k317Q5462q803m2773j35747J1718K1033k0427l8168L2869
5644A41135J9285j185N0299j5917N6066Q4504o7967J14293N1051r6300n3830j49436
5632A31998K5320J12236m2161L7827N2205o5265m4787J11293l2089j51063n5057
$$ plain form
5621 80457 188376 266071 214071 266090 115508 219290 224083 201173 -19642 26113 154214
5610 154214 157500 241492 241490 216218 391566 282428 248274 323455 236135 225814 140840 309476
5598 309476 300273 324299 311438 251900 230864 177166 196004 143750 137007 235259 268659 306293
5586 306293 242324 207493 189427 183172 194144 250695 300132 212778 273434 229815 199395 99525
5574 99525 154485 219980 227612 334125 375724 325694 315860 377777 310369 338692 361163 316065
5562 316065 416196 451255 403692 388800 438110 418336 552746 462715 339344 309514 257656
5551 257656 362458 383863 431067 166804 250114 379821 468964 454787 375137 438195 517431
5540 517431 442905 345543 377060 443883 512911 506932 578069 665254 650189 704685 755614 738015
$$ packed form
5621H0457J07919P7695n2000N2019j50582J03782M793k2910k20815M5755J28101
5610A54214L286Q3992kk5272J75348j09138l4154P5181q7320j0321q4974J68636
5598C09476r203K4026j2861n9538k1036n3698J8838n2254o743R8252L3400L7634
5586C06293o3969l4831j8066o255J0972N6551M9437q7354O0656m3619l0420r9870
5574I9525N4960O5495P632J06513M1599n0030r834O1917o7408K8323K2471m5098
5562C16065J00131L5059m7563j4892M9310j9774J34410r0031j23371k9830n1858
5551B57656J04802K1405M7204k64263Q3310J29707Q9143j4177p9650O3058P9236
5540E17431p4526r7362L1517O6823O9028n979P1137Q7185j5065N4496N0929j7599
$$ plain form
5528 738015 709837 669004 606312 577655 497976 474888 521052 496964 490251 451245 537308 557591
5516 557591 527754 496855 550744 537877 622276 650580 664206 632729 582175 739206 716746
5505 716746 769651 1030562 1107183 1095824 1125356 1074782 1153131 1144693 977827 793576 787083
5494 787083 790411 732848 577297 487628 510530 523122 589362 607939 615313 555582 580732 506656
5482 506656 443269 569215 538686 514897 445779 607030 664023 586005 687062 642919 756499
5471 756499 859056 826748 835288 858810 970565 835929 732401 633991 524780 493170 477334
5460 477334 534572 517544 452742 445126 466318 434713 339445 390516 456131 463711 502082 531829
5448 531829 525740 500990 509116 354761 445446 612678 531642 532627 360178 373449 523710 574553
$$ packed form
5528G38015k8178m0833o2692k8657p9679k3088M6164k4088o713l9006Q6063K0283
5516E57591k9837l0899N3889j2867Q4399K8304J3626l1477n0554J57031k2460
5505G16746N2905K60911P6621j1359K9532n0574P8349q438j66866j84251o493
5494G87083L328n7563j55551q9669K2902J2592O6240J8577P374n9731K5150p4076
5482E06656o3387J25946l0529k3789o9118J61251N6993p8018J01057m4143J13580
5471G56499J02557l2308Q540K3522J11755j34636j03528r8410j09211l1610j5836
5460D77334N7238j7028o4802p616K1192l1605r5268N1071O5615P580L8371K9747
5448E31829o089k4750Q126j54355R0685J67232q1036R85j72449J3271J50261N0843
$$ plain form
5436 574553 588130 579811 553454 510282 499596 405550 379535 412727 588715 509554 519474 590658
5424 590658 595399 538576 489702 474152 530977 497864 577266 546846 577874 599713 665439 704500
5412 704500 673912 674819 773759 651649 589001 653707 643370 630898 603868 691765 683892 667556
5400 667556 644053 746008 719904 725588 823257 885083 1030819 961066 958356 1115672 1119835 1145867
5388 1145867 1213890 1342099 1343898 1444093 1551024 1649731 1794439 1990173 2164776 2406561
5378 2406561 2603624 2816832 2836339 2858137 2988635 3309917 3520494 3780443 3964111 3807953
5368 3807953 3588184 3309939 3313361 3362370 3373796 3522516 3498386 3447127 3402076 3383777 3535606
5357 3535606 3456684 3287249 3292023 3390872 3427217 3592006 3720615 3723601 3477512 3303588 3250976
$$ packed form
5436E74553J3577q319k6357m3172j0686r4046k6015L3192J75988p9161R920P1184
5424E90658M741n6823m8874j5550N6825l3113P9402l0420L1028K1839O5726L9061
5412G04500l0588R07R8940j22110o2648O4706j0337j2472k7030Q7897p873j6336
5400F67556k3503J01955k6104N684R7669O1826J45736o9753k710J57316M163K6032
5388A145867O8023J28209J799J00195J06931R8707J44708J95734J74603K41785
5378B406561J97063K13208J9507K1798J30498L21282K10577K59949J83668j56158
5368C807953k19769k78245L422M9009J1426J48720k4130n1259m5051j8299J51829
5357C535606p8922j69435M774R8849L6345J64789J28609K986k46089j73924n2612
$$ plain form
5346 3250976 3074471 2830226 2781232 2693459 2557833 2269046 2197937 2049848 1782038 1745525
5336 1745525 1585668 1463164 1411902 1313603 1124672 1132991 1128987 1190328 1160607 1099359 1023373
5325 1023373 1082879 1109597 981620 946305 912007 1035423 985660 901264 954801 897180 973953
5314 973953 951331 934783 939970 937106 896323 945827 827934 834100 836275 759584 699162 704492
5302 704492 806984 781747 835352 762601 710719 643321 680787 720538 838227 893173 852768
5291 852768 882977 779165 785919 782112 733793 782696 751722 760286 757831 756283 809161 775335
5279 775335 677663 723102 695441 563850 553184 554372 526580 526709 649848 615557 537923 607051
5267 607051 618633 701541 658123 620334 673773 638898 631683 687865 663508 562979 520926 539402
$$ packed form
5346C250976j76505k44245m8994q7773j35626k88787p1109j48089k67810l6513
5336A745525j59857j22504n1262r8299j88931Q319m004O1341k9721o1248p5986
5325A023373N9506K6718j27977l5315l4298J23416m9763q4396N3537n7621P6773
5314I73953k2622j6548N187k864m0783M9504j17893O166K175p6691o0422N330
5302G04492J02492k5237N3605p2751n1882o7398L7466L9751J17689N4946m0405
5291H52768L0209j03812O754l807m8319M8903l0974Q564k455j548N2878l3826
5279G75335r7672M5439k7661j31591j0666J188k7792J29J23139l4291p7634O9128
5267F07051J1582Q2908m3418l7789N3439l4875p215N6182k4357j00529m2053J8476
$$ plain form
5255 539402 616804 636305 652321 566745 520663 494790 598173 560686 514317 558180 574918
5244 574918 530605 536548 652281 675886 690494 569898 562627 592702 503930 471393 595740
5233 595740 568823 593165 521120 553006 511271 548747 589330 575773 546291 564268 603988 602670
5221 602670 468837 500384 472493 633505 760169 736955 677434 616689 674069 635223 771028
5210 771028 830396 847589 719458 634895 597978 662603 603918 592472 561710 608736 623649
5199 623649 717517 616023 550381 570448 656981 655623 734973 665408 605411 631329 676650 614080
5187 614080 505021 594387 623792 597904 729037 771289 759704 730295 618453 613871 741791
5176 741791 938317 925681 696414 745077 836105 792257 876034 833984 888273 883866 939141
$$ packed form
5255E39402P7402J9501J6016q5576m6082k5873J03383l7487m6369M3863J6738
5244E74918m4313N943J15733K3605J4608j20596p271L0075q8772l2537J24347
5233E95740k6917K4342p2045L1886m1735L7476M0583j3557k9482J7977L9720j318
5221F02670j33833L1547k7891J61012J26664k3214n9521o0745N7380l8846J35805
5210G71028N9368J7193j28131q4563l6917O4625n8685j1446l0762M7026J4913
5199F23649R3868j01494o5642K0067Q6533j358P9350o9565n9997K5918M5321o2570
5187F14080j09059Q9366K9405k5888J31133M2252j1585k9409j11842m582J27920
5176G41791J96526j2636k29267M8663R1028m3848Q3777m2050N4289m407N5275
$$ plain form
5165 939141 930803 905070 985440 1091428 1047189 1178119 1187194 1249944 1239819 1386101 1612654
5154 1612654 1674185 1835356 2010096 2063777 2094421 2134209 2204330 2200558 2033529 1899955 1863926
5143 1863926 1802840 1652053 1429238 1280769 1271140 1252181 1198925 1067195 1002564 966227 978393
5132 978393 960136 901934 943583 963647 977144 1029660 989617 997977 1090664 1094437 994867 1028905
5120 1028905 1033269 960110 1132644 999942 1060728 1054931 935400 1075058 1052405 1003007 956796
5109 956796 930755 988957 954049 939194 944207 928230 986627 989360 967396 1081435 1223425 1181694
5097 1181694 1126674 989237 956235 964256 987349 1097394 1098843 1109248 1065782 1109811 1031924
5086 1031924 961095 1161739 1263058 1124984 1125551 1196248 1249383 1212451 1210249 1339746 1195541
$$ packed form
5165I39141q338k5733Q0370J05988m4239J30930R075O2750j0125J46282K26553
5154A612654O1531J61171J74740N3681L0644L9788P0121l772j67029j33574l6029
5143A863926o1086j50787k22815j48469r629j8959n3256j31730o4631l6337J2166
5132I78393j8257n8202M1649K0064J3497N2516m0043Q360R2687L773r9570L4038
5120A028905M364p3159J72534j32702O0786n797j19531J39658k2653m9398m6211
5109I56796k6041N8202l4908j4855N013j5977N8397K733k1964J14039J41990m1731
5097A181694n5020j37437l3002Q021K3093J10045J449J0405m3466M4029p7887
5086A031924p0829K00644J01319j38074N67P0697N3135l6932k202J29497j44205
$$ plain form
5075 1195541 1232347 1239627 1229004 1203187 1197421 1163528 1193594 1230218 1158447 1132686 1215127 1131929
5063 1131929 1153787 1166651 1176289 1282706 1360471 1257549 1236135 1185344 1062713 1137718 1207586
5052 1207586 1255920 1223184 1213642 1345231 1349265 1267210 1256284 1251699 1383996 1423388 1358683 1444059
5040 1444059 1465629 1384028 1468149 1405777 1395319 1596460 1508074 1412385 1411255 1566382 1547963
5029 1547963 1632166 1663613 1598962 1613618 1636804 1752120 1787987 1761730 1701421 1813956 1844459
5018 1844459 1877082 1773138 1695612 1781133 1810780 1815670 1746851 1854918 1915316 2010022 1977640
5007 1977640 1896339 1893700 1947200 1818009 1871180 1991981 1998324 2123730 1997323 1974436 1973860
4996 1973860 1957315 2125817 2100478 1994315 2126413 2131238 2154481 2124539 2114122 2159286 2247193
$$ packed form
5075A195541L6806P280j0623k5817n766l3893L0066L6624p1771k5761Q2441q3198
5063A131929K1858J2864R638J06417P7765j02922k1414n0791j22631P5005O9868
5052A207586M8334l2736r542J31589M034q2055j0926m585J32297L9392o4705Q5376
5040A444059K1570q1601Q4121o2372j0458K01141q8386r5689j130J55127j8419
5029A547963Q4203L1447o4651J4656K3186J15316L5867k6257o0309J12535L0503
5018A844459L2623j03944p7526Q5521K9647M890o8819J08067O0398R4706l2382
5007A977640q1301k639N3500j29191N3171J20801O343J25406j26407k2887n76
4996A973860j6545J68502k5339j06163J32098M825K3243k9942j0417M5164Q7907
$$ plain form
4985 2247193 2233846 2354183 2238693 2253585 2315154 2422228 2440981 2581781 2638895 2714479 2782853
4974 2782853 2705757 2778977 2993418 3076449 3232208 3257559 3394966 3345665 3335612 3343847 3421712
4963 3421712 3499812 3576305 3745839 3836769 3962205 3983783 4101756 4092171 4270932 4337880 4447208
4952 4447208 4640404 4765713 4893841 4937523 5038343 5207099 5485508 5748814 5950100 6219397
4942 6219397 6418851 6646554 6799349 7098823 7264167 7476044 7613477 7818188 7929605 8261198
4932 8261198 8529338 8657384 8755544 9157340 9554139 9847493 10116578 10549220 10917698 11204113
4922 11204113 11619007 12028181 12474124 12821015 13304504 13856260 14229422 14681431 15148716
4913 15148716 15693847 16216922 16817034 17387950 17913711 18736880 19654149 20519442 21314105
$$ packed form
4985B247193j3347J20337j15490J4892O1569J07074J8753J40800N7114P5584O8374
4974B782853p7096P3220K14441Q3031J55759K5351J37407m9301j0053Q235P7865
4963C421712P8100P6493J69534R0930J25436K1578J17973r585J78761O6948J09328
4952D447208J93196J25309J28128M3682J00820J68756K78409K63306K01286K69297
4942F219397J99454K27703J52795K99474J65344K11877J37433K04711J11417L31593
4932H261198K68140J28046R8160M01796L96799K93354K69085M32642L68478K86415
4922A1204113M14894M09174M45943L46891M83489N51756L73162M52009M67285
4913A5148716N45131N23075O00112N70916N25761Q23169R17269Q65293P94663
$$ plain form
4904 21314105 22395893 23513419 24874491 26254892 27936812 29732104 31627224 33742249
4896 33742249 36080583 38692816 41732105 45425798 49747816 54840449 60739712 67572611
4888 67572611 75203319 84072277 94370394 106424070 120666921 137647405 158213879
4881 158213879 181767633 205907095 229771569 252753013 265879259 267718982 265373045
4874 265373045 251691560 227027761 201883323 175706555 149880679 128307254 110739375
4867 110739375 96632688 85414797 76502206 69245211 63205017 58181254 53819270 50129599
4859 50129599 46642519 43700029 41219985 38692179 36491668 34642603 32996270 31565537
4851 31565537 30283303 29040174 28037862 27070011 26067594 25049517 24081706 23231672 22341618
$$ packed form
4904B1314105J081788J117526J361072J380401J681920J795292J895120K115025
4896C3742249K338334K612233L039289L693693M322018N092633N899263O832899
4888F7572611P630708Q868958J0298117J2053676J4242851J6980484K0566474
4881A58213879K3553754K4139462K3864474K2981444J3126246J839723k345937
4874B65373045j3681485k4663799k5144438k6176768k5825876k1573425j7567879
4867A10739375j4106687j1217891q912591p256995o040194n023763m361984l689671
4859E0129599l487080k942490k480044k527806k200511j849065j646333j430733
4851C1565537j282234j243129j002312r67851j002417j018077r67811q50034q90054
$$ plain form
4842 22341618 21558164 20731183 20025767 19195823 18474823 17911836 17359910 16717129 16246967
4833 16246967 15805842 15363275 14909533 14501335 14112256 13640032 13291963 13056054 12747690
4824 12747690 12349982 11959522 11736754 11551675 11297500 10950963 10611327 10357330 10174857
4815 10174857 10118434 9848888 9584086 9406927 9189376 9023416 8933075 8729995 8643210 8524483
4805 8524483 8412754 8290988 8173176 7871986 7805589 7623420 7548238 7297143 7093894 7041114
4795 7041114 6929989 6866826 6695232 6490524 6477526 6428304 6324958 6123544 6037162 5978770
4785 5978770 6051037 6016212 5902740 5889438 5807283 5753858 5694675 5567200 5657351 5624253 5500421
4774 5500421 5412291 5381756 5411032 5353656 5395777 5287602 5132002 5191482 5181672 5097510 5020364
$$ packed form
4842B2341618p83454q26981p05416q29944p21000n62987n51926o42781m70162
4833A6246967m41125m42567m53742m08198l89079m72224l48069k35909l08364
4824A2747690l97708l90460k22768j85079k54175l46537l39636k53997j82473
4815A0174857n6423k69546k64802j77159k17551j65960r0341k03080q6785j18727
4805H524483j11729j21766j17812l01190o6397j82169p5182k51095k03249n2780
4795G041114j11125o3163j71594k04708j2998m9222j03346k01414q6382n8392
4785E978770P2267l4825j13472j3302q2155n3425n9183j27475R0151l3098j23832
4774E500421q8130l0535K9276n7376M2121j08175j55600N9480r810q4162p7146
$$ plain form
4763 5020364 4939183 4908485 4803952 4759691 4807280 4856332 4838553 4717481 4567789 4549818 4555531
4752 4555531 4578153 4536687 4552363 4408741 4492268 4417808 4355719 4298062 4248321 4224262 4289455
4741 4289455 4332631 4323117 4212017 4071462 4073200 4155623 4040753 4051534 3959497 3843962 3879429
4730 3879429 3969946 3973893 3948279 3952145 3893814 3947938 4064173 4037004 3851078 3827861 3825041 3772512
4718 3772512 3707910 3745875 3825670 3790220 3829836 3637579 3743535 3712742 3790205 3836313 3789552
4707 3789552 3822120 3762361 3698509 3624160 3682987 3647244 3559888 3586624 3690899 3642677 3690276
4696 3690276 3751016 3667298 3605562 3747703 3759355 3569361 3451639 3488104 3558911 3593154 3552289
4685 3552289 3500435 3470817 3511912 3483626 3450928 3577752 3511386 3350982 3475609 3418105 3356342
$$ packed form
4763E020364q1181l0698j04533m4261M7589M9052j7779j21072j49692j7971N713
4752D555531K2622m1466J5676j43622Q3527p4460o2089n7657m9741k4059O5193
4741D289455M3176r514j11100j40555J738Q2423j14870J0781r2037j15535L5467
4730C879429R0517L947k5614L866n8331N4124J16235k7169j85926k3217k820n2529
4718C772512o4602L7965P9795l5450L9616j92257J05956l0793P7463M6108m6761
4707C789552L2568n9759o3852p4349N8827l5743q7356K6736J04275m8222M7599
4696C690276O0740q3718o1736J42141J1652j89994j17722L6465P0807L4243m0865
4685C552289n1854k9618M1095k8286l2698J26824o6366j60404J24627n7504o1763
$$ plain form
4674 3356342 3384917 3329824 3285514 3320683 3272228 3298006 3348981 3367102 3321134 3311503 3262236 3340421
4662 3340421 3291878 3270251 3376746 3412074 3375776 3416047 3480004 3551789 3595732 3533644 3484153
4651 3484153 3322948 3362101 3498991 3468070 3497194 3535449 3515711 3485176 3575470 3650932 3561128
4640 3561128 3515684 3484373 3564269 3579525 3409885 3549707 3622704 3647141 3457922 3542753 3698532
4629 3698532 3594880 3511527 3528343 3625341 3756750 3843372 3773836 3728762 3751491 3726919 3771315
4618 3771315 3810335 3862740 4001520 3981299 4104289 4139828 4229494 4274039 4244501 4236370 4231183
4607 4231183 4318083 4531928 4796531 4820679 4909270 5094773 5175315 5212863 5203277 5023826 4984287
4596 4984287 4888342 4741444 4628143 4527199 4661206 4628161 4594390 4578724 4584411 4514443 4439722
$$ packed form
4674C356342K8575n5093m4310L5169m8455K5778N0975J8121m5968r631m9267P8185
4662C340421m8543k1627J06495L5328l6298M0271O3957P1785M3943o2088m9491
4651C484153j61205L9153J36890l0921K9124L8255j9738l0535R0294P5462q9804
4640C561128m5444l1311P9896J5256j69640J39822P2997K4437j89219Q4831J55779
4629C698532j03652q3353J6816R6998J31409Q6622o9536m5074K2729k4572M4396
4618C771315L9020N2405J38780k0221J22990L5539Q9666M4545k9538q131n187
4607D231183Q6900K13845K64603K4148Q8591J85503Q0542L7548r586j79451l9539
4596D984287r5945j46898j13301j00944J34007l3045l3771j5666N687o9968p4721
$$ plain form
4585 4439722 4475351 4486181 4376761 4352008 4314383 4252283 4224641 4166744 4139407 4126997 4044390
4574 4044390 4130684 4101546 3997256 3997563 3888927 3930960 3911155 3969024 4013735 3995623 4022942
4563 4022942 4073466 4078464 4120312 4074958 3941433 4044624 3931028 3929909 3880264 3936080 3974842
4552 3974842 3961142 3872384 3787894 3706849 3621308 3589461 3590198 3467052 3544232 3599420 3522075 3562202
4540 3562202 3577031 3447008 3349105 3380289 3372701 3351310 3327959 3367571 3232676 3293203 3263051
4529 3263051 3208087 3283486 3283277 3267859 3210825 3204753 3142654 3012047 3027704 3086036 3153317 3128606
4517 3128606 3048087 3047261 3028892 2913599 2865537 2854659 2949058 2995431 2910081 2763055 2733172
4506 2733172 2843108 2735157 2680399 2667293 2680520 2726065 2729866 2760021 2795815 2745404 2599761
$$ packed form
4585D439722L5629J0830j09420k4753l7625o2100k7642n7897k7337j2410q2607
4574D044390Q6294k9138j04290L07j08636M2033j9805N7869M4711j8112K7319
4563D022942N0524M998M1848m5354j33525J03191j13596j119m9645N5816L8762
4552C974842j3700q8758q4490q1045q5541l1847P37j23146P7180N5188p7345M0127
4540C562202J4829j30023r7903L1184p588k1391k3351L9612j34895O0527l0152
4529C263051n4964P5399k09j5418n7034o072o2099j30607J5657N8332O7281k4711
4517C128606q0519q26j8369j15293m8062j0878R4399M6373q5350j47026k9883
4506B733172J09936j07951n4758j3106J3227M5545L801L0155L5794n0411j45643
$$ plain form
4495 2599761 2677259 2688490 2714749 2713555 2733927 2722203 2688856 2701005 2675170 2635362 2606155 2562089
4483 2562089 2545185 2578715 2510143 2501089 2477026 2479096 2468896 2450970 2458675 2417004 2415917 2387717
4471 2387717 2297616 2313360 2301742 2239933 2174551 2323472 2418906 2309621 2283526 2277189 2326648
4460 2326648 2369903 2479308 2385157 2444246 2492397 2503700 2488652 2562826 2585935 2476924 2459487
4449 2459487 2516602 2627795 2589786 2594821 2536552 2526958 2508838 2491046 2609250 2527268 2436921
4438 2436921 2456404 2529996 2566552 2534653 2513033 2449155 2444902 2396442 2374593 2369124 2430290 2461814
4426 2461814 2425611 2391217 2398104 2370739 2446629 2534701 2452621 2375541 2497031 2596613 2510297
4415 2510297 2465776 2457015 2550188 2636039 2523834 2517761 2432355 2301485 2288300 2315532 2459839
$$ packed form
4495B599761P7498J1231K6259j194K0372j1724l3347J2149k5835l9808k9207m4066
4483B562089j6904L3530o8572r054k4063K070j0200j7926P705m1671j087k8200
4471B387717r0101J5744j1618o1809o5382J48921R5434j09285k6095o337M9459
4460B326648M3255J09405r4151N9089M8151J1303j5048P4174K3109j09011j7437
4449B459487N7115J11193l8009N035n8269r594j8120j7792J18204q1982r0347
4438B436921J9483P3592L6556l1899k1620o3878m253m8460k1849n469O1166L1524
4426B461814l6203l4394O887k7365P5890Q8072q2080p7080J21490R9582q6316
4415B510297m4521q761R3173Q5851j12205o073q5406j30870j3185K7232J44307
$$ plain form
4404 2459839 2418997 2369129 2371540 2384669 2402210 2367637 2426106 2434523 2424887 2426225 2318537 2302151
4392 2302151 2441800 2470311 2400681 2318427 2377358 2425101 2333665 2290739 2297646 2325843 2366369
4381 2366369 2352987 2375604 2440234 2319872 2294516 2296688 2196499 2214769 2265828 2254201 2337150
4370 2337150 2449319 2431980 2316546 2213221 2307690 2353564 2245789 2218337 2193994 2139851 2234703
4359 2234703 2277299 2293714 2276538 2189543 2310078 2414192 2222299 2211399 2267579 2284093 2365519
4348 2365519 2342821 2359127 2366441 2359504 2408113 2437317 2587416 2602743 2692399 2743330 2798618 2831022
4336 2831022 2867687 2911276 2772414 2716337 2688084 2717879 2676638 2561924 2530846 2572151 2561942
4325 2561942 2533398 2532160 2460522 2387699 2445065 2567949 2533638 2433556 2498782 2557282 2687789
$$ packed form
4404B459839m0842m9868K411J3129J7541l4573N8469Q417r636J338j07688j6386
4392B302151J39649K8511o9630q2254N8931M7743r1436m2926O907K8197M0526
4381B366369j3382K2617O4630j20362k5356K172j00189J8270N1059j1627Q2949
4370B337150J12169j7339j15434j03325R4469M5874j07775k7452k4343n4143R4852
4359B234703M2596J6415j7176q6995J20535J04114j91893j0900N6180J6514Q1426
4348B365519k2698J6306P314o937M8609K9204J50099J5327Q9656N0931N5288L2404
4336B831022L6665M3589j38862n6077k8253K9795m1241j14714l1078M1305j0209
4325B561942k8544j238p1638p2823N7366J22884l4311j00082O5226N8500J30507
$$ plain form
4314 2687789 2769118 2879329 2789456 2876808 2865151 2838913 2998014 2959227 3057975 3107159 2928077
4303 2928077 2864534 2668097 2633599 2507459 2402272 2466707 2438997 2527762 2421203 2374045 2419445
4292 2419445 2439902 2390955 2357022 2300230 2388735 2432385 2374355 2574282 2599694 2519275 2569256
4281 2569256 2464900 2433492 2471798 2483798 2543129 2559889 2462274 2378836 2355109 2364665 2357863 2239068
4269 2239068 2195380 2201897 2224369 2122002 2008441 2042173 2096787 2010430 2030206 1937622 1939222
4258 1939222 1926026 1906626 1973710 1936555 1897757 1800831 1859373 1693365 1811712 1914931 1730400
4247 1730400 1624714 1679945 1705952 1684039 1612261 1585467 1551819 1585570 1566178 1509790 1459177
4236 1459177 1515471 1391223 1443844 1543698 1340644 1413499 1437846 1483800 1443223 1421798 1455176
$$ packed form
4314B687789Q1329J10211q9873Q7352j1657k6238J59101l8787R8748M9184j79082
4303B928077o3543j96437l4498j26140j05187O4435k7710Q8765j06559m7158M5400
4292B419445K0457m8947l3933n6792Q8505M3650n8030J99927K5412q0419M9981
4281B569256j04356l1408L8306J2000N9331J6760r7615q3438k3727R556o802j18795
4269B239068m3688O517K2472j02367j13561L3732N4614q6357J9776r2584J600
4258A939222j3196j9400O7084l7155l8798r6926N8542j66008J18347J03219j84531
4247A730400j05686N5231K6007k1913p1778k6794l3648L3751j9392n6388n0613
4236A459177N6294j24248N2621R9854k03054P2855K4347M5954m0577k1425L3378
$$ plain form
4225 1455176 1457003 1477963 1399025 1419365 1467996 1322219 1303835 1412036 1399634 1363039 1360824
4214 1360824 1396580 1301571 1282965 1360164 1358981 1401413 1347562 1295874 1213608 1240137 1254235 1253602
4202 1253602 1244823 1163520 1128647 1074819 1145319 1166007 1187065 1169321 1069082 1136041 1258790
4191 1258790 1309119 1177917 1036637 1095210 1082488 1117327 1094436 921493 917980 985387 1025543
4180 1025543 1036334 1032067 878691 894138 929541 972990 974552 898259 850343 872058 928235 946848
4168 946848 867330 840059 958272 905241 760536 838351 822366 921194 1014840 860625 817269
4157 817269 754986 811735 811236 890800 876870 877941 879412 893552 828439 873216 955568 962860 1057302
4144 1057302 849352 830049 900279 852187 840954 775383 864429 1010921 1055632 1000089 1059588
$$ packed form
4225A455176J827K0960p8938K0340M8631j45777j8384J08201j2402l6595k215
4214A360824L5756r5009j8606P7199j183M2432n3851n1688q2266K6529J4098o33
4202A253602q779q1303l4873n3828P0500K0688K1058j7744j00239O6959J22749
4191A258790N0329j31202j41280N8573j2722L4839k2891j72943l513O7407M0156
4180A025543J0791m267j53376J5447L5403M3449J562p6293m7916K1715N6177J8613
4168I46848p9518k7271J18213n3031j44705P7815j5985R8828R3646j54215m3356
4157H17269o2283N6749m99P9564j3930J071J471J4140o5113M4777Q2352P292R4442
4144A057302k07950j9303P0230m8092j1233o5571Q9046J46492M4711n5543N9499
$$ plain form
4133 1059588 1039729 969510 1015855 925798 946950 888661 764378 871626 918070 975194 868784
4122 868784 891257 913015 963526 1054111 897343 853965 974418 920667 888527 921152 991835
4111 991835 1063614 1016564 1067944 955085 1023641 1114883 1243508 1307152 1393322 1316931 1318826
4100 1318826 1352026 1365500 1350036 1340391 1371124 1220566 1194307 1211214 1288510 1396893 1407939
4089 1407939 1448706 1536641 1411462 1344074 1301511 1302311 1323074 1329612 1450135 1340958 1177723
4078 1177723 1187232 1387957 1365097 1302233 1304196 1404289 1412869 1440042 1540050 1571668 1655978
4067 1655978 1701034 1930149 2211944 2390537 2513016 2691548 2847752 3074862 3130072 3031031
4057 3031031 2819504 2578080 2347170 2121255 1837736 1627588 1458629 1342818 1270441 1189418
$$ packed form
4133A059588j9859p0219M6345r0057K1152n8289j24283J07248M6444N7124j06410
4122H68784K2473K1758N0511R0585j56768m3378J20453n3751l2140L2625P0683
4111I91835P1779m7050N1380j12859O8556R1242J28625O3644Q6170p6391J895
4100A318826L3200J3474j5464r645L0733j50558k6259J6907P7296J08383J1046
4089A407939M0767Q7935j25179o7388m2563Q00K0763O538J20523j09177j63235
4078A177723R509K00725k2860o2864J963J00093Q580K7173J00008L1618Q4310
4067A655978M5056K29115K81795J78593J22479J78532J56204K27110N5210r9041
4057C031031k11527k41424k30910k25915k83519k10148j68959j15811p2377q1023
$$ plain form
4047 1189418 1160256 1170000 1104288 1140684 1181244 1094800 1112434 1080118 970174 953406 1029791
4036 1029791 952367 879626 754301 714881 742378 779672 872160 785117 737343 685738 801283
4025 801283 875162 996295 959776 935339 1041204 1068632 1021465 1014552 1097506 1120041 1172200
4014 1172200 1138678 1149302 1134869 1123194 1068777 1203695 1212820 1081270 1159298 1226565 1210806
4003 1210806 1275705 1250935 1220477 1224342 1267867 1289208 1144153 1211812 1294499 1303123 1271000 1084924
3991 1084924 1140998 1167341 1127486 1220711 1345719 1345044 1245943 1244247 1265912 1437758 1402708 1415343
3979 1415343 1508129 1444838 1432311 1420522 1487599 1540672 1468010 1406971 1484000 1503236 1505900 1483519
3967 1483519 1403353 1619494 1727211 1728463 1742160 1748327 1970870 2157238 2307652 2346374 2369724
$$ packed form
4047A189418k9162R744o5712L6396M0560q6444J7634l2316j09944j6768P6385
4036A029791p7424p2741j25325l9420K7497L7294R2488q7043m7774n1605J15545
4025H01283P3879J21133l6519k4437J05865K7428m7167o913Q2954K2535N2159
4014A172200l3522J0624j4433j1675n4417J34918R125j31550P8028O7267j5759
4003A210806O4899k4770l0458L865M3525K1341j45055O7659Q2687Q624l2123j86076
3991A084924N6074K6343l9855R3225J25008o75r9101j696K1665J71846l5050J2635
3979A415343R2786o3291j2527j1789O7077N3073p2662o1039P7029J9236K664k2381
3967A483519q0166K16141J07717J252J3697O167K22543J86368J50414L8722K3350
$$ plain form
3956 2369724 2597926 2728056 2603868 2654444 2821052 2795897 2716682 2664893 2706434 2734505 2891135
3945 2891135 3137072 3108190 3130663 3073889 3000580 2895981 2912127 3062077 2894193 2970365 3112624
3934 3112624 3196944 3168285 3279525 3438775 3628416 3681090 3733619 3749385 3811883 3827881 3761146
3923 3761146 3810064 3868335 3870088 3928320 4167418 4233574 4267216 4212329 4182847 4025139 4135133
3912 4135133 4121028 4141719 4123074 4090827 4090531 4043492 4003548 4028756 4068059 4135757 4281173 4382827
3900 4382827 4466594 4518399 4796198 4910207 4932533 5101487 5386160 5619196 6012127 6371418
3890 6371418 6559255 6829565 6777546 6762443 6771947 6607200 6550654 6715159 6899241 7015613
3880 7015613 7140453 7280448 7436610 7597042 7834800 8081725 8332705 8440981 8696758 9067123
$$ packed form
3956B369724K28202J30130j24188N0576J66608k5155p9215n1789M1541K8071J56630
3945B891135K45937k8882K2473n6774p3309j04599J6146J49950j67884P6172J42259
3934C112624Q4320k8659J11240J59250J89641N2674N2529J5766O2498J5998o6735
3923C761146M8918N8271J753N8232K39098O6156L3642n4887k9482j57708J09994
3912D135133j4105K0691j8645l2247k96m7039l9944K5208L9303O7698J45416J01654
3900D382827Q3767N1805K77799J14009K2326J68954K84673K33036L92931L59291
3890F371418J87837K70310n2019j5103R504j64747n6546J64505J84082J16372
3880G015613J24840J39995J56162J60432K37758K46925K50980J08276K55777L70365
$$ plain form
3870 9067123 9426861 9724471 9990427 10529100 11047512 11656873 12396180 13017377 13664674 14391664
3860 14391664 15180533 15869439 16692599 17474872 18402612 19586419 20953482 22353344 24083051
3851 24083051 25862684 27852047 30276069 32980215 36234679 39975761 44535554 49633577
3843 49633577 54487085 57818395 59067448 57846648 54552026 50463296 46596247 43292503
3835 43292503 40697741 38869895 37561671 36689916 36211334 36108341 36268652 36623204 37164835
3826 37164835 37983294 38930286 40170646 41816040 43607372 45578647 47711107 50158021
3818 50158021 53151046 56385188 60071293 64369820 69398128 75387271 82401836 90355264
3810 90355264 99734433 110742017 123450109 138195468 155301031 175806204 200473275
$$ packed form
3870I067123L59738K97610K65956N38673N18412O09361P39307O21197O47297P26990
3860A4391664P88869O88906Q23160P82273R27740J183807J367063J399862J729707
3851B4083051J779633J989363K424022K704146L254464L741082M559793N098023
3843D9633577M853508L331310J249053j220800l294622m088730l867049l303744
3835D3292503k594762j827846j308224q71755m78582j02993J60311L54552N41631
3826C7164835Q18459R46992J240360J645394J791332J971275K132460K446914
3818E0158021K993025L234142L686105M298527N028308N989143P014565P953428
3810I0355264R379169J1007584J2708092J4745359J7105563K0505173K4667071
$$ plain form
3803 200473275 230445655 267235245 310774420 354331408 389046721 418421559 434023339
3796 434023339 417659071 387498521 351627642 303782919 257007937 217723717 185086123
3789 185086123 159467460 139403427 123423195 110723218 100293618 91938353 85001356
3782 85001356 79097208 73990170 69390112 65141538 61214649 57584593 54319183 51459725
3774 51459725 49036165 46797971 44833803 43083942 41469435 39853162 38240227 36647359
3766 36647359 35374728 33919079 32480579 31248903 30096987 28946689 27978024 27145575
3758 27145575 26349586 25468222 24574082 23726407 23075430 22505891 21879355 21236979 20677426
3749 20677426 20105586 19682878 19084142 18497810 18030908 17611815 17177902 16713954 16398198
$$ packed form
3803B00473275K9972380L6789590M3539175M3556988L4715313K9374838J5601780
3796D34023339j6364268l0160550l5870879m7844723m6774982l9284220l2637594
3789A85086123k5618663k0064033j5980232j2699977j0429600q355265o936997
3782H5001356n904148n107038m600058m248574l926889l630056l265410k859458
3774E1459725k423560k238194j964168j749861j614507j616273j612935j592868
3766C6647359j272631j455649j438500j231676j151916j150298r68665q32449
3758B7145575p95989q81364q94140q47675o50977n69539o26536o42376n59553
3749B0677426n71840m22708n98736n86332m66902m19093m33913m63948l15756
$$ plain form
3740 16398198 16107334 15855985 15588609 15321535 15058446 14700220 14412947 14212465 13998136
3731 13998136 13836069 13615781 13329505 13301693 13204111 13176104 13070386 12785748 12718900 12587845
3721 12587845 12377084 12286610 12119395 11977942 11808448 11841590 11878278 11899880 11897842 11989575 12003004
3710 12003004 11872042 11931876 12038461 12116241 12159120 12404003 12639492 12865575 13113104 13442773
3700 13442773 13745498 14115498 14390896 14677166 15243761 15804509 16493117 17257136 18211824
3691 18211824 19257420 20513573 22017312 23500408 25328659 27397596 29831508 32998204
3683 32998204 37072674 41967018 48318860 55708829 61366079 60280239 55496217 51271534
3675 51271534 47953729 46471331 46580156 48390545 51682413 56019892 58610423 56575528
$$ packed form
3740A6398198k90864k51349k67376k67074k63089l58226k87273k00482k14329
3731A3998136j62067k20288k86276k7812r7582k8007j05718k84638o6848j31055
3721A2587845k10761r0474j67215j41453j69494L3142L6688K1602k038R1733J3429
3710A2003004j30962N9834J06585P7780M2879K44883K35489K26083K47529L29669
3700A3442773L02725L70000K75398K86270N66595N60748O88608P64019R54688
3691A8211824J045596J256153J503739J483096J828251K068937K433912L166696
3683C2998204M074470M894344O351842P389969N657250j085840m784022m224683
3675E1271534l317805j482398J08825J810389L291868M337479K590531k034895
$$ plain form
3667 56575528 53108751 50632637 48929358 48923446 50698293 54024786 59096903 65301894 69294633
3658 69294633 65930337 59730331 54358989 49562915 46729189 45663300 46084335 47843748
3650 47843748 50751684 52719301 50133656 45078682 40700638 36802113 34141575 32580256
3642 32580256 31929300 31983994 32624759 33032751 31299430 28158866 25418806 22896986 20847196
3633 20847196 19155815 17898247 16617287 15629946 14996620 14262537 13544916 12921864 12293218
3624 12293218 11955037 11574162 11188908 10851434 10544892 10204357 9711860 9257310 8887865
3615 8887865 8689019 8463934 8221042 8111621 7934166 7655757 7411860 7346251 7133614 7021217
3605 7021217 6805989 6612162 6497441 6433837 6199074 5899435 5764391 5584120 5527171 5510625
$$ packed form
3667E6575528l466777k476114j703279n912J774847L326493N072117O204991L992739
3658F9294633l364296o200006n371342m796074k833726j065889M21035J759413
3650D7843748K907936J967617k585645n054974m378044l898525k660538j561319
3642C2580256o50956N4694O40765M07992j733321l140564k740060k521820k049790
3633B0847196j691381j257568j280960r87341o33326p34083p17621o23052o28646
3624A2293218l38181l80875l85254l37474l06542l40535m92497m54550l69445
3615H887865j98846k25085k42892j09421j77455k78409k43897o5609k12637j12397
3605G021217k15228j93827j14721o3604k34763k99639j35044j80271n6949j6546
$$ plain form
3595 5510625 5267454 5270666 5250771 5064190 4959153 4951425 4757127 4726902 4723461 4535808 4577958
3584 4577958 4498905 4430879 4292948 4100697 4207444 4118054 4077523 3986815 3947196 3959643 3858098
3573 3858098 3859050 3801790 3700330 3678060 3723274 3690660 3616220 3515251 3512182 3494013 3502916 3405569
3561 3405569 3289133 3249346 3140187 3181914 3219724 3144254 3192544 3195098 3184783 3109031 3115463
3550 3115463 3112201 3020897 2966345 3002396 2895867 3039052 3018161 3108004 3300944 3372268 3403124
3539 3403124 3583221 3744549 3808211 4087905 4198224 4262154 4396912 4572908 4344381 4119934
3529 4119934 3984467 3698480 3384706 3145868 2943378 2862971 2777712 2658007 2443668 2307353
3519 2307353 2418984 2412110 2241413 2131244 2071418 2082286 2127829 2043228 2037259 2037385 2001417 1949778
$$ packed form
3595E510625k43171L212j9895j86581j05037p728j94298l0225l441j87653M2150
3584D577958p9053o8026j37931j92251J06747q9390m0531r0708l9619J2447j01545
3573C858098R52n7260j01460k2270M5214l2614p4440j00969l069j8169Q903r7347
3561C405569j16436l9787j09159M1727L7810p5470M8290K554j0315p5752O432
3550C115463l262r1304n4552L6051j06529J43185k0891Q9843J92940P1324L0856
3539C403124J80097J61328O3662K79694J10319O3930J34758J75996k28527k24447
3529D119934j35467k85987l13774k38838k02490q0407q5259j19705k14339j36315
3519B307353J11631o874j70697j10169n9826J0868M5543q4601n969J26l5968n1639
$$ plain form
3507 1949778 1840745 1976176 1915321 1840436 1902507 1869248 1905059 1739004 1745254 1834168 1895307
3496 1895307 1850670 1864563 1902190 1841888 1812326 1688266 1718424 1712073 1776182 1668260 1664824
3485 1664824 1661624 1575674 1627966 1735540 1688772 1657445 1709001 1595558 1555094 1440390 1427484
3474 1427484 1443640 1450423 1364026 1371358 1355957 1390945 1438070 1402255 1443989 1391262 1490024 1476525
3462 1476525 1283328 1176611 1181756 1372834 1327978 1320279 1269332 1270200 1184866 1161280 1224004 1256782
3450 1256782 1312953 1410486 1373155 1272188 1203893 1215513 1267875 1250449 1103243 1191036 1288550
3439 1288550 1161101 1303172 1260514 1156557 1144913 1241407 1197346 1163609 1205913 1283844 1269076
3428 1269076 1256817 1307085 1250801 1203992 1198583 1330705 1213615 1224826 1248504 1225855 1153094
$$ packed form
3507A949778j09033J35431o0855p4885O2071l3259L5811j66055O250Q8914O1139
3496A895307m4637J3893L7627o0302k9562j24060L0158o351O4109j07922l436
3485A664824l200q5950N2292J07574m6768l1327N1556j13443m0464j14704j2906
3474A427484J6156O783q6397P332j5401L4988M7125l5815M1734n2727R8762j3499
3462A476525j93197j06717N145J91078m4856p699n0947Q68q5334k3586O2724L2778
3450A256782N6171R7533l7331j00967o8295J1620N2362j7426j47206Q7793R7514
3439A288550j27449J42071m2658j03957j1644R6494m4061l3737M2304P7931j4768
3428A269076j2259N0268n6284m6809n409J32122j17090J1211K3678k2649p2761
$$ plain form
3417 1153094 1111519 1113924 1110321 1155332 1146775 1202986 1166412 1136679 1021606 977004 1066961 1313570
3405 1313570 1200877 1068048 1248330 1251431 1249046 1322643 1328115 1117105 1171350 1139621 1151831
3394 1151831 1141923 1182206 1168523 1100656 1140430 1134115 1134580 1108243 1019019 1022177 916148 892952
3382 892952 999578 1089260 1174573 1178883 1199341 1211373 1066891 1002853 1085116 1007237 1115203
3371 1115203 1151596 1084461 1088498 1171165 1208941 1072413 1077553 1061842 1023890 1006850 1044889 1071732
3359 1071732 1174751 1179294 1137043 1122432 976716 979591 907766 978129 875395 961731 851643
3348 851643 911159 814638 872654 859843 789071 781803 881043 739950 828543 770717 735218 777048
3336 777048 820089 743710 791060 748779 817201 778482 722206 830008 925009 895627 742328
$$ packed form
3417A153094m1575K405l603M5011q557N6211l6574k9733j15073m4602Q9957K46609
3405A313570j12693j32829J80282L101k385P3597N472k11010N4245l1729J2210
3394A151831r908M0283j3683o7867L9774o315M65k6337q9224L158j06029k3196
3382H92952J06626Q9682Q5313M310K0458J2032j44482o4038Q2263p7879J07966
3371A115203L6393o7135M037Q2667L7776j36528N140j5711l7952j7040L8039K6843
3359A071732J03019M543m2251j4611j45716K875p1825P0363j02734Q6336j10088
3348H51643N9516r6521N8016j2811p0772p268R9240j41093Q8593n7826l5499M1830
3336G77048M3041p6379M7350m2281O8422l8719n6276J07802R5001k9382j53299
$$ plain form
3325 742328 937525 942010 899108 811852 937081 984979 805712 764365 788838 742481 738615
3314 738615 780117 865286 906944 874728 804714 942826 895008 845064 870609 795585 812983
3303 812983 900409 779987 824776 871060 860701 807736 765981 831036 838202 805649 792249 760429
3291 760429 808458 743760 734112 664303 799927 852136 773928 694333 645502 568379 597199 550075
3279 550075 597507 597259 531978 438834 446155 407350 454738 423771 503782 435035 538892 541973
3267 541973 579475 697108 521757 477448 551354 495858 442020 563821 529270 469392 530079
3256 530079 492168 516302 555268 594130 598450 486991 518530 598249 603062 550415 542449 625707
3244 625707 734561 635396 545804 518970 571567 604472 561072 556383 402922 497144 594204
$$ packed form
3325G42328J95197M485m2902q7256J25229M7898j79267m1347K4473m6357l866
3314G38615M1502Q5169M1658l2216p0014J38112m7818m9944K5545p5024J7398
3303H12983Q7426j20422M4789M6284j0359n2965m1755O5055P166l2553j3400l1820
3291G60429M8029o4698r648o9809J35624N2209p8208p9595m8831p7123K8820m7124
3279E50075M7432k48o5281r3144P321l8805M7388l0967Q0011o8747J03857L081
3267E41973L7502J17633j75351m4309P3906n5496n3838J21801l4551n9878O0687
3256E30079l7911K4134L8966L8862M320j11459L1539P9719M813n2647p966Q3258
3244F25707J08854r9165q9592k6834N2597L2905m3400m689j53461R4222R7060
$$ plain form
3233 594204 596096 689709 499214 463123 563292 524870 469556 482106 532357 423157 382443
3222 382443 449018 464099 436880 406979 478041 518504 608439 551910 482798 465372 527107 517422
3210 517422 506170 539468 600070 550880 621184 515049 529952 641805 733048 579692 538896
3199 538896 559494 560888 576835 569031 629041 646318 625322 572640 694145 606922 581956 520490
3187 520490 585324 602360 649982 598749 559720 608571 731086 770431 776843 745206 705373 800319
3175 800319 814431 765660 727396 762248 662127 762949 639845 662206 608659 664077 751898
3164 751898 755324 754515 865931 773397 841677 836761 819934 788657 786950 797829 920398 1046456
3152 1046456 1183121 1203011 1079354 1135752 1061282 1075309 1101778 1050818 1067127 1144663 1123783
$$ packed form
3233E94204J892R3613j90495l6091J00169l8422n5314J2550N0251j09200m0714
3222C82443O6575J5081k7219k9901P1062M0463Q9935n6529o9112j7426O1735r685
3210E17422j1252L3298O0602m9190P0304j06135J4903J11853R1243j53356m0796
3199E38896K0598J394J5947p804O0010J7277k0996n2682J21505q7223k4966o1466
3187E20490O4834J7036M7622n1233l9029M8851J22515L9345O412l1637l9833R4946
3175H00319J4112m8771l8264L4852j00121J00822j23104K2361n3547N5418Q7821
3164G51898L426q09J11416r2534O8280m916j6827l1277j707J0879J22569J26058
3152A046456J36665J9890j23657N6398p4470J4027K6469n0960J6309P7536k0880
$$ plain form
3141 1123783 1121996 1147725 1289217 1221232 1342053 1532122 1520604 1505092 1534608 1474700 1529865
3130 1529865 1507733 1553454 1683393 1754604 1846615 1944350 2032720 2195498 2387822 2401158 2381426
3119 2381426 2342643 2294640 2212628 2181079 2137518 1979764 2111240 2157359 2205416 2272136 2282018
3108 2282018 2350936 2400460 2532005 2639042 2728720 2883436 3056152 3048645 3066529 3169170 3222823
3097 3222823 3289497 3388989 3520351 3701152 3744360 3802030 3927398 3706453 3395134 3191197
3087 3191197 3002919 2767121 2702216 2457640 2216634 2108504 2019202 1959099 1960757 1884822 1881150
3076 1881150 1912913 1965755 2039960 2072426 2002489 2108625 2179338 2306688 2398925 2423773 2559513
3065 2559513 2605788 2653063 2752616 2787091 2751082 2740311 2608697 2427925 2437624 2359462 2263441
$$ packed form
3141A123783j787K5729J41492o7985J20821J90069j1518j5512K9516n9908N5165
3130A529865k2132M5721J29939P1211R2011R7735Q8370J62778J92324J3336j9732
3119B381426l8783m8003q2012l1549m3561j57754J31476M6119M8057O6720R882
3108B282018O8918M9524J31545J07037Q9678J54716J72716p507J7884J02641N3653
3097C222823O6674R9492J31362J80801M3208N7670J25368k20945l11319k03937
3087C191197j88278k35798o4905k44576k41006j08130q9302o0103J658p5935l672
3076A881150L1763N2842P4205L2466o9937J06136P0713J27350R2237K4848J35740
3065B559513M6275M7275R9553L4475l6009j0771j31614j80772R699p8162r6021
$$ plain form
3054 2263441 2227255 2098284 2223043 2176377 1935888 1959177 2077764 1994056 2053434 2027203 2087930
3043 2087930 2076864 2116173 2095099 1998009 1984689 2087961 2110580 1967297 1874395 1789733 1800013
3032 1800013 1703148 1688760 1687340 1597617 1518811 1542186 1477119 1429435 1401647 1310037 1241544 1226111
3020 1226111 1154136 1186079 1225175 1241688 1379379 1343739 1217226 1155464 1159402 1241286 1177411
3009 1177411 1053636 1069400 1015524 934840 886747 1077928 991136 961263 983973 992805 993571 836980
2997 836980 743018 687908 886926 852216 704606 825613 791580 819323 857530 821409 866709
2986 866709 812351 866442 950476 900103 788385 680211 756360 714411 728230 722310 678315
2975 678315 739316 740944 654578 603252 610750 504258 579097 550341 626322 546308 514325 512219
$$ packed form
3054B263441l6186j28971J24759m6666k40489K3289J18587q3708N9378k6231O0727
3043B087930j1066L9309k1074r7090j3320J03272K2619j43283r2902q4662J0280
3032A800013r6865j4388j420q9723p8806K3375o5067m7684k7788r1610o8493j5433
3020A226111p1975L1943L9096J6513J37691l5640j26513o1762L938Q1884o3875
3009A177411j23775J5764n3876q0684m8093J91181q6792k9873K2710Q832P66j56591
2997H36980r3962n5110J99018l4710j47610J21007l4033K7743L8207l6121M5300
2986H66709n4358N4091Q4034n0373j11718j08174P6149m1949J3819n920m3995
2975F78315O1001J628q6366n1326P498j06492P4839k8756P5981q0014l1983k106
$$ plain form
2963 512219 563617 563777 544832 553459 540248 512577 525005 563692 462222 490288 517245 579897
2951 579897 563782 598835 614720 596077 584857 599088 486593 268587 256917 521081 487312
2940 487312 503745 496758 371386 329633 460630 469020 412565 487813 378953 458008 440372
2929 440372 375779 296117 360171 377898 448661 464958 384912 384142 287642 343165 484041 477740
2917 477740 524408 354909 352199 349895 320793 364292 201985 89885 316211 438877 311229
2906 311229 342676 300230 383670 343051 315571 306479 360147 340586 402777 278753 323339 318837
2894 318837 405936 270240 246998 394534 359982 424636 391071 302735 369860 333194 312813
2883 312813 243960 291925 438515 483560 415826 318031 292681 214380 228289 218415 253451 378594
$$ packed form
2963E12219N1398J60j8945Q627j3211k7671J2428L8687j01470K8066K6957O2652
2951E79897j6115L5053J5885j8643j1220J4231j12495k18006j1670K64164l3769
2940D87312J6433o987j25372m1753J30997Q390n6455P5248j08860P9055j7636
2929D40372o4593p9662O4054J7727P0763J6297q0046p70r6500N5523J40876o301
2917D77740M6668j69499k710k304k9102M3499j62307j12100K26326J22666j27648
2906C11229L1447m2446Q3440m0619k7480r092N3668j9561O2191j24024M4586m502
2894C18837Q7099j35696k3242J47536l4552O4654l3565q8336O7125l6666k0381
2883C12813o8853M7965J46590M5045o7734r7795k5350p8301J3909r874L5036J25143
$$ plain form
2871 378594 473013 358211 336943 292858 238351 186924 294953 288814 304339 343117 310067
2860 310067 364232 334024 350896 517142 418999 327193 244577 271389 340806 418851 375611
2849 375611 287524 318682 381333 349667 295731 330511 217058 191134 208525 245022 338470
2838 338470 334089 314815 419723 487691 404674 497019 417101 433003 431973 468541 453811 480254
2826 480254 454809 395164 436611 358812 322500 414350 428898 484811 490306 480649 585858 504996
2814 504996 402274 369986 518753 515106 366808 469633 450324 384920 480074 510046 473421
2803 473421 591673 566135 655519 581571 486712 543387 535804 528281 528204 571270 469028 584198
2791 584198 685711 651244 685256 725361 639172 553146 623608 592870 570840 622834 514840
$$ packed form
2871C78594R4419j14802k1268m4085n4507n1427J08029o139J5525L8778l3050
2860C10067N4165l0208J6872J66246r8143r1806q2616K6812O9417P8045m3240
2849C75611q8087L1158O2651l1666n3936L4780j13453k5924J7391L6497R3448
2838C38470m381j9274J04908O7968q3017R2345p9918J5902j030L6568j4730K6443
2826D80254k5445n9645M1447p7799l6312R1850J4548N5913N495r657J05209q0862
2814E04996j02722l2288J48767l647j48298J02825j9309o5404R5154K9972l6625
2803D73421J18252k5538Q9384p3948r4859N6675p583p523p7M3066j02242J15170
2791E84198J01513l4467L4012M0105q6189q6026P0462l0738k2030N1994j07994
$$ plain form
2780 514840 687441 631515 565492 543942 610300 683132 784691 635348 641842 669586 599570
2769 599570 750936 860648 807429 759972 930176 795992 764990 927748 932671 1040372 1118684
2758 1118684 1240125 1146005 1020540 916850 923679 915173 830021 873295 846771 731205 612080
2747 612080 586135 646842 640533 485897 432017 473084 514257 499626 503236 521252 338089 381151
2735 381151 403608 381441 386419 371248 309203 208279 426207 312427 161012 246472 398254
2724 398254 402138 363879 403159 356492 374007 345520 270644 401634 261330 238066 284807
2713 284807 299617 280469 218927 210134 237655 277409 356769 332351 248753 169943 181454 233665
2701 233665 240214 233851 86794 123321 150693 210229 206819 108089 189856 123909 280346 361825
$$ packed form
2780E14840J72601n5926o6023k1550O6358P2832J01559j49343O494K7744p0016
2769E99570J51366J09712n3219m7457J70204j34184l1002J62758M923J07701P8312
2758A118684J21441r4120j25465j03690O829q506q5152M3274k6524j15566j19125
2747F12080k5945O0707o309j54636n3880M1067M1173j4631L610J8016j83163M3062
2735C81151K2457k2167M978j5171o2045j00924K17928j13780j51415Q5460J51782
2724C98254L884l8259L9280m6667J7515k8487p4876J30990j40304k3264M6741
2713B84807J4810j9148o1542q793K7521L9754P9360k4418q3598p8810J1511N2211
2701B33665O549o363j47057L6527K7372N9536l410r8730Q1767o5947J56437Q1479
$$ plain form
2689 361825 168897 214137 214763 191589 210515 155989 137104 194568 161729 194595 211248 125151
2677 125151 -5138 124954 115045 42331 64568 82151 144929 77560 62159 119753 136466
2666 136466 57158 71740 94255 140653 169753 67242 114654 121562 113491 82296 180992 117801
2654 117801 156720 248719 149284 14668 105720 164140 172796 145890 129899 85560 -24488
2643 -24488 231056 203319 93470 76537 31193 74872 105910 96905 139988 42527 17555 113460
2631 113460 164738 132469 59932 -34072 25087 84595 52649 54921 -6866 61373 139148 210639
2619 210639 60173 -39749 79747 109141 52274 50853 15758 19930 36326 18184 54499 81383
2607 81383 89539 74353 88119 68397 73629 82821 219223 24237 -45395 -64889 14552 102158
$$ packed form
2689C61825j92928M5240O26k3174J8926n4526j8885N7464l2839L2866J6653q6097
2677A25151j30289J30092r909p2714K2237J7583O2778o7369j5401N7594J6713
2666A36466p9308J4582K2515M6398K9100j02511M7412O908q071l1195R8696o3191
2654A17801L8919R1999r9435j34616R1052N8420Q656k6906j5991m4339j10048
2643b4488K55544k7737j09849j6933m5344M3679L1038r005M3083r7461k4972R5905
2631A13460N1278l2269p2537r4004N9159N9508l1946K272o1787O8239P7775P1491
2619B10639j50466r9922J19496K9394n6867j421l5095M172J6396j8142L6315K6884
2607H1383Q156j5186J3766j9722N232R192J36402j94986o9632j9494P9441Q7606
$$ plain form
2595 102158 149261 106781 125089 99000 166571 130783 115187 165094 171234 126426 157369 111005
2583 111005 72530 121706 94048 95257 183475 94702 129102 71174 103797 200044 190528 222857
2571 222857 176365 251941 150000 124940 69624 71233 60369 36199 64595 91223 102178 127064
2559 127064 -52218 133717 126069 111045 114263 101023 1298 102181 140060 72263 87504
2548 87504 144730 109195 73572 131127 64064 57315 135124 131875 149210 196834 133672 106060
2536 106060 106116 191796 189758 82102 31454 -59751 95127 46370 34566 190917 75346 35896
2524 35896 10540 27659 14374 93669 147066 141410 198970 97521 59285 -29948 67916 105660
2512 105660 67522 117411 112014 137449 75903 103767 106150 170095 117368 145627 116945 44648
$$ packed form
2595A02158M7103m2480J8308k6089O7571l5788j5596M9907O140m4808L0943m6364
2583A11005l8475M9176k7658J209Q8218q8773L4400n7928L2623R6247r516L2329
2571B22857m6492P5576j01941k5060n5316J609j0864k4170K8396K6628J0955K4886
2559A27064j79282J85935p648j5024L218j3240r9725J00883L7879o7797J5241
2548H7504N7226l5535l5623N7555o7063o749P7809l249J7335M7624o3162k7612
2536A06060N6Q5680k038j07656n0648r1205J54878m8757j1804J56351j15571l9450
2524C5896k5356J7119j3285P9295N3397n656N7560j01449l8236q9233R7864L7744
2512A05660l8138M9889n397K5435o1546K7864K383O3945n2727K8259k8682p2297
$$ plain form
2500 44648 81670 92917 170525 193273 146146 139963 168972 40862 -9946 -15844 55143 61263
2488 61263 58715 18578 -13617 -10193 -28882 -26149 -4581 58040 69283 -54032 -28617 65395
2476 65395 15633 -3394 48631 124330 78430 77583 46289 109219 -41335 68055 141182 171415
2464 171415 126314 1816 -80730 -22942 45997 36275 27119 120767 91321 101288 129707 73168
2452 73168 172521 237218 166946 172547 223251 124923 48481 -16134 35222 17744 99280 115710
2440 115710 199274 137976 -27909 -1446 14795 -4398 -41020 37516 140857 104797 85358
2429 85358 64657 -13787 13396 141914 130212 22420 -10527 116604 163402 198426 24151
2418 24151 -105254 32406 17989 -34899 888 86019 66801 33061 62458 84068 12827
$$ packed form
2500D4648L7022J1247P7608K2748m7127o183K9009j28110n0808n898P0987O120
2488F1263k548m0137l2195L424j8689K733K1568O2621J1243j23315K5415R4012
2476F5395m9762j9027N2025P5699m5900q47l1294O2930j50554J09390P3127L0233
2464A71415m5101j24498q2546N7788O8939r722r156R3648k9446R967K8419n6539
2452G3168R9353O4697p0272N601N0704r8328p6442o4615N1356j7478Q1536J6430
2440A15710Q3564o1298j65885K6463J6241j9193l6622P8536J03341l6060j9439
2429H5358k0701p8444K7183J28518j1702j07792l2947J27131M6798L5024j74275
2418B4151j29405J37660j4417n2888L5787Q5131j9218l3740K9397K1610p1241
$$ plain form
2407 12827 -66464 -18398 -56211 52954 160473 136281 46752 -73791 90627 81489 -15123
2396 -15123 -1181 91820 39004 82018 50292 97708 91952 124102 29186 70562 36139 72811
2384 72811 148980 95623 31109 -67434 27254 -37318 -60969 -83485 -38559 9211 56386 -1353
2372 -1353 12890 148977 29974 45243 82590 88306 81822 60260 166014 17077 28115 4882
2360 4882 -10037 19480 -39556 -96315 -68646 -26786 -73104 -43814 -6350 -49091 -77047 -1818
2348 -1818 12402 -41817 -33405 -73295 -16512 -47332 -72668 -55838 94842 47042 -21817 -1951
2336 -1951 44628 43540 96015 130489 139407 36560 127201 57183 73628 118178 112131 132914
2324 132914 109002 76023 31531 42228 -20879 25722 71097 77692 118178 29273 -56622 -10922
$$ packed form
2407A2827p9291M8066l7813J09165J07519k4192q9529j20543J64418r138r6612
2396a5123J3942R3001n2816M3014l1726M7416n756L2150r4916M1376l4423L6672
2384G2811P6169n3357o4514r8543R4688o4572k3651k2516M4926M7770M7175n7739
2372a353J4243J36087j19003J5269L7347N716o484k1562J05754j48937J1038k3233
2360D882j4919K9517n9036n6759K7669M1860m6318K9290L7464m2741k7956P5229
2348a818J4220n4219Q412l9890N6783l0820k5336J6830J50680m7800o8859J9866
2336a951M6579j088N2475L4474Q918j02847R0641p0018J6445M4550o047K0783
2324A32914k3912l2979m4492J0697o3107M6601M5375O595M0486q8905q5895M5700
$$ plain form
2312 -10922 27234 59955 74146 95510 113220 16324 -80344 20030 53022 66846 -695 -29703
2300 -29703 -69987 -67274 -13177 1429 -58443 -53554 -35473 -58326 -7657 -51683 -4319 17788
2288 17788 49769 44527 13469 27354 21993 41141 -31061 -21567 -35993 49740 177308 54933
2276 54933 42123 66791 -13344 24559 -29224 72853 18715 137337 93947 98978 -55254
2265 -55254 13191 94886 90421 -24173 -11701 51922 114830 23882 -39794 69875 -54963
2254 -54963 -38181 -47511 -105066 -46403 27412 23293 286 5625 36330 -19946 -1837 38962
2242 38962 56756 118262 164535 122600 143438 -68382 -60552 35770 51058 -42397 -59842 25143
2230 25143 -18992 -18951 45895 -111112 -181366 -47856 -93359 -86142 61430 61365 68427 -57225 -19520
$$ packed form
2312a0922L8156L2721J4191K1364J7710r6896r6668J00374L2992J3824o7541k9008
2300b9703m0284K713N4097J4606n9872M889J8081k2853N0669m4026M7364K2107
2288A7788L1981n242l1058J3885n361J9148p2202R494j4426Q5733J27568j22375
2276E4933j2810K4668q0135L7903n3783J02077n4138J18622m3390N031j54232
2265e5254O8445Q1695m465j14594J2472O3623O2908r0948o3676J09669j24838
2254e4963J6782r330n7555N8663P3815m119k3007N339L0705n6276J8109M0799
2242C8962J7794O1506M6273m1935K0838k11820P830R6322J5288r3455j7445Q4985
2230B5143m4135M1O4846j57007p0254J33510m5503P217J47572o5P062j25652L7705
$$ plain form
2217 -19520 27619 -168980 32699 20879 30775 79557 48196 15297 -30292 71399 66436 127426
2205 127426 113078 -58253 -104338 7586 -59698 4460 14352 -21408 -178701 -121295 -65850
2194 -65850 -10143 79349 -41446 -83060 70444 66103 -6983 25762 32897 194674 213723 44696
2182 44696 49337 42503 26957 -1677 -44798 -54476 16720 42463 22590 -31663 -47272 -9315
2170 -9315 -1871 94092 -28974 -4579 19985 -12089 -110133 -86890 -178381 -89400 -37333 -159172
2158 -159172 -107622 17137 -49005 -77877 -80360 -181469 -93259 11213 44850 -4657 8297
2147 8297 24982 -43241 -4160 -24187 -49521 57927 113333 192258 112323 86610 32843 64713
2135 64713 92272 207955 195218 95720 -43483 -76287 -66659 -6122 36695 18791 101996 -25132
$$ packed form
2217a9520M7139j96599K01679j1820R896M8782l1361l2899m5589J01691m963O0990
2205A27426j4348j71331m6085J11924o7284O4158R892l5760j57293N7406N5445
2194f5850N5707Q9492j20795m1614J53504m341p3086L2745P135J61777J9049j69027
2182D4696M641o834j5546k8634m3121r678P1196K5743j9873n4253j5609L7957
2170i315P444R5963j23066K4395K4564l2074r8044K3243r1491Q8981N2067j21839
2158a59172N1550J24759o6142k8872k483j01109Q8210J04472L3637m9507J2954
2147H297J6685o8223L9081k0027k5334J07448N5406P8925p9935k5713n3767L1870
2135F4713K7559J15683j2737r9498j39203l2804R628O0537M2817j7904Q3205j27128
$$ plain form
2123 -25132 -158983 -139700 -63070 -5087 -2715 90693 52120 30928 86255 40321 84377 -34022
2111 -34022 -56831 -119991 -89715 -80978 -53259 17353 38669 101110 21715 8926 30671 134471
2099 134471 64383 62756 36359 -86840 -81245 16417 91997 202923 165753 182641 62067
2088 62067 -55746 -3495 -4816 83353 171188 83964 -52675 -44015 34755 63116 59967 34641
2076 34641 -71221 93209 -7739 -28973 115164 139162 51403 37910 -50750 -90951 -66918
2065 -66918 -15966 -10230 -96169 -68140 -86865 -73849 -122361 -173518 -3350 -32263 398 -2532
2053 -2532 1316 -11738 -64854 -85604 -50095 -93706 5430 116687 110247 -47917 -75796 -46864
2041 -46864 -95651 -60662 8801 135209 63702 -36366 -41508 60061 60140 -3715 22369 45152
$$ packed form
2123b5132j33851J9283P6630N7983K372R3408l8573k1192N5327m5934M4056j18399
2111c4022k2809o3160L0276Q737K7719P0612K1316O2441p9395j2789K1745J03800
2099A34471p0088j627k6397j23199N595R7662P5580J10926l7170J6888j20574
2088F2067j17813N2251j321Q8169Q7835q7224j36639Q660P8770K8361l149k5326
2076C4641j05862J64430j00948k1234J44137K3998q7759j3493q8660m0201K4033
2065f6918N0952N736q5939K8029j8725J3016m8512n1157J70168k8913L2661k930
2053b532L848j3054n3116k0750L5509m3611R9136J11257o440j58164k7879K8932
2041d6864m8787L4989O9463J26408p1507j00068n142J01569P9o3855K6084K2783
$$ plain form
2029 45152 -27730 -19062 -20062 44874 26034 124129 70909 48573 96826 -24882 113108 73527
2017 73527 56176 101316 94347 74816 14418 203320 249183 112123 68005 -38730 -84879
2006 -84879 -50648 5060 72520 103072 870 -117808 -183308 -200122 -73567 -55234 4959
1995 4959 -14642 -90465 -34205 16429 80741 170954 -19204 2963 88161 6033 67502 -12715
1983 -12715 61294 34758 -13522 5559 19064 45181 91155 105337 -58585 70548 148163
1972 148163 96747 43334 68840 47037 -46064 -26193 10327 -6877 55782 31058 32956 -15396
1960 -15396 22676 43899 -64987 -84550 -75136 -45563 82066 64314 35157 -6431 -20238 32298
1948 32298 55715 -130796 -25820 -33172 -161659 -67182 -37492 -22923 -69904 4384 47078
$$ packed form
2029D5152p2882Q668j000O4936j8840R8095n3220k2336M8253j21708J37990l9581
2017G3527j7351M5140o969j9531o0398J88902M5863j37060m4118j06735m6149
2006h4879L4231N5708O7460L0552j02202j18678o5500j6814J26555J8333O0193
1995D959j9601p5823N6260N0634O4312R0213j90158K2167Q5198q2128O1469q0217
1983a2715P4009k6536m8280J9081J3505K6117M5974J4182j63922J29133P7615
1972A48163n1416n3413K5506k1803r3101J9871L6520j7204O2659k4724J898m8352
1960a5396L8072K1223j08886j9563R414K9573J27629j7752k9157m1588j3807N2536
1948C2298K3417j86511J04976p352j28487R4477K9690J4569m6981P4288M2694
$$ plain form
1937 47078 111508 235398 249977 156967 19682 14840 -24425 -48811 10247 -99612 -115850
1926 -115850 -87486 -206983 -133566 -19906 26930 -15716 -14309 56294 -65035 -43102 -60960
1915 -60960 -115490 -87894 -80996 5725 60602 41484 156019 77331 -5045 9348 -14199 -11929
1903 -11929 24877 -12748 -12949 -12232 -84990 -81380 -118928 -81234 -1295 -91920 -91070 3282 19828
1890 19828 -7173 -62511 -71652 129337 11164 -75192 -8183 60632 -16972 21558 12818 -101216
1878 -101216 -45601 7569 51854 100993 42428 38527 -65548 365 -16521 -100220 -56387 -60829
1866 -60829 -61464 -19406 50304 -19919 -93631 -94056 7436 52272 47484 104287 69818 -94879
1854 -94879 -51936 33854 35860 141742 107085 -18068 -63496 -57451 -77640 -100313 -173159 -130673
$$ packed form
1937D7078O4430J23890J4579r3010j37285m842l9265k4386N9058j09859j6238
1926a15850K8364j19497P3417J13660M6836m2646J407P0603j21329K1933j7858
1915f0960n4530K7596O898Q6721N4877j9118J14535p8688q2376J4393k3547K270
1903a1929L6806l7625k01P17p2758L610l7548L7694P9939r0625Q50R4352J6546
1890A9828k7001n5338r141K00989j18173q6356O7009O8815p7604L8530q740j14034
1878a01216N5615N3170M4285M9139n8565l901j04075O5913j6886q3699M3833m442
1866f0829o35M2058O9710p0223p3712m25J01492M4836m788N6803l4469j64697
1854i4879M2943Q5790K006J05882l4657j25153m5428O045k0189k2673p2846M2486
$$ plain form
1842 -130673 -30829 -4117 16416 139531 85180 -1734 -26741 -109365 -59298 -76700 -203228
1831 -203228 -60737 -93134 -176427 -85691 -63823 6486 45697 40815 -40845 -229381 -142505
1820 -142505 -40855 -80241 27213 93368 86251 16760 36801 -76100 -45420 -32300 -53629
1809 -53629 -23290 70544 91660 202603 65836 79497 46794 85758 109220 131765 -10289
1798 -10289 -40440 -26250 -22813 22129 48400 111024 80007 -13725 -25669 74178 -4831 -4295
1786 -4295 -15062 77538 44493 34550 83675 33297 78392 21343 127163 49618 31911 33751
1774 33751 -98057 8969 37732 -75090 -164760 -155709 2916 -6371 -48464 -9279 147289
1763 147289 91707 -95032 -122525 -126863 -54196 -38562 -17861 -46004 14418 114147 45739 97170
$$ packed form
1842a30673R9844K6712K0533J23115n4351q6914k5007q2624N0067j7402j26528
1831b03228J42491l2397q3293R0736K1868P0309L9211m882q1660j88536Q6876
1820a42505J01650l9386J07454O6155p117o9491K0041j12901L0680J3120k1329
1809e3629L0339R3834K1116J10943j36767J3661l2703L8964K3462K2545j42054
1798a0289l0151J4190L437M4942K6271O2624l1017r3732j1944R9847p9009N36
1786d295j0767R2600l3045r943M9125n0378M5095n7049J05820p7545j7707J840
1774C3751j31808J07026K8763j12822q9670R051J58625r287m2093L9185J56568
1763A47289n5582j86739k7493m338P2667J5634K0701k8143O0422R9729o8408N1431
$$ plain form
1751 97170 41215 -16999 107134 41361 137356 114476 -5386 -160961 -203157 -164542 -104535
1740 -104535 -62939 -8798 -104288 -56459 33609 67642 -3378 -98544 -82695 -2064 35248 11005
1728 11005 -47016 -37871 -77462 -46088 -84314 -32776 -42018 -21622 110243 46945 44322 72141
1716 72141 21700 -65637 -50216 68946 67189 -6851 66483 16410 24945 -94994 -96738 29577
1704 29577 63596 8326 -125042 -61489 32238 36116 -36376 -86081 -1564 97572 16396 32906
1692 32906 35715 30729 -7631 -51414 -32739 52534 40024 -60473 -56896 -20399 -35452 -58659
1680 -58659 -146791 -122914 -67644 43885 54015 -25655 4265 5379 78410 -39576 -126770 -88265
1668 -88265 -12248 -18167 -23904 33692 -63980 -52749 82370 54735 -32404 -60953 -32631 14106
$$ packed form
1751I7170n5955n8214J24133o5773R5995k2880j19862j55575m2196L8615O0007
1740a04535M1596N4141r5490M7829R0068L4033p1020r5166J5849Q0631L7312k4243
1728A1005n8021R145l9591L1374l8226N1538r242K0396J31865o3298k623K7819
1716G2141n0441q7337J5421J19162j757p4040P3334n0073Q535j19939j744J26315
1704B9577L4019n5270j33368O3553R3727L878p2492m9705Q4517R9136q1176J6510
1692C2906K809m986l8360m3783J8675Q5273j2510j00497L577L6497j5053k3207
1680e8659q8132K3877N5270J11529J0130p9670K9920J114P3031j17986q7194L8505
1668h8265P6017n919n737N7596r7672J1231J35119k7635q7139k8549K8322M6737
$$ plain form
1656 14106 169933 207159 28489 44863 -6669 -31653 -28537 -76109 -42924 -59728 -106871 -89547
1644 -89547 -9274 -69444 -175110 -95059 -8252 -59566 -9440 -22258 -4105 -98374 -26900 -15106
1632 -15106 95351 78126 -20894 -33817 52196 74528 1281 -43323 -16880 -22247 -63775 -61565
1620 -61565 -18471 5310 -87062 40534 19349 25028 -16995 -62726 -7608 19005 915 78778
1608 78778 37687 54877 124682 84797 33523 41695 60144 81270 4014 -45677 -57553 -116797
1596 -116797 -40325 -20595 69115 21433 105870 14692 -129990 -52183 18353 28135 129661
1585 129661 169571 5632 -48040 -67994 -92488 -97909 -70434 82942 47751 29581 146039
1574 146039 143421 6950 2605 13686 -73536 24777 49055 -57079 -49770 -58155 -16066 68884
$$ packed form
1656A4106J55827L7226j78670J6374n1532k4984L116m7572L3185j6804m7143J7324
1644h9547Q0273o0170j05666Q0051Q6807n1314N0126j2818J8153r4269P1474J1794
1632a5106J10457j7225r9020j2923Q6013K2332p3247m4604K6443n367m1528K210
1620f1565M3094K3781r2372J27596k1185N679m2023m5731N5118K6613j8090P7863
1608G8778m1091J7190O9805l9885n1274Q172J8449K1126p7256m9691j1876n9244
1596a16797P6472J9730Q9710m7682Q4437r1178j44682P7807P0536R782J01526
1585A29661L9910j63939n3672j9954k4494n421K7475J53376l5191j8170J16458
1574A46039k618j36471m345J1081q7222R8313K4278j06134P309q385M2089Q4950
$$ plain form
1562 68884 -29645 -29021 95191 65174 447 7510 4365 16469 5976 5952 -83505 -100655 -111861
1549 -111861 -127455 -108457 -20245 -36103 -31521 18263 71314 32175 -22122 -18101 -19629 122
1537 122 -59636 -34902 40158 -49069 59510 453 -113804 -65831 -107704 -38349 22002 -69704
1525 -69704 -25673 57254 85975 131020 -29900 -131892 -126032 -151713 -181042 -139365 -67056 -144335
1513 -144335 -89479 -111113 -123900 -63197 -79302 -60799 -72640 -52621 74981 46900 -61996
1502 -61996 -47228 42300 9225 -66196 89623 153267 141198 9198 77379 143580 23646
1491 23646 -35318 -24701 -75194 -80218 12508 48898 110203 -5209 -120003 -114536 -107045 -67896
1479 -67896 -94078 -37819 120634 24401 -107794 33820 -39864 -120858 -129818 -7161 -642
$$ packed form
1562F8884r8529O24J24212l0017o4727P063l145J2104j0493k4q9457j7150j1206
1549a11861j5594J8998Q8212j5858M582M9784N3051l9139n4297M021j528J9751
1537A22n9758K4734P5060q9227J08579n9057j14257M7973m1873O9355O0351r1706
1525f9704M4031Q2927K8721M5045j60920j01992N860k5681k9329M1677P2309p7279
1513a44335N4856k1634j2787O0703j6105J8503j1841K0019J27602k8081j08896
1502f1996J4768Q9528l3075p5421J55819O3644j2069j32000O8181O6201j19934
1491B3646n8964J0617n0493n024R2726L6390O1305j15412j14794N467P491L9149
1479f7896k6182N6259J58453r6233j32195J41614p3684q0994q960J22657O519
$$ plain form
1468 -642 969 -22070 25758 -10683 -123890 -71468 -73066 -94150 -110985 8341 14958 -28387
1456 -28387 -45409 -14033 -64401 -30263 -145978 9116 36256 59169 88708 -8153 20212
1445 20212 -5646 15152 -64705 4702 47491 150040 91255 3536 -35614 96142 83083
1434 83083 -93905 -17639 -44312 -54209 -96750 -182852 18816 20609 -7876 -73505 -186304 -10293
1422 -10293 53061 22872 16568 77301 119444 -3325 -116963 -68511 24857 24620 25419 -73201
1410 -73201 -131716 -56126 -15241 4938 69501 147878 110771 135063 47505 29942 7998 65584
1398 65584 97893 166518 115604 64799 73107 -54807 -96139 -28450 -14320 -81300 6484 -29485
1386 -29485 62515 57912 35162 4471 -12105 -172600 -178614 -112341 -151743 -30090 20545 92675
$$ packed form
1468f42J611k3039M7828l6441j13207N2422j598k1084j6835J19326O617m3345
1456b8387j7022L1376n0368L4138j15715J55094K7140K2913K9539r6861K8365
1445B0212k5858K0798p9857O9407M2789J02549n8785q7719l9150J31756j3059
1434H3083j76988P6266k6673r897m2541q6102K01668J793k8485o5629j12799J76011
1422a0293O3354l0189o304O0733M2143j22769j13638M8452R3368k37P99r8620
1410g3201n8515P5590M0885K0179O4563P8377l7107K4292q7558j7563k1944N7586
1398F5584L2309O8625n0914n0805Q308j27914m1332O7689J4130o6980Q7784l5969
1386b9485R2000m603k2750l0691j6576j60495o014O6273l9402J21653N0635P2130
$$ plain form
1374 92675 -31992 -41880 -34465 10631 -4387 12826 113239 1861 -4694 17041 -77059 56456
1362 56456 75569 37845 8296 -81885 -190329 -173982 10754 7066 -8089 -65865 -85286 -49059
1350 -49059 -21890 -40918 -25894 -74998 -98437 45500 8462 37386 57188 4226 4983 71963
1338 71963 101118 15329 -97654 -56322 67455 21021 90594 147169 55604 35317 121896
1327 121896 70073 35211 18516 8168 -10151 63342 -44468 -70704 -33303 -65074 -40343
1316 -40343 105794 172584 -20675 -67411 20354 9529 14200 -33412 -32919 -107201 -156185 -122360
1304 -122360 -77247 83222 -31355 -87186 -150889 -135993 4559 -9531 -27215 -11509 -64317
1293 -64317 -21947 -2078 -30087 97883 65522 -54581 52958 101741 77207 -51071 -105049
$$ packed form
1374I2675j24667r888P415M5096j5018J7213J00413j11378o555K1735r4100J33515
1362E6456J9113l7724k9549r0181j08444J6347J84736l688j5155n7776j9421L6227
1350d9059K7169j9028J5024m9104k3439J43937l7038K8924J9802n2962P57O6980
1338G1963K9155q5789j12983M1332J23777m6434O9573N6575r1565k0287Q6579
1327A21896n1823l4862j6695j0348j8319P3493j07810k6236L7401l1771K4731
1316d0343J46137O6790j93259m6736Q7765j0825M671m7612M93p4282m8984L3825
1304a22360M5113J60469j14577n5831o3703J4896J40552j4090j7684J5706n2808
1293f4317M2370J9869k8009J27970l2361j20103J07539M8783k4534j28278n3978
$$ plain form
1282 -105049 -10835 21360 -20640 -109790 -19191 -77344 -103650 -129739 -118807 -85204 -51468 60063
1270 60063 172253 210847 -16188 71472 -8267 -88302 1457 9341 53444 18070 23619 85673
1258 85673 -36445 -108701 -51879 -5603 -112569 -46631 -93684 -10073 23550 -64493 -99602
1247 -99602 -76206 -58528 -43813 -102743 -154044 30086 16398 -122408 -101507 -146151 -111190
1236 -111190 -54101 -157465 6628 -63250 63700 12767 -20651 -93743 -94744 83804 52415
1225 52415 -10028 25714 -32616 21978 36056 20222 -18594 -41208 -18870 -99187 -143784 -109587
1213 -109587 -72961 -27014 26474 1132 28458 -25889 12114 -3329 10178 -138558 -81375
1202 -81375 31336 -70405 -48709 73482 17018 72279 91909 42087 -33883 -57858 -40622
$$ packed form
1282a05049R4214L2195m2000q9150R0599n8153k6306k6089J0932L3603L3736J11531
1270F0063J12190L8594k27035Q7660p9739q0035Q9759P884M4103l5374N549O2054
1258H5673j22118p2256N6822M6276j06966O5938m7053Q3611L3623q8043l5109
1247i9602K3396J7678J4715n8930n1301J84130j3688j38806K0901m4644L4961
1236a11190N7089j03364J64093o9878J26950n0933l3418p3092j001J78548l1389
1225E2415o2443L5742n8330N4594J4078j5834l8816k2614K2338q0317m4597L4197
1213a09587L6626M5947N3488k5342K7326n4347L8003j5443J3507j48736N7183
1202h1375J12711j01741K1696J22191n6464N5261J9630m9822p5970k3975J7236
$$ plain form
1191 -40622 -98547 11527 10326 886 -75473 -12840 134969 43390 -83497 -90458 -36511 30600
1179 30600 34858 71690 -18552 -69034 18126 11534 -27378 -107331 -98889 -221951 -153664 -50602
1167 -50602 -34984 93057 95931 20338 -19746 -10783 31903 -2881 34484 36739 -41132 55333
1155 55333 52453 93269 66173 -35164 -43789 -57233 -62845 -66387 47992 71105 -64052 -96050
1143 -96050 -118039 -32273 -37063 -44411 -181366 -234474 -140841 -102332 -62556 -92608 -110590 26512
1131 26512 -39085 -86166 -85509 -15647 -8042 -153429 -87296 -95121 -97724 -68142 -63360 44656 54059
1118 54059 -16802 9505 -40954 -110593 -106456 -30824 100760 20286 -7870 13113 10647 101732
1106 101732 41666 60416 29992 -110556 -100423 -40386 -145743 -37021 -48927 2202 132535
$$ packed form
1191d0622n7925J10074j201r440p6359O2633J47809r1579j26887o961N3947O7111
1179C0600M258L6832r0242n0482Q7160o592l8912p9953Q442j23062O8287J03062
1167e0602J5618J28041K874p5593m0084Q963M2686l4784L7365K255p7871R6465
1155E5333k880M0816k7096j01337q625j3444n612l542J14379K3113j35157l1998
1143i6050k1989Q5766m790p348j36955n3108R3633L8509L9776l0052j7982J37102
1131B6512o5597m7081O57O9862P605j45387O6133p825k603K9582M782J08016R403
1118E4059p0861K6307n0459o9639M137P5632J31584q0474k8156K0983k466R1085
1106A01732o0066J8750l0424j40548J0133O0037j05357J08722j1906N1129J30333
$$ plain form
1095 132535 180063 99702 43371 -3917 -24093 -74029 -86546 111411 123986 -12590 -38379
1084 -38379 -63241 -27999 -56406 -40984 25313 -31294 -72461 -75933 -139107 -65907 -79404 -142987
1072 -142987 -37637 -145022 -104933 -146796 -203364 -143418 -100997 -124713 -101324 -65707 47102
1061 47102 50637 -6649 49655 21918 30538 -10998 7428 -56935 -107604 19198 -52600 -36883
1049 -36883 -64012 16460 -18822 -22714 -73225 -53284 -76776 -48074 6967 515 -23406 -81218
1037 -81218 -29138 -53529 -35315 -35072 -87933 -51359 -65243 -52539 -15410 33227 71104 37115
1025 37115 -15460 3071 59924 -59767 16626 -24511 87614 94721 40172 -115167 -90190
1014 -90190 -60150 90039 55837 22401 97402 60641 89697 165339 -5942 -9572 16184 44038
$$ packed form
1095A32535M7528q0361n6331m7288k0176m9936j2517J97957J2575j36576k5789
1084c8379k4862L5242k8407J5422O6297n6607m1167l472o3174P3200j3497o3583
1072a42987J05350j07385M0089m1863n6568N9946M2421k3716K3389L5617J12809
1061D7102L535n7286N6304k7737Q620m1536J8426o4363n0669J26802p1798J5717
1049c6883k7129Q0472l5282l892n0511J9941k3492K8702N5041o452k3921n7812
1037h1218N2080k4391J8214K43n2861L6574j3884J2704L7129M8637L7877l3989
1025C7115n2575J8531N6853j19691P6393m1137J12125P107n4549j55339K4977
1014i0190L0040J50189l4202l3436P5001l6761K9056P5642j71281l630K5756K7854
$$ plain form
1002 44038 70675 -37958 -19142 -22098 -25071 -28982 9698 -19286 -106509 -43942 32257 -12063
990 -12063 27624 1590 -75382 -57437 20941 -55663 -13805 37064 58857 97758 50797 -80464
978 -80464 -49130 46714 105106 29652 23546 112610 -8562 50525 75493 -45729 68322 43938
966 43938 -959 6258 5848 51719 61810 69250 -5405 -129435 -4258 -42907 -9794 -349 -69574
953 -69574 98365 51484 -78191 -129583 -15543 15591 -110868 74032 33102 -9714 56720
942 56720 33683 -14909 -102188 -77444 -109684 -119286 -97904 -90361 -31517 -35973 -59396 -140927 -52232
929 -52232 -4664 87583 82418 66258 -36493 -61047 76908 104962 9715 45137 35508 -93402
917 -93402 -64580 60323 168751 52835 46283 3460 -128184 -64969 -19883 -99757 -89488
$$ packed form
1002D4038K6637j08633J8816k956k973l911L8680k8984q7223O2567P6199m4320
990a2063L9687k6034p6972J7945P8378p6604M1858N0869K1793L8901m6961j31261
978h0464L1334R5844N8392p5454o106Q9064j21172N9087K4968j21222J14051k4384
966D3938m4897P217m10M5871J0091P440p4655j24030J25177l8649L3113R445o9225
953f9574J67939m6881j29675n1392J14040L1134j26459J84900m0930m2816O6434
942E6720k3037m8592q7279K4744l2240r602K1382P543N8844m456k3423q1531Q8695
929e2232M7568R2247n165j6160j02751k4554J37955K8054r5247L5422r629j28910
917i3402K8822J24903J08428j15916o552m2823j31644O3215M5086p9874J0269
$$ plain form
906 -89488 -74766 26486 -2801 -90243 34825 31805 15693 -8613 34071 -12572 46665 121536
894 121536 78504 28003 -26517 -31756 57587 31602 -62059 -5772 -51810 64997 14135 196375
882 196375 186154 86775 74454 5879 -500 52828 22530 8221 -2779 -22115 -20910 25098
870 25098 67213 47838 69132 43478 -28075 31194 83467 43080 17574 10611 -48095 -94490
858 -94490 28518 -17006 -119765 23211 11371 37577 83698 -83639 -66416 -37535 -75657
847 -75657 -16713 -42187 -26428 -35707 -155966 -168208 -202748 -114246 -62890 -40805 117886 54267
835 54267 -40953 -98260 -36168 83332 138253 124497 85668 97274 83216 65163 67084 16022
823 16022 -11668 -36793 45246 -13508 -84176 37042 24765 -120246 -182057 -177429 -70059 -55451
$$ packed form
906h9488J4722J01252k9287q7442J25068l020j6112k4306M2684m6643N9237P4871
894A21536m3032n0501n4520n239Q9343k5985r3661N6287m6038J16807n0862J82240
882A96375j0221r9379j2321o8575o379N3328l0298j4309j1000j9336J205M6008
870B5098M2115j9375K1294k5654p1553N9269N2273m0387k5506o963n8706m6395
858i4490J23008m5524j02759J42976j1840K6206M6121j67337J7223K8881l8122
847g5657N8944k5474J5759r279j20259j2242l4540Q8502N1356K2085J58691o3619
835E4267r5220n7307O2092J19500N4921j3756l8829J1606j4058j8053J921n1062
823A6022k7690k5125Q2039n8754p0668J21218j2277j45011o1811M628J07370J4608
$$ plain form
811 -55451 28798 26942 -62364 17310 12073 -22186 -15863 -70226 -76721 -115605 -4662 6003 34853
798 34853 30241 -41788 57978 -38267 -32788 79877 102328 80312 -36774 -60093 -74441 -79999
786 -79999 -17412 -102522 -43033 2398 53626 41048 99817 56971 48395 64448 -15163 -49908
774 -49908 -94539 -201804 -188219 -138730 107704 59972 -24103 131225 175891 131632 68350
763 68350 85755 11685 -59050 -148307 -153624 -64248 -65654 -27745 -108437 -88790 -42061 5894
751 5894 30291 -38012 -101996 -58475 -48006 72059 3992 -48312 -18101 -34474 -6934 166470
739 166470 31438 3371 128472 181561 95729 91632 86684 30677 86399 89658 41722 17303
727 17303 -6066 -40712 -155551 -219803 -154600 -113973 -84639 -121815 27839 65789 101798 30475
$$ packed form
811e5451Q4249j856q9306P9674n237l4259O323n4363o495l8884J10943J0665K8850
798C4853m612p2029R9766r6245N479J12665K2451k2016j17086k3319j4348n558
786g9999O2587q5110N9489M5431N1228j2578N8769m2846q576J6053p9611l4745
774d9908m4631j07265J3585M9489K46434m7732q4075J55328M4666m4259o3282
763F8350J7405p4070p0735q9257n317Q9376j406L7909q0692J9647M6729M7955
751E894K4397o8303o3984M3521J0469J20065o8067n2304L0211j6373K7540J73404
739A66470j35032k8067J25101N3089q5832m097m948n6007N5722L259m7936k4419
727A7303k3369l4646j14839o4252O5203M0627K9334l7176J49654L7950L6009p1323
$$ plain form
715 30475 73259 121738 105931 45417 25820 -62933 -13805 -20154 -37010 -64814 -644 17562
703 17562 -12145 7579 17992 60501 38448 -43368 -22117 32262 102722 111195 100906 120142
691 120142 -34043 -174323 -190031 -110199 14119 40587 110801 -30908 9337 84096 91727
680 91727 85578 66896 -18219 -129497 -103778 -49979 -30269 7734 39055 94125 114855 6419
668 6419 -10799 54963 39784 -21915 -72840 -49678 -32326 -30820 7968 -73704 2518 74736
656 74736 40023 -67131 -70337 -72286 -18088 33927 25177 -59850 -94371 -52358 111687 135717
644 135717 62069 138391 127195 126576 52442 -876 13801 64499 26166 -2726 35155 89814
632 89814 -43054 -39349 -19732 -137289 -54435 3416 118086 106617 -27038 37915 41418 113145
$$ packed form
715C0475M2784M8479j5807o0514j9597q8753M9128o349j6856k7804O4170J8206
703A7562k9707J9724J0413M2509k2053q1816K1251N4379P0460Q473j0289J9236
691A20142j54185j40280j5708P9832J24318K6468P0214j41709M0245P4759P631
680I1727o149j8682q5115j11278K5719N3799J9710L8003L1321N5070K0730j08436
668F419j7218O5762j5179o1699n0925K3162J7352J506L8788q1672P6222P2218
656G4736l4713j07154l206j949N4198N2015q750q5027l4521M2013J64045K4030
644A35717p3648P6322j1196o19p4134n3318J4677N0698l8333k8892L7881N4659
632H9814j32868L705J9617j17557Q2854N7851J14670j1469j33655O4953L503P1727
$$ plain form
620 113145 -31218 1571 -21078 4931 76368 59439 -25357 -86842 -49952 -70820 5802 54077
608 54077 84491 93803 92899 787 26619 56189 -105520 -116286 -88800 -78151 39905 -67143
596 -67143 -138615 -12011 153015 125321 126804 -7433 -11228 -1739 39821 66925 -12935 1196
584 1196 -5838 -136963 -126046 6160 34100 -23878 10454 47878 33287 15187 16295 -55045
572 -55045 -110530 -64256 -20083 28903 58842 -30945 19246 70139 73303 49658 167999 123304
560 123304 18855 -91132 -39169 73504 -62278 -143591 -67056 -51926 -139524 -103454 -10537
549 -10537 -26579 -14214 -12282 36859 25418 95745 73987 17196 2822 33913 69607 -42221
537 -42221 -127738 -58352 18325 71822 46881 -101282 -105339 13220 132078 -25018 -54951
$$ packed form
620A13145j44363L2789k2649K6009P1437j6929q4796o1485L6890k0868P6622M8275
608E4077L0414R312r04r2112K5832K9570j61709j0766K7486J0649J18056j07048
596f7143p1472J26604J65026k7694J483j34237l795R489M1560K7104p9860J4131
584A196p034j31125J0917J32206K7940n7978L4332L7424j4591j8100J108p1340
572e5045n5485M6274M4173M8986K9939q9787N0191N0893L164k3645J18341m4695
560A23304j04449j09987N1963J12673j35782q1313P6535J5130q7598L6070R2917
549a0537j6042J2365J932M9141j1441P0327k1758n6791j4374L1091L5694j11828
537d2221q5517O9386P6677N3497k4941j48163m057J18559J18858j57096k9933
$$ plain form
526 -54951 -98764 -133628 -111114 -19155 -63353 -52421 37078 -4249 -27740 -50871 -113773 -43392
514 -43392 -62604 39435 64663 59914 -25471 -68023 -86032 25030 87151 147660 161880 153539
502 153539 30818 -98099 36797 -33678 33521 132893 202504 83849 100104 -45308 -47364
$$ packed form
526e4951m3813l4864K2514R1959m4198J0932Q9499m1327k3491k3131o2902P0381
514d3392j9212J02039K5228m749q5385m2552j8009J11062O2121O0509J4220q341
502A53539j22721j28917J34896p0475O7199R9372O9611j18655J6255j45412k056
$$ [...]
##END NTUPLES=NMR SPECTRUM
##END=
