##TITLE=1H_CA-8906-1
 CDCl3, 8 sc, 
 29.07.2021
##JCAMPDX= 6.0         $$ Bruker NMR JCAMP-DX V2.0
##DATA TYPE= NMR SPECTRUM
##DATA CLASS= NTUPLES
##ORIGIN= UXNMR, Bruker Analytische Messtechnik GmbH
##OWNER= root
$$ XWIN-NMR		Version 3.5
$$ Thu Jul 29 09:37:13 2021 Russian Standard Time (UT+4h)  she@DPX200
##.OBSERVE FREQUENCY= 200.131506
##.OBSERVE NUCLEUS= ^1H
##.ACQUISITION MODE= SIMULTANEOUS
##.ACQUISITION SCHEME= undefined
##.AVERAGES= 8
##.DIGITISER RES= 18
##SPECTROMETER/DATA SYSTEM= spect
##.PULSE SEQUENCE= zg30
##.SOLVENT NAME= CDCl3
##.SHIFT REFERENCE= (INTERNAL, CDCl3, 0, 17.5081)
##AUDIT TRAIL= $$ (NUMBER, WHEN, WHO, WHERE, WHAT)
$$ ##TITLE= Audit trail, XWIN-NMR		Version 3.5
$$ ##JCAMPDX= 5.01
$$ ##ORIGIN= Bruker BioSpin GmbH
$$ ##OWNER= she
$$ F:/spectra/data/she/nmr/H-F/1/pdata/1/auditp.txt
$$ ##AUDIT TRAIL=  $$ (NUMBER, WHEN, WHO, WHERE, WHAT)
(   1,<2021-07-29 09:34:06.84 +0400>,<she>,<DPX200>,
      <created by zg, POWCHK disabled, PULCHK disabled
       configuration hash MD5:
       00 E9 B6 7A A2 85 ED C7 34 08 36 98 17 FE 4E 26
       data hash MD5: 16K
       7A 04 46 A9 98 1F CF CF D2 AF 89 90 1B 88 35 ED>)
(   2,<2021-07-29 09:34:09.50 +0400>,<she>,<DPX200>,
      <Start of raw data processing
       efp BC_mod = 2 LB = 0.24 FT_mod = 6 PKNL = 1 PHC0 = -12997.02 PHC1 = 9.60099 SI = 16K 
       data hash MD5: 16K
       13 24 0D A6 E1 5C 18 86 47 20 5A 10 DC FD 8B 8C>)
(   3,<2021-07-29 09:34:35.92 +0400>,<she>,<DPX200>,
      <pk PHC0 = -3.747815 PHC1 = 8.400002 
       data hash MD5: 16K
       51 6A B1 56 69 EB 58 0E AE 8D AD 83 D4 89 12 EC>)
(   4,<2021-07-29 09:34:38.93 +0400>,<she>,<DPX200>,
      <abs ABSG = 5 
       data hash MD5: 16K
       38 35 AE 4E 6F 3D 1E E2 F3 8B D8 26 16 14 E2 91>)
$$ ##END=
$$ 
$$ hash MD5
$$ 6E A2 21 E1 6D 52 4E 99 B5 C5 02 D5 7D 28 61 7F
##$RELAX= 
##$RELAX= 
##$RELAX= 
##$RELAX= 
##$RELAX= 
##$RELAX= 
$$ Bruker specific parameters
$$ --------------------------
##$DU= <F:/spectra>
##$EXPNO= 1
##$NAME= <H-F>
##$PROCNO= 1
##$TYPE= <nmr>
##$USER= <she>
##$AMP= (0..31)
100 100 100 100 100 100 100 100 100 100 100 100 100 100 100 100 100 100 
100 100 100 100 100 100 100 100 100 100 100 100 100 100 
##$AQSEQ= 0
##$AQ_mod= 1
##$AUNM= <au_zg>
##$AUTOPOS= <>
##$BF1= 200.13
##$BF2= 200.13
##$BF3= 200.13
##$BF4= 200.13
##$BF5= 200.13
##$BF6= 200.13
##$BF7= 200.13
##$BF8= 200.13
##$BYTORDA= 1
##$CFDGTYP= 0
##$CFRGTYP= 5
##$CHEMSTR= <none>
##$CNST= (0..31)
1 1 145 1 1 1 1 1 1 1 1 1 1 1 1 1 1 1 1 1 1 1 1 1 1 1 1 1 1 1 1 1 
##$CPDPRG= <>
##$CPDPRG1= <>
##$CPDPRG2= <>
##$CPDPRG3= <>
##$CPDPRG4= <mlev>
##$CPDPRG5= <mlev>
##$CPDPRG6= <mlev>
##$CPDPRG7= <mlev>
##$CPDPRG8= <mlev>
##$CPDPRGB= <>
##$CPDPRGT= <>
##$D= (0..31)
0 1.2 0 0 0 0 0 0 0 0.06 0 0.03 0 0 0 0 0.0002 0 0 0 0 0 0 0 0 0 0 0 0 
0 0 0 
##$DATE= 1627536846
##$DBL= (0..7)
120 120 120 120 120 120 120 120 
##$DBP= (0..7)
150 150 150 150 150 150 150 150 
##$DBP07= 0
##$DBPNAM0= <>
##$DBPNAM1= <>
##$DBPNAM2= <>
##$DBPNAM3= <>
##$DBPNAM4= <>
$$ [...]
##$SUBNAM3= <"">
##$SUBNAM4= <"">
##$SUBNAM5= <"">
##$SUBNAM6= <"">
##$SUBNAM7= <"">
##$SUBNAM8= <"">
##$SUBNAM9= <"">
##$SW= 20.0188882624521
##$SWIBOX= (0..15)
0 0 2 0 0 0 0 0 0 0 0 0 0 0 0 0 
##$SW_h= 4006.41025641026
##$TD= 16384
##$TD0= 1
##$TE= 0
##$TE2= 300
##$TE3= 300
##$TEG= 300
##$TL= (0..7)
0 120 120 120 120 120 120 120 
##$TP= (0..7)
150 150 150 150 150 150 150 150 
##$TP07= 0
##$TPNAME0= <>
##$TPNAME1= <>
##$TPNAME2= <>
##$TPNAME3= <>
##$TPNAME4= <>
##$TPNAME5= <>
##$TPNAME6= <>
##$TPNAME7= <>
##$TPOAL= (0..7)
0.5 0.5 0.5 0.5 0.5 0.5 0.5 0.5 
##$TPOFFS= (0..7)
0 0 0 0 0 0 0 0 
##$TUNHIN= 0
##$TUNHOUT= 0
##$TUNXOUT= 0
##$USERA1= <user>
##$USERA2= <user>
##$USERA3= <user>
##$USERA4= <user>
##$USERA5= <user>
##$V9= 5
##$VALIST= <valist>
##$VCLIST= <CCCCCCCCCCCCCCC>
##$VD= 0
##$VDLIST= <DDDDDDDDDDDDDDD>
##$VPLIST= <PPPPPPPPPPPPPPP>
##$VTLIST= <TTTTTTTTTTTTTTT>
##$WBST= 1024
##$WBSW= 4
##$XGAIN= (0..3)
0 0 0 0 
##$XL= 0
##$YL= 0
##$YMAX_a= 312376
##$YMIN_a= -337125
##$ZGOPTNS= <>
##$ZL1= 120
##$ZL2= 120
##$ZL3= 120
##$ZL4= 120
##$ABSF1= 17.52643
##$ABSF2= -2.492609
##$ABSG= 5
##$ABSL= 3
##$ALPHA= 0
##$AQORDER= 0
##$ASSFAC= 0
##$ASSFACI= 0
##$ASSFACX= 0
##$ASSWID= 0
##$AUNMP= <proc_1d>
##$AZFE= 0.1
##$AZFW= 0.1
##$BCFW= 0
##$BC_mod= 2
##$BYTORDP= 0
##$COROFFS= 0
##$CY= -3
##$DATMOD= 1
##$DC= 0
##$DFILT= <>
##$DTYPP= 0
##$F1P= 0
##$F2P= 0
##$FCOR= 1
##$FTSIZE= 16384
##$FT_mod= 6
##$GAMMA= 0
##$GB= 0
##$INTBC= 1
##$INTSCL= 1.334414e-10
##$ISEN= 128
##$LB= 0.24
##$LEV0= 0
##$LPBIN= 0
##$MAXI= 10000
##$MC2= 0
##$MEAN= 0
##$ME_mod= 0
##$MI= 1.114404
##$NCOEF= 0
##$NC_proc= -6
##$NLEV= 6
##$NOISF1= 3.799351
##$NOISF2= 2.8
##$NSP= 0
##$NTH_PI= 0
##$NZP= 0
##$OFFSET= 17.50811
##$PC= 1
##$PHC0= -13000.77
##$PHC1= 18.00099
##$PH_mod= 1
##$PKNL= yes
##$PPARMOD= 0
##$PSCAL= 0
##$PSIGN= 0
##$REVERSE= no
##$SF= 200.130005306986
##$SI= 16384
##$SIGF1= 3
##$SIGF2= 2
##$SINO= 5.538805
##$SIOLD= 16384
##$SREGLST= <1H.CDCl3>
##$SSB= 0
##$STSI= 16384
##$STSR= 0
##$SW_p= 4006.41025641026
##$SYMM= 0
##$S_DEV= 0
##$TDeff= 16384
##$TDoff= 0
##$TI= <>
##$TILT= no
##$TM1= 0
##$TM2= 0
##$TOPLEV= 0
##$USERP1= <user>
##$USERP2= <user>
##$USERP3= <user>
##$USERP4= <user>
##$USERP5= <user>
##$WDW= 1
##$XDIM= 16384
##$YMAX_p= 310630557
##$YMIN_p= -576162
$$ End of Bruker specific parameters
$$ ---------------------------------
##NTUPLES= NMR SPECTRUM
##VAR_NAME=  FREQUENCY,     SPECTRUM/REAL,   SPECTRUM/IMAG
##SYMBOL=    X,             R,               I
##VAR_TYPE=  INDEPENDENT,   DEPENDENT,       DEPENDENT
##VAR_FORM=  AFFN,          ASDF,            ASDF
##VAR_DIM=   16384,         16384,           16384
##UNITS=     HZ,            ARBITRARY UNITS, ARBITRARY UNITS
##FACTOR=    0.24454680195387, 1,            1
##FIRST=     3503.89815649867, 0,            0
##LAST=      -502.512099911591, 0,           0
##MIN=       -502.512099911591, -576162,     0
##MAX=       3503.89815649867, 310630557,    0
$$ Real data points
##PAGE= N=1
##DATA TABLE= (X++(R..R)), XYDATA
$$ [...]
7562B285458N3613j12012J29224O7945j5947J05016n1354n3191Q5908q7132R1421
7551B498949J38084L4680Q5511j58272j8722J06624M6910L4621M3804J04465l1233
7540B885421J07084p8995k1282J52728J18076q759J301J31265M7798j1680L0641
7529C353598q6284Q6996J4252J81746j8106l02K01067K64438P5618J50950J59083
7518D383056K01441L26262L51681K03051L3762K11604K18647Q3424j43530j3075
7508E856323j01316q6420j17026k40149l12660k68604j628k25889k42927l4093
7498D225611k7178l12128q5209M2238j12011K4147m4775L1901j45820N3886n6096
7487C594566j90606J57720J02536k36597J22690M7572J6321j22384Q8999J60757
$$ plain form
7562 2285458 2339071 2227059 2356283 2424228 2408281 2513297 2461943 2408752 2494660 2407528 2498949
7551 2498949 2637033 2671713 2757224 2598952 2580230 2686854 2733764 2768385 2812189 2916654 2885421
7540 2885421 2992505 2913510 2892228 3044956 3163032 3154273 3155574 3286839 3334637 3322957 3353598
7529 3353598 3267314 3354310 3368562 3550308 3532202 3531900 3732967 3997405 4073023 4223973 4383056
7518 4383056 4584497 4910759 5262440 5465491 5499253 5710857 5929504 6012928 5869398 5856323
7508 5856323 5755007 5668587 5551561 5311412 4998752 4730148 4728520 4502631 4259704 4225611
7498 4225611 4198433 3886305 3801096 3843334 3731323 3755470 3710695 3742596 3596776 3650662 3594566
7487 3594566 3403960 3561680 3664216 3427619 3550309 3597881 3614202 3491818 3580817 3741574
7477C741574L4355n1559P0704j57384r7382N5619J35059N4753J625K37667O0418
7466D085449N4156J30463j6277P1428n842J91711K91285J44055N0377K43532Q7091
7455E327428K88822M08527K80366L98579K56416K63195L25161O03910M25813N08564
7445I086781L60075J71317L5440K48904j6340k05172k78053l40457l36996l87815
7435H337684n21253o11970l66298k55310l62163l49004k76344k32109k02120k46729
7425D914384n5116l36193P7385o3610K2630j35392k95731k510n7783m2360o1802
7414C963902j1579l4080k0593j94o7039q1046N1985M0729L365j16797j45999k6161
7402C556493J24637K8174M3895j9920L4307p9690R5120j08325o2926o9812q0923
$$ plain form
7477 3741574 3775929 3724370 3795074 3637690 3540308 3595927 3730986 3785739 3787364 4025031 4085449
7466 4085449 4139605 4270068 4253791 4325219 4319377 4511088 4802373 4946428 4996805 5240337 5327428
7455 5327428 5616250 6024777 6305143 6703722 6960138 7223333 7548494 8152404 8578217 9086781
7445 9086781 9446856 9618173 9653613 9902517 9886177 9681005 9402952 9062495 8725499 8337684
7435 8337684 7816431 7204461 6838163 6582853 6220690 5871686 5595342 5363233 5161113 4914384
7425 4914384 4859268 4523075 4600460 4536850 4559480 4424088 4128357 4125847 4068064 4025704 3963902
7414 3963902 3952323 3918243 3897650 3897456 3830417 3749371 3801356 3842085 3845450 3728653 3582654 3556493
7402 3556493 3681130 3709304 3753199 3733279 3767586 3687896 3783016 3674691 3611765 3541953 3461030
7391C461030J08810k7976M0151J30374p2581J86503o7521m3996L1654l5804k69796
7380C440848J29836R9425J56189n8661j03174R5823P9617J22505j04202M395j4453
7369C848148K5817J93201K13046N3904j8322M1438J02831J36426K10768O1563
7359D868820Q9619R4587J61268K14772K50923K04691K08049J90102J37215L2973
7349F453019R1694J00254r6208q1269j45469j39008j52313n1041l17375l04046
7339E358238L1212j96084m2095q3664j61810o3347j2490M3501l3702m0021J72165
7328D971903j10666P7343L133M775M3478J17085J14146J41654j5856P2335K208
7317E421538J05753J67372K84040K61698J93680L27643K48296J5181J19341Q4080
$$ plain form
7391 3461030 3569840 3541864 3582015 3712389 3639808 3826311 3758790 3714794 3746448 3710644 3440848
7380 3440848 3570684 3670109 3826298 3767637 3664463 3760286 3839903 3962408 3858206 3862601 3848148
7369 3848148 3873965 4067166 4280212 4334116 4315794 4357232 4460063 4596489 4807257 4868820
7359 4868820 4958439 5053026 5214294 5429066 5679989 5884680 6092729 6282831 6420046 6453019
7349 6453019 6544713 6644967 6548759 6467490 6322021 6183013 6030700 5979659 5662284 5358238
7339 5358238 5389450 5193366 5151271 5067607 4905797 4842450 4829960 4873461 4839759 4799738 4971903
7328 4971903 4861237 4938580 4941713 4946488 4989966 5107051 5221197 5362851 5346995 5419330 5421538
7317 5421538 5527291 5694663 5978703 6240401 6434081 6761724 7010020 7025201 7144542 7228622
7307G228622l7581p5491j17265o6766k78259l16789l80773k01541r8000P424p6293
7296E587288p5512o6985j62524j75145o6429j7516l4301j01948J05913J7973N9014
7285E069828k5121J9758J58097q5488L0560R7338p1057j10213j1346k2122j14977
7274D935257k26183j23498n8879N9358n7372k25691m5405L5543r5925j27788L0954
7263D100371M4148j02190l5078o7654m9758Q5943L1565R4351K0446J9238P5571
7252D216953m2985R3726j52044K28233K86016k31131J31185K40874J48853L3720
7242D953400j3136J48276j31218j54298J07803P019p0088r0206p7572J2238j79884
7231D512334k01552j55403j29625m6953J5098J3771j79957j87371o1969j13404
$$ plain form
7307 7228622 7191041 7115550 6998285 6931519 6653260 6336471 5955698 5754157 5656157 5663581 5587288
7296 5587288 5511776 5444791 5282267 5107122 5040693 5023177 4988876 4886928 4992841 5010814 5069828
7285 5069828 5044707 5064465 5222562 5137074 5167634 5264972 5193915 5083702 5072356 5050234 4935257
7274 4935257 4709074 4585576 4526697 4586055 4528683 4302992 4257587 4293130 4197205 4069417 4100371
7263 4100371 4144519 4042329 4007251 3939597 3889839 3975782 4007347 4101698 4122144 4141382 4216953
7252 4216953 4173968 4267694 4115650 4343883 4629899 4398768 4529953 4770827 4919680 4953400
7242 4953400 4940264 5088540 4957322 4803024 4910827 4917846 4847758 4757552 4679980 4692218 4512334
7231 4512334 4310782 4155379 4025754 3978801 3993899 4007670 3827713 3640342 3578373 3464969
7221C464969j98401J72090j0619l8102k7161J20535j94802o8554r2678K35310
7211C362587J3430p9373K7245j26014O3374o8496l9795j06044n579J5972Q269
7200C065576m0128Q7279n6829p1884j16709R4007J17012q4582k1752J55350j13964
7189C013376p5482K2075j18615J59238l2676j95881P2488J571P7050r2887k3829
7178B806428j08008P4394n4073k5099J98461n8463m2467M2766J2961L5734m0293
7167B842341j52904R3423o6472j00755j06967J53318p6446j1271N0146R8243n6992
7156B665664j20929O8958r1912P9784J0364j21217m536l2273K9367N3253l8445
7145B498078Q6907K4484J9577k9697j9397j64795j16580r298l0231J12578P8433
$$ plain form
7221 3464969 3266568 3438658 3428039 3389937 3362776 3483311 3288509 3219955 3127277 3362587
7211 3362587 3376017 3296644 3323889 3197875 3261249 3192753 3152958 3046914 3041335 3057307 3065576
7200 3065576 3025448 3112727 3055898 2984014 2867305 2961312 3078324 2993742 2971990 3127340 3013376
7189 3013376 2937894 2959969 2841354 3000592 2967916 2772035 2844523 2846094 2923144 2830257 2806428
7178 2806428 2698420 2772814 2718741 2693642 2892103 2833640 2791173 2833939 2846900 2882634 2842341
7167 2842341 2689437 2782860 2716388 2615633 2508666 2661984 2585538 2574267 2624413 2722656 2665664
7156 2665664 2544735 2613693 2521781 2601565 2611929 2490712 2486176 2453903 2483270 2536523 2498078
7145 2498078 2584985 2609469 2629046 2599349 2579952 2415157 2298577 2289279 2259048 2371626 2450059
7134B450059k311o5638l0124l6292J1782j9628O5535n8573M3664M3370O0699j50663
7122B311880k2673M4028o648j60241L2257K9375n3483J38387j2735o0427q1806
7111B157914M3199q0632R1532J12616l9500j26738J6567J1990r7755j03378L2455
7100B018270J38684J1433j72313J52706n2216k55899L6308l2393Q8525R0970J4625
7089B038700J2262j47746O1980n8420l4784o3870J04887k1259k05860P7662J72892
7078A936444L7508N451o7291n3042p4411M6893n3171M5100j3642R7672o0665r5788
7066A751058M3143j5389q260o1013O3908o4543J2154J06853j18378j4567J8571
7055A713537p1194J04616l4877J12450j7563j14127q0264J4532O2820m6346O4851
$$ plain form
7134 2450059 2447748 2382110 2351986 2315694 2327476 2307848 2373383 2314810 2358474 2401844 2462543 2311880
7122 2311880 2289207 2333235 2326587 2166346 2198603 2227978 2174495 2312882 2300147 2239720 2157914
7111 2157914 2201113 2120481 2212013 2324629 2285129 2158391 2174958 2186948 2089193 1985815 2018270
7100 2018270 2156954 2168387 1996074 2148780 2096564 1840665 1876973 1844580 1933105 2024075 2038700
7089 2038700 2050962 1903216 1965196 1906776 1871992 1808122 1913009 1891750 1685890 1763552 1936444
7078 1936444 1973952 1979403 1912112 1859070 1784659 1831552 1778381 1823481 1809839 1907511 1846846 1751058
7066 1751058 1794201 1778812 1770552 1709539 1773447 1708904 1721058 1827911 1709533 1694966 1713537
7055 1713537 1642343 1746959 1712082 1824532 1806969 1692842 1612578 1627110 1689930 1643584 1708435
7044A708435k3775j3503j6777K3631n1882J36358j54444r0647J12067R5999N8856
7033A784318n0502K6844n3492k7113m6648j38663l7786K40685j23206J18096j13179
7022A579354o6733L3590P0127m9832j9244K3381m1785j56913J26649j65468J0642
7011A343768J72497P6265r4920m1103l5296N7011k1611j01142R1931N3758L5097
7000A536255K2934o0323k16192K9853J05956J29639k57970L7252J76723o659r3523
6989A403945L4229l110J14724m8837L0203n0424j09312J18465j5184n1842M495
6978A427352p7124m6416n1784J17992m2932L330j6306m0061J8858l929J43822
6967A432802L0444j49036M9468o1785j54125M6633K1404J04512m7501m1695k7045
$$ plain form
7044 1708435 1684660 1671157 1654380 1678011 1626129 1762487 1608043 1517396 1629463 1725462 1784318
7033 1784318 1733816 1760660 1707168 1680055 1633407 1494744 1456958 1697643 1574437 1692533 1579354
7022 1579354 1512621 1546211 1616338 1566506 1547262 1570643 1528858 1371945 1498594 1333126 1343768
7011 1343768 1516265 1592530 1497610 1456507 1421211 1478222 1456611 1355469 1447400 1501158 1536255
7000 1536255 1559189 1498866 1282674 1312527 1418483 1548122 1290152 1327404 1504127 1497468 1403945
6989 1403945 1438174 1435064 1549788 1500951 1531154 1480730 1371418 1489883 1474699 1422857 1427352
6978 1427352 1350228 1303812 1252028 1370020 1327088 1330418 1314112 1274051 1292909 1288980 1432802
6967 1432802 1463246 1314210 1363678 1301893 1147768 1194401 1215805 1320317 1272816 1231121 1204076
6956A204076L7617N2558Q3756k1840L2171q1552j2921N8436O7956j15312n9081
6945A245864Q8872N100k6309q0661l2693n3329J04238Q7994q9425k6504j4838
6934A208309P8259K9641J31425j36160J44252J15509J26911J1117j63812r9995
6924A445456J4812J15170L2279n3413k0958J64849j08303J3591J47690n644j3853
6913A731676Q9391O487j9842J73715J36018k3178N1135q4767K16778N3389N8812
6902B389614K1858P0292J41202K71303J10755J46269K25098K82786J95538L49834
6892D204549L06896L84550L69766L58031L24009K82546J29970J26451N1408l8007
6882F500169J24993j96219l82557k42935o7262m03671l25575k19930k87743k59968
$$ plain form
6956 1204076 1241693 1294251 1378007 1356167 1388338 1306786 1293865 1352301 1420257 1304945 1245864
6945 1245864 1334736 1339836 1313527 1232866 1200173 1146844 1251082 1339076 1249651 1223147 1208309
6934 1208309 1286568 1316209 1447634 1311474 1455726 1571235 1698146 1709263 1545451 1445456
6924 1445456 1460268 1575438 1607717 1554304 1533346 1698195 1589892 1603483 1751173 1745529 1731676
6913 1731676 1821067 1827554 1807712 1981427 2117445 2094267 2145402 2060635 2277413 2330802 2389614
6902 2389614 2411472 2481764 2622966 2894269 3005024 3151293 3376391 3659177 3854715 4204549
6892 4204549 4511445 4895995 5265761 5623792 5947801 6230347 6360317 6486768 6538176 6500169
6882 6500169 6625162 6428943 6046386 5803451 5736189 5332518 5006943 4787013 4499270 4239302
6872D239302k22037k74922l4951q8662k22072Q5446j12037q6148j42146m2271
6862C099502J53279j14982N2016J95869j701J6787J53593R9284O9928K20576K07828
6851D151979J99740J53787J86108L31578K24724K86377K778O8967O5218m4049
6841E627207L3019k95480l03937k17361l09541l32779l29682l22591l02737m58498
6831B787620l50040n2122o8286q9006k49670j16923P012n406j27633J7803j6174
6820A737175k10086K429j30497j24093J56192j08597p9745o6949k6268j05172
6810A044389K1565l8551M0239p017j16076j00009O3588o1214j23445q1448j0705
6799F31316M9476P6830j4460J54027r33n2554Q5286l5060j29285p9480R716j0019
$$ plain form
6872 4239302 4017265 3742343 3707392 3618730 3396658 3482104 3370067 3283919 3141773 3099502
6862 3099502 3252781 3137799 3189815 3385684 3383983 3400770 3554363 3653647 3723575 3944151 4151979
6851 4151979 4351719 4505506 4691614 5023192 5247916 5534293 5537071 5606038 5671256 5627207
6841 5627207 5660226 5364746 5060809 4843448 4533907 4201128 3871446 3548855 3246118 2787620
6831 2787620 2437580 2385458 2317172 2228166 1978496 1861573 1868585 1863179 1735546 1753349 1737175
6820 1737175 1527089 1529518 1399021 1274928 1431120 1322523 1242778 1175829 1149561 1044389
6810 1044389 1065954 1027403 1067642 1060625 944549 844540 908128 846914 723469 642021 631316
6799 631316 680792 757622 743162 897189 896256 843702 928988 893928 764643 685163 694879 684860
6787F84860j5153k37141P2397N847k8440k2363p4315K3536L2176J9495j8301k6261
6775D16337o6152k9966K7486j55633J70178J99435K9262k09638J10182P3372l0359
6764E34504k15013j27017O7950Q5898l2257J08377O1391r3719O0170q5450n9208
6753C05626L6978R0150j18245M4256l0788j7113l9753r0373N0916P202k1580m4110
6741A73166K6024J0389P8952k2635j97515j19866J30536J54583M076j0230j17631
6730A09849J61356L6757n695Q775R285n2219l7404n8022n4993M3768j11600L6473
6718H6330j5532J62897R445j15032o5751K5232N5595l1149J9933O328K1412O0829
6706B20537j10676J24306L9888o7955o1289j09531R9343O4845m3609p2374P1039
$$ plain form
6787 684860 669707 432566 504963 510810 482370 460007 385692 409228 441404 460899 442598 416337
6775 416337 350185 320219 347705 192072 362250 561685 590947 381309 491491 564863 534504
6764 534504 319491 192474 260424 346322 314065 422442 483833 390114 450284 364834 305626
6753 305626 342604 432754 314509 358765 327977 310864 271111 180738 231654 238856 217276 173166
6741 173166 199190 209579 288531 265896 68381 -51485 79051 233634 237710 227480 109849
6730 109849 271205 307962 302267 311042 320327 268108 230704 172682 117689 161457 49857 86330
6718 86330 70798 233695 243140 128108 62357 87589 143184 112035 131968 138296 159708 220537
6706 220537 109861 234167 274055 206100 144811 35280 134623 199468 155859 83485 154524
6695A54524Q8890K855q8563j07249J8168l4642k9203o2923J5020O9152l8377K3681
6683A1333j7853n7347J08357r0827O3192J55493r0880M1891j6188p8320j34016
6672a05165P1848m1940J05739J35312o5494n3998o5769m6583M6306l6588l825
6661f0157R812q8545j6430K7203P8903l2676N11R6606m6628M2670o4996J9753
6649c3974M2928K6842q5155l9690L5788p7488q024P3951l438K2987N4245N7915
6637F6887O5707K4730q0535p2927P6516j88910j6882J04243j38561K1344m3499
6626a81887O9776p5542j23380N1200l6051J3099R6989Q8179j03914K07347j48378
6615a42562j7388j7530O4774k4824P151L1236n426o5711j32711P6135L6901J03307
$$ plain form
6695 154524 243414 246269 157706 50457 68625 33983 4780 -58143 -43123 26029 -12348 11333
6683 11333 -6520 -63867 44490 -46337 16855 172348 81468 123359 107171 28851 -105165
6672 -105165 -33317 -75257 30482 165794 100300 46302 -19467 -66050 -19744 -56332 -60157
6661 -60157 -50345 -138890 -155320 -128117 -49214 -81890 -81379 15227 -31401 11269 -53727 -33974
6649 -33974 8954 35796 -49359 -89049 -53261 -130749 -138773 -64822 -68260 -45273 8972 66887
6637 66887 132594 157324 76789 3862 80378 -108532 -125414 -21171 -159732 -138388 -181887
6626 -181887 -112111 -187653 -311033 -259833 -295884 -282785 -185796 -97617 -201531 5816 -142562
6615 -142562 -159950 -177480 -112706 -137530 -130379 -99143 -104569 -170280 -302991 -226856 -189955 -86648
6603h6648j01689J12130J59497o6932k1119j12238n1516J22322p9778j20963J18470
6592a28464n4130L0470J4519p3000j25678J15040J11972j26507q1933o5504K27602
6581a55613L0224m2234j26123m798J54701R1571j67690J46709k5681m4539N5642
6570h7831L0098m9178M5395j16573j19352K366K03426j14023k5800N0081n6859
6559b38250J32611m3868N8166M5108J767j07169m7471k1756q1817N3464J12567
6548a36648k05830k0320O8012j7538n9854K29550J5382k0329j0828j5804j11015
6537b85222l0724j5834Q148J47297R9185N287j80250o6936J43764o1616m4913
6526b81814R5121q2143r0136R2554o7289R3501K51965J9556j43004q9531N307
$$ plain form
6603 -86648 -188337 -76207 83290 16358 -4761 -116999 -168515 -46193 -125971 -246934 -128464
6592 -128464 -182594 -152124 -137605 -210605 -336283 -221243 -109271 -235778 -317711 -383215 -155613
6581 -155613 -125389 -167623 -293746 -298544 -143843 -52272 -219962 -73253 -98934 -143473 -87831
6570 -87831 -57733 -106911 -61516 -178089 -297441 -295075 -91649 -205672 -231472 -181391 -238250
6559 -238250 -105639 -149507 -91341 -46233 -44466 -151635 -199106 -220862 -302679 -249215 -136648
6548 -136648 -342478 -362798 -294786 -312324 -372178 -142628 -127246 -147575 -158403 -174207 -285222
6537 -285222 -315946 -331780 -323632 -176335 -77150 -71863 -252113 -319049 -175285 -236901 -281814
6526 -281814 -186693 -268836 -358972 -266418 -333707 -240206 11759 31315 -111689 -201220 -195913
6515a95913O8562M7826j01290N1509j47658J00898O6347j04073L6506n8408l4123
6504b69817k0052N9684J6816r552j91009N3728L5872J06213J04282j43801P3718
6493a83918P3652j11304q1900M8951r2711M5771R0812l4401R0033j14999j73978
6482d43992L7519o8609J68320p54j3851J9338n6654l2308J82166J13415j40254
6471b35664L3536m3114k6724n020r4193O8932N919m4570p6625P9961o0381J85555
6459b12388Q8736o8046n8852q0393Q8809r9200n2150l2703R2093K4758Q1010M24
6447b27902N9522R361n8180N4098j17480L6468Q987l7287l6371K0277L9621o8226
6435c17112L2619j6324M9405m1130p8083O1642l2665L8433K15947q6225j22874
$$ plain form
6515 -195913 -127351 -79525 -180815 -129306 -276964 -176066 -109719 -213792 -177286 -235694 -269817
6504 -269817 -289869 -230185 -213369 -222921 -413930 -360202 -324330 -218117 -113835 -257636 -183918
6493 -183918 -110266 -221570 -303470 -254519 -347230 -301459 -210647 -245048 -155015 -270014 -443992
6482 -443992 -406473 -475082 -306762 -307516 -321367 -302029 -358683 -390991 -208825 -95410 -235664
6471 -235664 -202128 -245242 -271966 -276986 -371179 -302247 -296328 -340898 -417523 -337562 -397943 -212388
6459 -212388 -123652 -191698 -250550 -330943 -242134 -341334 -393484 -426187 -334094 -309336 -228326 -227902
6447 -227902 -168380 -159019 -217199 -163101 -280581 -244113 -235126 -272413 -308784 -288507 -248886 -317112
6435 -317112 -284493 -300817 -251412 -292542 -370625 -308983 -341648 -303215 -87268 -173493 -296367
6424b96367n2262J55759j6158p4765J3654L2291q9447Q9512J9501N19r399K1073
6412b06089p5341j24457P7403K00947j46074r6632J95732j52892r1899J8204P7042
6401c24056j0996n5805o8863O3364L7637l7602j9001j03639N1360J20089n1306
6390c98818P2855J40900K7675K9003p1657j04980J69054q1587O165l6589M4819
6379b03160O7923j03666P0487j92964K2274K51593j08546j39516J2120J79178
6369a44277j04557q4180l5938n9347P6139k1388o3333N8245m6147L7575p1324
6358d58532M1830P7239J82164k50128J00656m8316o2679J12480N2354P624j29538
6347c74846K13495j33513L9938J3945K6009j05102N5379L5639L1152j06906q7994
$$ plain form
6424 -296367 -348629 -192870 -209028 -283793 -270139 -237848 -327295 -237783 -218282 -217763 -227162 -206089
6412 -206089 -281430 -405887 -328484 -127537 -273611 -370243 -174511 -327403 -419302 -401098 -324056
6401 -324056 -335052 -390857 -459720 -396356 -358719 -396321 -415322 -518961 -467601 -347512 -398818
6390 -398818 -325963 -185063 -157388 -128385 -200042 -305022 -135968 -217555 -211390 -247979 -203160
6379 -203160 -135237 -238903 -168416 -361380 -339106 -87513 -196059 -335575 -323455 -144277
6369 -144277 -248834 -333014 -368952 -428299 -352160 -373548 -436881 -378636 -424783 -387208 -458532
6358 -458532 -416702 -339463 -157299 -407427 -306771 -355087 -417766 -305286 -252932 -245308 -374846
6347 -374846 -161351 -294864 -254926 -240981 -214972 -320074 -264695 -229056 -197904 -304810 -392804
6336c92804J31623j33057J24657N3427p700j0200j50098J39574O8103j48635j70652
6325d95762J39391K9667P4496L0360o8348r5703Q5579O3771N0948j10608J6414
6314b79795J06664l9577K7893L5077j8845n8297O4651j7723j7354M7552K6779
6303a22975j8025j21682j6170k27584J52920K48445n5607L2961j90553J41146
6293a77124k6681K6720K1578j48506l5918N4354L8765q3330Q2620p9601K1484
6282c05639m7062o6691J28740J8015J5606K7007K1940o4087l1399m602K384m9849
6270c55637r373Q5705J0555n6035k1730Q999n6433K4809j03812N6154M859j38485
6258e50424J40839N9787Q1075j07005K5618J0786m9790P5897r6677j43388j8692
$$ plain form
6336 -392804 -261181 -394238 -269581 -216154 -223854 -234054 -384152 -244578 -176475 -325110 -495762
6325 -495762 -356371 -326704 -252208 -221848 -290196 -385899 -300320 -236549 -185601 -296209 -279795
6314 -279795 -173131 -212708 -184815 -149738 -168583 -226880 -162229 -179952 -197306 -149754 -122975
6303 -122975 -141000 -262682 -278852 -506436 -353516 -105071 -160678 -127717 -318270 -177124
6293 -177124 -203805 -177085 -155507 -304013 -339931 -285577 -246812 -330142 -247522 -327123 -305639
6282 -305639 -352701 -419392 -290652 -272637 -257031 -230024 -208084 -272171 -303570 -308172 -305788 -355637
6270 -355637 -365010 -279305 -268750 -324785 -346515 -337516 -393949 -369140 -472952 -416798 -411939 -550424
6258 -550424 -409585 -349798 -268723 -375728 -350110 -339324 -389114 -313217 -409894 -553282 -571974
6247e71974J79044J37578j13339M0151K6932j4736J06529q8497O6553O136J3916
6236b11707j72789j86098P3599J8451J16841O2877q7165O8431P6459j45544m7202
6225d33847O4295J05160m3453j17302J49943m3097j15721j1391O8482q407O8947
6214c16391J8424j12603N731J54592K7092p3092j1828k6688M9238j17295m2301
6203d45121l6502M9813J21319M247n2527L7479k4657M354n1899o047j2201Q1563
6191c30179L7330j04694j9749q8640K1034Q3721j1028K6347O7172L3321j60970
6180d46335O5337M9325K2494j30639J8186K16803K6165j5728J04540j46053j67409
6169d03314r1949k103L5632L3463J03057q7673m3768m2817J3563P8219Q9096r5780
$$ plain form
6247 -571974 -392930 -255352 -368691 -328540 -301608 -316344 -209815 -298312 -231759 -225623 -211707
6236 -211707 -384496 -570594 -496995 -478544 -361703 -298826 -385991 -317560 -241101 -386645 -433847
6225 -433847 -369552 -264392 -307845 -425147 -275204 -318301 -434022 -445413 -376931 -385338 -316391
6214 -316391 -297967 -410570 -404839 -250247 -223155 -296247 -308075 -334763 -285525 -402820 -445121
6203 -445121 -481623 -431810 -310491 -306244 -358771 -321292 -345949 -341595 -393494 -399541 -411742 -330179
6191 -330179 -292849 -397543 -417292 -505932 -484898 -401177 -412205 -385858 -318686 -285365 -446335
6180 -446335 -380998 -331673 -309179 -439818 -421632 -204829 -178664 -194392 -89852 -235905 -403314
6169 -403314 -495263 -497366 -461734 -428271 -325214 -412887 -456655 -499472 -485909 -407690 -318594 -414374
6157d14374J395N6897K7245k0887J33396k3581j16853j32425L4978j21953M868
6146e71294J94306P184j5345K7876p7035R1453L8025j62137J69806J6339k9186
6135c10008K2371k2887M8867j17052J6335m427m823O32P0809o6892n9965l1599
6123d58639N0721J46803N8222o2300L9443J0544j24461L0565M9366q1065N753
6112c35048Q3607k20368R8476m2328Q8412L7729k9352j8156P0134m4680K9732
6101b81842L0898j02411O6021j04574J27584J843j29853K1409l9069O420J3507
6090c90067J30166Q1790j76029m8862L7816N2720L0424J8140L1868o4037O0395
6079b35676j91803L3091M7569k486l3332L6839Q9010J9946l9105k9583m0142J9726
$$ plain form
6157 -414374 -412979 -356082 -328837 -349724 -216328 -239909 -356762 -489187 -454209 -576162 -571294
6146 -571294 -376988 -369804 -385149 -357273 -434308 -342855 -304830 -466967 -297161 -280822 -310008
6135 -310008 -287637 -310524 -261657 -378709 -362374 -366801 -371624 -370992 -300183 -367075 -427040 -458639
6123 -458639 -407918 -261115 -202893 -265193 -225750 -215206 -339667 -309102 -259736 -340801 -335048
6112 -335048 -251441 -471809 -373333 -415661 -327249 -289520 -318872 -337028 -266894 -311574 -281842
6101 -281842 -250944 -353355 -287334 -391908 -264324 -262481 -392334 -370925 -409994 -403574 -390067
6090 -390067 -259901 -178111 -354140 -403002 -365186 -312466 -282042 -263902 -232034 -296071 -235676
6079 -235676 -427479 -394388 -346819 -349305 -382637 -345798 -256788 -236842 -275947 -305530 -345672 -325946
6067c25946p3414J14005L0748j11699J31979j67416P826K512M3856q3229L2213
6056c98565J86905l4623j07467J98321j25402j4873L2100r9628k6299J33288J01809
6045a54434r9811j48496P8384J08095m2180j9760M4539p0414r9203O258l9935
6034d36957o7844J13025N1836o7861k375N9964j6622p2387P4451Q6167J12702
6023a65901j31684N6881p936O027j20883j53433L8757J35687j1307j06301R2046
6012c68047p1666L5785L0974m4413O5643J37965P575o328j12409M6742M0581l8028
6000b75626m934j6828Q654L1408q7803M867J8469k8739o680K1558p8405n328J08235
5987c11152l5587q0441P1791O969J174J29231j67979M150K0004R3648q9196M5540
$$ plain form
6067 -325946 -399360 -285355 -254607 -366306 -234327 -401743 -393917 -391405 -347549 -430778 -398565
6056 -398565 -211660 -246283 -353750 -155429 -280831 -295704 -263604 -363232 -389531 -256243 -154434
6045 -154434 -254245 -402741 -324357 -216262 -258442 -278202 -233663 -304077 -403280 -397022 -436957
6034 -436957 -504801 -391776 -339940 -407801 -410176 -350212 -366834 -439221 -364770 -278603 -165901
6023 -165901 -297585 -240704 -248640 -242613 -363496 -516929 -478172 -342485 -353792 -460093 -368047
6012 -368047 -439713 -403928 -372954 -417367 -351724 -213759 -206184 -212512 -324921 -278179 -237598 -275626
6000 -275626 -280560 -297388 -288734 -257326 -345129 -340262 -321793 -350532 -357212 -335654 -414059 -419387 -311152
5987 -311152 -346739 -427180 -355389 -348420 -347246 -218015 -385994 -381844 -361840 -268192 -357388 -311848
5975c11848J13798m2648P4086j18250j27570L2519N6014K3851K7702J58055q6275
5964b00566M1906j49234j4503J07186R0923k1413j85164O7528J2686L3611J7312
5953a99728o0753L43l281j08197L6222J35883k8956J1699P6893k2361q4535O897
5941b39874j55359J50977l9201m7884J11872k8060j9378n7305N0777l4254J60822
5930a46867j2065K1870m439j15742n0225R6002n9429k2589M8800K7879L5098j65011
5918c46718m1023K5026O2665R4079N0796k1986k0399P7321m64N0365p5811o8590
5906b14739j71229j3037N4122J37614r5237o6964J29728R5916j74753n9355P0812
5895c07122K7249J73871n7259m2771o7444L1184j15851N5654j9940R5035J43248
$$ plain form
5975 -311848 -198050 -240698 -166612 -284862 -412432 -379913 -323899 -300048 -272346 -114291 -200566
5964 -200566 -158660 -307894 -322397 -215211 -124288 -145701 -330865 -263337 -250651 -217040 -199728
5953 -199728 -260481 -260138 -263419 -371616 -335394 -199511 -228467 -216768 -139875 -162236 -246771 -239874
5941 -239874 -395233 -244256 -283457 -331341 -219469 -247529 -266907 -324212 -273435 -307689 -146867
5930 -146867 -158932 -137062 -141501 -257243 -307468 -211466 -270895 -293484 -244684 -216805 -181707 -346718
5918 -346718 -387741 -362715 -300050 -205971 -155175 -177161 -197560 -120239 -120703 -70338 -146149 -214739
5906 -214739 -385968 -399005 -344883 -207269 -302506 -369470 -239742 -143826 -318579 -377934 -307122
5895 -307122 -279873 -106002 -163261 -206032 -273476 -242292 -358143 -302489 -322429 -227394 -84146
5884h4146p3253j04834j50k7206O2397o5890o9247O1243J46147r9253o4125P2379
5872b45938r2648j9920j46687J44499J06938Q2296P774L4587j71471j28427J59371
5861b69626J47630l055J11939l5673j77395m74J12753P9989j40149m5892l9842
5850b59795J22862J51337j64732j37018Q8420J22842r5405l4843J27785k9931
5840a08478M5600K050o0948Q5861j28359Q3069L8633p351k3071j43648P8120r972
5828a48494Q2864o635R0880k8451m2076j8610o3375K1561Q4161p6448L342n3450
5816a54731m0810L9232j00846L5692J40043R7609q3430q891k8804o9567l7317
5805b11820n7671J07672J14944L0779P4657L5824j42044P224O8428j09913j1888
$$ plain form
5884 -84146 -157399 -262233 -262383 -289589 -227192 -293082 -362329 -301086 -154939 -254192 -318317 -245938
5872 -245938 -338586 -358506 -505193 -360694 -253756 -171460 -163686 -129099 -300570 -428997 -269626
5861 -269626 -121996 -125051 -13112 -48785 -226180 -226654 -113901 -33912 -174061 -219953 -259795
5850 -259795 -136933 14404 -150328 -287346 -198926 -76084 -171489 -206332 -78547 -108478
5840 -108478 -62878 -60828 -121776 -35915 -164274 -81205 -42572 -49923 -72994 -216642 -138522 -148494
5828 -148494 -65630 -72265 18615 -9836 -51912 -70522 -133897 -112336 -28175 -104623 -101281 -154731
5816 -154731 -195541 -156309 -257155 -221463 -81420 16189 -67241 -76132 -104936 -174503 -211820
5805 -211820 -269491 -161819 -46875 -16096 58561 94385 -47659 -40435 27993 -81920 -93808
5794i3808J74382r3025p6946L2398J27972l0040j24799L6186r9630J76258N9329
5783H8277k57491P6927R6090q8705J35557L1644j21321Q3720K5763j46376O3219
5772a2696j8069n5485O9462J38974q1957P0320j81142P3316L0444J05014j05539
5761C2642n0964Q1624Q2612j41967q1288L1173l9419l3078j9406R1872Q4330J30912
5749A69043j77107N7030L7309J1772J15786O7263k02625J7679o4699N1400J41081
5738B23932l8731n3188K1477p4323m3484P3928r3529n2221J6851l7170o3303J08876
5726a0885Q3294o5329Q9320L9415q0805K3081j34619J7155O7584j5569J38906
5715A51548L2614M0503n5192l9667r175k9324m8575J71765p2887n1890L7998j9347
$$ plain form
5794 -93808 80574 -12451 -89397 -56999 70973 40933 -83866 -47680 -147310 28948 88277
5783 88277 -169214 -92287 3803 -84902 50655 82299 -39022 44698 70461 -75915 -12696
5772 -12696 -30765 -86250 -16788 122186 40229 110549 -70593 2723 33167 138181 32642
5761 32642 -18322 63302 145914 3947 -77341 -46168 -85587 -118665 -138071 -46199 38131 169043
5749 169043 -8064 48966 86275 98047 213833 281096 78471 96150 31451 82851 223932
5738 223932 185201 132013 153490 79167 35683 109611 16082 -36139 -19288 -56458 -119761 -10885
5726 -10885 72409 7080 96400 135815 55010 78091 -56528 -39373 28211 12642 151548
5715 151548 184162 224665 169473 129806 120631 91307 42732 214497 141610 89720 127718 108371
5703A08371m9580J9902N4700M8441l2448R969p4467K22399j4354j19474L0807
5692B04266m5944J75363N4791l9813J3640l5270N0986k6240M2724J7983k7251
5681C85235p820m4298j52956n0530K027N3802J33412j77198Q4201N239L4993j7197
5669B48910m4131J23116j2866l6146P9509Q3527j1417J13737J08155K110k5248
5658F29256P2624J76760J061O8358O3184m2611j75765j82201Q4856q3427P055
5647F19150r2387k6097n4451q2572K8453j67978L010P5350O7579k3725P1181N1773
5635D69286m8847J26056K8306j79124K0182l3177J51164J32650J20239J11665
5625H98400j4682n2134L5558l5686j27960j41461j6161j98584m6705J75344k27971
$$ plain form
5703 108371 58791 78693 133393 181834 149386 159355 84888 307287 292933 173459 204266
5692 204266 158322 333685 388476 348663 362303 327033 378019 351779 394503 412486 385235
5681 385235 377415 333117 180161 129631 131658 185460 318872 141674 225875 231114 266107 248910
5669 248910 204779 327895 315029 278883 358392 441919 430502 544239 652394 654504 629256
5658 629256 701880 878640 879701 948059 1011243 968632 792867 610666 695522 612095 619150
5647 619150 526763 500666 446215 363643 392096 224118 227128 302478 370057 346332 417513 469286
5635 469286 420439 546495 574801 395677 415859 382682 533846 666496 786735 898400
5625 898400 883718 831584 867142 831456 703496 562035 545874 347290 300585 475929 247958
5614B47958j03250Q1958L8090q110j71180O6253n3194J38344l3585j911M3589
5603B44962R0628p295j18596J6925k8466l3583K14171j7648O3079o245p1386Q2750
5591D29296j57082j71073q757J35574k3225j78541m4964J13282p2681k1840L0394
5580C0383o7237o4232p8594k0240O0974M6775J30407M3565K4293l2505K0319k1933
5568G1975j80793P513L3583Q1451L5587j08570Q265J6029L7283L6539O2760r1473
5556A0149Q8721O3569o8991j43574m9156J40516R5307j03060O6926J50323j15455
5545A35275n6542J06690l3441o8697p3453r8980m4K45605l1366l7631o8364P9772
5533I8824j5580j55203J5754Q7888P169m5676J41271n0095j52723J42229K3962
$$ plain form
5614 247958 144708 226666 264756 256646 85466 151719 98525 236869 203284 201373 244962
5603 244962 335590 328295 209699 226624 198158 164575 378746 361098 424177 417932 346546 429296
5591 429296 272214 101141 92384 227958 204733 26192 -18772 94510 21829 -11 30383
5580 30383 -36854 -101086 -179680 -199920 -138946 -92171 38236 81801 106094 73589 93908 71975
5568 71975 -108818 -101305 -67722 13729 49316 -59254 -50989 -34960 2323 38862 101622 10149
5556 10149 98870 162439 93448 -50126 -99282 41234 136541 33481 100407 250730 135275
5545 135275 78733 185423 151982 83285 9832 -89148 -89192 156413 125047 87416 19052 98824
5533 98824 83244 -71959 -56205 31683 38852 -6824 134447 84352 -68371 73858 97820
5522I7820J9935k9765o3546M4877m1992L291K5973o744J12270o2315j20142j47281
5510a67619J16618J54292L249j37766k4391J9300J4316l9897M0478K1998m8792
5499d8214J05728J12619k48931l0385N1846k0260J06335m1809N3405r7375r3621
5488a50662K27486K2906j11312j1171J25112J16129l8483j04367o2977M8617L5704
5477I6982M483k24650K34500J17083J73938j18855m4540j93061J00357J7283N4605
5466B18125m9172m7798J57268J67L2421m9121r1362k2995p5440j1689K3384Q2859
5454A66647M8570N0960j9496j05130R7652P8139J1064l794K0630k5733j2915J966
5442C08560j1943n0761Q3726k1634p822l9828L3007o691K7362N6480L6987J2229
$$ plain form
5522 97820 117755 87990 24444 69321 27329 30620 56593 49849 162119 99804 -20338 -167619
5510 -167619 -51001 103291 106540 -31226 -55617 -36317 -22001 -61898 -21420 578 -48214
5499 -48214 57514 170133 -78798 -109183 -57337 -77597 28738 -13071 40334 -57041 -150662
5488 -150662 76824 99730 -11582 -22753 102359 218488 180005 75638 12661 61278 96982
5477 96982 101465 -123185 111315 228398 402336 283481 238941 45880 146237 163520 218125
5466 218125 168953 121155 278423 278590 311011 261890 170528 147533 72093 60404 83788 166647
5454 166647 215217 266177 246681 141551 239203 317342 328406 324612 345242 319509 306594 308560
5442 308560 296617 245856 329582 307948 300126 260298 293305 286614 313976 370456 407443 419672
5430D19672P7662n8765p9309o3456j6747j0463O42m0463P7594N5043Q9772Q1549
5418E32731j05872M5162L8513O7680L9119m5793K8690l0374k2566m5329J93018
5407F94979n9480n4704k6886J1323o9390n1685K60723l5902j12052q7592R5162
5396E64496o9050o4259k2596J51740n6495j7437O2261O5554R3312K1207p8823
5385F49910J0052o3584N6965N28J1989M2435L1633p4018J10943O3734j12627j10382
5373F17578P0169J03460j80593j1963N6910J17601p9686q7762j1101J3621K0655
5362F28889K8582K6880j40393P3647o7671m03N1217P0095m3640l60194J77279
5351D44288p0276J10138J05539J0155R6148m8445o2416q4673L9101m0925m4478
$$ plain form
5430 419672 497334 438569 359260 295804 279057 268594 269236 228773 306367 361410 451182 532731
5418 532731 426859 472021 510534 578214 617333 571540 600230 569856 547290 501961 694979
5407 694979 635499 580795 553909 565232 495842 444157 704880 668978 556926 469334 564496
5396 564496 495446 431187 408591 560331 503836 486399 548660 614214 707526 728733 649910
5385 649910 659962 596378 653343 653871 665860 708295 739928 665910 776853 840587 727960 617578
5373 617578 687747 791207 610614 598651 655561 773162 693476 605714 594613 608234 628889
5362 628889 657471 684351 543958 617605 549934 549531 600748 670843 627203 267009 444288
5351 444288 374012 484150 589689 599844 695992 647547 585131 500458 539559 498634 454156
5340D54156J03606k1124q2085k2858J21872Q444q469q4873m6255L6869M4030n0980
5328D52333l7804L2303O1815m2455r6897P6517k1146L5410Q444o0940J9915r0446
5316C37049P5270j18710O7673j85290j48789J02445j9676Q5734O5173N0440j15181
5305A96138J95167k7272j38289q702R8495J18595j21615p6198M460J05045K6982
5294C72806j43218j5082J0515J76115j06589j02889J2832j3062J01718N337j2590
5283B85893p1287R7959L7189q8031N9833R3121M3673r6149j04024j7952n3710
5272A86515K7848J08343J02283l970j56184J32176K3824K8303J6191k09703K8813
5261B84439J78453O5584j01214J02319J2587j06556M1217J1515p5890R7658o4083
$$ plain form
5340 454156 557762 536638 454553 431695 553567 562011 553542 468669 422414 459283 503313 452333
5328 452333 414529 446832 508647 466192 369295 445812 424666 460076 468520 407580 427495 337049
5316 337049 412319 293609 361282 175992 27203 129648 109972 195706 260879 311319 196138
5305 196138 391305 364033 225744 217042 315537 434132 312517 236319 240779 345824 372806
5294 372806 229588 214506 225021 401136 294547 191658 204490 191428 293146 298483 285893
5283 285893 214606 312565 349754 261723 321556 414677 458350 362201 258177 240225 186515
5272 186515 214363 322706 424989 421019 264835 397011 420835 449138 465329 255626 284439
5261 284439 462892 528476 427262 529581 542168 435612 476829 488344 412454 510112 446029
5250D46029m5372L6314J01528O1277L1365j27724P5560j99723m6289K20614P5783
5239F29362k06460N5558M5009l9081J26311l8621J12941p3539o2422R8056j8495
5228F28619k6070K46186R3925k8870k32839n2335N8310K02199o842J02430j9296
5217I65417j70221P7510J79576j94199J25005k1433k2995M7165j8189m2225M6061
5206I71472J83967n6367n4189K2915l9058J30475P9581l2714j5792m2959J2720
5195A160051M344L9298R0869K7265j11720J41401o9217p6603O4026L0017j25705
5184A174026j28468K7875K9148l5767J48933l1203o8113q24n9518N4080j08167
5173A002002r7994Q1453r5745q5874j36539l2205J58974k3760L859p0537O1025
$$ plain form
5250 446029 400657 436971 538499 599776 631141 503417 578977 379254 332965 553579 629362
5239 629362 422902 478460 523469 484388 610699 572078 685019 611480 549058 647114 628619
5228 628619 602549 848735 942660 913790 680951 628616 686926 889125 882283 984713 965417
5217 965417 795196 872706 1052282 858083 983088 961655 938660 985825 967636 925411 971472
5206 971472 1155439 1099072 1044883 1067798 1028740 1159215 1238796 1206082 1190290 1147331 1160051
5195 1160051 1164395 1203693 1294562 1321827 1210107 1351508 1282291 1205688 1269714 1299731 1174026
5184 1174026 1045558 1073433 1102581 1066814 1215747 1184544 1116431 1115607 1056089 1110169 1002002
5173 1002002 904008 985461 889716 803842 667303 635098 794072 770312 774171 703634 764659
5162G64659J07920l8935j62940j7359l5471j06356L3407k7158J9505P2355p5215
5151E34412m492N4090j1293p4521N8486q5633N3958N5974q1252J06834k9338l113
5139E74112k3515n0162k7892m1425R5621M5448j15465J05311n3706O0689o8320
5128E00696j85417J66918J48688r5721m0393p6502L902P2073J23923o479j24664
5117D87024j07316P5275M1186J35946J54821j79317k4401K2259k5734j05463N8643
5106E32923p172o0435N5606m352J14684r3255r5268k5807J66104Q9610L6924j07340
5094F02222n8173J09244q8716l0816n9316m6610j12984J15491m6468N2756J49877
5083E86507j06436q0053J29503j8570j0413r833L9956j4416n8088l9952j1117
$$ plain form
5162 764659 872579 833644 670704 653345 617874 511518 544925 517767 537272 609627 534412
5151 534412 529920 584010 572717 498196 556682 471049 525007 580981 499729 606563 577225 574112
5139 574112 550597 500435 472543 431118 526739 572187 456722 562033 508327 569016 500696
5128 500696 315279 482197 630885 535164 494771 418269 422171 494244 618167 611688 487024
5117 487024 379708 454983 496169 632115 786936 607619 583218 605477 579743 474280 532923
5106 532923 525751 465316 520922 516570 631254 537999 442731 416924 583028 672638 709562 602222
5094 602222 544049 653293 564577 533761 474445 427835 314851 430342 383874 436630 586507
5083 586507 480071 400018 529521 510951 500538 490705 530661 516245 458157 418205 407088
5072D07088P8698P577k4566j08208J39233R4317k4307k4079K4188j08647l5801
5061D25493j0316j2405O5934J08069j44773K6798M0437Q7256N2964j15069K1718
5050E46106N4621R2989k07682J8638M9128L4804Q0302n7406J7272q083J11615
5039G32304p0568j87323l1056P0477o3955N1057M5839q8m4079J05602J9953p1325
5027E56838o1984k520N699p2349L0290M193L7410J6075r1937J08031J19056p0032
5015E78770M766n289j264O678N7410n7468l8152J02626N562j78448J08635P0413
5003F54239k9285j21731Q0512n5791M4647J75263k0563j63634J8940R6757J48512
4992H27866j82359n4914l5670p7076J09183k29577M9335J24862L401P7602k0918
$$ plain form
5072 407088 485786 493363 468797 360589 499822 594139 569832 545753 569941 461294 425493
5061 425493 415177 402772 468706 576775 432002 458800 499237 586493 639457 524388 546106
5050 546106 600727 693716 486034 504672 553800 588604 668906 611500 628772 620689 732304
5039 732304 661736 474413 443357 513834 449879 500936 546775 546687 502608 608210 628163 556838
5027 556838 494854 492334 498033 425684 455974 460167 497577 513652 421715 529746 648802 578770
5015 578770 583536 578247 576983 583661 641071 583603 545451 648077 653639 475191 583826 654239
5003 654239 624954 503223 583735 527944 572591 747854 727291 563657 582597 679354 827866
4992 827866 645507 590593 554923 477847 587030 357453 406788 531650 535051 612653 591735
4981E91735O0554j54599R8561k1867K7001J4136J10074m0918j75363N8413k8048
4970E39679K6861L9451l1057r6792j9798R7332R450j24335P9464J10621n7830
4959E73046P9218M0161q9807J14542m0379n9031K8063o2785O0356N7396j62286
4948E38494J93133q6230p094N7580O0250j64750K4908j46205P9363J39005O9911
4937G58365k8104o5188m4502O8797n2832r3916N2137Q0107q0586k9623O1401r1546
4925E34510M031P2586j02119J29629K2946K5722J78409k48677L5992O0013j2161
4914G00881j13055j10491J25675O9669j1572J33311m9254P273j39549r564J22287
4903G25611p4852N076p4749m3703K15364k912M0800j14109L5559r9673n5332J72557
$$ plain form
4981 591735 652289 497690 596251 574384 601385 615521 725595 684677 509314 567727 539679
4970 539679 566540 605991 574934 478142 458344 555676 565126 440791 520255 630876 573046
4959 573046 652264 692425 602618 717160 676781 617750 645813 583028 643384 700780 538494
4948 538494 731627 645397 638303 695883 756133 591383 616291 470086 549449 688454 758365
4937 758365 730261 665073 620571 689368 636536 542620 594757 674864 594278 564655 626056 534510
4925 534510 538541 611127 509008 638637 661583 687305 865714 617037 653029 713042 700881
4914 700881 587826 477335 603010 672679 661107 794418 745164 752437 612888 603324 725611
4903 725611 650759 655835 581086 537383 752747 749835 790635 676526 712085 612412 557080 729637
4891G29637Q0958j40911p1058p0415J79505o9575m1977K9391m6605L413O969Q9136
4879F78468K894r6865R7594P2892q6136M156o3942K7991J7180L1423n9983J58270
4867G83942P2001j49823n3521r0730N8875q4010J06018J18082K5021n3006l0025
4856G02824J29923j2978j67543m4499J16799K4195R107o1659j02761O4390R2415
4845G50213j9903K3883j2809J9821j6024M5249j20837J21431j52695O5083q0782
4834F22630j9968N7884J117o5715N7195r5373J25650N4235L6989M9757k52724
4823E71677M2555R6862M0770q8978P5198J68426k03616k2895j0414J44972J07917
4812I22474l8736j48248k5513P4976J2804J21393J8636j05568J03080L2462j25411
$$ plain form
4891 729637 810595 669684 598626 528211 707716 638141 596164 625555 578950 582363 589332 678468
4879 678468 681362 584497 682091 754983 668847 673003 609061 637052 654232 685655 625672 783942
4867 783942 855943 706120 652599 561869 620744 536734 642752 760834 785855 732849 702824
4856 702824 832747 819769 652226 607727 724526 748721 757828 696169 593408 657798 750213
4845 750213 730310 754193 741384 761205 745181 790430 669593 791024 638329 703412 622630
4834 622630 602662 660546 661663 595948 653143 557770 683420 737655 774644 824401 571677
4823 571677 614232 711094 751864 662886 738084 906510 702894 679999 669585 814557 922474
4812 922474 883738 735490 709977 784953 797757 919150 937786 832218 935298 967760 842349
4801H42349Q0938q5277l3600j06672J07574J26468Q6844R599j34999k29856J61790
4790H25158K6457j44240P2063P8437o6160K8288P9301K1325M6275l598p3389j0794
4778H79123L338P1472m929j07036O9129M2146O3462J40721q2677j36793m2339
4767H95617O9056P6486J921j9410q7772Q054M4731j185M4608k1408R5765n7685
4755A048778j30337J08593N1337m3017J0306N8317N4349L5445o2056j10807j0813
4744A010095K8930K4835Q9266M2033k8417J46747j22571J1645N5252J6519P7680
4733A352014n764J00585J34231p9386J35477N5337R1621k0519L1970J86456O3556
4722B045578J12280J94122K17097j8044O7046J20034q6828j29867k14757k03788
$$ plain form
4801 842349 923287 838010 804410 697738 805312 931780 1018624 1028223 893224 663368 825158
4790 825158 851615 707375 779438 857875 791715 820003 899304 920629 966904 963306 889917 879123
4778 879123 882461 953933 949004 841968 911097 953243 1016705 1157426 1074749 937956 895617
4767 895617 964673 1041159 1043080 1023670 935898 943952 988683 987498 1032106 1010698 1106463 1048778
4755 1048778 918441 1027034 1078371 1035354 1045660 1103977 1158326 1193771 1131715 1020908 1010095
4744 1010095 1039025 1063860 1153126 1195159 1166742 1313489 1190918 1202563 1257815 1274334 1352014
4733 1352014 1346250 1446835 1581066 1501680 1637157 1692494 1784115 1763596 1795566 1982022 2045578
4722 2045578 2157858 2351980 2569077 2551033 2618079 2738113 2651285 2521418 2306661 2102873
4712B102873j42244k4018l4246j17101j65614j2664K9923P0595p6186j01788j02166
4701A427364O859J06991R405m9075o9508J3366R5469J56674j12287K6241j03678
4690A507821k5016L5706k936J9468L8548j77539Q0835l4334K15292J28718j92804
4679A593759O9337N3306j0767k2242M9600K07554o5596J11192J44375O0930K76931
4668B468379J7063O6209J79196J25037J28647j38517q1924o2726j44508j35355
4658B421501j67051j0021m8025O4790j17271j89650J1274R6715K96658J49849
4648B508769k06782j44735j886m9616j15926j120K467j45453r435k7615J0703
4637A819371Q1498R9732L7998m5228J952L6049k251J18320p2764r4960N0125n7257
$$ plain form
4712 2102873 1960629 1936611 1902365 1785264 1619650 1606986 1636909 1707504 1631318 1529530 1427364
4701 1427364 1434223 1541214 1550619 1501544 1432036 1445402 1540871 1697545 1585258 1611499 1507821
4690 1507821 1482805 1518511 1515575 1535043 1573591 1396052 1476887 1442553 1657845 1786563 1593759
4679 1593759 1663096 1716402 1705635 1683393 1732993 1940547 1874951 1986143 2130518 2191448 2468379
4668 2468379 2485442 2551651 2730847 2855884 2984531 2846014 2764090 2701364 2556856 2421501
4658 2421501 2254450 2244429 2196404 2261194 2143923 1954273 1965547 2062262 2358920 2508769
4648 2508769 2301987 2157252 2155366 2105750 1989824 1988704 1991171 1845718 1836283 1808668 1819371
4637 1819371 1900869 2000601 2038599 1993371 1995323 2031372 2029121 2147441 2074677 1979717 2029842 1972585
4625A972585m4913J4949l485K7915L6890K4774J38669J64662L4968k4143P6933
4614B419804J39404P6820q9765m0600J23884l5221M219O8961l6851j66577L809
4603B467887j14168j54619K2566M0153K31262O1641L022o5759K70487Q3587k9771
4592B816288P7722L1020j8024K1315r8264l3095K1697m3658M8628P6836K4834
4581B925299J45898Q0671o2158J51683M3680J06186J0865n88M9731O5834k8565
4570C488536m9582j2004O0996p5406J59816O5910J0235O3278J32040J2797P6555
4559C933171M0280L0860J36356N4880J51232P1194O9261r807J12379r378J29365
4548D709793J33991P0712J83049J78669J94683J39044N5410M9145L18354L08490
$$ plain form
4625 1972585 1927672 1942621 1939136 1967051 2003941 2028715 2167384 2332046 2367014 2342871 2419804
4614 2419804 2559208 2636028 2546263 2505663 2629547 2594326 2598545 2667506 2630655 2464078 2467887
4603 2467887 2353719 2199100 2221666 2261819 2493081 2554722 2557744 2491985 2762472 2846059 2816288
4592 2816288 2894010 2925030 2907006 2928321 2830057 2796962 2818659 2775001 2823629 2900465 2925299
4581 2925299 3071197 3151868 3089710 3241393 3285073 3391259 3402124 3401536 3451267 3517101 3488536
4570 3488536 3438954 3426950 3487946 3412540 3572356 3638266 3648501 3711779 3843819 3856616 3933171
4559 3933171 3973451 4004311 4140667 4195547 4346779 4417973 4487234 4477427 4589806 4580428 4709793
4548 4709793 4843784 4914496 5097545 5276214 5470897 5609941 5665351 5714496 6032850 6341340
4538F341340N4274K90717K30522L01728O4511j79421j23367j23434n5225m7575
4528F754070p9835R2718O3643K46301j49770L6895J54192O2958N2925j1642P8371
4517G300826K28804J53983J25796K55960Q4193J67650J24621K23137L85995K35724
4507I286689K77198K32638L43934M26545M18110L66902L64843L16814L69434K38215
4497A2641322K68785K18651L02448Q9916J64281K78747Q0226K17603K36642M27132
4487A4925753J97779J96792L50606M75599L08236M97217O39752O07515L21816
4478A8521065N97256N90247O02711O61615O21091O30877O65657P09039J019065
4469B4618623R76932R77650J083541J182696J331615J286218J329116J492758
$$ plain form
4538 6341340 6395614 6686331 6916853 7218581 7283092 7103671 6980304 6856870 6801645 6754070
4528 6754070 6674235 6766953 6830596 7076897 6927127 6964022 7118214 7181172 7234097 7222455 7300826
4517 7300826 7529630 7683613 7809409 8065369 8149562 8317212 8441833 8664970 9050965 9286689
4507 9286689 9563887 9796525 10140459 10567004 10985114 11352016 11716859 12033673 12403107 12641322
4497 12641322 12910107 13128758 13431206 13521122 13685403 13964150 14044376 14261979 14498621 14925753
4487 14925753 15123532 15320324 15670930 16146529 16454765 16951982 17591734 18199249 18521065
4478 18521065 19118321 19708568 20311279 20972894 21593985 22224862 22890519 23599558 24618623
4469 24618623 25595555 26573205 27656746 28839442 30171057 31457275 32786391 34279149
4461C4279149J607701J811640K108381K193154K480375K388860K746931L513207
4453E3129398M019720M803815N716731O970751Q149734R546957J0773105J2452039
4445A15562250J4299259J6060639J8605196K2331516K6863102L1441270L2492114
4438B77655346K5025998P949213j2007559k7946685l6545563l5893934l0097685
4431A68139131k3045603j7265669j3418696j0594267q584885p633649o584487
4424H1011875n421935m522511l666818l033624k624378k365631k016566j644882
4416E5715530j349519j186831p71324l73521l09941j41309o6215L87428L11817
4407E2216115M07211N48702Q39794J156448J133860J267480J481065K066219K371978
$$ plain form
4461 34279149 35886850 37698490 39806871 42000025 44480400 46869260 49616191 53129398
4453 53129398 57149118 61952933 67669664 74640415 82790149 92337106 103110211 115562250
4445 115562250 129861509 145922148 164527344 186858860 213721962 245163232 277655346
4438 277655346 302681344 310630557 298622998 270676313 234130750 198236816 168139131
4431 168139131 145093528 127827859 114409163 103814896 95230011 87596362 81011875
4424 81011875 75589940 71067429 67400611 64366987 61742609 59376978 57360412 55715530
4416 55715530 54366011 53179180 52407856 52034335 51724394 51583085 51516870 51904298 52216115
4407 52216115 52623326 53172028 54011822 55168270 56302130 57569610 59050675 61116894 63488872
4398F3488872L113553L833944M704527N850871O934636Q331708R838837J1540284
4390A17637232J3144292J5034285J7532303K0580756K4448195K8214290K8718298
4383B65309651K3020621J0587369o176604k1611125l1474340l4153481l1055557
4376A74446534k5433195j9833911j5414148j2457141j0249107q583433p163850
4369G5311749o125327n295091m505244l898173l407863l087938k720905k338809
4361D3932399k187843k132421j688357j442915j494709j235644j160837j236858
4353C1352815r80034j104029r71473q44332q85822p57159q65141r02942q40355
4344B3201528p39689p54174n89284m95281o44390n17114m56062n20615m97927
$$ plain form
4398 63488872 66602425 70436369 75140896 80991767 87926403 96258111 106096948 117637232
4390 117637232 130781524 145815809 163348112 183928868 208377063 236591353 265309651
4383 265309651 288330272 298917641 292741037 271129912 239655572 205502091 174446534
4376 174446534 149013339 129179428 113765280 101308139 91059032 82475599 75311749
4369 75311749 69186422 63891331 59386087 55487914 52080051 48992113 46271208 43932399
4361 43932399 41744556 39612135 37923778 36480863 34986154 33750510 32589673 31352815
4353 31352815 30372781 29268752 28297279 27452947 26567125 25809966 24944825 24041883 23201528
4344 23201528 22461839 21707665 21118381 20623100 19978710 19461596 19005534 18484919 17986992
4335A7986992m87762l27296l72153l18619o36297m12228m05619l98629l88320
4326A4240069n21767k12086l15058l02830k88110k37842k86842r9664l30105l72930
4316A1272835k79504k03417p6058k01919j04649l5475J0127k58032l37784k16045
4306I570079j58763k31268j41047n9697j23532k28812j86872n0944j95871p5081
4296H118192j69997j28010k98084j58941j34729O4403o2913k35692k18712n707
4286F769810r0219J5896o872j59495N126j81106k10771k0104j49319p6536k46775
4275E649635K5644l594k09436Q038o0396n8583j37613j42201L2574o596j23656
4264D973816j04010j65736r9839M1816L549j77207M9816J2156k1504j45295J05943
$$ plain form
4335 17986992 17499230 17171934 16799781 16481162 15844865 15432637 15027018 14628389 14240069
4326 14240069 13718302 13506216 13191158 12888328 12600218 12362376 12075534 11975870 11645765 11272835
4316 11272835 10993331 10789914 10713856 10511937 10407288 10371813 10381940 10123908 9786124 9570079
4306 9570079 9411316 9180048 9039001 8979304 8855772 8626960 8440088 8389144 8193273 8118192
4296 8118192 7948195 7820185 7522101 7363160 7228431 7292834 7229921 6994229 6775517 6769810
4286 6769810 6679591 6695487 6688615 6529120 6534246 6353140 6142369 6122265 5972946 5896410 5649635
4275 5649635 5675279 5671685 5462249 5470287 5409891 5351308 5213695 5071494 5104068 5097472 4973816
4264 4973816 4869806 4704070 4604231 4646047 4649596 4472389 4522205 4534361 4512857 4367562 4473505
4253D473505K6388j79046L3134r863j47765k5606J8746n366k2718j51388k4593
4242C985428L604j51298K9569M7025Q833J98579j52606j29387j5316j07653j27274
4231C589504M1440L6217j76178J1807K22444j05961K6708J3918j91685O2960j9948
4220C511226K970J60130R581j43281j49049j00850R6376M2731j4242l6114J12588
4209C492066K0270J35462k03979J5173p5649M9048M2750R0768j5762J50P456k4830
4197C532923O2421O5451Q7722o1760R777P5063M2293J8222N7383j126J74360k1742
4185D040987Q8129k7491l0588N4441O2361R8888L1061M0795n4099K15652L6413
4174D556549n1145R9032m013J2347J71398Q5663K91633P0622J25878J13084J86378
$$ plain form
4253 4473505 4499893 4320847 4353981 4344118 4196353 4170747 4189493 4184127 4161409 4010021 3985428
4242 3985428 3989032 3837734 3867303 3914328 3923161 4121740 3969134 3839747 3824431 3716778 3589504
4231 3589504 3630944 3667161 3490983 3502790 3725234 3619273 3645981 3659899 3468214 3531174 3511226
4220 3511226 3514196 3674326 3683907 3540626 3391577 3290727 3387103 3429834 3415592 3379478 3492066
4209 3492066 3512336 3647798 3443819 3458992 3383343 3432391 3475141 3565909 3550147 3550297 3557753 3532923
4197 3532923 3595344 3660795 3748517 3686757 3696534 3771597 3813890 3832112 3889495 3888369 4062729 4040987
4185 4040987 4129116 4101625 4071037 4125478 4187839 4286727 4317788 4358583 4304484 4520136 4556549
4174 4556549 4505404 4604436 4600423 4612770 4784168 4869831 5161464 5232086 5357964 5471048 5657426
4163E657426J29519J67583K29783K31000L48266L49905J52243J55725K97022L72647
4153H091119K50498j73076k7356m0434R4907J04741q6100r5978O2495K62783J89986
4142H633585J9553J32112J77644K44998J99263K13213P4795K04476K71987K13730
4132A0385356L01673K88540Q2779L40962K57434L05071J13201L33804M22408J62070
4122A2993298J08651L51148L62560L55034J76899L17422K79495N0069P7471o6155
4112A5005892R47L1645j12718j65593O7019J48088Q2793K9175J52258K55964N12933
4101A6008403L62691L88575L42743L97974M61864M08110J51125Q9222J08563o3219
4091A8656051J28803J55541m9199K7465J43482m802J32964j08234j31411n2480
$$ plain form
4163 5657426 5786945 5954528 6184311 6415311 6763577 7113482 7265725 7421450 7718472 8091119
4153 8091119 8341617 8168541 8141185 8100751 8195658 8300399 8214299 8118321 8180816 8443599 8633585
4142 8633585 8653138 8785250 8962894 9207892 9407155 9620368 9695163 9899639 10171626 10385356
4132 10385356 10687029 10975569 11058348 11399310 11656744 11961815 12075016 12408820 12831228 12993298
4122 12993298 13101949 13453097 13815657 14170691 14347590 14665012 14944507 14994576 15072047 15005892
4112 15005892 15006839 15038484 14925766 14760173 14827192 14975280 15058073 15087248 15239506 15495470 16008403
4101 16008403 16371094 16759669 17102412 17500386 17962250 18370360 18521485 18610707 18719270 18656051
4091 18656051 18784854 18940395 18891196 18918661 19062143 19057341 19190305 19082071 18950660 18898180
4081A8898180j34390J3416N4589j47987q4678j68075N7952k1128j80030j12191
4071A8175658O4797o6741P185J8986j44745M7822J81583K2359J31576M3665L03701
4060A8785846L20262J59998J25201J3033J58355J40276J70661J53972K14969J59959
4050B0402532K31959J04549J47170K84817J17421K73505L84476J24409K00273
4041B2271111K11820K54746J18836J83506J98651R7383K06014L00445L08322K67477
4031B4418311J76442L16542M89573O67287N18104M37319N14411O60168O32294
4022B8830451O13920O76652Q25040N25864N18737M01223K80684K06219K42905
4013C3121695J54590J08457K0052j31970j29983j30147j51159j10305p3306k58243
$$ plain form
4081 18898180 18763790 18777206 18831795 18683808 18599130 18431055 18489007 18467879 18287849 18175658
4071 18175658 18240455 18173714 18180899 18199885 18055140 18102962 18284545 18306904 18438480 18482145 18785846
4060 18785846 19106108 19266106 19391307 19404340 19562695 19702971 19873632 20027604 20242573 20402532
4050 20402532 20634491 20739040 20886210 21171027 21288448 21561953 21946429 22070838 22271111
4041 22271111 22482931 22737677 22856513 23040019 23238670 23336053 23542067 23842512 24150834 24418311
4031 24418311 24594753 24911295 25400868 26068155 26586259 27023578 27537989 28198157 28830451
4022 28830451 29444371 30121023 30946063 31471927 31990664 32391887 32672571 32878790 33121695
4013 33121695 33276285 33384742 33404794 33272824 33142841 33012694 32861535 32751230 32677924 32419681
4003C2419681j82837j59731m6486Q2535L6339J83879L17404L75876O01947O48972
3993C4277579P33534R39560R27269J265148J229694J233518Q07907q5766q04355
3984D0524088j581758j610373j732603j520585j133349j023561r86800q59469
3976C0075590p37286p66029p66422n80059n10064l68620k58454j27614k1399j86918
3966B5752725l1431j01021j48494Q799p6988j76203J67314K11735L08710K91070
3956B6206216N84943O52223O41375P72266P30569P86824Q44244O19779N85894
3947C2424333N31652J89293n791r9617j99262l0816k72594l09624j41660j70699
3937C1915215o7120O788K83451J69280L24624L39287M58813M09265M89570N91687
$$ plain form
4003 32419681 32236844 32077113 32030627 32113162 32149501 32333380 32650784 33026660 33628607 34277579
3993 34277579 35011113 35950673 36877942 38143090 39372784 40606302 41414209 41328443 40524088
3984 40524088 38942330 37331957 35599354 34078769 32945420 31921859 30935059 30075590
3976 30075590 29338304 28572275 27805853 27225794 26715730 26347110 26088656 25961042 25939643 25752725
3966 25752725 25721294 25620273 25471779 25480578 25403590 25227387 25394701 25606436 25915146 26206216
3956 26206216 26791159 27443382 28084757 28857023 29587592 30374416 31218660 31838439 32424333
3947 32424333 32955985 33145278 33139487 33039870 32840608 32809792 32537198 32227574 32085914 31915215
3937 31915215 31848095 31854883 32138334 32307614 32632238 32971525 33430338 33839603 34329173 34920860
3927C4920860M67594L69905K31878q3482k84180l37143m78223k86888l55703m07768
3917C3756850l52937l55073o81322n26788m29811o14137m35380m98950n51848
3908B9310604o85920o82119m69430l64092m46799l15009m18878l60209m73041
3899B5095107j56939k02259j40226j57181j37115j17846j04887R0067N4834k29598
3889B3993957N2628r3534l0398n575k33866j32932n9368l11676k28812k46346
3879B2704078k28081k95495j30485j9947j49533K7187j66499O711j9089J07574
3869B1836421J02978n1921K34030K34352L16203L22474L90685M97232L77588N71161
3859B4831203O94921P16929P81296O38178R07498J178845R70993N38689P4875
$$ plain form
3927 34920860 35388454 35758359 35990237 35906755 35622575 35285432 34807209 34520321 34164618 33756850
3917 33756850 33403913 33048840 32367518 31840730 31410919 30796782 30361402 29862452 29310604
3908 29310604 28624684 27942565 27473135 27109043 26662244 26347235 25928357 25568148 25095107
3899 25095107 24938168 24735909 24595683 24438502 24301387 24183541 24078654 24168721 24223555 23993957
3889 23993957 24046585 23953051 23922653 23917078 23683212 23550280 23490912 23179236 22950424 22704078
3879 22704078 22475997 22180502 22050017 22030070 21880537 21907724 21741225 21747936 21728847 21836421
3869 21836421 21939399 21887478 22121508 22355860 22672063 22994537 23385222 23882454 24260042 24831203
3859 24831203 25526124 26243053 27024349 27662527 28570025 29748870 30719863 31258552 31333427
3850C1333427k47537l69566k23388m53003q728J66821K92887M71321O61807N29561
3840C2153602L96792K13351j87126n39750j102648j544296j752853j559694j478170
3831B4599208j435997j427840r82256q31858r61753n73834o23346m39527l93944
3822A6928853j73616k88312j92410r2742r5363j87444l5406J31214l9816n5700
3812A5899258m7360j25840k2256k50425k96697l65311l54943k22684k47545k74085
3802A3692112l20178k64350j96408l09552k85579K5539j66393k51394k04424l10272
3792A1409101k6286L9977k47743j06367J4366j1880j97631k8776j09453J30902
3782A0866210M4816p8869J10227j1916K5543j96748k01045k16569o8556p2171
$$ plain form
3850 31333427 31085890 30716324 30492936 30039933 30031205 30198026 30490913 30962234 31624041 32153602
3840 32153602 32550394 32763745 32576619 32036869 30934221 29389925 27637072 26077378 24599208
3831 24599208 23163211 21735371 20753115 19921257 18959504 18385670 17762324 17322797 16928853
3822 16928853 16755237 16466925 16274515 16181773 16086410 15898966 15863560 15994774 15954958 15899258
3812 15899258 15851898 15726058 15703802 15453377 15156680 14791369 14436426 14213742 13966197 13692112
3802 13692112 13371934 13107584 12911176 12601624 12316045 12341584 12175191 11923797 11719373 11409101
3792 11409101 11382815 11422792 11175049 11068682 11083048 11071168 10873537 10844761 10735308 10866210
3782 10866210 10911026 10832157 10942384 10930468 10956011 10759263 10558218 10341649 10273093 10200922
3772A0200922l2807o5368k36945L7948M2711o6514N4772K69855m3035J10014L48342
3761A0619895J68882K1175M3848J6361J18661J06014J65019L7718K2517K27953
3751A1548043L98903J50736K31033K44345J62949K10142K99953N29252K64665
3742A4040021L50306M38920N35447M70252O77142Q00489Q74148O89087Q75746
3733A9751558J083801J169678J237890J308556J643784J925136K012185K449202
3725C2581790K519203L009547L479853L850681M304320M676123M946609N422205
3717F4790331N472112N118161M098919J562077j020281l663982n661916o763104
3709F3932317o313793n775916n288396m496738l816573l234064k815341k456095
$$ plain form
3772 10200922 10168115 10102747 9865802 9903750 9946461 9879947 9934719 10204574 10161539 10271553 10619895
3761 10619895 10788777 10809952 10853800 10870161 10988822 11094836 11259855 11297573 11320090 11548043
3751 11548043 11946946 12097682 12328715 12573060 12736009 12946151 13246104 13775356 14040021
3742 14040021 14390327 14829247 15364694 15834946 16512088 17312577 18186725 18875812 19751558
3733 19751558 20835359 22005037 23242927 24551483 26195267 28120403 30132588 32581790
3725 32581790 35100993 38110540 41590393 45441074 49745394 54421517 59368126 64790331
3717 64790331 70262443 75380604 79479523 81041600 80021319 76357337 70695421 63932317
3709 63932317 57618524 51842608 46554212 42057474 38240901 35006837 32191496 29735401
3701B9735401k184333j932553j694023j529914j444345j101841j149172r59051
3693A7740169p72427q09952p62489p55992o95750n55496m85206m89575l53812
3684A2059470m43735l20513l55186k77726l52057m34551l27775k92775k50406
3675I004746l43739l48861j95672k16797j50338j41921k66888q8360j12865m07223
3665F732082j84159j13820j45264q4582j39821j45541p1800j07870k43205o2705
3655E433315K417n9082m1833k84863j21931Q255j79464k54221o6602j89801J09550
3644D355740j46235m9304j00285j33907j08630k37250q3548n7343m0015L1954
3634C431177n0837n6131M0708j09438j28795j7509L2539l1325j07264k3033P571
$$ plain form
3701 29735401 27551068 25618515 23924492 22394578 20950233 19848392 18699220 17740169
3693 17740169 16967742 16157790 15395301 14639309 13943559 13388063 12902857 12413282 12059470
3684 12059470 11615735 11295222 10940036 10662310 10310253 9875702 9547927 9255152 9004746
3675 9004746 8661007 8312146 8116474 7899677 7749339 7607418 7340530 7252170 7139305 6732082
3665 6732082 6547923 6434103 6288839 6204257 6064436 5918895 5847095 5739225 5496020 5433315
3655 5433315 5435732 5376650 5334817 5049954 4928023 4936278 4756814 4502593 4435991 4246190 4355740
3644 4355740 4209505 4160201 4059916 3926009 3817379 3580129 3496581 3439238 3399223 3431177
3634 3431177 3380340 3324209 3364917 3255479 3126684 3109175 3141714 3110389 3003125 2980092 2987663
3623B987663r0973m5616K7162M3234j06676q0531l0612r6571k0715n6773j0866
3612B518726J31224j27305j6130j7568j16793o1470J21278n7109J58582k15525
3602B317910p0148K4397p5574J06321N4982j67392j65312N1345N8481M8404O4019
3591B247433j30563K5742q9947L1441j78449j63192J27599p8951N3297l284n9328
3580A781798m0246j03936j53884J20017o5206N7500J37327o057j62244L4170J39467
3569A738706o3940j31722J79136J24875q1865r664R1443P6419q0354P7039K9177
3558A949250r1052j59272J5758L4847j06986j43652m3894j69041j71790J11090
3548A225258K9441p715j43482o2703L5492M5107K7815j63785o7059K9723J95219
$$ plain form
3623 2987663 2896690 2851074 2878236 2921470 2814794 2734263 2703651 2607080 2586365 2529592 2518726
3612 2518726 2649950 2522645 2506515 2488947 2372154 2310684 2431962 2374853 2533435 2317910
3602 2317910 2247762 2272159 2196585 2302906 2357888 2190496 2025184 2076529 2135010 2183414 2247433
3591 2247433 2116870 2142612 2052665 2084106 1905657 1742465 1870064 1791113 1844410 1841126 1781798
3580 1781798 1741552 1637616 1483732 1603749 1538543 1596043 1733370 1727313 1565069 1599239 1738706
3569 1738706 1674766 1543044 1722180 1847055 1765190 1755526 1846969 1923388 1843034 1920073 1949250
3558 1949250 1858198 1698926 1714684 1749531 1642545 1498893 1454999 1285958 1114168 1225258
3548 1225258 1254699 1246984 1103502 1040799 1076291 1121398 1149213 985428 918369 948092 1143311
3537A143311o8942k5452j19379O4635J9533j39462m9429k3437J00330m0744j09204
3526G51760J7816n0250N586J8005N1066n5078j73483L8777J92488j9919j10671
3515F66097J00952r4632j69423M1442o8783o1402J71304k5153n0856J28676J08245
3504G46467r3693K0463j33531o6793r1691J15846j0297P6795J08937n5890l2639
3493E83974M6572P6489j55730N0555o3435q3651K21537K3632o4120K08228j10370
3482G33681L56N9178q7428K2109J6692Q2300j28961n609J00076q726j34988j8844
3470F29836Q8448N1622j75575j16093P8149k0962k8092M9260L6653O1467J13761
3459G68474j39987l582J42740M1442k4597O4263j4846r8279J16843Q6006j07272
$$ plain form
3537 1143311 1074369 1048917 929538 994173 1013706 874244 824815 801378 901708 860964 751760
3526 751760 769576 719326 724912 742917 793983 738905 565422 604199 796687 776768 666097
3515 666097 767049 672417 502994 544436 475653 414251 585555 560402 509546 638222 746467
3504 746467 652774 673237 539706 472913 381222 497068 486771 563566 672503 616613 583974
3493 583974 630546 707035 551305 601860 538425 454774 676311 699943 635823 844051 733681
3482 733681 734037 793215 705787 727896 744588 826888 697927 692318 792394 783668 648680 629836
3470 629836 718284 769906 594331 478238 556387 535425 507333 556593 593246 654713 768474
3459 768474 628487 624905 767645 809087 784490 848753 833907 735628 852471 938477 831205
3448H31205n8970R3800r2515J70998j24967p7411O8167m5591j67520J25991p4586
3437F48601o2660j1309j59228P4512P8471J5093j7003J51529m6117L0774l2965
3426F69698O2226j11127L8679j19750R9403K2894o0399N8253j9682R0973J18988
3415H50156L2084M5084P3506M3676J77207q939j74761k48477q9248M732r8518
3404F06502Q3010J3308j03273J19585j01067j36443P2445R2152p2519J45633P2217
3393G91550n3234N6631J65337P3061P7260N4082L5083J11284J75099R7653K35713
3382A819519p6122k45248N5884j56919j45561j11938j87560j43898j09067o6873
3372F32217J10580M9662j21141j12678n8012k1617K036J13805K729n5107J60116
$$ plain form
3448 831205 772235 866035 773520 944518 819551 742140 810307 764716 597196 723187 648601
3437 648601 585941 574632 415404 489916 568387 583480 566477 718006 671889 702663 669698
3426 669698 731924 620797 659476 539726 639129 662023 601624 659877 640195 731168 850156
3415 850156 882240 927324 1000830 1044506 1221713 1212774 1038013 789536 700288 705020 606502
3404 606502 689512 702820 599547 719132 618065 481622 554067 646219 573700 719333 791550
3393 791550 738316 794947 960284 1033345 1110605 1164687 1199770 1311054 1486153 1583806 1819519
3382 1819519 1743397 1498149 1554033 1397114 1251553 1139615 952055 808157 699090 632217
3372 632217 742797 792459 671318 558640 500628 479011 481047 594852 597581 542474 702590
3361G02590L1900j8033l5324K4941o0369J44689J29888M9088O1570K0356R835
3350A061131K4593j83037j86869L2795q9107j20843p0829J0317o083k7790L3207
3339D77485L1720L0019K3252N4887j43053j00480J9790q960J24540l0755j39572
3328C38873P3842L9389O2734J11984m9161j1065l1949J1154j08868k000o747p9883
3316C48303L9387R4009K3291l6608j80087l7162O4891l9801R1849N178n1301j10652
3304B11297J092j2455K0223r8004Q5603l7984K8332n6398K92p2817J06227O5862
3292B41270j18903r6511J19311M2107q7920l1017n094K3271M1644N5419r8471
3281H5106j42335M8244m2543M347J21082L6088K7865j63666m570J08785r861l7998
$$ plain form
3361 702590 734490 716457 681133 706074 645705 790394 920282 969370 1030940 1051296 1061131
3350 1061131 1085724 902687 715818 748613 659506 538663 467834 478151 472068 444278 477485
3339 477485 509205 539224 562476 617363 474310 373830 393620 384660 509200 478445 338873
3328 338873 412715 452104 514838 626822 577661 566596 534647 545801 436933 434933 428186 348303
3316 348303 387690 481699 504990 468382 288295 251133 316024 276223 368072 373250 321949 211297
3304 211297 212389 199934 220157 122153 207756 169772 198104 141706 141998 69181 175408 241270
3292 241270 122367 25856 145167 187274 99354 68337 63243 86514 128158 183577 85106
3281 85106 -57229 -8985 -51528 -47181 73901 109989 137854 -25812 -30382 78403 68542 30544
3269C0544K1151j38676O8520o0449J890J25628o0553j45113J64614n460K3767
3258B5863n4389J8761O6085n9106p9199l107l8775j0669P833l5275J34026L8887
3246A0935J772m8098q1820O5164J1828M2015m2464o0187p5735N9682J31316M2913
3234E7321p3203J37412j24479p3472j30075P0758O6892J65159k2984j09817O7483
3223C0995o0399J41110P058j55766J62718o4704q7158J63246p2634m1007n5081
3212c1622O6646m7197k8213L0334j0300N4829l1004k0595J01925o4668K9051Q4488
3200A33674n2025m3511J83988p6545p634L3543j12332K6016R8301q8393j31475
3189c6393J05924Q3858j4278l8967p3172R509r0992l6881P4548N4849P3563N922
$$ plain form
3269 30544 51695 -86981 -18461 -78910 -77020 48608 -11945 -157058 7556 2096 25863
3258 25863 -28526 -9765 56320 -2786 -81985 -85092 -123867 -134536 -126703 -161978 -27952 10935
3246 10935 12707 -35391 -117211 -52047 -40219 1796 -40668 -100855 -176590 -116908 14408 57321
3234 57321 -15882 121530 -2949 -76421 -206496 -135738 -68846 96313 73329 -36488 30995
3223 30995 -29404 111706 118764 -37002 125716 61012 -26146 137100 64466 23459 -31622
3212 -31622 35024 -12173 -40386 -10052 -20352 34477 3473 -17122 84803 20135 49186 133674
3200 133674 81649 38138 222126 145581 137947 171490 59158 85174 183475 95082 -36393
3189 -36393 69531 153389 139111 100144 26972 36481 -54511 -91392 -16844 38005 111568 117490
3177A17490J19627j61141j44965J77196J8771m510j1675J79257j26069p1j5288
3166A48622L5171k4402j14082o4505K30645R9269r282j50912N0756J59815n4176
3155C06919l9298p1372J22410l0804r4352O7538Q1659Q0971J75587L2435j26637
3144E05056J85841L4614j69481m4392N2261N3550p9880J76666Q8327n4293k00103
3133E48166N8534J26422R7020N6770q8595J5820J73531l9188k3671k6302M6963
3122I45470j0247J6665J20581K3344L6124q5680l3866J09783J68115K45034n3405
3111A481918l8294K8609K5186K1498P0958N4873K3868J40793Q0018J52625J7723
3100B059775O5157J22539J54956K51670J93127J56849J8057K3390K39817P7744
$$ plain form
3177 117490 237117 75976 -68989 108207 126978 122468 110793 290050 163981 163910 148622
3166 148622 183793 159391 45309 -19196 211449 310718 301436 150524 201280 361095 306919
3155 306919 267621 196249 318659 287855 193503 261041 342700 423671 599258 631693 505056
3144 505056 690897 725511 556030 511638 563899 617449 537569 714235 802562 748269 548166
3133 548166 606700 733122 830142 886912 798317 814137 987668 948480 924809 898507 945470
3122 945470 935223 951888 1072469 1095813 1131937 1046257 1012391 1122174 1290289 1535323 1481918
3111 1481918 1443624 1472233 1497419 1518917 1589875 1644748 1668616 1809409 1889427 2042052 2059775
3100 2059775 2124932 2247471 2402427 2654097 2847224 3004073 3022130 3045520 3285337 3363081
3090C363081N5347J82209K87054J61502N1595J04525J9471j49295k6587k17467
3080C831435j11480k13868l28930j21746J7074k51081o9182l0145k80518p0536
3070B371023j00263R79j04315k7201m6606j95741L591m6528r6976l8056m9509
3059A670398m0699J2455k9333p7390m7109o8347j2714j13262K4289J5008n7565
3048A275731l0093n8680n6840j4073j4419L096J4595J00333l2024j48195k1568
3037A017863q417j48286Q7326j31818R4105J71409k4360j16138l9841J5880o2723
3026H55000j4348p2531j11256O7485K4146m7517j27579L4592L2552q8865J29454
3015F81133J2260k46248Q0763L6012j15173K66946R2884j69637l4748j06758J8879
$$ plain form
3090 3363081 3418428 3600637 3887691 4049193 4100788 4205313 4224784 4075489 4048902 3831435
3080 3831435 3719955 3506087 3177157 3055411 3072485 2821404 2752222 2722077 2441559 2371023
3070 2371023 2270760 2271739 2167424 2140223 2093617 1897876 1901467 1854939 1757963 1719907 1670398
3059 1670398 1629699 1642154 1612821 1535431 1488322 1419975 1407261 1293999 1318288 1333296 1275731
3048 1275731 1245638 1186958 1130118 1116045 1101626 1104722 1119317 1219650 1187626 1039431 1017863
3037 1017863 1009446 861160 948486 816668 910773 1082182 1057822 941684 901843 917723 855000
3026 855000 840652 768121 656865 724350 748496 700979 573400 607992 640544 551679 681133
3015 681133 693393 447145 527908 563920 448747 715693 808577 638940 604192 497434 516313
3004E16313p1437k7814J00459j67539J10737J27359l9334p3496j7581K4015q0487
2993D01195j18679m238l2294M6488r3376p0177J16259Q7488m4039J8736K3520
2982C30883N7486j49600J665q545p6686J1333k1306J12708k4138o8805Q993m3654
2970A30334Q0192r1529j17075j21673K13661L7236K4694l0719q8893J11694r5685
2959E2237P723Q719M4833m1733K9349p0029n1446J66749J34j47857m8818P8828
2947B8689j26762j22935K57189L6115j46005M4675N6858L1538p8780J3314L1231
2936B5127q4550P7276L793o3726J3259j14805N2415Q2848j16071L5492N8561O940
2924b3441n5000L4376N2583M203N8876J5880m4382K3648j8461L7586r4426o8546
$$ plain form
3004 516313 444876 417062 517521 349982 460719 588078 548744 475248 457667 481682 401195
2993 401195 282516 278278 245984 292472 199096 128919 245178 332666 288627 307363 330883
2982 330883 388369 238769 240434 231889 155203 166536 145230 257938 233800 164995 173988 130334
2970 130334 210526 118997 1922 -119751 93910 131146 155840 125121 36228 147922 52237
2959 52237 59960 68679 113512 71779 101128 31099 -20347 146402 146536 -1321 -50139 28689
2947 28689 -98073 -221008 36181 72296 -73709 -29034 27824 59362 -19418 -6104 25127
2936 25127 -59423 17853 21646 -42080 -28821 -143626 -91211 -8363 -124434 -88942 -30381 -23441
2924 -23441 -78441 -44065 8518 12721 71597 87477 43095 66743 48282 85868 -8558 -77104
2912g7104k8358P8693P0477q5554m7467J4572J13213J5639Q3210O521k44219L1070
2900f9307J21318j21275j03119O6859P0915O4753J23683j14771o1869R7693L6750
2889A11630p26R3153N3551j29506Q6622N2496N0480m709L4176M9801m9824R7422
2877D44566J25414N1758N1442M7724r9966M8733p2180m3812N0760J4461k7689
2866E91211j29640p2510K25442J46199k8242r3534k8481j5018K6434q1995J10348
2855F50214O4025P9608M9741j01515J61345j23431M977j0244K57848J75758Q2655
2844A290981L7383P9934M1228j5876J6470j3143j70617m0630O8036P3238P9736
2833A446740q6299P804o2446j67894j04281q0637q7604K2468j26744q6134q332
$$ plain form
2912 -77104 -105462 -26769 43708 -41846 -89313 -74741 38472 54111 137321 143842 -100377 -69307
2900 -69307 52011 -69264 -172383 -105524 -34609 30144 153827 39056 -22813 74880 111630
2889 111630 110904 204057 257608 128102 214724 267220 317700 312991 347167 396968 347144 444566
2877 444566 569980 621738 673180 720904 620938 669671 597491 553679 604439 618900 591211
2866 591211 461571 389061 614503 760702 732460 638926 610445 595427 621861 539866 650214
2855 650214 714239 793847 843588 742073 903418 779987 784964 774720 1032568 1208326 1290981
2844 1290981 1328364 1408298 1449526 1433650 1450120 1436977 1266360 1225730 1293766 1367004 1446740
2833 1446740 1360441 1368245 1305799 1137905 1033624 952987 865383 887851 761107 674973 666641
2822F66641L8432O472j4176n7329J96573J3989K34p007Q3181N7959Q2632L9053
2810A106654j10230L1043o0673Q3738q0516k3439J70754K9786k91619j32634P5248
2799G98112j6268p8454k0709p9173K1926O2227N6101j35183J0993K1549j72107
2788D69014P3843L2837M7142q5041J1128O1594N7308J1552M6070q4081K2457o2548
2776F01275l0252N5424l9297o7753m5869q7413Q7646J42548m3460P7333m4441
2765F05741j64463L8031j26531O5021L2353l8933O7285l6373q4924k6948J80009
2754E10268l5493j5250J5016K2176m6608l8990O6377r1303m6334m990r7591K2441
2742B59719J2085K8583J57422P3799j75244k1237k9428J18169j20998m6229M1646
$$ plain form
2822 666641 705073 711545 697369 640040 836613 850602 850836 843829 927010 984969 1067601 1106654
2810 1106654 996424 1027467 966794 1050532 970016 946577 1117331 1147117 855498 722864 798112
2799 798112 781844 703390 682681 603508 625434 687661 743762 608579 619572 641121 469014
2788 469014 542857 575694 622836 537795 548923 610517 667825 679377 725447 641366 663823 601275
2776 601275 571023 626447 587150 519397 473528 386115 473761 616309 572849 650182 605741
2765 605741 441278 479309 352778 417799 450152 411219 478504 442131 357207 330259 510268
2754 510268 474775 459525 474541 496717 450109 411119 477496 386193 339859 334869 237278 259719
2742 259719 271804 300387 457809 531608 356364 335127 305699 423868 302870 256641 298287
2731B98287j33170k3489K4134r5768Q646n5822j9241Q7343P1510n7872n6444J5134
2719F3248K8002N4680R981K407r8799l0257l6860J74613j19258k80915J66444
2708f6714P1979j10920j18118J98108m9687j45140j35292K11374R4560j78956
2698b28806M9988p3553R1351K8479J2399p0721J36031k0037o2225k7532R681J2257
2686a42688n4557n1260J02901o5151m8510O6338p1757R100J3045J46464p7606
2675a73681O8868J0281k63972N2132J44626n9700p6739J732R0061m9008O5573
2664a89827L8253k4357k2208o0176l0500j0137n475N5921L5083k03641J3447N7826
2652c45791P6069L0705O2620m1823J19290N6970k14862P0052o898J2213j19508
$$ plain form
2731 298287 165117 141628 165762 69994 78640 22818 3577 90920 162430 104558 48114 63248
2719 63248 91250 145930 155911 158318 59519 29262 -7598 167015 47757 -233158 -66714
2708 -66714 5265 -105655 -223773 -25665 -75352 -220492 -355784 -144410 -49850 -228806
2698 -228806 -178818 -252371 -161020 -132541 -120142 -190863 -54832 -74869 -137094 -164626 -154945 -142688
2686 -142688 -197245 -248505 -145604 -210755 -259265 -192927 -264684 -255584 -242539 -96075 -173681
2675 -173681 -104813 -94532 -358504 -306372 -161746 -221446 -298185 -296453 -206392 -255400 -189827
2664 -189827 -151574 -175931 -198139 -258315 -288815 -298952 -304427 -248506 -213423 -417064 -403617 -345791
2652 -345791 -269722 -239017 -176397 -218220 -98930 -41960 -256822 -186770 -193668 -181455 -300963
2641c00963K3541J02247j66030J68277J55527r9907j09972j09328r960O237r9932
2630d40263J52605q2652K12301j28829q2503q7976M2336J02721j7787Q1163o468
2619b55352O6017m6922R7181l7847O6370k28600N8757l5846j10504O0003J1612
2608c55131N3438Q463q3741K5504l9770k4182N8330m8112J29921R3805M803j26822
2596c03494J7694O6700n2748p3642J2063L4530Q6253q5985l4216M399q0755J43358
2584b65843n2904Q454k9865k1148Q266O6852M2776J26340J10268j02423n102m8069
2572a62398L9383M3803r0216O2774Q8556j72636o3463m0352L8329p55l5886j6218
2560c09079N9230J01775j8324m8699r980P8974J24229M8203L0999j54168k934
$$ plain form
2641 -300963 -277422 -175175 -341205 -172928 -17401 -117308 -227280 -336608 -346568 -340331 -440263
2630 -440263 -287658 -370310 -158009 -286838 -369341 -457317 -414981 -312260 -330047 -248884 -255352
2619 -255352 -189335 -236257 -139076 -176923 -110553 -339153 -280396 -316242 -426746 -366743 -355131
2608 -355131 -301693 -293230 -376971 -351467 -391237 -415419 -357089 -405201 -275280 -181475 -176672 -303494
2596 -303494 -285800 -219100 -271848 -345490 -333427 -298897 -212644 -298629 -332845 -328446 -409201 -265843
2584 -265843 -318747 -310293 -340158 -361306 -353040 -286188 -243412 -117072 -6804 -109227 -114329 -162398
2572 -162398 -123015 -79212 -169428 -106654 -18098 -190734 -254197 -294549 -256220 -256975 -292861 -309079
2560 -309079 -249849 -148074 -166398 -215097 -225077 -146103 -21874 26329 57328 -96840 -99774
2549i9774J12564L1008l2316j44664m9267O4948J82968Q082J06953M9366j21102
2538A08766N9846L3159l1523r0056l0611N9278n4950O7148J83214k4002k30733
2527D9536N2595J57482O0680K263n0417q9059r3672J71102j12463q8604P7984
2516A37427J94477K10474j59075j9756j42627N8652N849O6413J514m3591n0726
2505B59031J78013o269n627q7575l2643J86802j39667n7763R7062J6034K9892
2494D37290j85833j65767J10834Q7624O3710R227r1746j09718K365q7136O1801
2483A32651J59414j15307n388R6225m2509l5346J92196N2068j88391j8573m7667
2472A79373J41792n2340j08064l1053L6201M2734q7437K3273J46115j33820N6044
$$ plain form
2549 -99774 12790 43798 11482 -133182 -182449 -117501 65467 73549 180502 229868 108766
2538 108766 168612 201771 170248 80192 49581 108859 53909 121057 304271 280269 49536
2527 49536 102131 259613 320293 322556 272139 183080 89408 260510 148047 59443 137427
2516 137427 331904 542378 383303 363547 220920 279572 285421 351834 353348 309757 259031
2505 259031 437044 430775 425148 337573 304930 491732 352065 294302 391364 407398 437290
2494 437290 251457 85690 196524 284148 347858 357085 265339 155621 157986 70850 132651
2483 132651 292065 176758 171370 267595 225086 189740 381936 434004 245613 227040 179373
2472 179373 321165 268825 160761 129708 165909 208643 121206 144479 290594 156774 212818
2461B12818j59021k40253J83343P3360m8411l0769Q8003l1105m2326J6634K193
2450B4466k3298Q6235j25691m5804j34637Q9527n276m624L8600M2222n2823j51123
2438b62226J99627K5611J8092m2000R2518k40066K3694J3807L2492o5788m1091
2427b45330n5770O7870J00882l2093r906j12170L2449Q566p0577Q6145J39715
2416i0219N2482o9826q9227M3879j31950j88134k2531R582J63548K0736J01761
2405a99899N0184p9046p2371M1091N6152L7020q3391j85014L5228J09150k9055
2394c19951N1022N7315N71q9223P5415J18441j38780j1591Q04j07361L539J28969
2382b30830k4082j00805l3060J6215M3413j12868m7359P5093l3731R9905K5639
$$ plain form
2461 212818 53797 -186456 -3113 70247 21836 -8933 79070 47965 5639 22273 24466
2450 24466 1168 87403 -38288 -84092 -218729 -129202 -134478 -139102 -100502 -58280 -111103 -262226
2438 -262226 -62599 -36988 -18896 -60896 31622 -208444 -184750 -170943 -138451 -204239 -245330
2427 -245330 -301100 -233230 -132348 -164441 -174347 -286517 -254068 -245502 -316079 -229934 -90219
2416 -90219 -37737 -107563 -196790 -152911 -284861 -472995 -495526 -485944 -322396 -301660 -199899
2405 -199899 -149715 -228761 -301132 -260041 -203889 -166869 -250260 -435274 -400046 -290896 -319951
2394 -319951 -268929 -211614 -211043 -300266 -224851 -106410 -245190 -256781 -255977 -363338 -359799 -230830
2382 -230830 -254912 -355717 -388777 -372562 -329149 -442017 -489376 -414283 -448014 -348109 -322470
2371c22470o4174O9251R2866j70003k2218K8857O6463J15630j1971j6903K4514
2360b10158r9667M0460l6305q0138P0949q7966L641J4719j5232J20369p8435P39
2348c57024J31707j32888M5570m0058j58150J68684M1916L2595M7344j5369n5249
2337b90922Q916l3617O6596j42887j1765P6753j8607m9858L8136N2527k5847l4120
2325c64695o9608J3834J59535o7727j2600L5316J25705j09941q0621n3546J46824
2314b77524m787P771p1405j5763J82868j48242J02082N2394o0745n3527J09444
2303a77434q1641k665R0029M3386Q1891l6051j24953K5269K2554J16112k4368
2292f7871K6748M293p7274j07713J0543j9979M5127L014j14623L4728j05691J21092
$$ plain form
2371 -322470 -386644 -317393 -224527 -394530 -416748 -387891 -321428 -205798 -217769 -234672 -210158
2360 -210158 -309825 -269365 -305670 -385808 -314859 -402825 -399184 -384465 -399697 -279328 -357763 -357024
2348 -357024 -225317 -358205 -312635 -352693 -510843 -342159 -300243 -267648 -220304 -235673 -290922
2337 -290922 -282006 -315623 -249027 -391914 -403679 -326926 -345533 -395391 -357255 -304728 -330575 -364695
2325 -364695 -434303 -420469 -260934 -328661 -341261 -305945 -180240 -290181 -370802 -424348 -277524
2314 -277524 -282311 -274540 -345945 -361708 -178840 -327082 -225000 -172606 -233351 -286878 -177434
2303 -177434 -259075 -261740 -171711 -128325 -46434 -82485 -207438 -182169 -159615 -43503 -67871
2292 -67871 -41123 -36830 -114104 -221817 -211274 -231253 -186126 -183112 -297735 -263007 -368698 -247606
2280b47606Q8600n5148r7425p7177N1356Q2851M799P1893j83429p7176J37229
2269c01233P5600P3891j08101k3249J6438n3053j16932O3487J41090q428r755
2258b50245R0717o0666l1537o4144K5534R1626k214j24982Q1985O4903l5549r98
2246b15570P5701J0373l09K1169k8036n6081J5182j26548M1273l4752l3129J3985
2234c16742k8915k4888l1243J9958L7213l1129J36034k5210k7590Q6275n2934
2223b59171j48160O5235L9021l8760m6111p3556k1825J38301J55798n7235L4207
2212b12256j23569O288l7565J49401r8024p2292M8316q1911P8769K32822j30311
2201b40332j31541r662R5794O9078J00845j31295m5768P9523N7010O5390j92145
$$ plain form
2280 -247606 -159006 -214154 -311579 -388756 -337400 -254549 -249750 -177857 -361286 -438462 -301233
2269 -301233 -225633 -151742 -259843 -283092 -266654 -319707 -436639 -373152 -232062 -240490 -250245
2258 -250245 -159528 -220194 -251731 -315875 -290341 -198715 -200929 -325911 -243926 -179023 -214572 -215570
2246 -215570 -139869 -129496 -129805 -108636 -136672 -192753 -177571 -304119 -262846 -297598 -330727 -316742
2234 -316742 -345657 -370545 -401788 -381830 -344617 -375746 -239712 -264922 -292512 -206237 -259171
2223 -259171 -407331 -342096 -303075 -341835 -387946 -461502 -483327 -345026 -189228 -246463 -212256
2212 -212256 -335825 -329537 -367102 -217701 -315725 -388017 -339701 -421612 -342843 -110021 -240332
2201 -240332 -371873 -381535 -285741 -216663 -115818 -247113 -292881 -213358 -156348 -90958 -283103
2190b83103r4014J72202O9202p9558K9688K0752k5513n0732r4787r7709J64840
2179b68732J53776Q6537r826L3551m8220j35088M0232J25898n6488M2590o7638
2168a03408l8785J81318R223j48915r2854l964O9877n4129m5883L0413K5444K40902
2156F9239l0948N619r2178o4868l7045J5765J89131o6102J00789r7159L0015J4280
2144C6538o0945p6593j0466J58590L8165L2512k20270J11298J62167m3035j23102
2133D859J0998J14659J09964j81489k7626J54307O443q1723Q1613N3913L8231
2122B84149K1135m2241N8291R230Q3077j6660L8630j7343Q6451q9341P7798J26585
2110F19761J7782j12151N028J17209N1345J53565K1211J13593p1332R0169K4910
$$ plain form
2190 -283103 -377117 -204915 -135713 -215271 -185583 -164831 -190344 -241076 -335863 -433572 -268732
2179 -268732 -114956 -28419 -38245 -4694 -52914 -188002 -147770 -21872 -78360 -35770 -103408
2168 -103408 -142193 39125 48348 -100567 -193421 -197385 -127508 -181637 -227520 -197107 -171663 69239
2156 69239 38291 43910 -48268 -113136 -150181 -134416 54715 -11387 89402 -7757 22258 36538
2144 36538 -24407 -101000 -111466 47124 85289 117801 -102469 8829 170996 127961 4859
2133 4859 15857 130516 240480 58991 31365 185672 192115 110392 192005 245918 284149
2122 284149 305284 263043 321334 330564 413641 396981 435611 418268 504719 415378 493176 619761
2110 619761 637543 525392 530420 647629 698974 852539 873750 987343 916011 1006180 1031090
2099A031090o7149k991N1660K39569m9526J09153P3595J1896J58687K21114J2509
2088A789607p6858J50419M2374K93868J3106Q0899J84153J38968K62863J528K38574
2077C119501L15251K74437L29500L40932L66794K28638N08607P41345O74165P86574
2067G685744P48093P87981R37040J171156J429764J829295K055356K199097K789952
2058B1633478L597429M871518N837919N447734R84767l189247m981752o717447
2050B7484399n390177l843162k841029k009289j625906j118815r43342q43206
2042H869473o97510n28067n50721n82069n85993m61690m45254m46575l57644k12457
2032D001493k30912k32051j86513j13711k37328J21513r8893k49654j65558q3921
$$ plain form
2099 1031090 963941 960950 1012610 1252179 1202653 1311806 1385401 1397297 1555984 1777098 1789607
2088 1789607 1712749 1863168 1905542 2199410 2212516 2293415 2477568 2616536 2879399 2880927 3119501
2077 3119501 3434752 3709189 4038689 4379621 4746415 4975053 5483660 6225005 6899170 7685744
2067 7685744 8433837 9221818 10158858 11330014 12759778 14589073 16644429 18843526 21633478
2058 21633478 25230907 30102425 35940344 41388078 42372845 39183598 34201846 27484399
2050 27484399 22094222 18251060 15410031 13400742 11774836 10656021 9712679 8869473
2042 8869473 8171963 7643896 7093175 6511106 5925113 5463423 5018169 4571594 4213950 4001493
2032 4001493 3770581 3538530 3352017 3238306 3000978 3122491 3023598 2773944 2608386 2524465
2022B524465N8518k12859m0579k56306j05437n4965j14180j04564j09788q2526
2012A501779l7119j36049J37848O1403j51292p3779m4977m9159k320p8563q8183
2001A039589N6569j43717j09640r4987J13731n8110o6159Q690K0960j8517n4996
1990F93413j6610j5945k9044O3286q2424k17334n8526m3200J02010q1558M9663
1979C63731N7194J15861r1687j00638n1360j299r0777R7149m3119J1038j43930
1968A22163q3509J00203J5214J51993l3024j39662m0104n5613k1002J55710j0686
1957A61683o3046p0711J6636M5997L1265O3229n9926j79514M8096J9543j3811
1946e59m4807o025k3345J01934m0691o0524M0733J03388j28008N2403n2213J11058
$$ plain form
2022 2524465 2582983 2370124 2329545 2073239 1967802 1912837 1798657 1694093 1584305 1501779
2012 1501779 1464660 1328611 1466459 1527862 1376570 1302791 1257814 1208655 1206335 1127772 1039589
2001 1039589 1096158 952441 842801 747814 861545 803435 737276 745966 766926 748409 693413
1990 693413 676803 660858 631814 695100 612676 395342 336816 293616 395626 314068 363731
1979 363731 420925 536786 445099 344461 293101 291802 201025 298174 255055 266093 122163
1968 122163 38654 138857 154071 306064 273040 133378 93274 37661 16659 172369 161683
1957 161683 98637 27926 44562 90559 121824 185053 125127 -54387 -6291 13252 -559
1946 -559 -45366 -51391 -74736 27198 -13493 -74017 -33284 70104 -57904 -5501 -57714 53344
1934E3344O0944j23743N582J1484O1639m3442j0132J22126l4588j10461j24120
1923a31367m5482J09871n9453j0097P9706q489j0725k2858J3351m7324K3767J7455
1911i1645O0499k42399n5903J91391M0621K8904l2719l4813j15127M3403n938
1900b13726J86O8806j4134K1258J31717p5553l6312Q1549L9562j18391K9047o1322
1888a47313L7292K277P4864p0465j01442l7318K7026J72568j07187N8902J6558
1877g4238m5511l4500J64128o6180j00597O2162l6775J5669j22909j03029O2416
1866b79364p6180P2568N2338L5229N6581o8568J6882O8201n7443j07178J42933
1855a44001J6315R4503k28022Q8260L0899j51376Q7436m2603N1531l5159J1328
$$ plain form
1934 53344 114288 -9455 -3873 7611 69250 25808 15676 137802 103214 -7247 -131367
1923 -131367 -176849 -66978 -126431 -136528 -56822 -65311 -76036 -98894 -85543 -132867 -109100 -91645
1911 -91645 -31146 -273545 -329448 -138057 -97436 -68532 -101251 -136064 -251191 -207788 -213726
1900 -213726 -213540 -144734 -158868 -137610 -5893 -81446 -117758 -36209 3353 -115038 -85991 -147313
1888 -147313 -110021 -107744 -32880 -103345 -204787 -242105 -215079 -42511 -149698 -90796 -74238
1877 -74238 -119749 -154249 9879 -56301 -156898 -94736 -131511 -115842 -238751 -341780 -279364
1866 -279364 -355544 -282976 -230638 -195409 -138828 -207396 -190514 -122313 -179756 -286934 -144001
1855 -144001 -127686 -33183 -261205 -172945 -142046 -293422 -205986 -248589 -197058 -232217 -220889
1844b20889J30599p8466J0513j55633J268Q0046k912j4482k9549n4847j996J36611
1832a99737Q6349l2514m5542n5286l2865J40002Q8435k10182n8635R9328J02107
1821a18540P0558o2771Q0914j38082M6933Q2159n1830K5802J09062l1781j18579
1810a06155O7039M0605L2336J26456k41525M1822n4421K0842l0615l0789N433
1799a28972m148q5642j3582N9163k0988J50278q4338j5342O4727n0985L5220J18286
1787B3677j22196M4201k9388o1656K2325o494q3811K9773O8458M6607M5079n238
1775b8663j95495L7005J8604q2337Q9107N8418j9317r7460p5373J00911o8092
1764b62692p8416J59743m396O5062q9090M9331O730m1643o0733J02816q9687j57389
$$ plain form
1844 -220889 -90290 -168756 -158243 -313876 -312608 -232562 -235474 -249956 -279505 -334352 -336348 -199737
1832 -199737 -113388 -145902 -191444 -246730 -279595 -139593 -51158 -261340 -319975 -220647 -118540
1821 -118540 -47982 -110753 -29839 -167921 -120988 -38829 -90659 -64857 44205 12424 -106155
1810 -106155 -39116 1489 33825 160281 -81244 -39422 -93843 -73001 -103616 -134405 -128972
1799 -128972 -133120 -218762 -232344 -173181 -194169 -43891 -128229 -143571 -78844 -129829 -94609 23677
1787 23677 -98519 -54318 -83706 -145362 -123037 -129531 -213342 -183569 -115111 -68504 -23425 -28663
1775 -28663 -224158 -187153 -168549 -250886 -161779 -103361 -122678 -220138 -295511 -194600 -262692
1764 -262692 -341108 -181365 -185761 -120699 -209789 -160458 -153728 -195371 -256104 -153288 -242975 -400364
1752d00364q3781L4984J11491J42377l1279K9546J6414k9080Q6808j09379l2692
1741b64955m2814J18709j1547k9355l7508L1349L4464M0434Q0428j17271J7585
1730a80481k6011k7150q190L1130p1105p947O8156Q0666m4338p3089J8945r9622
1718c39036J01897k72J61272p1114j05357l2999J6898M1433l7770J06793M9842
1707a08413k3415o025L0288n7502n7088r2466L4135K30786K7284j08076m7602
1696a78094l5243p2646j4538r089J51522k8248J30969j5968k31857j77055J22123
1685c58124J54575j54827J33196O0392q9274J18064J9441p7252q9905M8205j5588
1674b51097N8547j6001o5062M3478R4408J2619l2130K7198m2382l7479j4573K2939
$$ plain form
1752 -400364 -484145 -449161 -337670 -195293 -226572 -197026 -180612 -209692 -122884 -232263 -264955
1741 -264955 -307769 -189060 -200607 -229962 -267470 -236121 -201657 -161223 -80795 -198066 -180481
1730 -180481 -206492 -233642 -241832 -210702 -281807 -289754 -221598 -140932 -185270 -258359 -239414 -339036
1718 -339036 -237139 -237411 -76139 -147253 -252610 -285609 -268711 -227278 -265048 -158255 -108413
1707 -108413 -131828 -137853 -107565 -165067 -222155 -314621 -280486 -49700 -22416 -130492 -178094
1696 -178094 -213337 -285983 -300521 -309610 -158088 -186336 -55367 -71335 -303192 -480247 -358124
1685 -358124 -203549 -358376 -225180 -164788 -254062 -135998 -116557 -193809 -283714 -235509 -251097
1674 -251097 -192550 -208551 -273613 -230135 -135727 -123108 -155238 -128040 -170422 -207901 -222474 -199535
1662a99535p0839J03424j58744j55827j1308J96173J58020l6946K3222N6921j4578
1651a10017J0853j44033J02961M4962k4930O3019j28207Q9870Q2035j45192p6518
1640b35197J17542N7993m3770j57517L0806k5405Q0724K0321j69231m4527K0971
1629c47290R5385L0126k7954k0384J53321J21406j19736j30602m314R1398l7252
1618a95896k4766k7145j31836Q7704J01839j2318K2515O1433R5806j40560M1915
1607a21309P4258j61150Q5462r6823j6670q5498J46877n9678p0496J42874K398
1596a59755K9515p1168n0026J8169m695N5393L1845J9436l0924q0788q7299k7570
1584c57867J58170R6681k06245N1075Q1946J9258K0987Q276k1058P4535L3499
$$ plain form
1662 -199535 -270374 -166950 -325694 -481521 -492829 -296656 -138636 -175582 -152360 -95439 -110017
1651 -110017 -99164 -243197 -140236 -95274 -120204 -57185 -185392 -95522 -13487 -158679 -235197
1640 -235197 -117655 -59662 -103432 -260949 -230143 -255548 -174824 -154503 -323734 -368261 -347290
1629 -347290 -251905 -221779 -249733 -270117 -116796 4610 -115126 -245728 -250042 -158644 -195896
1618 -195896 -220662 -247807 -379643 -291939 -190100 -202418 -179903 -118470 -22664 -163224 -121309
1607 -121309 -47051 -208201 -122739 -219562 -236232 -321730 -174853 -234531 -305027 -162153 -159755
1596 -159755 -130240 -201408 -251434 -233265 -237960 -182567 -150722 -131286 -162210 -242998 -330297 -357867
1584 -357867 -199697 -103016 -309261 -258186 -176240 -156982 -135995 -127719 -148777 -74242 -40743
1573d0743j8417o0191J58972r1851j83656O1388q4100R6293j65906l4898J2782
1562c50327J32610j1548J02490K2918N5594j0109l8035L7859o7014M4133l6927
1551a18356j02933J806J270l2957J21286M8875J0793j5503j2376j0868K8168j13782
1539a94577n1088j30678O9100J21897l4805o3179K126J52116n8144M7188j34911
1528b74955J44697J01026j06153o099l0157j42143K6181Q0464J11675k004o0780
1517a58248j15287l4761j244J28210J37306j28311m139P1916n3959p2283K0249
1506b10551j03976J4075J19989J4894q0173O3552k4665j78891P2358J16510K9250
1495a67628j2394q646o4861Q7478Q0840M2442r0995q931j22457n1972Q0109Q5563
$$ plain form
1573 -40743 -59160 -119351 39621 -52230 -235886 -174498 -258598 -162305 -328211 -363109 -350327
1562 -350327 -217717 -229265 -126775 -103857 -48263 -58372 -96407 -58548 -125562 -81429 -118356
1551 -118356 -221289 -219483 -218213 -251170 -129884 -81009 -70216 -85719 -98095 -108963 -80795 -194577
1539 -194577 -245665 -376343 -307243 -185346 -220151 -283330 -281204 -129088 -187232 -140044 -274955
1528 -274955 -130258 -29232 -135385 -141484 -171641 -313784 -287603 -207139 -95464 -97468 -158248
1517 -158248 -273535 -308296 -309540 -181330 -44024 -172335 -176474 -104558 -158517 -230800 -210551
1506 -210551 -314527 -300452 -180463 -165569 -245742 -182190 -206855 -385746 -313388 -196878 -167628
1495 -167628 -180022 -188668 -253529 -166051 -85211 -42769 -133764 -142695 -265152 -317124 -237015 -151452
1483a51452L601q7134J44066O3944p2269j37133l5590N0125J00550M2120m5215
1472a24387j49310P7720j3193J56478k0211o9209j2541o0746K6524l0862q258
1461b27995o0371L3189J4466J71040J44961j94351j1746k4256K747j5848R5574
1450g2590P3939j11241o9814k3590L5721J81257q4639j3089j02404j00941J04460
1439a82931K5863J684P0923J26944j62322N0999q5567l4439L2078P9967p5955
1428a52756L5132r7803k1255l529J76260M8368q3052K2317j31016O4929J00681
1417d1724Q2232k7943j64655j21950L1632O5909J123n7310J1801Q9373q465P131
1405a32846R4144n6164n8398N3679j5705j2705L759p2098P2987n1151R0408j46185
$$ plain form
1483 -151452 -147851 -234985 -90919 -26975 -99244 -236377 -271967 -221842 -121292 -79172 -124387
1472 -124387 -273697 -195977 -209170 -52692 -72903 -142112 -154653 -215399 -188875 -219737 -227995
1461 -227995 -288366 -255177 -240711 -69671 75290 -119061 -130807 -155063 -152316 -168164 -72590
1450 -72590 1349 -109892 -179706 -203296 -167575 13682 -70957 -84046 -186450 -287391 -182931
1439 -182931 -157068 -155384 -84461 42483 -119839 -68840 -154407 -188846 -156768 -76801 -152756
1428 -152756 -117624 -215427 -236682 -240211 -63951 -15583 -98635 -76318 -207334 -142405 -41724
1417 -41724 40508 12565 -152090 -274040 -242408 -176499 -175376 -232686 -220885 -131512 -139977 -132846
1405 -132846 -38702 -94866 -153264 -99585 -115290 -127995 -124236 -196334 -123347 -174498 -84090 -230275
$$ [...]
##END NTUPLES=NMR SPECTRUM
##END=
