##TITLE=1H_CA-8905-1
 CDCl3, 8 sc, 
 27.07.2021
##JCAMPDX= 6.0         $$ Bruker NMR JCAMP-DX V2.0
##DATA TYPE= NMR SPECTRUM
##DATA CLASS= NTUPLES
##ORIGIN= UXNMR, Bruker Analytische Messtechnik GmbH
##OWNER= root
$$ XWIN-NMR		Version 3.5
$$ Tue Jul 27 08:36:15 2021 Russian Standard Time (UT+4h)  she@DPX200
##.OBSERVE FREQUENCY= 200.131506
##.OBSERVE NUCLEUS= ^1H
##.ACQUISITION MODE= SIMULTANEOUS
##.ACQUISITION SCHEME= undefined
##.AVERAGES= 8
##.DIGITISER RES= 18
##SPECTROMETER/DATA SYSTEM= spect
##.PULSE SEQUENCE= zg30
##.SOLVENT NAME= CDCl3
##.SHIFT REFERENCE= (INTERNAL, CDCl3, 0, 17.4788)
##AUDIT TRAIL= $$ (NUMBER, WHEN, WHO, WHERE, WHAT)
$$ ##TITLE= Audit trail, XWIN-NMR		Version 3.5
$$ ##JCAMPDX= 5.01
$$ ##ORIGIN= Bruker BioSpin GmbH
$$ ##OWNER= she
$$ F:/spectra/data/she/nmr/H-F/1/pdata/1/auditp.txt
$$ ##AUDIT TRAIL=  $$ (NUMBER, WHEN, WHO, WHERE, WHAT)
(   1,<2021-07-27 08:35:02.18 +0400>,<she>,<DPX200>,
      <created by zg, POWCHK disabled, PULCHK disabled
       configuration hash MD5:
       00 E9 B6 7A A2 85 ED C7 34 08 36 98 17 FE 4E 26
       data hash MD5: 16K
       41 29 D3 A8 85 DE 64 FF 1B F2 B6 AA CE AA F1 B6>)
(   2,<2021-07-27 08:35:05.03 +0400>,<she>,<DPX200>,
      <Start of raw data processing
       efp BC_mod = 2 LB = 0.24 FT_mod = 6 PKNL = 1 PHC0 = -12457.35 PHC1 = 13.60099 SI = 16K 
       data hash MD5: 16K
       88 12 60 52 79 16 4C A5 9F F9 7F 0F 43 DA FE 52>)
(   3,<2021-07-27 08:35:26.56 +0400>,<she>,<DPX200>,
      <pk PHC0 = -177.9441 PHC1 = 2.980232e-07 
       data hash MD5: 16K
       63 23 EE C1 40 FF C1 7D E5 8A CD 4F 74 3C A2 8D>)
(   4,<2021-07-27 08:35:32.73 +0400>,<she>,<DPX200>,
      <abs ABSG = 5 
       data hash MD5: 16K
       C9 3B 68 14 DD 6C D5 4A 0E CC 39 17 77 17 19 B8>)
$$ ##END=
$$ 
$$ hash MD5
$$ 85 79 7A 73 1B 93 8B A0 0F EF 87 8A 46 54 F0 6F
##$RELAX= 
##$RELAX= 
##$RELAX= 
##$RELAX= 
##$RELAX= 
##$RELAX= 
$$ Bruker specific parameters
$$ --------------------------
##$DU= <F:/spectra>
##$EXPNO= 1
##$NAME= <H-F>
##$PROCNO= 1
##$TYPE= <nmr>
##$USER= <she>
##$AMP= (0..31)
100 100 100 100 100 100 100 100 100 100 100 100 100 100 100 100 100 100 
100 100 100 100 100 100 100 100 100 100 100 100 100 100 
##$AQSEQ= 0
##$AQ_mod= 1
##$AUNM= <au_zg>
##$AUTOPOS= <>
##$BF1= 200.13
##$BF2= 200.13
##$BF3= 200.13
##$BF4= 200.13
##$BF5= 200.13
##$BF6= 200.13
##$BF7= 200.13
##$BF8= 200.13
##$BYTORDA= 1
##$CFDGTYP= 0
##$CFRGTYP= 5
##$CHEMSTR= <none>
##$CNST= (0..31)
1 1 145 1 1 1 1 1 1 1 1 1 1 1 1 1 1 1 1 1 1 1 1 1 1 1 1 1 1 1 1 1 
##$CPDPRG= <>
##$CPDPRG1= <>
##$CPDPRG2= <>
##$CPDPRG3= <>
##$CPDPRG4= <mlev>
##$CPDPRG5= <mlev>
##$CPDPRG6= <mlev>
##$CPDPRG7= <mlev>
##$CPDPRG8= <mlev>
##$CPDPRGB= <>
##$CPDPRGT= <>
##$D= (0..31)
0 1.2 0 0 0 0 0 0 0 0.06 0 0.03 0 0 0 0 0.0002 0 0 0 0 0 0 0 0 0 0 0 0 
0 0 0 
##$DATE= 1627360501
##$DBL= (0..7)
120 120 120 120 120 120 120 120 
##$DBP= (0..7)
150 150 150 150 150 150 150 150 
##$DBP07= 0
##$DBPNAM0= <>
##$DBPNAM1= <>
##$DBPNAM2= <>
##$DBPNAM3= <>
##$DBPNAM4= <>
$$ [...]
##$SUBNAM3= <"">
##$SUBNAM4= <"">
##$SUBNAM5= <"">
##$SUBNAM6= <"">
##$SUBNAM7= <"">
##$SUBNAM8= <"">
##$SUBNAM9= <"">
##$SW= 20.0188882624521
##$SWIBOX= (0..15)
0 0 2 0 0 0 0 0 0 0 0 0 0 0 0 0 
##$SW_h= 4006.41025641026
##$TD= 16384
##$TD0= 1
##$TE= 0
##$TE2= 300
##$TE3= 300
##$TEG= 300
##$TL= (0..7)
0 120 120 120 120 120 120 120 
##$TP= (0..7)
150 150 150 150 150 150 150 150 
##$TP07= 0
##$TPNAME0= <>
##$TPNAME1= <>
##$TPNAME2= <>
##$TPNAME3= <>
##$TPNAME4= <>
##$TPNAME5= <>
##$TPNAME6= <>
##$TPNAME7= <>
##$TPOAL= (0..7)
0.5 0.5 0.5 0.5 0.5 0.5 0.5 0.5 
##$TPOFFS= (0..7)
0 0 0 0 0 0 0 0 
##$TUNHIN= 0
##$TUNHOUT= 0
##$TUNXOUT= 0
##$USERA1= <user>
##$USERA2= <user>
##$USERA3= <user>
##$USERA4= <user>
##$USERA5= <user>
##$V9= 5
##$VALIST= <valist>
##$VCLIST= <CCCCCCCCCCCCCCC>
##$VD= 0
##$VDLIST= <DDDDDDDDDDDDDDD>
##$VPLIST= <PPPPPPPPPPPPPPP>
##$VTLIST= <TTTTTTTTTTTTTTT>
##$WBST= 1024
##$WBSW= 4
##$XGAIN= (0..3)
0 0 0 0 
##$XL= 0
##$YL= 0
##$YMAX_a= 810178
##$YMIN_a= -885761
##$ZGOPTNS= <>
##$ZL1= 120
##$ZL2= 120
##$ZL3= 120
##$ZL4= 120
##$ABSF1= 17.55177
##$ABSF2= -2.46727
##$ABSG= 5
##$ABSL= 3
##$ALPHA= 0
##$AQORDER= 0
##$ASSFAC= 0
##$ASSFACI= 0
##$ASSFACX= 0
##$ASSWID= 0
##$AUNMP= <proc_1d>
##$AZFE= 0.1
##$AZFW= 0.1
##$BCFW= 0
##$BC_mod= 2
##$BYTORDP= 0
##$COROFFS= 0
##$CY= -3
##$DATMOD= 1
##$DC= 0
##$DFILT= <>
##$DTYPP= 0
##$F1P= 0
##$F2P= 0
##$FCOR= 1
##$FTSIZE= 16384
##$FT_mod= 6
##$GAMMA= 0
##$GB= 0
##$INTBC= 1
##$INTSCL= 1.334414e-10
##$ISEN= 128
##$LB= 0.24
##$LEV0= 0
##$LPBIN= 0
##$MAXI= 10000
##$MC2= 0
##$MEAN= 0
##$ME_mod= 0
##$MI= 1.114404
##$NCOEF= 0
##$NC_proc= -5
##$NLEV= 6
##$NOISF1= 3.799351
##$NOISF2= 2.8
##$NSP= 0
##$NTH_PI= 0
##$NZP= 0
##$OFFSET= 17.47878
##$PC= 1
##$PHC0= -12635.29
##$PHC1= 13.60099
##$PH_mod= 1
##$PKNL= yes
##$PPARMOD= 0
##$PSCAL= 0
##$PSIGN= 0
##$REVERSE= no
##$SF= 200.130011175463
##$SI= 16384
##$SIGF1= 3
##$SIGF2= 2
##$SINO= 5.538805
##$SIOLD= 16384
##$SREGLST= <1H.CDCl3>
##$SSB= 0
##$STSI= 16384
##$STSR= 0
##$SW_p= 4006.41025641026
##$SYMM= 0
##$S_DEV= 0
##$TDeff= 16384
##$TDoff= 0
##$TI= <>
##$TILT= no
##$TM1= 0
##$TM2= 0
##$TOPLEV= 0
##$USERP1= <user>
##$USERP2= <user>
##$USERP3= <user>
##$USERP4= <user>
##$USERP5= <user>
##$WDW= 1
##$XDIM= 16384
##$YMAX_p= 375899298
##$YMIN_p= -421520
$$ End of Bruker specific parameters
$$ ---------------------------------
##NTUPLES= NMR SPECTRUM
##VAR_NAME=  FREQUENCY,     SPECTRUM/REAL,   SPECTRUM/IMAG
##SYMBOL=    X,             R,               I
##VAR_TYPE=  INDEPENDENT,   DEPENDENT,       DEPENDENT
##VAR_FORM=  AFFN,          ASDF,            ASDF
##VAR_DIM=   16384,         16384,           16384
##UNITS=     HZ,            ARBITRARY UNITS, ARBITRARY UNITS
##FACTOR=    0.24454680195387, 1,            1
##FIRST=     3498.0285861225, 0,             0
##LAST=      -508.38167028776, 0,            0
##MIN=       -508.38167028776, -421520,      0
##MAX=       3498.0285861225, 375899298,     0
$$ Real data points
##PAGE= N=1
##DATA TABLE= (X++(R..R)), XYDATA
$$ [...]
$$ plain form
7007 -141958 -166871 -146840 -110131 -176810 -77617 -64798 -147832 -142153 -109596 -123194 -107253 -182378
6995 -182378 -212484 -178414 -170085 -198403 -199787 -223828 -224368 -203210 -225549 -266505 -274365 -257664 -261555
6982 -261555 -291627 -292979 -280276 -288002 -249390 -248485 -220332 -254180 -259298 -254370 -290270 -326698 -341105
6969 -341105 -293799 -305132 -277083 -227673 -274614 -268151 -267626 -252343 -324489 -290720 -269712 -309785
6957 -309785 -299734 -283436 -284210 -290797 -329807 -292667 -297181 -334411 -370246 -353164 -293462 -262599
6945 -262599 -286944 -344053 -318608 -348020 -332358 -318949 -306462 -256450 -285389 -296514 -327119 -331662
6933 -331662 -315145 -328004 -258121 -232722 -279560 -254532 -289648 -246711 -281380 -278147 -218913 -294091
6921 -294091 -261860 -280066 -268364 -212241 -188845 -209600 -229258 -246116 -228255 -189941 -215953 -199203
$$ packed form
7007a41958k4913K0031L6709o6679R9193J2819q3034N679L2557j3598J5941p5125
6995a82378l0106L4070Q329k8318j384k4041n40K1158k2339m0956p860J6701l891
6982b61555l0072j352J2703p726L8612R05K8153l3848n118M928l5900l6428j4407
6969c41105M7306j1333K8049M9410m6941O463N25J5283p2146L3769K1008m0073
6957c09785J0051J6298p74o587l9010L7140m514l7230l5835J7082N9702L0863
6945b62599k4345n7109K5445k9412J5662J3409J2487N0012k8939j1125l0605m543
6933c31662J6517j2859O9883K5399m6838K5028l5116M2937l4669L233N9234p5178
6921b94091L2231j8206J1702N6123K3396k0755j9658j6858J7861L8314k6012J6750
$$ plain form
6909 -199203 -186336 -147023 -80278 -116107 -106374 -134380 -151957 -162462 -127012 -150034 -169670 -175007
6897 -175007 -169105 -172406 -129585 -82839 -117586 -162378 -106179 -99022 -115500 -118598 -111533 -153275 -134139
6884 -134139 -69392 -71011 -103790 -114763 -123067 -81861 -103170 -153125 -136283 -149939 -122491 -143029
6872 -143029 -157582 -131597 -128758 -156930 -155074 -154708 -154838 -190953 -167814 -193023 -234688 -249377 -228395
6859 -228395 -263909 -250285 -278710 -260706 -279506 -249225 -249274 -223638 -264488 -292721 -284831 -273863
6847 -273863 -230706 -247735 -291240 -274950 -278464 -251681 -254277 -226131 -225583 -277582 -252702 -237283
6835 -237283 -231997 -165880 -149859 -220241 -269079 -287557 -288763 -249430 -277532 -273234 -221877 -292906
6823 -292906 -271785 -291269 -271005 -203480 -242235 -255131 -260471 -265384 -218568 -230552 -273820 -246872
$$ packed form
6909a99203J2867L9313O6745l5829R733k8006j7577j0505L5450k3022j9636n337
6897a75007N902l301M2821M6746l4747m4792N6199P157j6478l098P065m1742J9136
6884a34139O4747j619l2779j0973q304M1206k1309m9955J6842j3656K7448k0538
6872a43029j4553K5985K839k8172J856L66j30l6115K3139k5209m1665j4689K0982
6859b28395l5514J3624k8425J8004j8800L0281m9K5636m0850k8233P890J0968
6847b73863M3157j7029m3505J6290l514K6783k596K8146N48n1999K4880J5419
6835b37283N286O6117J6021p0382m8838j8478j206L9333k8102M298N1357p1029
6823b92906K1121j9484K0264O7525l8755j2896n340m913M6816j1984m3268K6948
$$ plain form
6811 -246872 -144956 -143072 -193737 -225584 -223742 -254936 -251612 -247410 -265134 -212958 -201605 -235600
6799 -235600 -282492 -271377 -192533 -193202 -205794 -186424 -143761 -150904 -138300 -179542 -180444 -194797 -177869
6786 -177869 -169363 -154828 -165882 -175159 -159945 -158161 -139422 -76836 -58393 -45858 -31638 -32917
6774 -32917 -62575 -24400 50224 51559 355 -10595 -5482 26637 63666 70151 69428 95401 83831
6761 83831 83031 131845 194218 227758 229396 277581 242289 256240 245596 253241 279621 301508 324045
6748 324045 354238 313848 283805 264682 206577 195156 225579 193527 165895 132655 93511 69561
6736 69561 78040 66616 -8935 -182 -26647 -31410 -25699 -50376 -132972 -116411 -101031 -80876 -77755
6723 -77755 -71510 -145177 -171165 -120004 -101567 -72255 -81772 -118829 -181376 -189307 -101280 -95035 -64432
$$ packed form
6811b46872J01916J884n0665l1847J842l1194L324M202j7724N2176J1353l3995
6799b35600m6892J1115P8844o69j2592J9370M2663p143J2604m1242r02j4353J6928
6786a77869Q506J4535j1054r277J5214J784J8739O2586J8443J2535J4220j279
6774c2917k9658L8175P4624J335n1204j0950N113L2119L7029O485p23K5973j1570
6761H3831q00M8814O2373L3540J638M8185l5292J3951j0644P645K6380K1887K2537
6748C24045L0193m0390l0043j9123n8105j1421L0423l2052k7632l3240l9144k3950
6736F9561Q479j1424p5551Q753k6465m763N711k4677q2596J6561J5380K0155L121
6723g7755O245p3667k5988N1161J8437K9312r517l7057o2547p931Q8027O245L0603
$$ plain form
6710 -64432 -82355 -133313 -120461 -152659 -123670 -129438 -110873 -124312 -92398 -90621 -77489 -109987
6698 -109987 -94807 2016 4904 37190 47401 8594 30479 72541 80455 109453 185473 187725
6686 187725 238302 245359 276946 326588 277426 298142 312054 315956 307453 280239 305455 302019
6674 302019 265316 172559 157260 174552 210071 121196 48600 41702 66644 91099 66842 19455
6662 19455 60179 -15385 -30300 -30092 -60901 -30998 -27399 -48612 -1086 90063 92327 109763 176052
6649 176052 148763 105146 143049 142493 106642 160096 184126 187006 273461 248626 236999 211925
6637 211925 153300 170233 187873 179797 158471 106613 40511 -20109 -62378 -104730 -130101 -72492
6625 -72492 -78986 -139540 -158991 -153957 -168088 -203801 -166922 -191701 -203071 -214510 -221861 -188983
$$ packed form
6710f4432j7923n0958J2852l2198K8989n768J8565j3439L1914J777J3132l2498
6698a09987J5180R6823K888L2286J0211l8807K1885M2062P914K8998P6020K252
6686A87725N0577P057L1587M9642m9162K0716J3912L902q503k7214K5216l436
6674C02019l6703r2757j5299J7292L5519q8875p2596o898K4942K4455k4257m7387
6662A9455M0724p5564j4915K08l0809K9903L599k1213M7526R1149K264J7436O6289
6649A76052k7289m3617L7903n56l5851N3454K4030K880Q6455k4835j1627k5074
6637B11925n8625J6933J7640q076k1326n1858o6102o0620m2269m2352k5371N7609
6625g2492o494o0554j9451N034j4131l5713L6879k4779j1370j1439p351L2878
$$ plain form
6613 -188983 -164487 -143607 -145803 -199223 -225133 -245740 -204915 -208804 -224751 -221412 -274393 -255713
6601 -255713 -220932 -261680 -274755 -302366 -283411 -291264 -275439 -269688 -286922 -297696 -238810 -249864
6589 -249864 -279638 -298363 -273715 -291408 -295004 -328110 -272370 -305138 -281436 -254359 -262171 -240212
6577 -240212 -268676 -255711 -267381 -271357 -256477 -272147 -300903 -236575 -317896 -247745 -256232 -309579
6565 -309579 -266407 -346794 -349827 -328128 -332499 -272990 -280155 -298954 -284899 -302973 -295126 -225025
6553 -225025 -236064 -280742 -272608 -297307 -315547 -301829 -354301 -355072 -353280 -344637 -317399 -348750 -356200
6540 -356200 -312132 -289149 -327091 -303741 -243237 -271686 -303016 -275707 -266491 -334000 -350877 -337354
6528 -337354 -280526 -296869 -357253 -316536 -334610 -361027 -358707 -302007 -283142 -311077 -299886 -285060
$$ packed form
6613a88983K4496K0880k196n3420k5910k0607M0825l889j5947L339n2981J8680
6601b55713L4781m0748j3075k7611J8955p853J5825N751j7234j0774N8886j1054
6589b49864k9774j8725K4648j7693l596l3106N5740l2768K3702K7077p812K1959
6577b40212k8464J2965j1670l976J4880j5670k8756O4328q1321P0151q487n3347
6565c09579M3172q0387l033K1699m371N9509p165j8799J4055j8074P847P0101
6553b25025j1039m4678Q134k4699j8240J3718n2472p71J792Q643K7238l1351p450
6540c56200M4068K2983l7942K3350O0504k8449l1330K7309R216o7509j6877J3523
6528c37354N6828j6343o0384M0717j8074k6417K320N6700J8865k7935J1191J4826
$$ plain form
6516 -285060 -308008 -277140 -340975 -343749 -340173 -350947 -319535 -329730 -329167 -313301 -312835 -309652 -308150
6503 -308150 -309527 -335894 -401001 -366359 -399934 -345543 -349241 -353062 -333398 -374879 -363360 -319062
6491 -319062 -310240 -277003 -339802 -337786 -306952 -337853 -344150 -379581 -388555 -377378 -300475 -225996
6479 -225996 -294128 -333756 -342755 -331340 -303449 -320243 -314442 -281623 -326436 -298786 -255376 -328250
6467 -328250 -312983 -305467 -294254 -284153 -252499 -299057 -359414 -298099 -305436 -333261 -275116 -213286
6455 -213286 -231042 -225943 -214385 -213422 -228908 -222544 -212001 -272980 -259528 -270492 -267645 -268197 -293435
6442 -293435 -255741 -242916 -229030 -241346 -257000 -265954 -304891 -241295 -269263 -248835 -247737 -202711
6430 -202711 -216063 -227273 -186282 -190474 -170004 -192096 -216982 -233695 -186271 -139628 -158280 -132943
$$ packed form
6516b85060k2948L0868o3835k774L576j0774L1412j0195N63J5866M66L183J502
6503c08150j377k6367o5107L4642l3575N4391l698l821J9664m1481J1519M4298
6491c19062Q822L3237o2799K016L0834l0901o297l5431q974J1177P6903P4479
6479b25996o8132l9628q999J1415K7891j6794N801L2819m4813K7650M3410p2874
6467c28250J5267P516J1213J0101L1654m6558o0357O1315p337k7825N8145O1830
6455b13286j7756N099J1558R63j5486O364J0543o0979J3452j0964K847n52k5238
6442b93435L7694J2825J3886j2316j5654q954l8937O3596k7968K0428J098M5026
6430b02711j3352j1210M0991m192K0470k2092k4886j6713M7424M6643j8652K5337
$$ plain form
6418 -132943 -117359 -137057 -130693 -181773 -150243 -202808 -154197 -127685 -134900 -139342 -99361 -111242
6406 -111242 -116513 -143811 -189381 -202662 -179142 -184451 -201504 -150729 -172741 -214798 -214442 -225567
6394 -225567 -197585 -139073 -126342 -111750 -121116 -164423 -170283 -154961 -194189 -179432 -239569 -212283
6382 -212283 -212750 -237385 -205523 -176835 -194029 -185952 -216178 -200049 -163815 -188214 -219017 -235817
6370 -235817 -201275 -227936 -266348 -286487 -271093 -249331 -250085 -236259 -207697 -254032 -293436 -255368
6358 -255368 -216815 -182139 -237695 -329806 -219734 -175298 -223105 -193542 -142399 -140759 -160501 -131649
6346 -131649 -177084 -170017 -209199 -229771 -203202 -148803 -138128 -145587 -131473 -168675 -201930 -224700
6334 -224700 -210896 -206749 -263451 -246174 -281296 -255196 -224252 -207838 -202535 -242246 -242723 -209017
$$ packed form
6418a32943J5584j9698O364n1080L1530n2565M8611K6512p215m442L9981j1881
6406a11242n271k7298m5570j3281K3520n309j7053N0775k2012m2057L56j1125
6394b25567K7982N8512J2731J4592r366m3307n860J5322l9228J4757o0137K7286
6382b12283m67k4635L1862K8688j7194Q077l0226J6129L6234k4399l0803j6800
6370b35817L4542k6661l8412k0139J5394K1762p54J3826K8562m6335l9404L8068
6358b55368L8553L4676n5556r2111J10072M4436m7807K9563N1143J640j9742K8852
6346a31649m5435P067l9182k0572K6569N4399J0675p459J4114l7202l3255k2770
6334b24700J3804M147n6702J7277l5122K6100L0944J6414N303l9711m77L3706
$$ plain form
6322 -209017 -220806 -244550 -255514 -206907 -159689 -189600 -219565 -264383 -240973 -264809 -233211 -234217
6310 -234217 -234403 -245834 -204706 -241958 -253537 -245424 -228452 -196281 -211478 -226659 -221166 -185674
6298 -185674 -250251 -230786 -231670 -252273 -235312 -209476 -220290 -209881 -219072 -254839 -253005 -265162
6286 -265162 -264057 -277234 -263555 -267581 -301011 -313081 -292376 -262792 -247165 -292574 -285501 -245141
6274 -245141 -203342 -228461 -292860 -271518 -285510 -278783 -288053 -215868 -313389 -268992 -178943 -271197
6262 -271197 -239141 -247350 -270488 -250023 -275701 -295115 -285995 -287993 -231462 -264421 -285339 -227114
6250 -227114 -201966 -261126 -274291 -247347 -198399 -191679 -180573 -233096 -212056 -264817 -321258 -273254
6238 -273254 -191094 -217972 -215461 -174849 -217286 -248789 -282181 -247177 -294632 -343468 -261398 -292208
$$ packed form
6322b09017j1789k3744j0964M8607M7218k9911k9965m4818K3410k3836L1598j006
6310b34217j86j1431M1128l7252j1579Q113J6972L2171j5197j5181N493L5492
6298a85674o4577J9465q84k0603J6961K5836j0814J0409r191l5767J834j2157
6286b65162J105j3177J3679m026l3430j2070K0705K9584J5627m5409P073M0360
6274b45141M1799k5119o4399K1342j3992O727r270P2185r7521M4397R0049r2254
6262b71197L2056q209k3138K0465k5678j9414R120j998N6531l2959k0918N8225
6250b27114K5148n9160j3165K6944M8948O720J1106n2523K1040n2761n6441M8004
6238b73254Q2160k6878K511M0612m2437l1503l3392L5004m7455m8836Q2070l0810
$$ plain form
6226 -292208 -267678 -217290 -262402 -268113 -250520 -271413 -244752 -264791 -300658 -309416 -290292 -248197
6214 -248197 -253584 -224450 -234447 -162718 -273038 -265414 -292412 -311616 -240475 -246159 -297234 -252409
6202 -252409 -265350 -258785 -284434 -307207 -241646 -232180 -205080 -269212 -221264 -197364 -217771 -229889
6190 -229889 -252044 -270640 -264091 -293433 -266941 -236804 -166481 -142271 -206319 -268775 -250405 -197520
6178 -197520 -225123 -188638 -195446 -285560 -252494 -273680 -275921 -269132 -253594 -257810 -209993 -190739
6166 -190739 -217981 -186018 -234608 -267121 -307598 -220053 -181189 -161762 -189248 -190377 -172574 -211540
6154 -211540 -202153 -227918 -210440 -133197 -205014 -216634 -193728 -143586 -109833 -138544 -111586 -97308
6142 -97308 -65420 -72161 -58215 -113123 -136364 -125453 -177574 -170089 -108946 -117192 -154208 -129899
$$ packed form
6226b92208K4530N0388m5112n711J7593k0893K6661k0039l5867q758J9124M2095
6214b48197n387K9134r997P1729j10320P624k6998j9204P1141n684n1075M4825
6202b52409j2941O565k5649k2773O5561R466K7100o4132M7948K3900k0407j2118
6190b29889k2155j8596O549k9342K6492L0137P0323K4210o4048o2456J8370N2885
6178a97520k7603L6485o808r0114L3066k1186k241O789J5538m216M7817J9254
6166a90739k7242L1963m8590l2513m0477Q7545L8864J9427k7486j129J7803l8966
6154b11540R387k5765J7478P7243p1817j1620K2906N0142L3753k8711K6958J4278
6142i7308L1888o741J3946n4908k3241J0911n2121P485O1143q246l7016K4309
$$ plain form
6130 -129899 -101047 -159313 -184016 -207029 -167548 -156146 -203915 -171029 -164265 -173221 -175529 -181812
6118 -181812 -149908 -161351 -211957 -223364 -223512 -174193 -195950 -160512 -184905 -176007 -153789 -123928
6106 -123928 -201568 -250267 -202730 -203619 -192417 -251575 -297704 -245795 -243224 -244583 -256234 -281803
6094 -281803 -250827 -186168 -218531 -239728 -256786 -261541 -218784 -222220 -251502 -228341 -185063 -220141
6082 -220141 -243769 -209995 -215039 -189745 -168756 -212937 -215674 -256327 -222890 -174679 -248932 -218489
6070 -218489 -169648 -199057 -195626 -232826 -225833 -241433 -165777 -169452 -201834 -228365 -199786 -216760
6058 -216760 -223509 -246343 -241664 -247431 -230574 -235737 -226715 -167957 -197321 -237902 -243824 -247206 -182287
6045 -182287 -170494 -222502 -176487 -154627 -174568 -192600 -171176 -154646 -145638 -128755 -138212 -136783
$$ packed form
6130a29899K8852n8266k4703k3013L9481J1402m7769L2886O764q956k308o283
6118a81812L1904j1443n0606j1407j48M9319k1757L5438k4393Q898K2218K9861
6106a23928p7640m8699M7537q89J1202n9158m6129N1909K571j359j1651k5569
6094b81803L0976O4659l2363k1197j7058m755M2757l436k9282K3161M3278l5078
6082b20141k3628L3774n044K5294K0989m4181k737m0653L3437M8211p4253L0443
6070b18489M8841k9409L431l7200O993j5600P5656l675l2382k6531K8579j6974
6058b16760o749k2834M679n767J6857n163R022N8758k9364m0581n922l382O4919
6045a82287J1793n2008M6015K1860j9941j8032K1424J6530R008J6883r457J429
$$ plain form
6033 -136783 -94419 -87374 -139195 -133637 -150565 -145859 -142586 -188131 -118780 -86043 -150989 -116300
6021 -116300 -105855 -101221 -97493 -102925 -76017 -65894 -110953 -187135 -169692 -88277 -81587 -93487
6009 -93487 -55873 -116847 -68961 -55130 -38669 -1542 -39696 -62678 -19521 16948 23982 -14396
5997 -14396 -21093 24236 1956 -19489 -1384 -4209 45398 18010 41028 81193 134474 97496
5985 97496 74180 75987 103470 112072 86893 113852 147004 155355 123388 142286 125778 76718
5973 76718 49439 84167 112223 106875 87685 103905 131319 142254 167877 109061 81068 83239
5961 83239 51309 32239 61376 73328 46743 92289 91168 59411 107765 47862 25902 127787
5949 127787 130754 149354 142275 85394 47407 135895 97594 122326 118111 89489 134506 109117
$$ packed form
6033a36783M2364P045n1821N558j6928M706L273m5545O9351L2737o4946L4689
6021a16300J0445M634L728n432K6908J0123m5059p6182J7443Q1415O690j1900
6009i3487L7614o0974M7886J3831J6461L7127l8154k2982M3157L6469P034l8378
5997a4396o697M5329k2280k1445J8105k825M9607k7388K3018M0165N3281l6978
5985I7496k3316J807K7483Q602k5179K6959L3152Q351l1967J8898j6508m9060
5973G6718k7279L4728K8056n348j9190J6220K7414J0935K5623n8816k7993K171
5961H3239l1930j9070K9137J1952k6585M5546j121l1757M8354n9903k1960J01885
5949A27787K967J8600p079n6881l7987Q8488l8301K4732m215k8622M5017k5389
$$ plain form
5937 109117 135152 74116 87060 94826 53832 50685 29880 121918 120576 83303 103219 86436
5925 86436 117860 121412 140114 102065 68541 58425 73740 118439 66589 116683 140487 137685
5913 137685 141802 158270 152382 140959 160725 209092 201019 206183 207081 211532 120550 118364 133245
5900 133245 189030 243780 197020 240894 257189 232999 238447 311990 265421 227877 273807 246938
5888 246938 270916 319213 338358 312549 338938 297390 305970 372603 392769 412392 391313 367237
5876 367237 339611 383080 377577 394522 451975 375827 377604 360548 396100 428656 417732 442384
5864 442384 444028 499319 448237 411459 380212 415082 442359 443055 362045 429566 421035 352139
5852 352139 352350 428119 406650 433147 463349 471039 469028 486049 483344 423679 469941 490597 467601
$$ packed form
5937A09117K6035o1036J2944P766m0994l147k0805R2038j342l7273J9916j6783
5925H6436L1424L552J8702l8049l3524j0116J5315M4699n1850N0094K3804k802
5913A37685M117J6468n888j1423J9766M8367q073N164Q98M451r0982k186J4881
5900A33245N5785N4750m6760M3874J6295k4190N448P3543m6569l7544M5930k6869
5888B46938K3978M8297J9145k5809K6389m1548Q580O6633K0166J9623k1079k4076
5876C67237k7626M3469n503J6945N7453p6148J777j7056L5552L2556j0924K4652
5864D42384J644N5291n1082l6778l1247L4870K7277O96q1010O7521q531o8896
5852C52139K11P5769k1469K6497L0202P690k011J7021k705n9665M6262K0656k2996
$$ plain form
5839 467601 480262 434802 446385 479766 500897 495223 470807 525923 550656 546699 614853 588873
5827 588873 501818 548569 635231 610642 632061 696574 749746 738596 743942 774538 832170 895053
5815 895053 910577 916284 996512 1075114 1065913 1056571 1001240 988880 963465 895804 820789 802584
5803 802584 787482 809965 793697 778445 661669 663214 618908 605078 626496 639063 626280 562836
5791 562836 573568 620263 665966 641300 627475 605252 627124 656820 608148 573918 587710 603543
5779 603543 637336 607558 599632 554316 613216 671150 659749 649777 663323 630625 591422 600940
5767 600940 630550 724179 625289 631899 671450 646028 646479 673668 646328 639322 640282 579841 611137
5754 611137 581755 597005 696336 698982 758730 806281 744492 771741 811185 835571 921358 982495
$$ packed form
5839D67601J2661m5460J1583L3381K1131n674k4416N5116K4733l957O8154k5980
5827E88873q7055M6751Q6662k4589K1419O4513N3172j1150N346L0596N7632O2883
5815H95053J5524N707Q0228P8602r201r342n5331j2360k5415o7661p5015j8205
5803H02584j5102K2483j6268j5252j16776J545m4306j3830K1418J2567j2783o3444
5791E62836J0732M6695M5703k4666j3825k2223K1872K9696m8672l4230J3792J5833
5779F03543L3793k9778p926m5316N8900N7934j1401r972J3546l2698l9203R518
5767F00940K9610R3629r8890O610L9551k5422M51K7189k7340p006R60o0441L1296
5754F11137k9382J5250R9331K646N9748M7551o1789K7249L9444K4386Q5787O1137
$$ plain form
5742 982495 1013498 1058150 1163054 1238893 1388599 1441150 1528956 1591436 1614666 1582565 1503332
5731 1503332 1461278 1384325 1280440 1142639 1059723 942662 876740 897982 851820 857140 805074
5720 805074 821658 837608 763597 765774 776059 723235 743966 725414 734005 773557 785196 745505
5708 745505 756541 737009 737768 751908 750166 816213 763576 742975 769744 779827 811081 872739
5696 872739 895369 883000 887833 919080 898335 904491 887858 903892 954629 983568 985256 1040025
5684 1040025 1028477 1073692 1128086 1111781 1107189 1116283 1114647 1192549 1245925 1255222 1263793 1338929
5672 1338929 1398309 1405115 1421454 1460194 1482069 1511962 1597174 1644827 1682221 1726558 1726550 1786463
5660 1786463 1851165 1934026 1987951 2033385 2146927 2186214 2186809 2329265 2391674 2475922 2568589
$$ packed form
5742I82495L1003M4652J04904P5839J49706N2551Q7806O2480K3230l2101p9233
5731A503332m2054p6953j03885j37801q2916j17061o5922K1242m6162N320n2066
5720H05074J6584J5950p4011K177J0285n2824K0731j8552Q591L9552J1639l9691
5708G45505J1036j9532P59J4140j742O6047n2637k0601K6769J0083L1254O1658
5696H72739K2630j2369M833L1247k0745O156j6633J6034N0737K8939J688N4769
5684A040025j1548M5215N4394j6305m592R094j636P7902N3376R297Q571P5136
5672A338929N9380O806J6339L8740K1875K9893Q5212M7653L7394M4337qN9913
5660A786463O4702Q2861N3925M5434J13542L9287N95J42456O2409Q4248R2667
$$ plain form
5649 2568589 2726279 2792910 2924765 3036826 3170934 3327626 3466863 3619124 3778709 4026236
5639 4026236 4156333 4340407 4631860 4810611 4993225 5256404 5451805 5716387 5933248 6148082
5629 6148082 6353906 6496676 6652930 6795524 6926884 7010938 7108168 7200705 7193873 7274703 7383266
5618 7383266 7463822 7630524 7718101 7857950 8010579 8183813 8397516 8638390 8917514 9218959
5608 9218959 9513518 9794338 10075975 10311938 10539953 10763921 10898239 10970189 11077527 11019660
5598 11019660 10849491 10608780 10387951 10090033 9843338 9551798 9245159 8926619 8695624
5589 8695624 8457516 8225092 8060569 7907117 7684902 7610393 7522862 7439307 7303130 7259027
5579 7259027 7165348 7136696 7106825 6993536 6913159 6724791 6565220 6344542 6144661 5956128
$$ packed form
5649B568589J57690O6631J31855J12061J34108J56692J39237J52261J59585K47527
5639D026236J30097J84074K91453J78751J82614K63179J95401K64582K16861K14834
5629F148082K05824J42770J56254J42594J31360Q4054R7230R2537o832Q0830J08563
5618G383266Q0556J66702Q7577J39849J52629J73234K13703K40874K79124L01445
5608I218959K94559K80820K81637K35963K28015K23968J34318P1950J07338n7867
5598A1019660j70169k40711k20829k97918k46695k91540l06639l18540k30995
5589H695624k38108k32424j64523j53452k22215p4509q7531q3555j36177m4103
5579G259027r3679k8652k9871j13289q0377j88368j59571k20678j99881j88533
$$ plain form
5569 5956128 5751101 5522106 5249656 4995218 4739042 4537499 4363251 4132728 3918480 3765167
5559 3765167 3612816 3406959 3250184 3054365 2915879 2806057 2755871 2700102 2605329 2452916
5549 2452916 2373199 2304743 2232464 2139443 2043285 1996617 1944489 1878642 1786929 1790900 1765901 1656318
5537 1656318 1677766 1635002 1569590 1504470 1447039 1401392 1398135 1363413 1303878 1229517 1238240 1228695
5525 1228695 1224382 1220638 1229884 1145655 1121928 1149431 1118896 1144249 1065316 1093306 1014797 997168
5513 997168 1027877 1041596 976219 928799 932591 908363 899318 880329 829056 825314 873902 872969 845003
5500 845003 833908 830735 850036 846258 812617 861615 819475 812889 882437 878492 869704 867014 849812
5487 849812 847292 880656 851012 796280 886211 934167 883864 902134 924241 930205 914042 921314
$$ packed form
5569E956128k05027k28995k72450k54438k56176k01543j74248k30523k14248j53313
5559C765167j52351k05857j56775j95819j38486j09822n0186n5769r4773j52413
5549B452916p9717o8456p2279r3021r6158m6668n2128o5847r1713L971k4999j09583
5537A656318K1448m2764o5412o5120n7431m5647l257l4722n9535p4361Q723r545
5525A228695m313l744R246q4229k3727K7503l0535K5353p8933K7990p8509j7629
5513I97168L0709J3719o5377m7420L792k4228r045j8989n1273l742M8588r33k7966
5500H45003j1095l173J9301l778l3641M8998m2140o586O9548l945q788k690j7202
5487H49812k520L3364k9644n4732Q9931M7956n0303J8270K2107N964j6163P272
$$ plain form
5475 921314 938271 993399 988428 1025766 1002918 1022017 1002750 1013331 1042048 1099294 1131817 1155762
5463 1155762 1162934 1285986 1384486 1426373 1440633 1499397 1630744 1692963 1805634 1869118 2050175
5452 2050175 2221061 2320454 2403248 2573756 2686458 2856798 2932619 2939800 2881021 2763663 2580280
5441 2580280 2519705 2467491 2372017 2256517 2205225 2193810 2112847 2167957 2153529 2111125 2154068
5430 2154068 2119587 2089398 2020449 1966128 1866523 1755227 1665831 1567347 1481757 1405207 1278191
5419 1278191 1219466 1199519 1170381 1167356 1130056 1099846 1074221 1019630 1000564 927917 848483 882800
5407 882800 915580 903752 866537 835726 826801 843001 809238 787630 767128 787940 772926 781298
5395 781298 780815 719345 758402 751385 709168 771520 736413 719218 756923 723425 728290 731119 707727
$$ packed form
5475I21314J6957N5128m971L7338k2848J9099j9267J0581K8717N7246L2523K3945
5463A155762P172J23052R8500M1887J4260N8764J31347O2219J12671O3484J81057
5452B050175J70886R9393Q2794J70508J12702J70340P5821P181n8779j17358j83383
5441B580280o0575n2214r5474j15500n1292j1415q0963N5110j4428m2404M2943
5430B154068l4481l0189o8949n4321r9605j11296q9396r8484q5590p6550j27016
5419A278191n8725j9947k9138l025l7300l0210k5625n4591j9066p2647p9434L4317
5407H82800L2780j1828l7215l0811q925J6200l3763k1608k0502K0812j5014Q372
5395G81298m83o1470L9057p017m2217O2352l5107j7195L7705l3498M865K829k3392
$$ plain form
5382 707727 714397 732071 751821 692829 640524 668465 698042 747025 746096 761967 742307 755629
5370 755629 740832 722548 698505 707764 715916 745785 740336 714194 704515 758918 809547 786476
5358 786476 768547 753868 808365 867540 897519 887810 887423 900031 977859 965688 982234 994727
5346 994727 959452 974973 999859 1005733 1021250 990793 929075 859914 857413 847800 888770 782832
5334 782832 739328 784540 837988 718677 681882 742957 701762 735684 772669 788610 764759
5323 764759 728950 779684 766507 720693 735426 786158 760030 735653 782256 701609 657066 697757
5311 697757 743442 695085 694799 734199 790133 795679 726632 696958 708741 706595 671887 713205
5299 713205 679610 711824 770315 721755 693246 655669 755009 825190 754884 712290 735019 776610
$$ packed form
5382G07727O670J7674J9750n8992n2305K7941K9577M8983r29J5871j9660J3322
5370G55629j4797j8284k4043R259Q152K9869n449k6142r679N4403N0629k3071
5358G86476j7929j4679N4497N9175K9979r709l87J2608P7828j2171J6546J2493
5346I94727l5275J5521K4886N874J5517l0457o1718o9161k501r613M0970j05938
5334G82832m3504M5212N3448j19311l6795O1075m1195L3922L6985J5941k3851
5323G64759l5809N0734j3177m5814J4733N0732k6128k4377M6603q0647m4543M0691
5311F97757M5685m8357k86L9400N5934N546o9047k9674J1783k146l4708M1318
5299G13205l3595L2214N8491m8560k8509l7577R9340P0181p0306m2594K2729M1591
$$ plain form
5287 776610 740657 775578 763524 741823 785063 769850 823537 846477 817431 758776 782975 784766
5275 784766 797214 828251 855287 880141 851772 863820 864555 844132 810740 818455 827223 861487
5263 861487 901353 883848 888010 909014 978831 992770 1020347 1000385 984879 996556 1062627 1043104
5251 1043104 1002185 1008231 972088 1046116 1023472 999951 1024398 1054623 1102947 1116748 1127205 1135027
5239 1135027 1137072 1159083 1184104 1150375 1171528 1252255 1238187 1226760 1264971 1282187 1235400 1259458
5227 1259458 1267067 1243149 1308970 1289284 1296021 1363467 1378657 1394332 1423739 1414661 1440476 1468905
5215 1468905 1493793 1505074 1529241 1535625 1577180 1607195 1644105 1652795 1678659 1637467 1652651 1777238
5203 1777238 1793939 1840888 1853771 1867566 1885103 1879070 1898615 1916076 1986444 1992270 1990209 1998288
$$ packed form
5287G76610l5953L4921j2054k1701M3240j5213N3687K2940k9046n8655K4199J791
5275G84766J2448L1037K7036K4854k8369J2048P35k0423l3392P715Q768L4264
5263H61487L9866j7505M162K1004O9817J3939K7577j9962j5506J1677O6071j9523
5251A043104m0919O046l6143P4028k2644k3521K4447L0225M8324J3801J0457P822
5239A135027K045K2011K5021l3729K1153Q0727j4068j1427L8211J7216m6787K4058
5227A259458P609k3918O5821j9686O737O7446J5190J5675K9407r078K5815K8429
5215A468905K4888J1281K4167O384M1555L0015L6910Q690K5864m1192J5184J24587
5203A777238J6701M6949J2883J3795J7537o033J9545J7461P0368N826k061Q079
$$ plain form
5191 1998288 2038828 2048485 2068762 2024865 2042185 2174901 2219404 2213836 2190596 2239598 2294606 2315250
5179 2315250 2303629 2360456 2474183 2543399 2610071 2659046 2621689 2642777 2745775 2750057 2824085
5168 2824085 2909080 2995825 3064726 3125830 3187547 3214742 3255044 3384365 3507233 3516554 3621778
5157 3621778 3688799 3808228 3887717 3994280 4105708 4183563 4262201 4373897 4528994 4650085
5147 4650085 4827666 4904298 4983631 5158597 5300769 5470577 5563512 5730547 5855466 6035021
5137 6035021 6208356 6374549 6575203 6729942 6976202 7160303 7339122 7610705 7792952 8017733
5127 8017733 8341374 8571516 8856109 9167442 9488327 9735273 10025651 10341204 10649980 10979604
5117 10979604 11342065 11728067 12123510 12589097 13034894 13554975 14059962 14574866 15199516
$$ packed form
5191A998288M0540R657K0277m3897J7320J32716M4503n568k3240M9002N5008K0644
5179B315250j1621N6827J13727O9216O6672M8975l7357K1088J02998M282P4028
5168B824085Q4995Q6745O8901O1104O1717K7195M0302J29321J22868R321J05224
5157C621778O7021J19429P9489J06563J11428P7855P8638J11696J55097J21091
5147D650085J77581P6632P9333J74966J42172J69808R2935J67035J24919J79555
5137F035021J73335J66193K00654J54739K46260J84101J78819K71583J82247K24781
5127H017733L23641K30142K84593L11333L20885K46946K90378L15553L08776L29624
5117A0979604L62461L86002L95443M65587M45797N20081N04987N14904O24650
$$ plain form
5108 15199516 15799845 16426342 17139665 17860764 18657482 19388556 20200982 21088086 22009156
5099 22009156 23011438 24122618 25242645 26527131 27865331 29307484 30910565 32681850
5091 32681850 34695243 36910060 39305999 41975401 44994722 48276909 51862744 55764535
5083 55764535 60110864 64686674 69543115 74518093 79511290 84510983 89264903 93632277
5075 93632277 97463813 100540917 102529729 103429162 103055468 101396041 98517762 94824421
5067 94824421 90512173 85779158 80780788 75720858 70868460 66143391 61841625 57833770
5059 57833770 54270481 51149778 48498735 46177159 44195598 42544913 41131833 39984196
5051 39984196 39060618 38272403 37673445 37178420 36771035 36413728 35990218 35488850 34906422
$$ packed form
5108A5199516O00329O26497P13323P21099P96718P31074Q12426Q87104R21070
5099B2009156J002282J111180J120027J284486J338200J442153J603081J771285
5091C2681850K013393K214817K395939K669402L019321L282187L585835L901791
5083E5764535M346329M575810M856441M974978M993197M999693M753920M367374
5075I3632277L831536L077104J988812Q99433l73694j659427k878279l693341
5067I4824421m312248m733015m998370n059930m852398m725069m301766m007855
5059E7833770l563289l120703k651043k321576j981561j650685j413080j147637
5051C9984196r23578p88215n98958m95025m07385l57307m23510n01368n82428
$$ plain form
5042 34906422 34236117 33395966 32421137 31307753 30115449 28823300 27514400 26126863 24879156
5033 24879156 23707643 22509515 21341724 20276162 19313932 18296203 17473004 16702177 15990620
5024 15990620 15345703 14691283 14113818 13594023 13080800 12630420 12174993 11771538 11352075
5015 11352075 10948252 10625175 10323479 10035197 9738141 9480939 9202901 8892930 8628676
5006 8628676 8369294 8191417 7973357 7802771 7591504 7343479 7158065 6989662 6837634 6711183
4996 6711183 6524684 6353261 6254900 6064559 5878745 5765213 5689543 5581621 5492716 5386726
4986 5386726 5243049 5131009 5056781 4929798 4823669 4760933 4735604 4636967 4583027 4470173
4976 4470173 4361148 4307224 4265059 4153898 4061913 4056003 4020281 3960172 3926472 3882140 3791806
$$ packed form
5042C4906422o70305q40151r74829j113384j192304j292149j308900j387537j247707
5033B4879156j171513j198128j167791j065562r62230j017729q23199p70827p11557
5024A5990620o44917o54420n77465n19795n13223m50380m55427m03455m19463
5015A1352075m03823l23077l01696k88282k97056k57202k78038l09971k64254
5006H628676k59382j77877k18060j70586k11267k48025j85414j68403j52028j26451
4996F711183j86499j71423r8361j90341j85814j13532p5670j07922q8905j05990
4986E386726j43677j12040p4228j26983j06129o2736k5329r8637n3940j12854
4976D470173j09025n3924m2165j11161r1985n910l5722o0109l3700m4332r0334
$$ plain form
4965 3791806 3734968 3698268 3689009 3597769 3600076 3551326 3440337 3368230 3353875 3327526 3295184 3226554
4953 3226554 3177200 3153812 3106142 3030538 3044487 3035358 2976354 2888503 2810764 2818307 2811836 2775504
4941 2775504 2743377 2713764 2661188 2668753 2616802 2629442 2577673 2489910 2459924 2473112 2438719 2446851
4929 2446851 2412849 2359574 2348830 2289444 2255842 2251925 2160469 2186814 2220748 2160223 2124630 2130997
4917 2130997 2063789 2063086 2035807 2004128 1998910 2055791 2029008 1997607 2032623 1959033 1875117 1882851
4905 1882851 1837502 1811720 1835605 1778303 1796784 1803647 1763148 1785259 1771751 1752108 1774664 1782840
4893 1782840 1758382 1751876 1714337 1714402 1747066 1734745 1793650 1778929 1740490 1727552 1767299 1710506
4881 1710506 1678596 1639188 1660969 1628306 1608939 1637523 1646047 1614028 1604956 1611713 1639468 1697751
$$ packed form
4965C791806n6838l6700r259r1240K307m8750j10989p2107j4355k6349l2342o8630
4953C226554m9354k3388m7670p5604J3949r129n9004q7851p7739P543o471l6332
4941B775504l2127k9613n2576P565n1951J2640n1769q7763k9986J3188l4393Q132
4929B446851l4002n3275j0744n9386l3602l917r1456K6345L3934o0525l5593O367
4917B130997o7208p03k7279l1679n218N6881k6783l1401L5016p3590q3916P734
4905A882851m5349k5782K3885n7302J8481O863m0499K2111j3508j9643K2556Q176
4893A782840k4458o506l7539O5L2664j2321N8905j4721l8439j2938L9747n6793
4881A710506l1910l9408K1781l2663j9367K8584Q524l2019r072O757K7755N8283
$$ plain form
4869 1697751 1670216 1619932 1617756 1638440 1687140 1704383 1717516 1625131 1645680 1715402 1634359 1660240
4857 1660240 1610002 1556323 1530304 1548422 1545975 1595532 1657544 1660409 1621257 1573696 1554004 1503551
4845 1503551 1516120 1460059 1428781 1457111 1425736 1423590 1444496 1518613 1517730 1463039 1432440 1449023
4833 1449023 1456798 1375748 1374711 1383692 1428583 1364738 1365161 1356276 1328281 1327329 1357270 1325786 1346651
4820 1346651 1355042 1351090 1323790 1339719 1324978 1359542 1400323 1358565 1336536 1354566 1357079 1369683
4808 1369683 1379461 1392295 1432601 1420311 1430306 1374163 1403318 1433653 1404700 1371201 1460545 1488576
4796 1488576 1448759 1359139 1397215 1444061 1417919 1391752 1386885 1294786 1256892 1232790 1221112 1221265
4784 1221265 1166550 1142481 1163909 1142257 1122306 1135795 1140782 1104538 1142213 1157764 1109304 1068752
$$ packed form
4869A697751k7535n0284k176K0684M8700J7243J3133r2385K0549O9722q1043K5881
4857A660240n0238n3679k6019J8118k447M9557O2012K865l9152m7561j9692n0453
4845A503551J2569n6061l1278K8330l1375k146K0906P4117q83n4691l0599J6583
4833A449023P775q1050j037Q981M4891o3845M23q885k7995r52K9941l1484K0865
4820A346651Q391l952k7300J5929j4741L4564M0781m1758k2029J8030K513J2604
4808A369683R778J2834M0306j2290R995n6143K9155L0335k8953l3499Q9344K8031
4796A488576l9817q9620L8076M6846k6142k6167m867r2099l7894k4102j1678J53
4784A221265n4715k4069K1428k1652j9951J3489M987l6244L7675J5551m8460m0552
$$ plain form
4772 1068752 1017596 1033368 1029915 1045599 1086634 1077236 1069457 1098099 1114220 1027083 997545 1040881
4760 1040881 1073479 1033221 987711 993579 1002561 1039833 1014280 1026750 1016713 992047 984916 989455
4748 989455 1071630 1061879 1026214 1063627 1065804 1087123 1091533 1066888 1034710 1045895 1080122 994442
4736 994442 994184 1040543 1042734 1072400 1079528 1137797 1127245 1054669 1086205 1146246 1226050 1171275
4724 1171275 1160735 1169452 1171518 1227867 1221127 1216855 1222391 1274579 1240672 1228383 1218736 1184945 1234919
4711 1234919 1225152 1270928 1276615 1261887 1305756 1287576 1296007 1302863 1297296 1333292 1350277 1355294 1416890
4698 1416890 1510175 1505089 1532592 1627691 1674448 1694089 1728895 1779067 1750804 1707715 1565091
4687 1565091 1541053 1547248 1540528 1496145 1461746 1474531 1449500 1459896 1496396 1440085 1433319 1490335
$$ packed form
4772A068752n1156J5772l453J5684M1035r398p779K8642J6121q7137k9538M3336
4760A040881L2598m0258m5510N868Q982L7272k5553J2470j0037k4666p131M539
4748I89455Q2175r751l5665L7413K177K1319M410k4645l2178J1185L4227q5680
4736I94442k58M6359K191K9666P128N8269j0552p2576L1536O0041P9804n4775
4724A171275j0540Q717K066N6349o740m272N536N2188l3907j2289r647l3791M9974
4711A234919r767M5776N687j4728M3869j8180Q431O856n567L5996J6985N017O1596
4698A416890R3285n086K7503R5099M6757J9641L4806N0172k8263m3089j42624
4687A565091k4038O195o720m4383l4399J2785k5031J0396L6500n6311o766N7016
$$ plain form
4675 1490335 1536574 1519659 1554123 1584583 1627247 1700199 1733906 1791589 1809764 1812006 1808257 1826317
4663 1826317 1811961 1783686 1753998 1669434 1653171 1644452 1664525 1581822 1609263 1642118 1541563
4652 1541563 1584999 1668956 1702859 1745804 1682667 1666234 1664725 1665436 1681670 1711494 1783678 1815411
4640 1815411 1882219 1889898 1908144 1979966 1983180 1991460 2000808 2012249 2068895 2146567 2165321 2164062
4628 2164062 2223286 2197430 2251267 2230522 2263006 2333701 2356655 2358815 2407552 2454367 2470739 2489553
4616 2489553 2488557 2561370 2571137 2594561 2613127 2594602 2629801 2635905 2641674 2700397 2785874 2747692
4604 2747692 2740328 2786042 2891467 2963290 3050675 3104733 3117856 3108425 3164031 3175274 3236701 3268668
4592 3268668 3254995 3317804 3272086 3249193 3326991 3290077 3259056 3269593 3241005 3306436 3285341
$$ packed form
4675A490335M6239j6915L4464L0460M2664P2952L3707N7683J8175K242l749J8060
4663A826317j4356k8275k9688q4564j6263q719K0073q2703K7441L2855j00555
4652A541563M3436Q3957L3903M2945o3137j6433j509P11J6234K9824P2184L1733
4640A815411O6808P679J8246P1822L214Q280R348J1441N6646P7672J8754j259
4628B164062N9224k5856N3837k0745L2484P0695K2954K160M8737M6815J6372J8814
4616B489553r96P2813R767K3424J8566j8525L5199O104N769N8723Q5477l8182
4604B747692p364M5714J05425P1823Q7385N4058J3123r431N5606J1243O1427L1967
4592C268668j3673O2809m5718k2893P7798l6914l1021J0537k8588O5431k1095
$$ plain form
4581 3285341 3313200 3342229 3286434 3199331 3232181 3172793 3163656 3196411 3208506 3274765 3276878 3301136
4569 3301136 3234921 3277685 3290776 3301440 3337989 3367953 3472304 3490893 3539306 3582587 3613312
4558 3613312 3669762 3728567 3759561 3720122 3787046 3740326 3738612 3739199 3695210 3767046 3763903 3774896
4546 3774896 3790464 3795881 3833970 3824492 3827470 3927454 3990171 4006189 4042506 4023290 4090870 4164658
4534 4164658 4064589 4104668 4229924 4252986 4307680 4326569 4329423 4352070 4390959 4471555 4576415
4523 4576415 4677323 4739366 4721292 4730578 4829819 4901307 4865714 4922068 5002332 5097371 5141592
4512 5141592 5189245 5302720 5408523 5546838 5578809 5608788 5688012 5737139 5800528 5912383 5984562
4501 5984562 6117396 6215700 6288691 6418349 6561474 6638266 6785887 6897516 7047460 7169991
$$ packed form
4581C285341K7859K9029n5795q7103L2850n9388r137L2755J2095O6259K113K4258
4569C301136o6215M2764J3091J0664L6549K9964J04351J8589M8413M3281L0725
4558C613312N6450N8805L0994l9439O6924m6720j714N87m3989P1836l143J0993
4546C774896J5568N417L8089r478K978R9984O2717J6018L6317j9216O7580P3788
4534D164658j00069M0079J25256K3062N4694J8889K854K2647L8889Q0596J04860
4523D576415J00908O2043j8074R286R9241P1488l5593N6354Q0264R5039M4221
4512E141592M7653J13475J05803J38315L1971K9979P9224M9127O3389J11855P2179
4501E984562J32834R8304P2991J29658J43125P6792J47621J11629J49944J22531
$$ plain form
4491 7169991 7227597 7299440 7396794 7442152 7546751 7606662 7687898 7799091 7834453 7878099 8017084
4480 8017084 8154910 8258775 8378763 8459895 8592475 8734784 8927069 9081487 9227268 9419939
4470 9419939 9568004 9772426 10035435 10195600 10302498 10500565 10702874 10956474 11204857 11419358
4460 11419358 11664914 11866398 12109180 12383473 12660772 12988178 13303904 13718890 14083429
4451 14083429 14486272 14860076 15311313 15737451 16178072 16672889 17164652 17659626 18173332
4442 18173332 18704189 19221426 19871695 20526556 21131510 21791319 22470282 23259494 24132867
4433 24132867 25039903 26053394 27143015 28421454 29895512 31569002 33492699 35718956
4425 35718956 38250404 41203973 44554128 48368361 52729203 57737793 63330029 69843757
$$ packed form
4491G169991N7606P1843R7354M5358J04599N9911Q1236J11193L5362M3646J38985
4480H017084J37826J03865J19988Q1132J32580J42309J92285J54418J45781J92671
4470I419939J48065K04422K63009J60165J06898J98067K02309K53600K48383K14501
4460A1419358K45556K01484K42782K74293K77299L27406L15726M14986L64539
4451A4083429M02843L73804M51237M26138M40621M94817M91763M94974N13706
4442A8173332N30857N17237O50269O54861O04954O59809O78963P89212Q73373
4433B4132867R07036J013491J089621J278439J474058J673490J923697K226257
4425C5718956K531448K953569L350155L814233M360842N008590N592236O513728
$$ plain form
4417 69843757 77389387 85942124 94739377 102949529 109587807 112908531 111899198 106109936
4409 106109936 96817586 86611534 77399899 70185216 64924640 61160286 58440928 56632004
4401 56632004 55484778 55092034 55381807 56308932 57832426 60129837 63107744 66802732 71309687
4392 71309687 76729811 83222604 90909475 99191816 107228042 114023516 117352403 115987056
4384 115987056 110608286 101919331 91543726 81679822 73429806 67061825 62209637 58388871
4376 58388871 55369878 52913578 50963888 49537399 48491550 47774792 47364111 47143439 47143518
4367 47143518 47287555 47580561 48014386 48593325 49422086 50336596 51331093 52466698 53774902
4358 53774902 55089465 56461123 57941616 59471508 61039376 62565544 63967745 65438214
$$ packed form
4417F9843757P545630Q552737Q797253Q210152O638278L320724j009333n789262
4409A06109936r292350j0206052r211635p214683n260576l764354k719358j808924
4401E6632004j147226l92744K89773R27125J523494K297411K977907L694988M506955
4392G1309687N420124O492793P686871Q282341Q036226O795474L328887j365347
4384A15987056n378770q688955j0375605r863904q250016o367981m852188l820766
4376E8388871l018993k456300j949690j426489j045849p16758m10681k20672P9
4367D7143518J44037K93006M33825N78939Q28761R14510R94497J135605J308204
4358E3774902J314563J371658J480493J529892J567868J526168J402201J470469
$$ plain form
4350 65438214 66869726 68327895 69791004 71295781 72868100 74464035 76156640 77869892
4342 77869892 79650529 81549553 83488383 85427862 87413887 89410384 91435808 93376377
4334 93376377 95115324 96688397 98060350 99188548 99875308 100218057 99983865 99242135 97923966
4325 97923966 96034173 93758148 91306564 88913301 86598851 84451217 82637144 81071248
4317 81071248 79796880 78843657 78113884 77583459 77225985 76961492 76802703 76647479 76491248
4308 76491248 76078310 75337204 74474474 73207188 71715442 70075873 68149449 66191092 64281809
4299 64281809 62279019 60356560 58470265 56621161 54913246 53278580 51729394 50282772
4291 50282772 48918613 47706113 46580036 45588877 44662589 43815775 43031861 42258735 41627557
$$ packed form
4350F5438214J431512J458169J463109J504777J572319J595935J692605J713252
4342G7869892J780637J899024J938830J939479J986025J996497K025424J940569
4334I3376377J738947J573073J371953J128198O86760L42749k34192p41730j318169
4325I7923966j889793k276025k451584k393263k314450k147634j814073j565896
4317H1071248j274368r53223p29773n30425l57474k64493j58789j55224j56231
4308G6491248m12938p41106q62730j267286j491746j639569j926424j958357j909283
4299F4281809k002790j922459j886295j849104j707915j634666j549186j446622
4291E0282772j364159j212500j126077r91159r26288q46814p83914p73126o31178
$$ plain form
4282 41627557 41027251 40623564 40266365 40023509 39805179 39610978 39435849 39324718 39356051 39384430
4272 39384430 39448234 39532853 39677235 39891944 40112619 40393097 40741138 41102116 41502397 41948146
4262 41948146 42403308 42962614 43734254 44502673 45413065 46389792 47493267 48787860 50213870
4253 50213870 51668973 53279618 54915867 56586882 58298669 60189366 62185943 64306844
4245 64306844 66519625 68898181 71315526 73718753 76062049 78265812 80256095 81955917
4237 81955917 83385407 84445802 85333542 86136469 86886829 87676815 88664882 89716360 91052173
4228 91052173 92633986 94496673 96573652 98915629 101536576 104268363 107118488 109925065
4220 109925065 112675842 115472178 118251330 120990164 123774409 126416489 128650757 130406803
$$ packed form
4282D1627557o00306m03687l57199k42856k18330j94201j75129j11131L1333K8379
4272C9384430O3804Q4619J44382K14709K20675K80478L48041L60978M00281M45749
4262D1948146M55162N59306P71640P68419R10392R76727J103475J294593J426010
4253E0213870J455103J610645J636249J671015J711787J890697J996577K120901
4245F4306844K212781K378556K417345K403227K343296K203763J990283J699822
4237H1955917J429490J060395Q87740Q02927P50360P89986R88067J051478J335813
4228I1052173J581813J862687K076979K341977K620947K731787K850125K806577
4220A09925065K750777K796336K779152K738834K784245K642080K234268J756046
$$ plain form
4212 130406803 131689352 132542510 133299400 134265764 135670549 137648481 140253675 143640683
4204 143640683 147312801 151099532 154846052 158080235 160553478 162153831 162912149 163064331
4196 163064331 162767387 162184833 161373542 160419694 159032022 157028300 154288263 150701414 146318933
4187 146318933 141248119 135958919 130556111 125601850 121518766 118237359 115687754 113871246
4179 113871246 112649935 111630414 110559092 109350944 107732205 105904967 104081217 102341913
4171 102341913 100903997 99850157 99154949 98631293 98262868 98006403 97964786 98389017 99350366
4162 99350366 100934081 103291169 106378713 110223920 114906643 120470618 126904050 134265458
4154 134265458 142580299 151806036 161906342 172843321 184616249 196713411 208560667
$$ packed form
4212A30406803J282549Q53158P56890R66364J404785J977932K605194L387008
4204A43640683L672118L786731L746520L234183K473243J600353P58318J52182
4196A63064331k96944n82554q11291r53848j387672k003722k740037l586849m382481
4187A46318933n070814n289200n402808m954261m083084l281407k549605j816508
4179A13871246j221311j019521j071322j208148j618739j827238j823750j739304
4171A02341913j437916j053840o95208n23656l68425k56465m1617M24231R61349
4162I9350366J583715K357088L087544L845207M682723N563975O433432P361408
4154A34265458Q314841R225737J0100306J0936979J1772928J2097162J1847256
$$ plain form
4147 208560667 218988726 226421740 229276241 226539636 218401303 206395985 192641009 178879709
4139 178879709 166352460 155445887 146181921 138330396 131642584 126009271 120953505 116107865
4131 116107865 111383560 106347855 101116420 95700722 90249378 84924914 79884609 75236623
4123 75236623 71006295 67218062 63634248 60527382 57672356 55043336 52685714 50549429
4115 50549429 48552579 46810801 45154687 43611748 42317241 41043058 39985532 38926399
4107 38926399 37900360 36993359 36036216 35197195 34467743 33764813 33001034 32247474 31476487
4098 31476487 30715267 29948374 29311890 28749246 28113940 27506845 26983788 26562445 26077608
4089 26077608 25640636 25257650 24833691 24437968 24118212 23765200 23414449 23100953 22792166
$$ packed form
4147B08560667J0428059P433014K854501k736605q138333j2005318j3754976j3761300
4139A78879709j2527249j0906573r263966p851525o687812n633313n055766m845640
4131A16107865m724305n035705n231435n415698n451344n324464n040305m647986
4123G5236623m230328l788233l583814l106866k855026k629020k357622k136285
4115E0549429j996850j741778j656114j542939j294507j274183j057526j059133
4107C8926399j026039r07001r57143q39021p29452p02930p63779p53560p70987
4098C1476487p61220p66893o36484n62644o35306o07095n23057m21343m84837
4089B6077608m36972l82986m23959l95723l19756l53012l50751l13496l08787
$$ plain form
4080 22792166 22488484 22218737 21900881 21570471 21264532 20927476 20588020 20290296 19980643
4071 19980643 19679310 19413116 19203922 18965240 18812492 18591364 18446634 18389121 18225309 18090911
4061 18090911 17947861 17790970 17730072 17607310 17469298 17442622 17369838 17327984 17371827 17336366
4051 17336366 17317366 17334805 17381686 17431218 17460137 17520465 17581229 17682089 17861046 18004893 18131851
4040 18131851 18238620 18376217 18540778 18756338 18979389 19189454 19453291 19661412 19953007
4031 19953007 20180917 20416126 20716993 20960343 21243584 21618693 21975393 22407659 22895038
4022 22895038 23349225 23873789 24351348 24887329 25450256 25996591 26609364 27193930 27896677
4013 27896677 28721838 29564467 30431486 31532026 32563437 33750235 35065317 36425398 37853414
$$ packed form
4080B2792166l03682k69747l17856l30410l05939l37056l39456k97724l09653
4071A9980643l01333k66194k09194k38682j52748k21128j44730n7513j63812j34398
4061A8090911j43050j56891o0898j22762j38012k6676p2784m1854M3843l5461
4051A7336366j9000J7439M6881M9532K8919O0328O0764J00860J78957J43847J26958
4040A8131851J06769J37597J64561K15560K23051K10065K63837K08121K91595
4031A9953007K27910K35209L00867K43350K83241L75109L56700M32266M87379
4022B2895038M54187N24564M77559N35981N62927N46335O12773N84566P02747
4013B7896677Q25161Q42629Q67019J100540J031411J186798J315082J360081J428016
$$ plain form
4004 37853414 39345897 40861028 42304671 43695281 45010262 46230098 47327305 48509825
3996 48509825 49837472 51362798 53107434 54991592 57203859 59726020 62560903 65786810
3988 65786810 69576225 73961386 78987744 84861845 91686758 99546586 108610066 119067587
3980 119067587 131020713 144613793 160170142 177910464 198057169 221065104 247371747
3973 247371747 277066040 308755966 338454473 361824979 375899298 375536951 356730269
3966 356730269 323211626 283926799 246346873 214375933 188319262 167156197 149745574
3959 149745574 135059908 122479608 111702796 102419135 94386233 87422103 81350521 76005955
3951 76005955 71305595 67051642 63235753 59804644 56693901 53751449 50994242 48548343
$$ packed form
4004C7853414J492483J515131J443643J390610J314981J219836J097207J182520
3996D8509825J327647J525326J744636J884158K212267K522161K834883L225907
3988F5786810L789415M385161N026358N874101O824913P859828R063480J0457521
3980A19067587J1953126J3593080J5556349J7740322K0146705K3007935K6306643
3973B47371747K9694293L1689926K9698507K3370506J4074319l62347j8806682
3966C56730269l3518643l9284827l7579926l1970940k6056671k1163065j7410623
3959A49745574j4685666j2580300j0776812r283661q032902o964130o071582n344566
3951G6005955m700360m253953l815889l431109l110743k942452k757207k445899
$$ plain form
3943 48548343 46305787 44200770 42259856 40481015 38825049 37309798 35988475 34770076
3935 34770076 33522388 32367716 31421639 30557771 29674714 28845847 28097483 27286222 26524910
3926 26524910 25847848 25099992 24340939 23739715 23035503 22330594 21759340 21130231 20694443
3917 20694443 20199986 19802783 19393659 19077551 18766844 18399436 18055933 17702041 17403885
3908 17403885 16986759 16542183 16137763 15760434 15445058 15174722 14878996 14568208 14252163
3899 14252163 13989984 13748677 13440726 13189188 12973062 12769401 12586877 12463356 12368034 12310937
3889 12310937 12279819 12254606 12246669 12239523 12282609 12430107 12607301 12782964 12881007 12878334 12616769
3878 12616769 12214616 11814608 11321270 10837952 10457734 10201868 9991185 9799307 9630944
$$ packed form
3943D8548343k242556k105017j940914j778841j655966j515251j321323j218399
3935C4770076j247688j154672r46077q63868q83057q28867p48364q11261p61312
3926B6524910o77062p47856p59053o01224p04212p04909n71254o29109m35788
3917B0694443m94457l97203m09124l16108l10707l67408l43503l53892k98156
3908A7403885m17126m44576m04420l77329l15376k70336k95726l10788l16045
3899A4252163k62179k41307l07951k51538k16126k03661j82524j23521r5322n7097
3889A2310937l1118k5213p937p146M3086J47498J77194J75663R8043k673k61565
3878A2616769m02153m00008m93338m83318l80218k55866k10683j91878j68363
$$ plain form
3869 9630944 9401211 9195794 8917635 8700956 8495018 8250725 8039973 7886465 7717726 7529253
3859 7529253 7375620 7183335 7018658 6852196 6791348 6690442 6520922 6372605 6289267 6175104
3849 6175104 6073974 6018641 5921024 5813607 5711714 5521946 5432751 5338377 5174753 5001056
3839 5001056 4874856 4818252 4717717 4623948 4551459 4503271 4405117 4315339 4218572 4187941 4101498
3828 4101498 4050313 4016390 3979901 3934550 3990344 3974075 3921844 3807484 3692444 3655559 3617435
3817 3617435 3587461 3512691 3503752 3423789 3387766 3347808 3295293 3241334 3199831 3171059 3170393 3139882
3805 3139882 3129459 3103442 3074832 3085075 3080574 3055010 3019954 2957314 2943954 2927142 2970737 2954751
3793 2954751 3000563 3030818 3071496 3099657 3086463 3132338 3182059 3171526 3164467 3211398 3259025 3259040
$$ packed form
3869I630944k29733k05417k78159k16679k05938k44293k10752j53508j68739j88473
3859G529253j53633j92285j64677j66462o0848j00906j69520j48317q3338j14163
3849F175104j01130n5333r7617j07417j01893j89768q9195r4374j63624j73697
3839E001056j26200n6604j00535r3769p2489m8188r8154q9778r6767l0631q6443
3828D101498n1185l3923l6489m5351N5794j6269n2231j14360j15040l6885l8124
3817C617435k9974p4770q939p9963l6023l9958n2515n3959m1503k8772o66l0511
3805C139882j0423k6017k8610J0243m501k5564l5056o2640j3360j6812M3595j5986
3793B954751M5812L0255M0678K8161j3194M5875M9721j0533p059M6931M7627J5
$$ plain form
3781 3259040 3183212 3162172 3109653 3027197 2975845 2936582 2881554 2767186 2688605 2585136 2478518
3770 2478518 2417081 2415534 2392123 2321105 2283433 2282571 2246530 2225166 2247085 2235734 2222379 2133786
3758 2133786 2163789 2197818 2128154 2148922 2120220 2121667 2121371 2118402 2114595 2087904 2055924 2030540
3746 2030540 1999419 1957224 1992375 1985534 1940294 1923654 1945562 1991039 1906760 1875660 1936981 1939805
3734 1939805 1909943 1932849 1966651 1947318 1953472 1934410 1997505 2049353 2044139 2038159 2097181 2055991
3722 2055991 2008207 1964878 1968479 1956557 1993493 1957305 1922871 1935004 1975342 2033152 2000436 2042718
3710 2042718 2120769 2182055 2201459 2273849 2370683 2404660 2437476 2583335 2693670 2778986 2937847
3699 2937847 3091625 3261011 3390451 3544387 3700700 3845156 3880697 3810951 3679971 3505697
$$ packed form
3781C259040p5828k1040n2519q2456n1352l9263n5028j14368p8581j03469j06618
3770B478518o1437j547k3411p1018l7672q62l6041k1364K1919j1351j3355q8593
3758B133786L0003L4029o9664K0768k8702J447k96k969l807k6691l1980k5384
3746B030540l1121m2195L5151o841m5240j6640K1908M5477q4279l1100O1321K824
3734A939805k9862K2906L3802j9333O154j9062O3095N1848n214n980N9022m1190
3722B055991m7784m3329L601j1922L6936l6188l4434J2133M0338N7810l2716M2282
3710B042718P8051O1286J9404P2390R6834L3977L2816J45859J10335Q5316J58861
3699B937847J53778J69386J29440J53936J56313J44456L5541o9746j30980j74274
$$ plain form
3689 3505697 3297342 2986030 2800136 2599452 2459533 2330468 2215960 2105333 2021713 1979704
3679 1979704 1883022 1826237 1799519 1727614 1674851 1683382 1612311 1600262 1601489 1530477 1488386 1479334
3667 1479334 1507519 1482952 1402986 1450740 1437507 1418093 1396231 1358746 1372333 1417937 1357528
3656 1357528 1287792 1271270 1228621 1231416 1280459 1277012 1250028 1307909 1293300 1170198 1162430 1136403
3644 1136403 1096245 1126709 1106300 1089793 1142131 1079604 1074294 988630 950859 980954 991906 1034225
3632 1034225 1038062 1049967 1025958 1071430 1081701 1067754 994284 984143 947017 969926 1054048 959376
3620 959376 943632 996726 1003730 947203 945767 949956 885225 894983 895956 842891 880446 878618 811715
3607 811715 759910 786398 766585 755201 752489 698755 706209 687828 671282 598902 564779 571372
$$ packed form
3689C505697k08355l11312j85894k00684j39919j29065j14508j10627q3620m2009
3679A979704r6682n6785k6718p1905n2763Q531p1071j2049J227p1012m2091r052
3667A479334K8185k4567p9966M7754j3233j9414k1862l7485J3587M5604o0409
3656A357528o9736j6522m2649K795M9043l447k6984N7881j4609j23102p768k6027
3644A136403m0158L0464k0409j6507N2338o2527n310q5664l7771L0095J0952M2319
3632A034225L837J1905k4009M5472J0271j3947p3470j0141l7126K2909Q4122r4672
3620I59376j5744N3094P004n6527j436M189o4731R758R73n3065L7555j828o6903
3607H11715n1805K6488j9813j1384k712n3734P454j8381j6546p2380l4123O593
$$ plain form
3595 571372 625218 595610 547597 513186 466799 484378 512457 582365 568327 521003 590707 569807
3583 569807 562011 536018 561246 509474 461178 484472 501300 566500 542197 498200 504341 486421
3571 486421 517229 488985 464797 438833 472933 409480 414173 364748 360318 381826 410494 448666
3559 448666 449749 438125 433314 438243 397659 396437 358667 385065 417327 324481 330727 362328 367730
3546 367730 304918 316810 374631 388877 357282 295476 272951 342193 380649 379175 464365 405135
3534 405135 402405 356779 334057 366795 388269 402480 364184 323972 356986 409963 412153 370909
3522 370909 349444 351545 415093 417092 374675 406485 468960 420631 406093 382524 410556 406379
3510 406379 401066 432994 431511 432453 446035 378645 326848 317844 293656 318647 321552 322169 331908
$$ packed form
3595E71372N3846k9608m8013l4411m6387J7579K8079O9908j4038m7324O9704k0900
3583E69807p796k5993K5228n1772m8296K3294J6828O5200k4303m3997O141j7920
3571D86421L0808k8244k4188k5964L4100o3453M693m9425m430K1508K8668L8172
3559D48666J083j1624m811M929m0584j222l7770K6398L2262r2846O246L1601N402
3546C67730o2812J1892N7821J4246l1595o1806k2525O9242L8456j474Q5190n9230
3534D05135k730m5626k2722L2738K1474J4211l8296m0212L3014N2977K190m1244
3522C70909k1465K101O3548J999m2417L1810O2475m8329j4538k3569K8032m177
3510D06379n313L1928j483R42J3582o7390n1797r004k4188K4991K905O17R739
$$ plain form
3497 331908 331958 339047 301015 300490 274400 328573 344467 346869 292375 235819 238956 302472 302574 258202
3483 258202 257071 263779 237729 302225 246895 231860 269090 270600 257015 255993 256194 224807 264634
3470 264634 274683 180160 95644 167952 192501 204616 243162 266129 220416 180840 106547 122790
3458 122790 156674 147202 120147 181465 209238 234869 296917 208182 187593 209673 206561 206889
3446 206889 254694 250688 247505 222972 228427 240481 251672 227857 219391 264021 259233 239377 237458
3433 237458 267901 273767 261949 206412 274812 254119 214381 280123 275356 240654 262607 214615
3421 214615 215754 227695 235994 224067 189426 193498 187742 184781 189691 195554 232243 226557 276172
3408 276172 249099 261630 259577 248027 260172 294309 330882 322855 298485 348114 267921 285444
$$ packed form
3497C31908N0P089l8032n25k6090N4173J5894K402n4494n6556L137O3516J02m4372
3483B58202j131O708k6050O4496n5330j5035L7230J510j3585j022K01l1387L9827
3470B64634J0049r4523q4516P2308K4549J2115L8546K2967m5713l9576p4293J6243
3458A22790L3884r472k7055O1318K7773K5631O2048q8735k0589K2080l112L28
3446B06889M7805m006l183k4533N455J2054J1191k3815q466M4630m788j9856j919
3433B37458L0443N866j1818n5537O8400k0693l9738O5742m767l4702K1953m7992
3421B14615J139J1941Q299j1927l4641M072n756k961M910N863L6689n686M9615
3408B76172k7073J2531k053j1550J2145L4137L6573q027k4370M9629q0193J7523
$$ plain form
3396 285444 252904 221956 264036 307335 305055 305291 315264 288483 349402 328022 377432 303315
3384 303315 275576 325993 328469 375633 339246 343510 309213 354400 415947 352579 343688 327381
3372 327381 363259 390368 352005 313026 346414 284914 290494 362392 378544 382573 464451 440779
3360 440779 358375 358995 324805 300916 352228 336555 380333 359835 281479 337247 317786 347134
3348 347134 313251 283333 298081 218032 259079 255530 299924 314698 338714 285577 281918 279380
3336 279380 325075 304584 242265 225349 242036 316049 358613 340685 334706 326173 243438 291508
3324 291508 342778 336630 312379 258323 267079 277008 245688 221380 207878 283783 247269 263538
3312 263538 282722 274017 295965 260570 247064 207897 204191 249694 228335 208443 173672 204275
$$ packed form
3396B85444l2540l0948M2080M3299k280K36R973k6781O0919k1380M9410p4117
3384C03315k7739N0417K476M7164l6387M264l4297M5187O1547o3368q891j6307
3372C27381L5878K7109l8363l8979L3388o1500N580P1898J6152M029Q1878k3672
3360D40779q2404O20l4190k3889N1312j5673M3778k0498p8356N5768j9461K9348
3348C47134l3883k9918J4748q0049M1047l549M4394J4774K4016n3137l659k538
3336B79380M5695k0491o2319j6916J6687P4013M2564j7928n979q533q2735M8070
3324B91508N1270o148k4251n4056Q756R929l1320k4308j3502P5905l6514J6269
3312B63538J9184q705K1948l5395j3506l9167l706M5503k1359j9892l4771L0603
$$ plain form
3300 204275 233973 204180 174219 197531 111964 136685 150889 167350 175544 156836 166081 203317
3288 203317 186075 166531 192703 168661 148108 181909 166797 184982 156030 196992 198929 117828
3276 117828 142766 180090 187278 152592 207750 205915 224452 234270 218639 223291 256019 209973
3264 209973 214317 217969 274253 269397 209541 195659 182818 176055 165208 167842 208430 216728 228354
3251 228354 160481 197459 227517 224556 271606 245582 281385 311805 241417 270167 274865 231296
3239 231296 219068 225827 240234 210462 235526 332751 380866 332999 282723 305752 333280 333508
3227 333508 326759 272378 301141 318524 297299 326703 272887 306896 326317 309843 234759 212727
3215 212727 250450 239495 221136 227301 245276 220867 194267 206964 229900 195132 171681 147779
$$ packed form
3300B04275K9698k9793k9961K3312q5567K4721J4204J6461Q194j8708R245L7236
3288B03317j7242j9544K6172k4042k0553L3801j5112J8185k8952M0962J937q1101
3276A17828K4938L7324P188l4686N5158j835J8537R818j5631M652L2728m6046
3264B09973M344L652N6284m856n9856j3882j2841o763j0847K634M0588Q298J1626
3251B28354o7873L6978L0058k961M7050k6024L5803L0420p0388K8750M698m3569
3239B31296j2228O759J4407k9772K5064R7225M8115m7867n0276K3029K7528K28
3227C33508o749n4381K8763J7383k1225K9404n3816L4009J9421j6474p5084k2032
3215B12727L7723j0955j8359O165J7975k4409k6600J2697K2936l4768k3451k3902
$$ plain form
3203 147779 221032 186323 199641 189061 226463 234010 177397 201991 221187 205709 207219 232293
3191 232293 228464 235845 219910 228918 243092 280808 313056 247258 286893 259575 265214 283765
3179 283765 252601 220091 238290 286310 251882 258380 276139 296758 346789 342571 304635 332689
3167 332689 341197 371046 395209 391076 406696 335233 352772 422599 430778 399458 421328 502316
3155 502316 506833 474125 488547 499575 460653 507150 576179 506042 516182 542556 542664 591969
3143 591969 595964 577418 585142 636813 663254 673979 711795 731823 802865 865447 856044 909409
3131 909409 926705 948259 1018413 1049929 1031057 1131459 1155660 1202837 1201077 1297929 1376953 1459159
3119 1459159 1522078 1583186 1722708 1761052 1849643 2036610 2043133 2115624 2202129 2297271 2341635
$$ packed form
3203A47779P3253l4709J3318j0580L7402P547n6613K4594J9196j5478J510K5074
3191B32293l829P381j5935R008J4174L7716L2248o5798L9635k7318N639J8551
3179B83765l1164l2510J8199M8020l4428O498J7759K0619N0031m218l7936K8054
3167C32689Q508K9849K4163m133J5620p1463J7539O9827Q179l1320K1870Q0988
3155E02316M517l2708J4422J1028l8922M6497O9029p0137J0140K6374J08M9305
3143E91969L995j8546P724N1671K6441J0725L7816K0028P1042O2582r403N3365
3131I09409J7296K1554P0154L1516j8872J00402K4201M7177j760R6852P9024Q2206
3119A459159O2919O1108J39522L8344Q8591J86967O523P2491Q6505R5142M4364
$$ plain form
3108 2341635 2336083 2294345 2213195 2088890 1994339 1943396 1886784 1837177 1762751 1734434 1621038
3097 1621038 1589577 1557160 1531749 1479240 1423663 1418682 1397007 1326230 1365480 1309495 1347118 1340243
3085 1340243 1281966 1253271 1205049 1139697 1154367 1215515 1155529 1096850 1086854 1048727 1081805 1048643
3073 1048643 1025939 1079202 1117658 1033965 1042998 982592 1009168 986016 953332 1022082 1066629 1078583
3061 1078583 1029518 1064805 1075653 966395 921048 930647 911744 927636 900225 878650 882009 887928
3049 887928 887142 826040 787028 807936 785577 719638 710648 720875 695944 658174 600131 604935
3037 604935 495075 558658 580366 574027 546880 527635 523817 527352 521665 547217 512942 455328
3025 455328 459724 433761 460255 447033 395716 375664 390445 414607 395148 453556 388793 339707
$$ packed form
3108B341635n552m1738q1150j24305r4551n0943n6612m9607p4426k8317j13396
3097A621038l1461l2417k5411n2509n5577m981k1675p0777L9250n5985L7623o875
3085A340243n8277k8695m8222o5352J4670O1148n9986n8679r996l8127L3078l3162
3073A048643k2704N3263L8456q3693R033o0406K6576k3152l2684O8750M4547J1954
3061A078583m9065L5287J0848j09258m5347R599j8903J5892k7411k1575L359N919
3049H87928p86o1102l9012K0908k2359o5939q990J0227k4931l7770n8043M804
3037F04935j09860O3583K1708o339k7147j9245l818L535n687K5552l4275n7614
3025D55328M396k5963K6494j3222n1317k0052J4781K4162j9459N8408o4763m9086
$$ plain form
3013 339707 356385 361077 357696 290073 304102 293207 316834 361177 383045 326348 300051 303339
3001 303339 274038 290070 264781 284997 268437 267755 296371 292668 310967 296984 270773 238160
2989 238160 264803 302614 228901 232941 232865 253159 243332 258468 229678 204240 241136 217105 223850
2976 223850 249873 247446 295372 246394 246037 231929 184213 172623 186775 222679 227408 226769 183411
2963 183411 148835 204352 208993 163577 120971 101842 114329 156482 166914 143656 176578 153584
2951 153584 177729 172563 191540 148399 126146 136110 207132 163660 193638 171750 162714 187576
2939 187576 174339 162991 132758 181187 189994 171340 218783 265035 246005 197348 240568 212231
2927 212231 228148 236168 207922 208283 213678 251464 308918 328473 308329 349261 380305 368275
$$ packed form
3013C39707J6678M692l381o7623J4029j0895K3627M4343K1868n6697k6297L288
3001C03339k9301J6032k5289K0216j6560o82K8616l703J8299j3983k6211l2613
2989B38160K6643L7811p3713M040p6K0294r827J5136k8790k5438L6896k4031O745
2976B23850K6023k427M7926m8978l57j4108m7716j1590J4152L5904M729o39m3358
2963A83411l4576N5517M641m5416m2606j9129J2487M2153J0432k3258L2922k2994
2951A53584K4145n166J8977m3141k2253R964P1022m3472K9978k1888r036K4862
2939A87576j3237j1348l0233M8429Q807j8654M7443M6252j9030m8657M3220k8337
2927B12231J5917Q020k8246L61N395L7786N7454J9555k0144M0932L1044j2030
$$ plain form
2915 368275 346956 392779 406568 428410 410189 387714 384817 416358 353601 304644 366936 361176
2903 361176 383111 401830 448551 410935 368340 401200 439706 413158 422065 449516 484689 464731
2891 464731 442125 459036 398563 431492 476733 450858 468823 426807 532016 627505 640751
2880 640751 712781 691455 675598 720625 691874 681214 649341 628538 613461 568671 543023 530602
2868 530602 570710 580194 615399 582995 614246 606942 552344 525103 473091 482709 482007 500758 466306
2855 466306 470789 422044 435159 464800 475592 489458 479450 519954 496796 508187 461141 483275
2843 483275 521542 446320 438296 488927 467851 444960 398734 498358 454179 416419 389864 391989
2831 391989 381557 407809 444629 451950 412983 396388 385537 371625 368236 380498 330326 420281
$$ packed form
2915C68275k1319M5823J3789K1842j8221k2475k897L1541o2757m8957O2292n760
2903C61176K1935J8719M6721l7616m2595L2860L8506k6548Q907K7451L5173j9958
2891D64731k2606J6911o0473L2929M5241k5875J7965m2016J05209R5489J3246
2880F40751P2030k1326j5857M5027k8751j0660l1873k0803j5077m4790k5648j2421
2868E30602M0108R484L5205l2404L1251p304n4598k7241n2012R618p02J8751l4452
2855D66306M483m8745J3115K9641J0792J3866j0008M0504k3158J1391m7046K2134
2843D83275L8267p5222q024N0631k1076k2891m6226R9624m4179l7760k6555K125
2831C91989j0432K6252L6820P321l8967j6595j0851j3912l389J2262n0172Q9955
$$ plain form
2819 420281 431482 340440 334185 343650 301967 341265 377809 334131 363798 320116 367002 376382
2807 376382 444217 401483 367922 390040 428368 423432 412795 441610 404368 433219 417802 421697
2795 421697 398584 379522 342660 381602 380651 381062 332344 309755 347195 308810 310344 330092 337761
2782 337761 344387 344646 294477 318403 367460 349137 319140 384923 367399 377877 361688 311399
2770 311399 301381 314386 315974 278303 263059 296175 322447 303475 233185 253360 264806 240985
2758 240985 213392 210180 195522 202837 183653 208671 162087 204412 229737 253953 282967 212105
2746 212105 205866 244503 218280 185265 177221 189970 226093 179785 197359 220046 243600 250407
2734 250407 226258 162096 161171 210612 179141 154370 211364 285733 289793 241780 182547 150263
$$ packed form
2819D20281J1201r1042o255R465m1683L9298L6544m3678K9667m3682M6886R380
2807C76382O7835m2734l3561K2118L8328m936j0637K8815l7242K8851j5417L895
2795D21697k3113j9062l6862L8942r51M11m8718k2589L7440l8385J534J9748P669
2782C37761O626K59n0169K3926M9057j8323k9997O5783j7524J0478j6189n0289
2770C11399j0018J3005J588l7671j5244L3116K6272j8972p0290K0175J1446k3821
2758B40985k7593l212j4658P315j9184K5018m6584M2325K5325K4216K9014p0862
2746B12105o239L8637k6223l3015q044J2749L6123m6308J7574K2687K3554O807
2734B50407k4149o4162r25M9441l1471k4771N6994P4369M060m8013n9233l2284
$$ plain form
2722 150263 191117 224936 233102 231502 269226 256502 195661 226789 296408 280384 238458 242971
2710 242971 229175 220313 182959 221843 239556 237804 274049 209782 193003 173599 141954 138850
2698 138850 125091 118290 117971 130736 139040 146451 109443 153871 89206 111696 112969 93497 130215
2685 130215 120674 135405 110423 80411 137650 121412 137323 185029 150277 120533 62464 150710
2673 150710 129688 90280 83041 125364 80882 47484 27652 -4298 -41518 -60863 -76081 -64235
2661 -64235 -58144 -46700 -12931 -40499 3610 -67733 -108088 -104179 -83057 -49761 -50963 -39343
2649 -39343 -101462 -105847 -62026 -38063 -28192 -33940 -83762 -133489 -116853 -108730 -135939 -80228 -92280
2636 -92280 -128177 -92030 -59325 -63706 -99842 -172464 -167792 -135970 -133276 -125977 -101171 -136487 -115305
$$ packed form
2722A50263M0854L3819Q166j600L7724j2724o0841L1128O9619j6024m1926M513
2710B42971j3796q862l7354L8884J7713j752L6245o4267j6779j9404l1645l104
2698A38850j3759o801l19J2765Q304P411l7008M4428o4665K2490J273j9472L6718
2685A30215r541J4731k4982l0012N7239j6238J5911M7706l4752k9744n8069Q8246
2673A50710k1022l9408p239M2323m4482l3398j9832l1950l7220j9345j5218J1846
2661f4235O091J1444L3769k7568M4109p1343m0355L909K1122L3296j202J1620
2649c9343o2119m385M3821K3963R871n748m9822m9727J6636Q123k7209N5711j2052
2636i2280l5897L6147L2705m381l6136p2622M672L1822K694P299K4806l5316K1182
$$ plain form
2623 -115305 -71883 -63503 -39752 -72617 -57391 -26650 -14324 -34549 -55271 -89434 -114944 -77044
2611 -77044 -70983 -82437 -105736 -36853 -34052 -26874 -63581 -111241 -77138 -122123 -84075 -49105
2599 -49105 -51647 -46120 3749 8698 -16793 -83260 -97690 -92777 -84494 -19712 3087 16725 -36247
2586 -36247 -38310 -27197 -12005 -41115 -50507 -24563 -16077 32475 55089 42864 -2868 43072
2574 43072 59060 70987 21331 40325 146456 127903 84038 94109 50979 38712 17712 33105
2562 33105 82033 78071 51921 71564 69977 52232 87551 71492 151782 146606 129489 120473 164439
2549 164439 151841 113887 141565 160277 218575 178162 208135 197296 170854 202667 125692 95910
2537 95910 125622 110973 100200 56993 55717 108168 102774 71819 158720 146872 81356 78729
$$ packed form
2623a15305M3422Q380K3751l2865J5226L0741J2326k0225k0722l4163k5510L7900
2611g7044O061j1454k3299O8883K801P178l6707m7660L4103m4985L8048L4970
2599d9105k542N527M9869M949k5491o6467j4430M913Q283O4782K2799J3638n2972
2586c6247k063J1113J5192k9110r392K5944Q486M8552K2614j2225m5732M5940
2574D3072J5988J1927m9656J8994J06131j8553m3865J0071m3130j2267k1000J5393
2562C3105M8928l962k6150J9643j587j7745L5319j6059Q0290n176j7117r016M3966
2549A64439j2598l7954K7678J8712N8298m0413K9973j0839k6442L1813p6975k9782
2537I5910K9712j4649j0773m3207j276N2451n394l0955Q6901j1848o5516k627
$$ plain form
2525 78729 39510 17597 87799 55776 36692 96540 161749 98538 108925 164772 176862 190397
2513 190397 140573 90984 96470 132664 96250 118292 113335 109859 143360 115870 71999 51327
2501 51327 57868 26920 18176 41310 72172 45745 8662 -56359 -22986 -286 -67246 -51502
2489 -51502 13949 24802 -46800 7183 -16045 -62584 -33167 5940 -47764 -21648 -32106 857
2477 857 -9356 -61404 -23876 -45276 -31885 -96641 -21168 -12635 -93412 -103612 -56491 -78809
2465 -78809 -102985 -109589 -114249 -83014 -134790 -144025 -115666 -96528 -138405 -155319 -125864 -109099
2453 -109099 -135284 -75876 -93461 -103517 -151980 -110264 -122423 -119853 -109799 -85475 -127327 -208717
2441 -208717 -220789 -180748 -141287 -181671 -161950 -105409 -65762 -135850 -163000 -184515 -241263 -272480
$$ packed form
2525G8729l9219k1913P0202l2023j9084N9848O5209o3211J0387N5847J2090J3535
2513A90397m9824m9589N486L6194l6414K2042m957l476L3501k7490m3871k0672
2501E1327O541l0948q744K3134L0862k6427l7083o5021L3373K2700o6960J5744
2489e1502O5451J0853p1602N3983k3228m6539K9417L9107n3704K6116j0458L2963
2477H57j0213n2048L7528k1400J3391o4756P5473Q533q0777j0200M7121k2318
2465g8809k4176o604m660L1235n1776r235K8359J9138m1877j6914K9455J6765
2453a09099k6185N9408j7585j0056m8463M1716j2159K570J0054K4324m1852q1390
2441b08717j2072M0041L9461m0384J9721N6541L9647p0088k7150k1515n6748l1217
$$ plain form
2429 -272480 -256453 -226202 -200461 -175361 -206578 -232358 -160480 -191250 -200404 -168864 -172413 -160708
2417 -160708 -144635 -176718 -211266 -197763 -210852 -172189 -181312 -149150 -112919 -134848 -160074 -166632
2405 -166632 -151971 -180516 -144143 -154835 -201481 -182663 -219142 -233040 -205268 -140634 -65879 -180729
2393 -180729 -147840 -156374 -203863 -175838 -178884 -140855 -123466 -118989 -145727 -142256 -177373 -164389
2381 -164389 -134929 -121780 -111377 -128210 -128354 -173322 -180439 -187742 -176817 -184166 -150456 -159683 -192189
2368 -192189 -155387 -145856 -151009 -199116 -200667 -207143 -195532 -179834 -113108 -83624 -154834 -230325
2356 -230325 -273218 -264553 -184864 -104842 -159796 -135648 -102686 -118883 -136804 -177007 -175995 -164177
2344 -164177 -202012 -214907 -199076 -217433 -247874 -244621 -202038 -235088 -208832 -224472 -239640 -146002
$$ packed form
2429b72480J6027L0251K5741K5100l1217k5780P1878l0770r154L1540l549J1705
2417a60708J6073l2083l4548J3503j3089L8663r123L2162L6231k1929k5226o558
2405a66632J4661k8545L6373j0692m6646J8818l6479j3898K7772O4634P4755j14850
2393a80729L2889q534m7489K8025l046L8029J7389M477k6738L471l5117J2984
2381a64389K9460J3149J0403j6833j44m4968p117p303J0925p349L3710r227l2506
2368a92189L6802R531n153m8107j551o476J1611J5698O6726K9484p1210p5491
2356b30325m2893Q665P9689Q0022n4954K4148L2962j6197j7921m0203J012J1818
2344a64177l7835j2895J5831j8357l0441L253M2583l3050K6256j5640j5168R3638
$$ plain form
2332 -146002 -125282 -164660 -212546 -180772 -154727 -110283 -152439 -163505 -174028 -123999 -70298 -95433
2320 -95433 -98597 -120455 -108442 -175605 -142003 -91110 -114916 -166963 -135428 -113584 -168301 -174421
2308 -174421 -163531 -148086 -167166 -150870 -117762 -67178 -72114 -62344 -100378 -138206 -109005 -92126
2296 -92126 -138059 -158779 -161305 -131716 -128459 -185934 -177651 -161919 -137701 -140202 -128034 -189819 -195243
2283 -195243 -193817 -174324 -148718 -183214 -165863 -177732 -128850 -175488 -155876 -137001 -153263 -189784
2271 -189784 -162141 -146535 -237765 -196441 -171574 -249610 -185550 -117395 -151654 -159366 -226394 -177065
2259 -177065 -163194 -233077 -232373 -167468 -151047 -119557 -127879 -58567 -110937 -172605 -111068 -129033
2247 -129033 -113033 -70825 -137702 -151602 -158190 -189933 -159458 -166887 -144331 -135395 -144009 -128282
$$ packed form
2332a46002K0720l9378m7886L1774K6045M4444m2156j1066j0523N0029N3701k5135
2320i5433l164k1858J2013o7163L3602N0893k3806n2047L1535K1844n4717o120
2308a74421J0890J5445j9080J6296L3108N0584m936R770l8034l7828K9201J6879
2296i2126m5933k0720k526K9589L257n7475Q283J5732K4218k501J2168o1785n424
2283a95243J426J9493K5606l4496J7351j1869M8882m6638J9612J8875j6262l6521
2271a89784K7643J5606r1230M1324K4867p8036O4060O8155l4259p712o7028M9329
2259a77065J3871o9883P04O4905J6421L1490q322O9312n2370o1668O1537j7965
2247a29033J6000M2208o6877j3900o588l1743L0475p429K2556Q936q614J5727
$$ plain form
2235 -128282 -129307 -149014 -189418 -211270 -196610 -123451 -160514 -108115 -136188 -129532 -98154 -120793
2223 -120793 -101977 -113614 -145116 -125020 -111135 -135905 -117937 -149192 -135152 -126169 -156484 -145517
2211 -145517 -106844 -88603 -124869 -91797 -86370 -127848 -198903 -216973 -176870 -183274 -141262 -141424
2199 -141424 -93672 -90757 -111015 -160662 -123430 -159518 -162215 -145201 -116749 -90450 -155051 -150022
2187 -150022 -92542 -104772 -106264 -61972 -79398 -52981 -38354 -39728 -61212 -73407 -72485 -46515
2175 -46515 -19893 -45156 -34653 -15508 -41494 -10730 1413 11986 -7591 -18758 4927 -29227
2163 -29227 -58421 -86764 -59472 -27514 8511 -16516 -56450 -51077 1542 -7994 37749 79394
2151 79394 57482 68037 40727 22300 21575 -9544 16314 45406 93095 98205 85553 95930
$$ packed form
2235a28282j025j9707m0404k1852J4660P3159l7063N2399k8073O656L1378k2639
2223a20793J8816j1637l1502K0096J3885k4770J7968l1255J4040Q983l0315J0967
2211a45517L8673J8241l6266L3072N427m1478p1055j8070M0103o404M2012j62
2199a41424M7752K915k0258m9647L7232l6088k697J7014K8452K6299o4601N029
2187a50022N7480j2230j492M4292j7426K6417J4627j374k1484j2195R22K5970
2175d6515K6622k5263J0503J9145k5986L0764J2143J0573j9577j1167K3685l4154
2163b9227k9194k8343K7292L1958L6025k5027l9934N373N2619r536M5743M1645
2151G9394k1912J0555k7310j8427p25l1119K5858K9092M7689N110j2652J0377
$$ plain form
2139 95930 116012 105658 93754 137541 182599 199723 209272 183318 125757 199774 237567 263921
2127 263921 308715 324990 317786 278533 336896 366895 360363 366105 402319 435538 471549 488072
2115 488072 459066 504282 590680 587750 617508 625500 685966 762514 828407 859203 878242 941283
2103 941283 977505 1029130 1093376 1280473 1375888 1453462 1505529 1631581 1803557 2039573 2263221
2092 2263221 2474190 2713123 2929686 3220049 3613098 4082907 4667038 5356902 6122969 7019069
2082 7019069 8099939 9771021 11259303 12127236 11291797 9334191 7723322 6251527 5101665
2073 5101665 4313254 3829683 3377763 2950613 2635034 2440896 2216036 2066024 1905592 1764344
2063 1764344 1633350 1508078 1346666 1293565 1206286 1108940 1009022 953952 888531 837186 736732
$$ packed form
2139I5930K0082j0354j1904M3787M5058J7124R549k5954n7561P4017L7793K6354
2127B63921M4794J6275p204l9253N8363K9999o532N742L6214L3219L6011J6523
2115D88072k9006M5216Q6398k930K9758P992O0466P6548O5893L0796J9039O3041
2103I41283L6222N1625O4246J87097R5415P7574N2067J26052J71976K36016K23648
2092B263221K10969K38933K16563K90363L93049M69809N84131O89864P66067Q96100
2082G019069J080870J671082J488282Q67933q35439j957606j610869j471795j149862
2073E101665p88411m83571m51920m27150l15579j94138k24860j50012j60432j41248
2063A764344j30994j25272j61412n3101q7279r7346r9918n5070o5421n1345j00454
$$ plain form
2052 736732 709299 686514 602030 567861 582689 520210 463908 452107 401521 357267 304078 313953
2040 313953 336698 333937 348051 372144 354618 292134 278853 258557 268146 257994 207616 229090
2028 229090 213171 230105 179185 218375 181368 171649 159419 190988 124861 144936 170824 119208
2016 119208 88626 79848 85597 47101 85044 106041 88917 60438 77418 54479 52069 10777
2004 10777 4555 9506 -450 1665 51796 30702 -5399 -6640 -5848 -49343 -49088 -28550 -46001 -71205
1990 -71205 -113155 -56845 -35983 -24360 -25549 23016 30646 40319 -1305 -27998 -31793 -14207 -4772
1977 -4772 -57921 -32464 29829 -32570 -44890 -109100 -117174 -80874 -65231 -117298 -121478 -91264
1965 -91264 -91888 -69311 -82074 -118328 -110192 -77272 -158263 -168076 -167059 -168109 -125695 -101330 -101796
$$ packed form
2052G36732k7433k2785q4484l4169J4828o2479n6302j1801n0586m4254n3189R875
2040C13953K2745k761J4114K4093j7526o2484j3281k0296R589j0152n0378K1474
2028B29090j5919J6934n0920L9190l7007r719j2230L1569o6127K0075K5888n1616
2016A19208l0582q778N749l8496L7943K0997j7124k8479J6980k2939k410m1292
2004A0777o222M951r956K115N0131k1094l6101j241P92m3495K55K0538j7451k5204
1990g1205m1950N6310K0862J1623j189M8565P630R673m1624k6693l795J7586R435
1977d772n3149K5457O2293o2399j2320o4210q074L6300J5643n2067m180L0214
1965i1264o24K2577j2763l6254Q136L2920q0991r813J017j050M2414K4365m66
$$ plain form
1952 -101796 -86552 -70914 -63213 -119927 -115304 -123410 -93729 -154340 -119597 -96163 -61498 -86878
1940 -86878 -123711 -158263 -161447 -76818 -129277 -130110 -73213 -101504 -94978 -88172 -164128 -140798 -28441
1927 -28441 -75768 -110005 -142653 -159831 -98750 -124511 -138015 -122589 -131421 -156827 -146044 -165564
1915 -165564 -142878 -109512 -89010 -119390 -163009 -131031 -162259 -117593 -76932 -134480 -152605 -171481
1903 -171481 -179870 -160130 -198043 -154727 -78998 -116690 -88367 -102052 -162728 -156212 -141975 -160192
1891 -160192 -126850 -163311 -132487 -158749 -116274 -111929 -153037 -160911 -155735 -109566 -98220 -56541
1879 -56541 -52708 -97062 -156613 -124922 -147391 -147655 -81953 -92499 -103466 -120928 -125948 -129945 -66244
1866 -66244 -81545 -57382 -48006 -60972 -102250 -85948 -92925 -115878 -127440 -107627 -96483 -121686
$$ packed form
1952a01796J5244J5638P701n6714M623q106K9681o0611L4743K3434L4665k5380
1940h6878l6833l4552l184Q4629n2459q33N6897k8291O526O806p5956K3330J12357
1927b8441m7327l4237l2648j7178O1081k5761j3504J5426q832k5406J0783j9520
1915a65564K2686L3366K0502l0380m3619L1978l1228M4666M0661n7548j8125j8876
1903a71481q389J9740l7913M3316P5729l7692K8323j3685o0676O516J4237j8217
1891a60192L3342l6461L0824k6262M2475M345m1108p874N176M6169J1346M1679
1879e6541L833m4354n9551L1691k2469k64O5702j0546j0967j7462n020l997O3701
1866f6244j5301K4163R376j2966m1278J6302o977k2953j1562J9813J1144k5203
$$ plain form
1854 -121686 -124696 -144380 -166062 -177880 -167216 -119202 -126920 -127326 -146735 -155128 -126872 -140783 -117965
1841 -117965 -109011 -108290 -102662 -69448 -75129 -62097 -111913 -149916 -135847 -128342 -141658 -98024 -83659
1828 -83659 -48070 -168864 -179835 -167642 -142219 -131820 -136045 -115372 -135790 -197160 -209155 -181865
1816 -181865 -131756 -164272 -172530 -126769 -136784 -112296 -94984 -88475 -129526 -154224 -171434 -186446
1804 -186446 -197802 -184707 -118714 -65511 -90108 -119602 -117354 -138557 -136049 -136280 -189029 -156421
1792 -156421 -184842 -201419 -146653 -173716 -175352 -111850 -56578 -128153 -141618 -168219 -163198 -150069
1780 -150069 -148137 -200780 -185819 -146953 -145357 -149021 -163914 -120859 -176584 -176031 -114362 -106094 -123066
1767 -123066 -172620 -139217 -142267 -171429 -125573 -141862 -149254 -192821 -173340 -88140 -64962 -132476
$$ packed form
1854a21686l010j9684k1682j1818J0664M8014p718m06j9409q393K8256j3911K2818
1841a17965Q954P21N628L3214n681J3032m9816l8003J4069P505j3316M3634J4365
1828h3659L5589j20794j0971J2193K5423J0399m225K0673k0418o1370j1995K7290
1816a81865N0109l2516q258M5761j0015K4488J7312O509m1051k4698j7210j5012
1804a86446j1356J3095O5993N3203k4597k9494K248k1203K508k31n2749L2608
1792a56421k8421j6577N4766k7063j636O3502N5272p1575j3465k6601N021J3129
1780a50069J932n2643J4961L8866J596l664j4893M3055n5725N53O1669Q268j6972
1767a23066m9554L3403l050k9162M5856j6289p392m3567J9481Q5200K3178o7514
$$ plain form
1755 -132476 -141476 -191323 -156469 -88065 -60148 -83761 -126415 -119557 -142786 -152996 -136798 -132681
1743 -132681 -144210 -153421 -117777 -176079 -195493 -161307 -159034 -206264 -170650 -151536 -145747 -189677
1731 -189677 -145121 -76674 -87593 -83628 -139041 -124176 -109260 -136333 -104885 -106697 -187350 -159991
1719 -159991 -147031 -135024 -126540 -158321 -178916 -148154 -108810 -105271 -50274 -108459 -154384 -133001
1707 -133001 -89920 -128132 -134500 -139386 -150897 -141001 -172562 -129979 -116732 -151457 -156820 -179254
1695 -179254 -186674 -121549 -115035 -116451 -154256 -120646 -112976 -123241 -143456 -72835 -76180 -101119 -159989
1682 -159989 -215915 -222763 -188719 -217470 -182765 -131396 -130334 -96026 -110562 -115692 -107562 -99224 -91653
1669 -91653 -92350 -101149 -117942 -125091 -127513 -127953 -121408 -128421 -156104 -156411 -169801 -181370 -129172 -172772
$$ packed form
1755a32476r000m9847L4854O8404K7917k3613m2654O858k3229j0210J6198M117
1743a32681j1529r211L5644n8302j9414L4186K273m7230L5614J9114N789m3930
1731a89677M4556O8447j0919L965n5413J4865J4916k7073L1448j812q0653K7359
1719a59991J2960J2007Q484l1781k0595L0762L9344L539N4997n8185m5925K1383
1707a33001M3081l8212o368m886j1511R896l1561M2583J3247l4725n363k2434
1695a79254p420O5125O514j416l7805L3610P670j0265k0215P0621l345k4939n8870
1682a59989n5926o848L4044k8751L4705N1369J062L4308j4536n130Q130Q338P571
1669i1653o97q799j6793p149k422m40O545p013k7683l07j3390j1569N2198m3600
$$ plain form
1655 -172772 -128373 -93801 -80301 -81306 -105992 -133821 -115358 -130626 -150609 -117917 -124615 -150227
1643 -150227 -199114 -193767 -159398 -135551 -110652 -126444 -134182 -145304 -126353 -164328 -192019 -195194
1631 -195194 -176093 -167259 -115938 -134749 -111913 -71604 -25065 -49265 -114139 -90214 -171179 -185803
1619 -185803 -175877 -164978 -99903 -124365 -100740 -95150 -170809 -173522 -174915 -162189 -108343 -98307
1607 -98307 -71376 -81307 -139115 -148047 -148373 -148146 -172469 -134283 -102101 -101278 -154842 -182169 -159850
1594 -159850 -135582 -101308 -165084 -174116 -137959 -114662 -98980 -94015 -137937 -174040 -161484 -168525
1582 -168525 -113340 -143004 -133996 -101129 -140621 -132629 -135880 -149984 -124336 -153566 -191139 -159731
1570 -159731 -167040 -205468 -217114 -231752 -167249 -153283 -117491 -134061 -131278 -98848 -115542 -126388
$$ packed form
1655a72772M4399L4572J3500j005k4686k7829J8463j5268j9983L2692o698k5612
1643a50227m8887N347L4369K3847K4899j5792p738j1122J8951l7975k7691l175
1631a95194J9101Q834N1321j8811K2836M0309M6539k4200o4874K3925q0965j4624
1619a85803R926J0899O5075k4462K3625N590p5659k713j393J2726N3846J0036
1607i8307K6931r931n7808q932l26K27k4323L8186L2182Q23n3564k7327K2319
1594a59850K4268L4274o3776r032L6157K3297J5682M965m3922l6103J2556p041
1582a68525N5185k9664R008L2867l9492P992l251j4104K5648k9230l7573L1408
1570a59731p309l8428j1646j4638O4503J3966L5792j6570K783L2430j6694j0846
$$ plain form
1558 -126388 -96061 -59050 -105353 -85669 -63476 -118358 -100147 -111707 -117077 -118809 -73747 -131907
1546 -131907 -141276 -157521 -192616 -212929 -200451 -155158 -192721 -123301 -75224 -100596 -139196 -149096
1534 -149096 -171968 -181998 -126515 -125961 -148710 -131267 -90735 -104318 -74905 -99893 -115184 -147106
1522 -147106 -181799 -157827 -181204 -170212 -169529 -154267 -177412 -154476 -124547 -158367 -136406 -162663
1510 -162663 -135580 -126401 -95393 -71141 -132928 -167862 -159302 -63071 -102468 -153848 -169765 -201709
1498 -201709 -153430 -85671 -96698 -125418 -178326 -152688 -119748 -90559 -116500 -141105 -65729 -85728
1486 -85728 -121478 -51533 -70990 -89946 -131709 -109974 -152452 -152461 -143185 -183606 -202599 -100008 -116842
1473 -116842 -136967 -125083 -102926 -76165 -121718 -130191 -134687 -158319 -117733 -82707 -169809 -188906
$$ packed form
1558a26388L0327L7011m6303J9684K2193n4882J8211j1560n370j732M5062n8160
1546a31907r369j6245l5095k0313J2478M5293l7563O9420M8077k5372l8600r900
1534a49096k2872j0030N5483N54k2749J7443M0532j3583K9413k4988j5291l1922
1522a47106l4693K3972k3377J0992O83J5262k3145K2936K9929l3820K1961k6257
1510a62663K7083R179L1008K4252o1787l4934Q560R6231l9397n1380j5917l1944
1498b01709M8279O7759j1027k8720n2908K5638L2940K9189k5941k4605P5376j9999
1486h5728l5750O9945j9457j8956m1763K1735m2478rR276m0421j8993J02591j6834
1473a16842k0125J1884K2157K6761m5553q473m496k3632M0586L5026q7102j9097
$$ plain form
1461 -188906 -189596 -250402 -214861 -160886 -133332 -151985 -139401 -93511 -87187 -153196 -178395 -91649
1449 -91649 -108945 -78734 -80980 -81363 -127850 -134600 -170206 -142664 -53997 -81431 -137634 -115114 -119859
1436 -119859 -100898 -40035 -79097 -102098 -89740 -75301 -117342 -161404 -172692 -84516 -80646 -32381
1424 -32381 -21682 -50129 -87878 -128605 -116744 -80792 -25994 -79311 -95709 -137170 -126749 -84013
1412 -84013 -50138 -53693 -57830 -77585 -90747 -43143 -105217 -133048 -66801 -44171 -46248 -83633
1400 -83633 -22599 -60490 -61388 -93676 -147070 -145256 -97856 -88385 -59556 -129851 -178953 -40431
1388 -40431 -79572 -94094 -102671 -68699 -79365 -91230 -74381 -57456 -112842 -102285 -118654 -122308
1376 -122308 -115869 -105199 -62142 -135089 -95125 -136616 -131514 -87882 -113174 -80552 -36038 -64757
$$ packed form
1461a88906o90o0806L5541N3975K7554j8653J2584M5890O324o6009k5199Q6746
1449i1649j7296L0211k246l83m6487o750l5606K7542Q8667k7434n6203K2520m745
1436a19859J8961O0863l9062k3001J2358J4439m2041m4062j1288Q8176L870M8265
1424c2381J0699k8447l7749m0727J1861L5952N4798n3317j6398m1461J0421M2736
1412h4013L3875l555m137j9755j3162M7604o2074k7831O6247K2630k077l7385
1400h3633O1034l7891q98l2288n3394J814M7400R471K8829p0295m9102J38522
1388d0431l9141j4522q577L3972j0666j1865J6849J6925n5386J0557j6369l654
1376a22308O439J0670M3057p2947L9964m1491N102M3632k5292L2622M4514k8719
$$ plain form
1364 -64757 -25332 -14420 -91775 -108894 -69958 -88441 -98197 -129050 -132554 -147333 -107441 -92611
1352 -92611 -140553 -96935 -98821 -90739 -86217 -46129 -32501 -21589 -72945 -87326 -139255 -141364 -126905
1339 -126905 -155015 -93789 -113469 -83381 -105324 -82056 -72392 -90798 -83797 -84476 -60281 -93844
1327 -93844 -112134 -109625 -78464 -72005 -73460 -97018 -129738 -78634 -80843 -86802 -106786 -116682 -87567
1314 -87567 -116675 -82346 -67032 -41153 -70677 -112725 -50680 -62007 -128928 -96282 -75096 -124635
1302 -124635 -105956 -97453 -77362 -79844 -72118 -87156 -86420 -87970 -58319 -46425 -71426 -136928 -120372
1289 -120372 -108268 -60376 -28072 -39784 -65177 -74124 -66195 -63835 -71909 -40381 -70563 -76968 -126002
1276 -126002 -93892 -61087 -95969 -93977 -79541 -66906 -68131 -4116 -26022 -85436 -121721 -67412
$$ packed form
1364f4757L9425J0912p7355j7119L8936j8483r756l0853l504j4779L9892J4830
1352i2611m7942M3618j886Q082M522M0088J3628J0912n1356j4381n1929k109J4459
1339a26905k8110O1226j9680L0088k1943K3268R664j8406P001o79K4195l3563
1327i3844j8290K509L1161O459j455k3558l2720N1104k209n959j9984r896K9115
1314h7567k9108L4329J5314K5879k9524m2048O2045j1327o6921L2646K1186m9539
1302a24635J8679Q503K0091k482P726j5038P36j550K9651J1894k5001o5502J6556
1289a20372J2104M7892L2304j1712k5393q947P929K360q074L1528l0182o405m9034
1276a26002L2110L2805l4882J992J4436J2635j225O4015k1906n9414l6285N4309
$$ plain form
1264 -67412 -147262 -78483 -60557 -75071 -73741 -71008 -53378 -36960 -104959 -52993 -25199 -100390
1252 -100390 -76360 -74627 -101452 -108085 -71823 -54082 -67349 -115308 -125223 -88352 -97381 -90312 -142683
1239 -142683 -101502 -100550 -82869 -92120 -120450 -49018 -6341 -69746 -29482 -46171 -13824 759
1227 759 -8474 -11656 -63264 -86631 -67394 -105679 -99717 -91372 -92403 -74346 -85042 -63658 -78431
1214 -78431 -101103 -58858 -47554 -101467 -82383 -86639 -76121 -86241 -93224 -87645 -127478 -101536
1202 -101536 -42032 -59580 -70136 -66664 -93608 -97689 -94074 -94574 -96141 -96240 -33486 -70236 -83929
1189 -83929 -118318 -65234 -49084 -53978 -74396 -87083 -68448 -15613 -6599 -60669 -59820 -10554 -41017
1176 -41017 -42508 2539 -30201 -22876 -22924 -75934 -57648 -41683 -49539 -98881 -35983 -73614 -108817
$$ packed form
1264f7412p9850O8779J7926j4514J330K733J7630J6418o7999N1966K7794p5191
1252a00390K4030J733k6825o633L6262J7741j3267m7959r915L6871r029P069n2371
1239a42683M1181R52J7681r251k8330P1432M2677o3405M0264j6689L2347J4583
1227G59r233l182n1608k3367J9237l8285N962Q345j031J8057j0696K1384j4773
1214g8431k2672M2245J1304n3913J9084m256J0518j0120o983N579l9833K5942
1202a01536N9504j7548j0556L472k6944m081L615n00j567r9O2754l6750j3693
1189h3929l4389N3084J6150m894k0418j2687J8635N2835R014n4070Q49M9266l0463
1176d1017j491M5047l2740P325m8n3010J8286J5965p856m9342O2898l7631l5203
$$ plain form
1163 -108817 -58209 -33097 -15188 -74667 -74464 -5544 -66108 -83816 -119471 -118724 -93993 -84909 -24298
1150 -24298 -61092 -96400 -81509 -64545 -86353 -107155 -84908 -31496 -5382 -55580 795 -9108
1138 -9108 -6107 -48088 -63322 -84908 -84394 -24711 -34573 -47801 -49501 -48959 -93528 -66276 -88885
1125 -88885 -121841 -81304 -32524 -64388 -35355 -24681 -19512 -58761 -16516 -1725 -25160 14172
1113 14172 -38808 -121579 -70819 -83305 -72282 -86077 -38899 -45851 -35735 -6053 -23483 -48622
1101 -48622 -19756 8683 -27178 -31406 -5534 -27207 -37371 -17389 -120163 -95938 -12294 -36363
1089 -36363 -19619 -36729 -24906 -33300 -69829 -8543 -6564 1165 -24006 -14271 -30208 -35693 -35057
1076 -35057 -1272 -27028 -74093 -41401 -29332 -27468 -39368 -50682 -25643 -35317 23417 -45152
$$ packed form
1163a08817N0608K5112J7909n9479K03O8920o0564j7708l5655P47K4731R084O0611
1150b4298l6794l5308J4891J6964k1808k0802K2247N3412K6114n0198N6375r903
1138i108L001m1981j5234k1586N14N9683r862j3228j700N42m4569K7252k2609
1125h8885l2956M0537M8780l1864K9033J0674N169l9249M2245J4791k3435L9332
1113A4172n2980q2771N0760j2486J1023j3795M7178o952J0116K9682j7430k5139
1101d8622K8866K8439l5861m228K5872k1673j0164J9982j02774K4225Q3644k4069
1089c6363J6744j7110J1823q394l6529O1286J979P729k5171R735j5937n485O36
1076c5057L3785k5756m7065L2692J2069J864j1900j1314K5039r674N8734o8569
$$ plain form
1064 -45152 10842 4954 -50642 -9080 7664 -39689 -17030 9033 -42188 -25622 -21089 -56367
1052 -56367 -26910 -62713 -73665 33278 -12765 -37236 -68604 -27143 -1029 -48731 -28848 -27633
1040 -27633 -23572 8133 34510 50051 -5247 -15431 -101942 -48756 22738 17339 -2767 -23941
1028 -23941 -50028 -269 -28606 -54203 -72209 -85278 -101708 -114920 -30349 -43354 -58469 -54275
1016 -54275 -52697 -35994 -74379 -85278 -107607 -40474 -55983 6307 660 -29549 -28083 -34753 -41845
1003 -41845 11299 10765 -23896 21560 11735 3340 43633 52792 16918 2496 25367 62981 6601
990 6601 15637 -17835 4178 -19855 -33094 -69948 4635 17021 3382 -55810 -64782 3936 -29965
977 -29965 -1265 31098 15796 -65932 -40922 -22403 -33797 -71557 -33250 -17942 -49666 1376
$$ packed form
1064d5152N5994n888n5596M1562J6744m7353K2659K6063n1221J6566M533l5278
1052e6367K9457l5803j0952J06943m6043k4471l1368M1461K6114m7702J9883J215
1040b7633M061L1705K6377J5541n5298j0184q6511N3186P1494n399k0106k1174
1028b3941k6087M9759k8337k5597j8006j3069j6430j3212Q4571j3005j5115M194
1016e4275J578J6703l8385j0899k2329O7133j5509O2290n647l0209J466o670p092
1003d1845N3144n34l4661M5456r825q395M0293R159l5874j4422K2871L7614n6380
990F601R036l3472K2013k4033j3239l6854P4583J2386j3639n9192q972O8718l3901
977b9965K8700L2363j5302q1728K5010J8519j1394l7760L8307J5308l1724N1042
$$ plain form
965 1376 -13762 3188 3456 -13774 -2330 24719 -3124 57013 29863 48035 14509 -29568 -11718
952 -11718 -10872 -3939 -5170 -49480 -63188 -40533 -20669 -25772 -1535 48636 16404 1472 -12512
939 -12512 4989 40600 51079 -35114 -9203 -32839 -21329 -31750 -17170 -3991 -7792 -13249
927 -13249 -41630 13732 -29908 -59230 -28632 -21227 -26948 -40929 5245 -38926 -23762 -29158 28743
914 28743 64601 88489 62255 -2995 4858 -40433 14005 40962 56155 54473 58721 -1825 -32842
901 -32842 26491 -5552 -2119 35949 14548 -16809 -21384 -31357 -50269 -29705 -13732 26851 -14373
888 -14373 -6004 6996 -6844 -46086 -25794 -39574 -6206 -41265 -38384 -45683 -13374 63092 21952
875 21952 -15235 -16779 -26129 6786 -16629 -31022 10841 32831 -17955 -11316 75032 41507 21031
$$ packed form
965A376j5138J6950K68j7230J1444K7049k7843O0137k7150J8172l3526m4077J7850
952a1718Q46O933j231m4310j3708K2655J9864n103K4237N0171l2232j4932j3984
939a2512J7501L5611J0479q6193K5911k3636J1510j0421J4580J3179l801n457
927a3249k8381N5362m3640k9322L0598P405n721j3981M6174m4171J5164n396N7901
914B8743L5858K3888k6234o5250P853m5291N4438K6957J5193j682M248o0546l1017
901c2842N9333l2043L433L8068k1401l1357m575r973j8912K0564J5973M0583m1224
888a4373Q369J3000j3840l9242K0292j3780L3368l5059K881p299L2309P6466m1140
875B1952l7187j544r350L2915k3415j4393M1863K1990n0786O639Q6348l3525k0476
$$ plain form
862 21031 29016 -28644 -51847 -39887 -2974 -23061 -39787 -3931 -6757 -10072 -7083 30861 30788
849 30788 13768 27969 -2257 37575 83788 43078 22743 -11276 -43923 -59994 -13326 21615
837 21615 40721 -3861 -18048 15737 54569 16015 25547 68228 49902 47556 7778 -17108
825 -17108 16091 23338 41070 49171 24684 34130 42288 36737 -12242 46975 72144 5989 27929
812 27929 -18396 -12835 -24214 -11035 -15451 -11064 -83419 -12167 45931 4693 -23720 18682 47242
799 47242 47618 54160 26690 -58946 -69879 5014 64207 79766 30881 43234 32184 14561 57393
786 57393 -13648 -15858 42305 24008 35304 5256 -15792 5210 46773 24098 6841 29470
774 29470 21797 22393 -21147 -4116 -28637 17328 91788 64169 81211 85706 72260 11515 -12221
$$ packed form
862B1031P985n7660k3203J1960L6913k0087j6726L5856k826l315K989L7944p3
849C0788j7020J4201l0226L9832M6213m0710k0335l4019l2647j6071M6668L4941
837B1615J9106m4582j4187L3785L8832l8554R532M2681j8326k346l9778k4886
825a7108L3199P247J7732Q101k4487R446Q158n551m8979N9217K5169o6155K1940
812B7929m6325N561j1379J3179m416M387p2355P1252N8098m1238k8413M2402K8560
799D7242L76O542k7470q5636j0933P4893N9193J5559m8885J2353j1050j7623M2832
786E7393p1041k210N8163j8297J1296l0048k1048K1002M1563k2675j7257K2629
774B9470p673N96m3540J7031k4521M5965P4460k7619J7042M495j3446o0745k3736
$$ plain form
761 -12221 29896 22123 27874 12281 -7593 62475 43187 -13435 -26466 52468 48240 51828 -2043
748 -2043 -5781 23307 55586 13830 13697 55438 68834 53308 16889 29152 26716 51675 32719
735 32719 32937 -1543 619 43632 -878 -10757 28040 9151 39575 46186 83350 58900 -29256
722 -29256 22023 52651 15714 -7065 2183 40644 99307 69286 38730 61529 34605 44940
710 44940 97141 90835 26596 951 24416 60488 80225 95554 77135 49921 16773 51372
698 51372 48234 3677 49575 60984 47273 25814 7810 51902 73008 12648 67117 57602
686 57602 53224 266 -11933 57552 26228 40613 67031 24150 26815 81620 58287 66368 82487
673 82487 104046 43570 -17385 78404 38586 60581 82376 95684 81926 73473 29362 21606
$$ packed form
761a2221M2117p773N751j5593j9874P0068j9288n6622j3031P8934m228L588n3871
748b043l738K9088L2279m1756j33M1741J3396j5526l6419J2263k436K4959j8956
735C2719K18l4480K162M3013m4510r879L8797j8889L0424O611L7164k4450q8156
722b9256N1279L0628l6937k2779R248L8461N8663l0021l0556K2799k6924J0335
710D4940N2201o306o4239k5645K3465L6072J9737J5329j8419k7214l3148L4599
698E1372l138m4557M5898J1409j3711k1459j8004M4092K1106o0360N4469r515
686E7602m378n2958j2199O9485l1324J4385K6418m2881K665N4805k3333Q081J6119
673H2487K1559o0476o0955R5789l9818K1995K1795J3308j3758q453m4111p756
$$ plain form
661 21606 106822 71640 74708 63234 67189 150055 130812 101614 92559 71293 78794 47576 57074
648 57074 116955 71163 104233 112809 49900 37964 51022 86807 85028 145031 120315 41542
636 41542 52779 6001 70962 97183 95006 89294 75178 7223 -36968 26734 88742 95374 62530
623 62530 114311 118868 118739 33245 14480 -5302 -19236 51164 31270 44611 49283 61531 112498
$$ packed form
661B1606Q5216l5182L068j1474L955Q2866j9243k9198r055k1266P501l1218R498
648E7074N9881m5792L3070Q576o2909j1936J3058L5785j779O0003k4716p8773
636D1542J1237m6778O4961K6221k177n712j4116o7955m4191O3702O2008O632l2844
623F2530N1781M557j29q5494j8765j9782j3934P0400j9894J3341M672J2248N0967
$$ [...]
##END NTUPLES=NMR SPECTRUM
##END=
