##TITLE=1H_CA-8892-1
 CDCl3, 8 sc, 
 9.07.2021
##JCAMPDX= 6.0         $$ Bruker NMR JCAMP-DX V2.0
##DATA TYPE= NMR SPECTRUM
##DATA CLASS= NTUPLES
##ORIGIN= UXNMR, Bruker Analytische Messtechnik GmbH
##OWNER= root
$$ XWIN-NMR		Version 3.5
$$ Fri Jul  9 08:43:14 2021 Russian Standard Time (UT+4h)  she@DPX200
##.OBSERVE FREQUENCY= 200.131506
##.OBSERVE NUCLEUS= ^1H
##.ACQUISITION MODE= SIMULTANEOUS
##.ACQUISITION SCHEME= undefined
##.AVERAGES= 8
##.DIGITISER RES= 18
##SPECTROMETER/DATA SYSTEM= spect
##.PULSE SEQUENCE= zg30
##.SOLVENT NAME= CDCl3
##.SHIFT REFERENCE= (INTERNAL, CDCl3, 0, 17.5301)
##AUDIT TRAIL= $$ (NUMBER, WHEN, WHO, WHERE, WHAT)
$$ ##TITLE= Audit trail, XWIN-NMR		Version 3.5
$$ ##JCAMPDX= 5.01
$$ ##ORIGIN= Bruker BioSpin GmbH
$$ ##OWNER= she
$$ F:/spectra/data/she/nmr/H-F/1/pdata/1/auditp.txt
$$ ##AUDIT TRAIL=  $$ (NUMBER, WHEN, WHO, WHERE, WHAT)
(   1,<2021-07-09 08:41:53.64 +0400>,<she>,<DPX200>,
      <created by zg, POWCHK disabled, PULCHK disabled
       configuration hash MD5:
       00 E9 B6 7A A2 85 ED C7 34 08 36 98 17 FE 4E 26
       data hash MD5: 16K
       9B E7 2A 0B 06 8F 32 8E AB 34 F8 61 BF 3C AC B4>)
(   2,<2021-07-09 08:41:55.95 +0400>,<she>,<DPX200>,
      <Start of raw data processing
       efp BC_mod = 2 LB = 0.24 FT_mod = 6 PKNL = 1 PHC0 = -12276.49 PHC1 = 14.20101 SI = 16K 
       data hash MD5: 16K
       8D EA FC 59 00 5A 69 57 47 4F BC 76 C3 EB 7A DE>)
(   3,<2021-07-09 08:42:18.73 +0400>,<she>,<DPX200>,
      <pk PHC0 = 4.687386 PHC1 = -5.8 
       data hash MD5: 16K
       39 1E 51 1B 88 80 2C 3F 86 BF 1C 8B 36 34 B2 CB>)
(   4,<2021-07-09 08:42:21.59 +0400>,<she>,<DPX200>,
      <abs ABSG = 5 
       data hash MD5: 16K
       53 EC F9 A1 8C 01 B9 87 4A 87 86 AC 68 27 FF A9>)
$$ ##END=
$$ 
$$ hash MD5
$$ CF 35 FB F1 DE BB E6 33 1D EA 6C 4E 58 BF 0A 2E
##$RELAX= 
##$RELAX= 
##$RELAX= 
##$RELAX= 
##$RELAX= 
##$RELAX= 
$$ Bruker specific parameters
$$ --------------------------
##$DU= <F:/spectra>
##$EXPNO= 1
##$NAME= <H-F>
##$PROCNO= 1
##$TYPE= <nmr>
##$USER= <she>
##$AMP= (0..31)
100 100 100 100 100 100 100 100 100 100 100 100 100 100 100 100 100 100 
100 100 100 100 100 100 100 100 100 100 100 100 100 100 
##$AQSEQ= 0
##$AQ_mod= 1
##$AUNM= <au_zg>
##$AUTOPOS= <>
##$BF1= 200.13
##$BF2= 200.13
##$BF3= 200.13
##$BF4= 200.13
##$BF5= 200.13
##$BF6= 200.13
##$BF7= 200.13
##$BF8= 200.13
##$BYTORDA= 1
##$CFDGTYP= 0
##$CFRGTYP= 5
##$CHEMSTR= <none>
##$CNST= (0..31)
1 1 145 1 1 1 1 1 1 1 1 1 1 1 1 1 1 1 1 1 1 1 1 1 1 1 1 1 1 1 1 1 
##$CPDPRG= <>
##$CPDPRG1= <>
##$CPDPRG2= <>
##$CPDPRG3= <>
##$CPDPRG4= <mlev>
##$CPDPRG5= <mlev>
##$CPDPRG6= <mlev>
##$CPDPRG7= <mlev>
##$CPDPRG8= <mlev>
##$CPDPRGB= <>
##$CPDPRGT= <>
##$D= (0..31)
0 1.2 0 0 0 0 0 0 0 0.06 0 0.03 0 0 0 0 0.0002 0 0 0 0 0 0 0 0 0 0 0 0 
0 0 0 
##$DATE= 1625805713
##$DBL= (0..7)
120 120 120 120 120 120 120 120 
##$DBP= (0..7)
150 150 150 150 150 150 150 150 
##$DBP07= 0
##$DBPNAM0= <>
##$DBPNAM1= <>
##$DBPNAM2= <>
##$DBPNAM3= <>
##$DBPNAM4= <>
$$ [...]
##$SUBNAM3= <"">
##$SUBNAM4= <"">
##$SUBNAM5= <"">
##$SUBNAM6= <"">
##$SUBNAM7= <"">
##$SUBNAM8= <"">
##$SUBNAM9= <"">
##$SW= 20.0188882624521
##$SWIBOX= (0..15)
0 0 2 0 0 0 0 0 0 0 0 0 0 0 0 0 
##$SW_h= 4006.41025641026
##$TD= 16384
##$TD0= 1
##$TE= 0
##$TE2= 300
##$TE3= 300
##$TEG= 300
##$TL= (0..7)
0 120 120 120 120 120 120 120 
##$TP= (0..7)
150 150 150 150 150 150 150 150 
##$TP07= 0
##$TPNAME0= <>
##$TPNAME1= <>
##$TPNAME2= <>
##$TPNAME3= <>
##$TPNAME4= <>
##$TPNAME5= <>
##$TPNAME6= <>
##$TPNAME7= <>
##$TPOAL= (0..7)
0.5 0.5 0.5 0.5 0.5 0.5 0.5 0.5 
##$TPOFFS= (0..7)
0 0 0 0 0 0 0 0 
##$TUNHIN= 0
##$TUNHOUT= 0
##$TUNXOUT= 0
##$USERA1= <user>
##$USERA2= <user>
##$USERA3= <user>
##$USERA4= <user>
##$USERA5= <user>
##$V9= 5
##$VALIST= <valist>
##$VCLIST= <CCCCCCCCCCCCCCC>
##$VD= 0
##$VDLIST= <DDDDDDDDDDDDDDD>
##$VPLIST= <PPPPPPPPPPPPPPP>
##$VTLIST= <TTTTTTTTTTTTTTT>
##$WBST= 1024
##$WBSW= 4
##$XGAIN= (0..3)
0 0 0 0 
##$XL= 0
##$YL= 0
##$YMAX_a= 448750
##$YMIN_a= -739626
##$ZGOPTNS= <>
##$ZL1= 120
##$ZL2= 120
##$ZL3= 120
##$ZL4= 120
##$ABSF1= 17.51055
##$ABSF2= -2.50849
##$ABSG= 5
##$ABSL= 3
##$ALPHA= 0
##$AQORDER= 0
##$ASSFAC= 0
##$ASSFACI= 0
##$ASSFACX= 0
##$ASSWID= 0
##$AUNMP= <proc_1d>
##$AZFE= 0.1
##$AZFW= 0.1
##$BCFW= 0
##$BC_mod= 2
##$BYTORDP= 0
##$COROFFS= 0
##$CY= -3
##$DATMOD= 1
##$DC= 0
##$DFILT= <>
##$DTYPP= 0
##$F1P= 0
##$F2P= 0
##$FCOR= 1
##$FTSIZE= 16384
##$FT_mod= 6
##$GAMMA= 0
##$GB= 0
##$INTBC= 1
##$INTSCL= 1.334414e-10
##$ISEN= 128
##$LB= 0.24
##$LEV0= 0
##$LPBIN= 0
##$MAXI= 10000
##$MC2= 0
##$MEAN= 0
##$ME_mod= 0
##$MI= 1.114404
##$NCOEF= 0
##$NC_proc= -6
##$NLEV= 6
##$NOISF1= 3.799351
##$NOISF2= 2.8
##$NSP= 0
##$NTH_PI= 0
##$NZP= 0
##$OFFSET= 17.5301
##$PC= 1
##$PHC0= -12271.8
##$PHC1= 8.40101
##$PH_mod= 1
##$PKNL= yes
##$PPARMOD= 0
##$PSCAL= 0
##$PSIGN= 0
##$REVERSE= no
##$SF= 200.130000906836
##$SI= 16384
##$SIGF1= 3
##$SIGF2= 2
##$SINO= 5.538805
##$SIOLD= 16384
##$SREGLST= <1H.CDCl3>
##$SSB= 0
##$STSI= 16384
##$STSR= 0
##$SW_p= 4006.41025641026
##$SYMM= 0
##$S_DEV= 0
##$TDeff= 16384
##$TDoff= 0
##$TI= <>
##$TILT= no
##$TM1= 0
##$TM2= 0
##$TOPLEV= 0
##$USERP1= <user>
##$USERP2= <user>
##$USERP3= <user>
##$USERP4= <user>
##$USERP5= <user>
##$WDW= 1
##$XDIM= 16384
##$YMAX_p= 472334053
##$YMIN_p= -293934
$$ End of Bruker specific parameters
$$ ---------------------------------
##NTUPLES= NMR SPECTRUM
##VAR_NAME=  FREQUENCY,     SPECTRUM/REAL,   SPECTRUM/IMAG
##SYMBOL=    X,             R,               I
##VAR_TYPE=  INDEPENDENT,   DEPENDENT,       DEPENDENT
##VAR_FORM=  AFFN,          ASDF,            ASDF
##VAR_DIM=   16384,         16384,           16384
##UNITS=     HZ,            ARBITRARY UNITS, ARBITRARY UNITS
##FACTOR=    0.24454680195387, 1,            1
##FIRST=     3508.29890263475, 0,            0
##LAST=      -498.111353775511, 0,           0
##MIN=       -498.111353775511, -293934,     0
##MAX=       3508.29890263475, 472334053,    0
$$ Real data points
##PAGE= N=1
##DATA TABLE= (X++(R..R)), XYDATA
$$ [...]
5480B783916j10343J0380r8692M597j3247o3832J9375k1463n5281K8670J11908
5469B595988k3376J2467J9775p654n9852j4621L3249n0422l6348Q4934o1342N1313
5457B544111K3484k7150L3676l7474l8123M6873n1923L2070k936k4778K9985m7105
5445B480710L1669k1996L3787j8104K0534Q3039n0151L7269N6010n8323J9060
5434B613504L3624o6447J2410L0703K13300j3967l8469Q4702J9427N462J08133
5423C002382Q2422m1457O7044R8453Q3364J6805J5007N9462J83452J00521J6631
5412C684086K2474J55212J69283Q2749J72213K53774Q8313K39312J64851J92622
5402E224889K25086L05672K91504L19667J97315J96484J12341Q3290m3126j52901
$$ plain form
5480 2783916 2673573 2683953 2585261 2589858 2576611 2512779 2532154 2510691 2455410 2484080 2595988
5469 2595988 2572612 2585079 2604854 2597200 2537348 2522727 2555976 2505554 2469206 2554140 2492798 2544111
5457 2544111 2567595 2540445 2574121 2536647 2498524 2545397 2493474 2525544 2522608 2497830 2527815 2480710
5445 2480710 2512379 2490383 2524170 2506066 2526600 2609639 2559488 2596757 2652767 2594444 2613504
5434 2613504 2647128 2580681 2593091 2623794 2837094 2823127 2784658 2869360 2888787 2894249 3002382
5423 3002382 3084804 3043347 3110391 3208844 3292208 3309013 3324020 3383482 3566934 3667455 3684086
5412 3684086 3706560 3861772 4031055 4113804 4286017 4539791 4628104 4867416 5032267 5224889
5402 5224889 5449975 5755647 6047151 6366818 6564133 6760617 6872958 6956248 6913122 6760221
5392F760221j83744k99513l06972k74826k95173j72228k39966k25367k08279j53525
5382D400628o9302q1103r2040j29987q0594j56502k9970q9000m5611q6121n1545
5371C488853n5751j82246j3184j3162j29920N5930l5053j03299L148j45343j16680
5360B753293r6313j8117r0492m9240R9207n8859r6702o0237o0451o3091J07187
5349B366185k9693o4639m7379m1128n865J4912k9572j1731k1603L3127j8699p0170
5337B073745l0827o5899J9455K1447n246J9619L6322p717j8317l9408r851P4436
5325B067759n6011k8592R71j332o8717Q2822N4463k8150J30256J0284K6397N5079
5313B245229r7968j8613J20079L8789k6274J33527n2776l343l2405q2807L6530
$$ plain form
5392 6760221 6576477 6276964 5969992 5695166 5399993 5227765 4987799 4762432 4554153 4400628
5382 4400628 4331326 4250223 4158183 4028196 3947602 3791100 3761130 3672130 3626519 3540398 3488853
5371 3488853 3433102 3250856 3237672 3224510 3094590 3150520 3115467 3012168 3015316 2869973 2753293
5360 2753293 2656980 2638863 2548371 2499131 2598338 2539479 2442777 2382540 2322089 2258998 2366185
5349 2366185 2336492 2271853 2224474 2183346 2177481 2192393 2162821 2151090 2129487 2162614 2143915 2073745
5337 2073745 2042918 1977019 1996474 2017921 2012675 2032294 2068616 2060899 2042582 2003174 1993323 2067759
5325 2067759 2011748 1983156 1984127 1982795 1914078 1996900 2051363 2023213 2153469 2163753 2190150 2245229
5313 2245229 2147261 2128648 2248727 2287516 2261242 2394769 2341993 2338650 2306245 2223438 2259968
5302B259968P9840j4908o4355k5808q4691L6866L7602J9861m5438L319n4287o7141
5290B080828k6705o3322j3478m2358K3079j12087o9677L7083Q1281o9908p6041
5279A748695N9534L21r8206N0741O9518O1908O4575q5409k9370L9784M9915k1838
5267A910168m3898Q0422J0524k5924j39149K0250J54429l4455N0176k0489k9769
5256A932285l5310J27597K3619L9967j9985j9821K16Q3743N1604k5569P8972m1304
5244B196014R4318k7937o9957K9411L8993K2008j9166P3072l2419O3059O6472
5233B433868N2386m7236K9391k1595n7840Q7756j4554j67021Q4146o7874J8410
5222B329837Q7952k9458N2915m4646N760K3183P5243M9147L7074j0605J13042
$$ plain form
5302 2259968 2339808 2324900 2260545 2234737 2150046 2186912 2224514 2244375 2198937 2202256 2147969 2080828
5290 2080828 2054123 1990801 1977323 1934965 1958044 1845957 1776280 1813363 1894644 1824736 1748695
5279 1748695 1808229 1808550 1710344 1761085 1830603 1892511 1957086 1871677 1842307 1882091 1932006 1910168
5267 1910168 1866270 1946692 1957216 1931292 1792143 1812393 1966822 1932367 1982543 1962054 1932285
5256 1932285 1896975 2024572 2048191 2088158 2068173 2048352 2048568 2132311 2183915 2158346 2237318 2196014
5244 2196014 2290332 2262395 2192438 2221849 2260842 2282850 2263684 2336756 2304337 2367396 2433868
5233 2433868 2486254 2439018 2468409 2446814 2388974 2476730 2462176 2295155 2379301 2311427 2329837
5222 2329837 2417789 2388331 2441246 2396600 2402360 2425543 2500786 2549933 2587007 2576402 2689444
5211B689444P3706M2846j176k2010K431k043j9271m4645k7683n4959K9105j12060
5199B553685j0597m5735l0J2569M8142r5652l749J8792m9384N1561M5631l6739
5187B488494n3327L295J12001K0276j10051l5896M5395N7934M2637l3358J31582
5176B668982J653k2984N6192m4441L5462L8491N5678m7502Q0781J0875K1180J9433
5164B873800K8682l0162R037j08390K192R7374J43271l7682L8293R4398P1108
5153C181921J05323L7633N8942m3261m2591K16168O0195P5778Q5742m5809J55558
5142C845599R2179K611M0223Q2628J16621Q0819O1462P9483Q6330Q616R8144J73045
5130D767760J12614R4636J23335M8880P2430J64003Q5525L0101J11549J58219
$$ plain form
5211 2689444 2763150 2805996 2804820 2782810 2785241 2783198 2763927 2719282 2691599 2636640 2665745 2553685
5199 2553685 2543088 2497353 2497323 2509892 2558034 2462382 2458633 2477425 2428041 2479602 2525233 2488494
5187 2488494 2435167 2438462 2550463 2570739 2460688 2424792 2470187 2528121 2570758 2537400 2668982
5176 2668982 2670635 2647651 2703843 2659402 2694864 2733355 2789033 2741531 2822312 2833187 2854367 2873800
5164 2873800 2902482 2872320 2881357 2772967 2775159 2872533 3015804 2978122 3016415 3110813 3181921
5153 3181921 3287244 3324877 3383819 3340558 3297967 3514135 3574330 3650108 3735850 3690041 3845599
5142 3845599 3937778 3940389 3980612 4063240 4179861 4260680 4322142 4401625 4487955 4496571 4594715 4767760
5130 4767760 4880374 4975010 5098345 5147225 5219655 5383658 5469183 5499284 5610833 5769052
5120E769052J19364J4978Q9330J48873J80438J27071N3010J29562J42157M0555
5110F814390J60816J39584P6136J61787J56968K09252K24158J88163J93969J25758
5100H450981K13793J21402K05746J03174J25283K0151J9280J23215K0725N7952
5090I461702Q2407N2787M5828J61666O0514O1643J87348J75828J79577K34842
5080A0704142J49450J83656J15717K31940K06172K38465L52789L04076K29120
5071A2715527L88315M21738M75459M36552M43705N51253N42414N13459N92172
5062A7080594N22002O62683P26916P42011P28233Q74811R41850R98410J241049
5053B4518559J286735J401485J733367J775317K149204K245886K684166L176566
$$ plain form
5120 5769052 5888416 5903394 5992724 6141597 6322035 6449106 6502116 6631678 6773835 6814390
5110 6814390 6975206 7114790 7190926 7352713 7509681 7718933 7943091 8131254 8325223 8450981
5100 8450981 8664774 8786176 8991922 9095096 9220379 9240530 9259810 9383025 9403750 9461702
5090 9461702 9544109 9596896 9642724 9804390 9864904 9926547 10113895 10289723 10469300 10704142
5080 10704142 10853592 11037248 11152965 11384905 11591077 11829542 12182331 12486407 12715527
5071 12715527 13103842 13525580 14001039 14437591 14881296 15432549 15974963 16488422 17080594
5062 17080594 17602596 18265279 18992195 19734206 20462439 21337250 22279100 23277510 24518559
5053 24518559 25805294 27206779 28940146 30715463 32864667 35110553 37794719 40971285
5045D0971285L487693M058214M617068N284759N723066O188036O609692O883827
5037H3823640O760699O475874O111913N280171M009490K357136K5046k110909
5029A12733060l920016n705388o633602p231180p336814p081862o791793o071601
5021F1960804n560220m797159m294176l859816l271356k904526k613999k343327
5013C2316225k011238j789492j676207j528882j225851j235294j028329q43218
5005B0977714r04599p51292p20206p18110n83337o09098n93880n46770n56995
4996A4993427l96786m81276l72269l32167l05867l04183k66917l31585j72039
4987A2030338k42050j95594j92984j31483j56382k09568j69999j51673j15733
$$ plain form
5045 40971285 44458978 48517192 53134260 58419019 64142085 70330121 76939813 83823640
5037 83823640 90584339 97060213 103172126 108452297 112461787 114818923 114843969 112733060
5029 112733060 108813044 103107656 96474054 89242874 81906060 74824198 68032405 61960804
5021 61960804 56400584 51603425 47309249 43449433 40178077 37273551 34659552 32316225
5013 32316225 30304987 28515495 26839288 25310406 24084555 22849261 21820932 20977714
5005 20977714 20073115 19321823 18601617 17883507 17300170 16691072 16097192 15550422 14993427
4996 14993427 14596641 14115365 13743096 13410929 13105062 12800879 12533962 12202377 12030338
4987 12030338 11788288 11592694 11399710 11268227 11111845 10902277 10732278 10580605 10464872
4978A0464872k29562k45327j48141j10667j67443o0737q1113M0773p0809j9963
4968I371883j59976p2408L7462n5722J7683L1065K7567J08931k1638K50034K76588
4957I811469J30997L07991K10197J53285J01997j1188j32072k45899l37689l52812
4947I636276l79670l64632j95627l76982k43627k09347k48717k04815k43143k64849
4937F904867j79100j59774j67771m8498j49726r4293j39934m9122j29620r5905
4927E691124j8949P5375m6203l1732q5384K7725P9946O2284P4067Q2136J50455
4916F060844J36218J35331Q0249N3709K9216m7670j47542k11672j62452o3527
4906E862704j03006j06057m1764k1143j04341j04408j0260j4855Q2926n2414j7695
$$ plain form
4978 10464872 10235310 9989983 9841842 9731175 9563732 9502995 9421882 9462655 9391846 9371883
4968 9371883 9211907 9139499 9176961 9121239 9138922 9169987 9197554 9306485 9284847 9534881 9811469
4957 9811469 9942466 10250457 10460654 10613939 10715936 10704748 10572676 10326777 9989088 9636276
4947 9636276 9256606 8891974 8696347 8319365 8075738 7866391 7617674 7412859 7169716 6904867
4937 6904867 6725767 6565993 6398222 6349724 6199998 6105705 5965771 5916649 5787029 5691124
4927 5691124 5672175 5747550 5701347 5669615 5584231 5611956 5691902 5754186 5828253 5910389 6060844
4916 6060844 6197062 6332393 6412642 6466351 6495567 6447897 6300355 6088683 5926231 5862704
4906 5862704 5759698 5653641 5611877 5590734 5486393 5381985 5371725 5356870 5439796 5387382 5369687
4895E369687J29318J05695j6475J11340J16142R727n2101q8086m8648j46981j35931
4884E353687j25323j39493q0941R376p5505o8618J00636k9639Q6038R1476q0373
4873E041321p0936O2326R3820P6096m7921m5212j2528m0961j3640j04551j23833
4862D813981j7468M6065j7037O1808K1450M0749l3415K332K6110K9188J09463
4851E083226J13068J5809K0169R6190J44715k7876O5799Q6946O7260m270n3653
4840E607383j8722J04442N9963K1787Q7095J04033R8259J40533R203R4615J92778
4829F501369K50095K40465K90136J62139R7240J68421J51893L27891K16069K48323
4819H654041L91927L65516L03988L05057M50052N14660N67251N87417N88073P28478
$$ plain form
4895 5369687 5499005 5604700 5588225 5699565 5815707 5825434 5773333 5685247 5636599 5489618 5353687
4884 5353687 5228364 5088871 5007930 5017306 4941801 4873183 4973819 4944180 5030218 5121694 5041321
4873 5041321 4970385 5032711 5126531 5202627 5154706 5109494 5096966 5056005 5042365 4937814 4813981
4862 4813981 4796513 4842578 4825541 4887349 4908799 4949548 4916133 4918465 4944575 4973763 5083226
4851 5083226 5196294 5212103 5232272 5328462 5473177 5445301 5511100 5598046 5665306 5661036 5607383
4840 5607383 5588661 5693103 5753066 5774853 5861948 5965981 6064240 6204773 6213976 6308591 6501369
4829 6501369 6751464 6991929 7282065 7444204 7541444 7709865 7861758 8189649 8405718 8654041
4819 8654041 9045968 9411484 9715472 10020529 10470581 10985241 11552492 12139909 12727982 13456460
4809A3456460P90742J032349J190033J257861J388206J532118J684343J882249
4801B4214361J925755J718554J502868J142439O65798K17644P7074o8194j66212
4792C1230087k71193l69232l09591l79087k94076k65660j86631J39919K56620
4783B9551156M97800Q57559J305816J498234J908919K272307K598076K843864
4775D3333731K801088K730121K306241J727650J119978P25023M89120J75094l6876
4766E5371170k00272o51701j356810k184183k649504k807078k784147k620586
4758D0116889k166173j755454j382973j022619o14726l12820j37491K14729M35195
4749C3374557N77238O32860N51514N17513L82931K97830K65930J75959l2002l69215
$$ plain form
4809 13456460 14247202 15279551 16469584 17727445 19115651 20647769 22332112 24214361
4801 24214361 26140116 27858670 29361538 30503977 31169775 31387419 31464493 31396299 31230087
4792 31230087 30958894 30589662 30280071 29900984 29606908 29341248 29154617 29294536 29551156
4783 29551156 30048956 30906515 32212331 33710565 35619484 37891791 40489867 43333731
4775 43333731 46134819 48864940 51171181 52898831 54018809 54743832 55232952 55408046 55371170
4766 55371170 55170898 54519197 53162387 50978204 48328700 45521622 42737475 40116889
4758 40116889 37950716 36195262 34812289 33789670 33174944 32862124 32724633 32939362 33374557
4749 33374557 33951795 34584655 35136169 35653682 36036613 36334443 36600373 36776332 36744330 36375115
4739C6375115q35317j432310k033153k110273k274467k228876k031065j747814
4731B1681840j685908j306312j199120j170159q21645q29950o40200n94460o82616
4722A2751470o35323m76861l64771m39361l55922l89896l11927k52576j94482
4713I330351j54174j14430j94048k7291j0933m3031Q3904J28694J05301R3793
4703I198136j9219j53164m63922m89621k87741l19909l15273k22778j31527k77688
4693F517294j39243j20741j11286j22263o4219p1989p1494j20226n1137j11657
4683E533039k4454p368o0921j80657l4852J4844L3596j4718q789j47199p6535
4672E025986K7476l894Q067J01967R6166L1969j5583Q2836J44984J36721K90223
$$ plain form
4739 36375115 35539798 34107488 32074335 29964062 27689595 25460719 23429654 21681840
4731 21681840 19995932 18689620 17490500 16320341 15498696 14668746 14028546 13434086 12751470
4722 12751470 12116147 11639286 11274515 10835154 10479232 10089336 9777409 9524833 9330351
4713 9330351 9176177 9061747 8867699 8840408 8829475 8786444 8870348 8999042 9104343 9198136
4703 9198136 9178917 9025753 8561831 8072210 7784469 7464560 7149287 6926509 6794982 6517294
4693 6517294 6378051 6257310 6146024 6023761 5959542 5887553 5816059 5695833 5644696 5533039
4683 5533039 5508585 5501217 5440296 5259639 5224787 5239631 5273227 5258509 5249720 5102521 5025986
4672 5025986 5053462 5049568 5057635 5159602 5255768 5287737 5272154 5354990 5499974 5636695 5926918
4661E926918K22733K88937L24450K30271Q1021K1030j24903j07118j69452k54671
4651F439216k15164m0389k0808j01243m8714Q5184P3458K6612l0278o4272L9538
4640F143140J24920J27182N0780O1771N0593J11113L7993Q3247J61983J34194
4630G086916R9796J91625K35012J93305K17452K62993L13970K70026J33721J43677
4620I148493J29797n687M5766R3288J28161J11450L37718L14981L11535L31201
4610A0946703N02704O16314M50035O31625P47879P36130P98105R52992R88889
4601A7371376J182985J298940J495358J751845J972629K109977K310613K446611
4593C1940334K254396K073362J585899R70264N31350Q7870l12693m32357m40970
$$ plain form
4661 5926918 6149651 6438588 6763038 6993309 7074330 7095360 6970457 6863339 6693887 6439216
4651 6439216 6224052 6183663 6162855 6061612 6012898 6098082 6171540 6198152 6167874 6103602 6143140
4640 6143140 6268060 6395242 6446022 6507793 6558386 6669499 6707492 6790739 6952722 7086916
4630 7086916 7186712 7378337 7613349 7806654 8024106 8287099 8601069 8871095 9004816 9148493
4620 9148493 9278290 9272603 9318369 9411657 9539818 9651268 9988986 10303967 10615502 10946703
4610 10946703 11449407 12065721 12515756 13147381 13895260 14631390 15429495 16382487 17371376
4601 17371376 18554361 19853301 21348659 23100504 25073133 27183110 29493723 31940334
4593 31940334 34194730 36268092 37853991 38824255 39355605 39443475 39130782 38698425 38257455
4584C8257455m56864m28610n43384m24763l79611k46134p6512J97174N34404O84270
4574C7117425J083905J392729J774080J998272K199472K526981K479129K221772
4566E2793765J713578J170582M92658J13482k47118k97843n11413q22870j050949
4557E3353872j487166j973069k399224k509403k537756k379780k048583j686454
4549C6332437j355837j089037p87390l60777k82805k4257K50813K86848J93514
4540C3163509K68681L17473M27184L52201L16096J98865l4209m07682o83390j289956
4530C2628772j749242j740670j634138j562824j596373j327717j033436q83650
4522B1100722p42240p01372o17749n79944n06516m69253m97354m14775l23159
$$ plain form
4584 38257455 37800591 37371981 36828597 36403834 36024223 35778089 35701577 35898751 36433155 37117425
4574 37117425 38201330 39594059 41368139 43366411 45565883 48092864 50571993 52793765
4566 52793765 54507343 55677925 56170583 56284065 56036947 55739104 55227691 54404821 53353872
4557 53353872 51866706 49893637 47494413 44985010 42447254 40067474 38018891 36332437
4549 36332437 34976600 33887563 33100173 32739396 32456591 32432334 32683147 32969995 33163509
4540 33163509 33432190 33749663 34176847 34529048 34845144 35044009 35009800 34602118 33918728 32628772
4530 32628772 30879530 29138860 27504722 25941898 24345525 23017808 21984372 21100722
4522 21100722 20358482 19657110 19039361 18459417 17952901 17483648 16986294 16571519 16248360
4513A6248360l52201k94060k88615j14336j21933j25341R6858j6801M2414J21278
4503A5195623J29265Q4200L6324P1299J09630J19078o9772q051p8225K0882J17536
4492A5727789J25253P5930K40224L16880L51592K84882K85289M19348L79585K71151
4482A8477923J02917J38427K13911K58257L69948K09038L86289L91535M07032
4473B0955277K94666K66552M30464L29977M62191M36599O45044N91133O92127
4464B5104030P24480Q34732R85978J199897J230272J299246J289693J310644J303437
4455C5282409J450383J444290J439342J366330J494771J538013J723517J886674
4447D7625729K168721K482337K691264K874147L110161L366648L764795M355288
$$ plain form
4513 16248360 15896159 15602099 15313484 15199148 15077215 14951874 15048732 15031931 15074345 15195623
4503 15195623 15324888 15409088 15445412 15516711 15626341 15745419 15675647 15667596 15589371 15610253 15727789
4492 15727789 15853042 15928972 16169196 16486076 16837668 17122550 17407839 17827187 18206772 18477923
4482 18477923 18580840 18719267 18933178 19191435 19561383 19770421 20156710 20548245 20955277
4473 20955277 21249943 21516495 21946959 22276936 22739127 23175726 23820770 24411903 25104030
4464 25104030 25828510 26663242 27649220 28849117 30079389 31378635 32668328 33978972 35282409
4455 35282409 36732792 38177082 39616424 40982754 42477525 44015538 45739055 47625729
4447 47625729 49794450 52276787 54968051 57842198 60952359 64319007 68083802 72439090
4439G2439090N216876O023881O808762P974244R397363J1022054J3440459J6458577
4431A48781306K0744266K5503432L1818744L8659578M5819320M7694888M6905975
4424D05927509L0399129O309917j7443597m3103056n1354537n0838907m3710279
4417B36186179l2875346k4074366j8555446j4568217j1648661r389714p676021
4410A17398408o103983n238566m447188l828365l174607k750880k304991j911326
4402H7638502j376559r60293k17925K78680P39354R21855J177420J422566J845477
4393I1469077K440750L138839L821599M765710N654665O905254Q462426J0558460
4385A37216780J3449147J6912448K1133034K6367803L2634896L9756924M3577022
$$ plain form
4439 72439090 77655966 83679847 90488609 98462853 107860216 118882270 132322729 148781306
4431 148781306 169525572 195029004 226847748 265507326 311326646 359021534 405927509
4424 405927509 436326638 442636555 425192958 382089902 330735365 279896458 236186179
4417 236186179 203310833 179236467 160681021 146112804 134464143 125074429 117398408
4410 117398408 111294425 106055859 101608671 97780306 94605699 91854819 89549828 87638502
4402 87638502 86261943 85301650 85083725 85362405 86101759 87023614 88201034 89623600 91469077
4393 91469077 93909827 97048666 100870265 105635975 111290640 118195894 126658320 137216780
4385 137216780 150665927 167578375 188711409 215079212 247714108 287471032 331048054
4378C31048054M3995385L7960969J4868735q53947k1786908m4415863m6525211
4371C14291214m5775582m0874790l1124792k3065008j8193305j4468936j1812074
4364A28976727r585397p860790o684865n638432m877751m200227l841144l443898
4356H2844223l082967k684347k320342j978668j787487j688076j416042j181229
4348F6705065j031621q05749o54314n65977k03312k21714j42752j03960p185m860
4338F2963621J89017K23230J82693K36295L84049K26207L22430L74450M04938
4329F5506930N48297P59764Q83058J076015J293420J677273J984942K176996K593688
4320G8500383L005238L580379M159565M962497N679642O497599P170903P758519
$$ plain form
4378 331048054 375043439 413004408 427873143 427019196 405232288 360816425 314291214
4371 314291214 268515632 227640842 196516050 173451042 155257737 140788801 128976727
4364 128976727 119391330 111530540 104845675 99207243 94329492 90129265 86288121 82844223
4356 82844223 79761256 77076909 74756567 72777899 70990412 69302336 67886294 66705065
4348 66705065 65673444 64867695 64213381 63647404 63444092 63222378 63079626 62975666 62968481 62963621
4338 62963621 63152638 63375868 63558561 63794856 64178905 64405112 64727542 65101992 65506930
4329 65506930 66055227 66814991 67698049 68774064 70067484 71744757 73729699 75906695 78500383
4320 78500383 81505621 85086000 89245565 94208062 99887704 106385303 113556206 121314725
4312A21314725P941507Q044373P703519P367172P236880P213248P081051O809941
4304A80712416O158250M849090L001589O98689j686687l939107n929874p301218
4296A76563148q038875q550305q502631q231395p887734p380804o894488o512388
4288A14564528o166843n676226n370953n062405m699138m448312m346547m080624
4280G4713480l795359l461012l209857k880657k611678k442954k188928j959167
4272E2163868j871572j746726j613117j519566j397177j244290j319395j181473
4264D0270552j079137r40618r58906q77341q29188q63592o94172p53051o02309
4255C2672238o11897o71705o57207n63063n69835n63469n32423o88770n00646
$$ plain form
4312 121314725 129256232 137300605 145004124 152371296 159608176 166821424 173902475 180712416
4304 180712416 186870666 191719756 194721345 195420034 193733347 189794240 183864366 176563148
4296 176563148 168524273 159973968 151471337 143239942 135352208 127971404 121076916 114564528
4288 114564528 108397685 102721459 97350506 92288101 87588963 83140651 78794104 74713480
4280 74713480 70918121 67457109 64247252 61366595 58754917 56311963 54123035 52163868
4272 52163868 50292296 48545570 46932453 45412887 44015710 42771420 41452025 40270552
4264 40270552 39191415 38250797 37291891 36414550 35585362 34721770 34027598 33274547 32672238
4255 32672238 32060341 31388636 30731429 30168366 29598531 29035062 28502639 27813869 27313223
4246B7313223m46630n57581n42193n73526n43559m21232l49586m18513l57547
4237B3102856k94270l78256l46995k34001l40920l22728l25950l16659k08531
4228B0334546m49932l05954l34540k99916k46090k34040j17608N055M7068r0504
4218A8308085j17669j05514n6708j51763j97084k23299k35488j31393j81887j54711
4208A6752569m5541j45099j0174k8589L3894r0865l0431L0679M1620m908O8457
4197A6571612R6393O4571M6329p85m2587r185J51735Q7029p1489N6113k4672o3325
4185A6861739j17428j22879j75548k15556k18966j34637j59257j69404j456k2342
4175A5524266q373K78524K33049J48033K48495K29805K28578J1568R6266K05727
$$ plain form
4246 27313223 26866593 26309012 25766819 25193293 24649734 24228502 23878916 23460403 23102856
4237 23102856 22808586 22430330 22083335 21849334 21508414 21185686 20859736 20543077 20334546
4228 20334546 19884614 19578660 19244120 18944204 18698114 18464074 18346466 18351521 18398589 18308085
4218 18308085 18190416 18084902 18028194 17876431 17679347 17456048 17220560 17089167 16907280 16752569
4208 16752569 16707028 16561929 16551755 16523166 16557060 16466195 16435764 16466443 16508063 16503155 16571612
4197 16571612 16668005 16732576 16778905 16778120 16735533 16726348 16878083 16965112 16893623 16949736 16925064 16861739
4185 16861739 16744311 16621432 16445884 16230328 16011362 15876725 15717468 15548064 15546608 15524266
4175 15524266 15515893 15794417 16027466 16175499 16423994 16653799 16882377 16893945 16990211 17195938
4165A7195938J00816J65616K44541K62679K04508J77565K28174J92700K61977
4156A9034514K71643L58521M09254M36412N93351N35144O55255Q32738Q44973
4147B3971805Q55285Q85560R47403R58945R48675J129601J201298Q70330R39898
4138C2708800P80301Q26894R33270J007078J190152J389657J571146J763667J871728
4129D4042693J947519K325640K560821L054684L564286M005727M571351N294619
4121G1367340O109642P362750Q660560J0400012J2489225J4844967J7171253J9270504
4113A67676253K0335601J8744805J4121834N656090n148854j4095710j9679005
4106A87611014k1848390k0376808j7325502j4141191j1586613r573250p841134
$$ plain form
4165 17195938 17296754 17462370 17706911 17969590 18174098 18351663 18579837 18772537 19034514
4156 19034514 19306157 19664678 20073932 20510344 21103695 21638839 22294094 23126832 23971805
4147 23971805 24827090 25712650 26660053 27618998 28567673 29697274 30898572 31768902 32708800
4138 32708800 33489101 34315995 35249265 36256343 37446495 38836152 40407298 42170965 44042693
4129 44042693 45990212 48315852 50876673 53931357 57495643 61501370 66072721 71367340
4121 71367340 77476982 84839732 93500292 103900304 116389529 131234496 148405749 167676253
4113 167676253 188011854 206756659 220878493 226534583 221385729 207290019 187611014
4106 187611014 165762624 145385816 128060314 113919123 102332510 92759260 84918126
4099H4918126o495922n444476m681487m113304l523996k951157k702926k410084
4091E2594774k196362j876678j717700j613050j194036j172951q61898q43938
4083D1118161q49470r52359j181022j360448j414257j552882j470253j369326
4075C0968144j374969j188089j057791q77742q15149p37580o26734n91394m64235
4066B3234461o14258m87170n14572n17820n21845m31463m01683l90583l66082
4057A8988985k73989l16854k70016l30073k97113j65283k81136k30402k29414
4048A6594705n5903j33369j43022k37109j39537j85293k33135l03648k91596l38197
4038A4533896j83047k00797j73321j48152k00290j66130j03728l6031n1879l4296
$$ plain form
4099 84918126 78422204 72977728 68296241 64182937 60658941 57707784 55004858 52594774
4091 52594774 50398412 48521734 46804034 45190984 43996948 42823997 41962099 41118161
4083 41118161 40268691 39316332 38135310 36774862 35360605 33807723 32337470 30968144
4075 30968144 29593175 28405086 27347295 26469553 25654404 24916824 24290090 23698696 23234461
4066 23234461 22620203 22133033 21618461 21100641 20578796 20147333 19745650 19355067 18988985
4057 18988985 18714996 18398142 18128126 17798053 17500940 17335657 17054521 16824119 16594705
4048 16594705 16538802 16405433 16262411 16025302 15885765 15700472 15467337 15163689 14872093 14533896
4038 14533896 14350849 14150052 13976731 13828579 13628289 13462159 13358431 13322400 13270521 13236225
4028A3236225L1539j46263n3443j28843k11196j87354k41424j45713l7874j76390
4018A1939264j91389j70862j10963q8414k38305j87035j46615j42537o5639m1356
4008A0556149j19562N685k9483m4201J4148M1956p3585J20241Q8372j8455Q0859
3997A0622124J87077P5074J48726J02669J41459J90356J94091K25624J46897K15037
3987A2249134p1061k04162k25587l36233k76199k57975j71816j05438j76290j28179
3977A0296194l5055j84740j63601j70634j34288L1126k1706M7830k0646j3393
3967I631087P0548K48880J91968N8476p0742N934J8797L0526O4293R6450L6219
3956A0382436M1887m9314R7236J01054J33444J46564K13951K67763J57499J43480
$$ plain form
4028 13236225 13267764 13121501 13068058 12939215 12728019 12540665 12299241 12153528 12115654 11939264
4018 11939264 11747875 11577013 11466050 11377636 11139331 10952296 10805681 10663144 10597505 10556149
4008 10556149 10436587 10442272 10412789 10368588 10382736 10424692 10351107 10471348 10559720 10541265 10622124
3997 10622124 10809201 10884275 11033001 11135670 11277129 11467485 11661576 11887200 12034097 12249134
3987 12249134 12178073 11973911 11748324 11412091 11135892 10877917 10706101 10600663 10424373 10296194
3977 10296194 10261139 10076399 9912798 9742164 9607876 9639002 9617296 9665126 9644480 9631087
3967 9631087 9701635 9950515 10142483 10200959 10130217 10136151 10154948 10185474 10249767 10346217 10382436
3956 10382436 10424323 10375009 10472245 10573299 10706743 10853307 11067258 11335021 11492520 11636000
3946A1636000m3779K22175K00497J57621K58620K61295K76263L56560M16540N06393
3936A4248185O97873P29340Q19157R53694J070581J114164J154228R14572M92905
3927B2194699k7840o39660r27156j291386j313118r01682p67496p04463n08044
3918A5113854m91774m53600j72242j13205j29436l5661j0711L9901J38199J06358
3908A3991683P5417N7728J04150K25383J21975K12705K19073K72926L03332L74742
3898A5959114L81662N18799N10112O51982R02904Q43977J146217J190202J278739
3889B3383708J381111J203699Q72761M00888k15959n54312p02421r96894j044213
3880B3728368q49431n81289l71578k97172j75613l92728o90495q01161q45406
$$ plain form
3946 11636000 11592221 11814396 12014893 12172514 12431134 12692429 12968692 13325252 13741792 14248185
3936 14248185 14946058 15675398 16494555 17448249 18518830 19632994 20787222 21701794 22194699
3927 22194699 22166859 21527199 20600043 19308657 17995539 17093857 16326361 15621898 15113854
3918 15113854 14622080 14168480 13996238 13883033 13753597 13717936 13707225 13747126 13885325 13991683
3908 13991683 14067100 14124828 14228978 14454361 14576336 14789041 15008114 15281040 15584372 15959114
3898 15959114 16340776 16859575 17369687 18021669 18924573 19768550 20914767 22104969 23383708
3889 23383708 24764819 25968518 26841279 27242167 27026208 26471896 25769475 24772581 23728368
3880 23728368 22878937 22297648 21926070 21628898 21453285 21060557 20370062 19568901 18723495
3871A8723495j000308q23427o27302o35787n10046m47156l52671m09744l47088
3862A3569966l56040l03595l56980l08807j82160k72179l43831j26625k19680
3853A1100069p7528q3028J6584n8100N2329M9803J2649J31982K20005J44733J03784
3842A1613282J56463J43239L52071K60921K34879K58899K34374J69591J66422
3833A3590141L09342L19688J39709J71180R2184n3733k59641l53948m62090l97803
3823A3095029l97506l93331l58988k32569j27538j47245j72302n6567l525J872
3813A1207330M3323J24374J44062J13263J89162K51882K09576K40304L16408K84639
3803A3124323K35276M44742M17891M06545M20128N58430O21363O63204P51713
$$ plain form
3871 18723495 17723187 16899760 16272458 15636671 15126625 14679469 14326798 13917054 13569966
3862 13569966 13213926 12910331 12553351 12244544 12062384 11790205 11446374 11319749 11100069
3853 11100069 11022541 10939513 10956097 10897997 10950326 11000129 11012778 11144760 11364765 11509498 11613282
3842 11613282 11769745 11912984 12265055 12525976 12760855 13019754 13254128 13423719 13590141
3833 13590141 13899483 14219171 14358880 14530060 14622244 14568511 14308870 13954922 13492832 13095029
3823 13095029 12697523 12304192 11945204 11712635 11585097 11437852 11265550 11208983 11205458 11207330
3813 11207330 11250653 11375027 11519089 11632352 11821514 12073396 12282972 12523276 12839684 13124323
3803 13124323 13359599 13804341 14222232 14628777 15048905 15607335 16228698 16891902 17643615
3794A7643615O20028P60915Q49952P62267P65187O65047N92065P55527P98170
3785B4212773Q81979J028257J045384J065827J117851J096374J196845J078079
3777C2723369P97881N58248N44436L50162M07445M18902M91537P01137P06322
3768C7699439P20780P82099P59306L08939N4081k08330m88797p19225q34148o97423
3758C7376721o38889m01846l48346l19731l17614m33137n50697p32203r64384
3749C2669874j239594j261368j211174j099783j238121r67036r54415q97207p77437
3740B3023739p75036p74540q27489p75980r92272q10698q71294r11203p55515
3731A5529712p08418o20879o18168n78592m98379m84007m21090l44387m72245
$$ plain form
3794 17643615 18263643 19024558 19874510 20636777 21401964 22067011 22659076 23414603 24212773
3785 24212773 25094752 26123009 27168393 28234220 29352071 30448445 31645290 32723369
3777 32723369 33521250 34079498 34623934 34974096 35381541 35800443 36291980 36993117 37699439
3768 37699439 38420219 39202318 39961624 40270563 40324644 40116314 39627517 38908292 38074144 37376721
3758 37376721 36737832 36335986 35987640 35667909 35350295 34917158 34366461 33634258 32669874
3749 32669874 31430280 30168912 28957738 27857955 26619834 25652798 24698383 23801176 23023739
3740 23023739 22248703 21474163 20646674 19870694 18878422 18067724 17196430 16285227 15529712
3731 15529712 14821294 14200415 13582247 13003655 12505276 12021269 11600179 11255792 10783547
3722A0783547m57612m37607k97254m36278l20117j83696k41241k92616l02429
3713G814697l14699r5026k03360k55539j96867k63868j12227n2817k93748j19658
3703E906888j20725j40826j15682j72537j23960k24155j8141j44056r3745j98303
3693D554758k20985K638p5872k14812k6667j58410r3522m9795m0494j0386j12635
3682C553818j77548o704M8198n0352q3311m8424j31986J2914l3003p1955M0018
3671C051665o9099o3109m5215j55774j0014p2254j0057m6069m7379k6163q6359
3660B420173L1499j02629n261J5670o1471j6939M675J411M7616n1284q6766K3769
3648B220463j38278n8532J17350l9644M2959J1962k8506k2816m5633k5768m6236
$$ plain form
3722 10783547 10325935 9888328 9591074 9154796 8834679 8650983 8409742 8117126 7814697
3713 7814697 7499998 7404972 7201612 6946073 6749206 6485338 6373111 6320294 6026546 5906888
3703 5906888 5786163 5645337 5529655 5357118 5233158 5009003 4990862 4846806 4753061 4554758
3693 4554758 4333773 4336411 4260539 4045727 4019060 3860650 3767128 3717333 3676839 3666453 3553818
3682 3553818 3376270 3369566 3417764 3367412 3284101 3235677 3103691 3116605 3083602 3011647 3051665
3671 3051665 2982566 2919457 2874242 2718468 2708454 2636200 2626143 2580074 2532695 2506532 2420173
3660 2420173 2451672 2349043 2343782 2359452 2297981 2281042 2285717 2287128 2334744 2283460 2196694 2220463
3648 2220463 2082185 2023653 2141003 2101359 2144318 2156280 2127774 2104958 2059325 2033557 1987321
3637A987321R638k2858k1380l4782j5066L0758m7892m5406n3555K4015n9708J05341
3625A856426K2478n7973j0372M1224L9021L198j9629l3695K0387J9291o3553J4357
3613A831160J1033r679o1278K5150P5584j78448K9054L8757j3140J985L666K9728
3601A783572k8548m445k3754j04045J1821L2565k2526l3956O7931R4949m7965
3590A725599p2599j5983J7384J123j46655J5384P0916l893j11081j0267J25991
3579A595919j6665j04072J8074O7346j14745M2544n559m3516n4575l5770M2069
3568A391050L331K0928k533j3048M2639O0619L6244j3658o1528N2446J04142n2728
3556A567904k1172J02989o0106Q6428M137M960O7341O8817O3894j8932K8496N7136
$$ plain form
3637 1987321 1996959 1974101 1952721 1917939 1902873 1933631 1885739 1840333 1786778 1810793 1751085 1856426
3625 1856426 1878904 1820931 1810559 1851783 1890804 1894002 1874373 1840678 1861065 1880356 1816803 1831160
3613 1831160 1842193 1832514 1771236 1796386 1871970 1693522 1722576 1761333 1748193 1750178 1753844 1783572
3601 1783572 1755024 1750579 1726825 1622780 1634601 1667166 1644640 1610684 1678615 1773564 1725599
3590 1725599 1653000 1637017 1654401 1655524 1508869 1524253 1595169 1591276 1480195 1469928 1595919
3579 1595919 1579254 1475182 1493256 1560602 1445857 1488401 1482842 1439326 1384751 1348981 1391050
3568 1391050 1394381 1415309 1412776 1399728 1442367 1502986 1539230 1525572 1464044 1516490 1620632 1567904
3556 1567904 1546732 1649721 1589615 1676043 1680180 1685140 1752481 1821298 1885192 1866260 1894756 1951892
3544A951892L0466Q8056k1482m9010J0465r998J7994o790K2668q2215n9069o0957
3532A832020J03463r2230J4840P3354R6985k2567n3698m8156L975o1364k4188
3521A822434J456L1013P3053p5332k5508p5469N2461K0926j1908j14657M9502
3510A747971N89J1019O0861o5649k8268l252L7397l115j4977M3693j5106J6575
3498A787738k5447K5487J02498N0648m8871L6952N4280J818n6169j5906P2303
3487A985331J4384P435K1285O823J4110K7488o2317o406R049J9827L8775q0176
3475A995608L9520P2456K1338r4441j56932j3514K8626M3174r187j4052L0913
3464A943509n147Q898Q8773l4890N5169r6099l9516R8825q3337J8001P2385j0853
$$ plain form
3544 1951892 1982358 2070414 2048932 1999922 2010387 2000389 2018383 2011593 2034261 1952046 1892977 1832020
3532 1832020 1935483 1843253 1858093 1931447 2028432 2005865 1952167 1904011 1907986 1846622 1822434
3521 1822434 1823890 1854903 1927956 1852624 1827116 1751647 1804108 1825034 1813126 1698469 1747971
3510 1747971 1748560 1759579 1820440 1754791 1726523 1723271 1760668 1757553 1742576 1786269 1771163 1787738
3498 1787738 1762291 1787778 1890276 1940924 1892053 1929005 1983285 1985103 1928934 1913028 1985331
3487 1985331 1999715 2007150 2028435 2035258 2049368 2076856 2014539 2008133 2017182 2037009 2075784 1995608
3475 1995608 2035128 2107584 2128922 2034481 1877549 1864035 1892661 1935835 1926648 1912596 1943509
3464 1943509 1938362 1947260 2036033 2001143 2056312 1960213 1920697 2019522 1936185 1954186 2026571 2015718
3452B015718N8707M6683J49941o2530P8952l425j5285l7033M3345r125P2667J1055
3440B349670p7600R5192o8080n5448j3893L2670l7575j5835r2851L9123K7448
3429B182821n1488r098k3867K7691K6096r4235j4013p0002J06723J00704M5525
3418B226857Q06j772O291J2916P7112K523k7014Q1542M6760Q5210L1413l1829
3406B510815J33773O9858k7395p6631P1541J00034P3422J21580L3343P1406L795
3395C085541M7934M8525R0376J7638J4155j6092M6439M4546O1233l4601J02118
3384C507812N6956M5540N4875k456J08293K7645l1356J7501L5288q9350J7170
3373C747918Q1304M7528K2643N5725M5753o218L5290J3710M4755M7005Q7255L1934
$$ plain form
3452 2015718 2074425 2121108 2271049 2208519 2287471 2284046 2268761 2231728 2275073 2265948 2338615 2349670
3440 2349670 2272070 2367262 2299182 2243734 2229841 2262511 2224936 2209101 2116250 2155373 2182821
3429 2182821 2131333 2122235 2098368 2126059 2152155 2057920 2043907 1973905 2080628 2181332 2226857
3418 2226857 2227663 2225891 2232182 2245098 2322210 2324733 2297719 2379261 2426021 2511231 2542644 2510815
3406 2510815 2644588 2714446 2687051 2610420 2681961 2781995 2855417 2976997 3010340 3081746 3085541
3395 3085541 3133475 3182000 3272376 3290014 3304169 3288077 3334516 3379062 3440295 3405694 3507812
3384 3507812 3564768 3610308 3665183 3662727 3771020 3798665 3767309 3784810 3820098 3730748 3747918
3373 3747918 3829222 3876750 3899393 3955118 4000871 3994653 4029943 4043653 4088408 4135413 4222668 4254602
3361D254602M1522M3417l2835O4303l6361l3168N7880l7245n7233n652j7343j4759
3349D227128j9549L7983K6809o991q986O150m7063O4839q1658Q3152J05909P2775
3337D460498L1078n6290R4095p43J75120J29341Q7537O4720P8341Q7018L5511
3326E186226L8289O9065J7812J34572J85382O7515J11366k9197P2373Q8949Q4475
3315F026827M504L0161K0634P659J60531m0337M2130J27255J9952J69736j6636
3304F552416n0855P5272R8181N8555k9632Q1005j6657N9587O3286M9695J18865
3293G059718J9381J28141O5889l3324Q3173J24822M7767J67708j527J07554Q8748
3282G858050R9978J36365N1689J04288Q0282q173J73996J14416j6302R2724J4530
$$ plain form
3361 4254602 4296124 4339541 4306706 4371009 4334648 4301480 4359360 4322115 4264882 4259230 4241887 4227128
3349 4227128 4207579 4245562 4272371 4265380 4256394 4262544 4215481 4280320 4198662 4281814 4387723 4460498
3337 4460498 4491576 4435286 4529381 4528638 4703758 4833099 4920636 4985356 5063697 5150715 5186226
3326 5186226 5224515 5293580 5311392 5445964 5631346 5698861 5810227 5781030 5853403 5942352 6026827
3315 6026827 6031331 6061492 6082126 6089785 6250316 6209979 6252109 6379364 6399316 6569052 6552416
3304 6552416 6501561 6576833 6675014 6733569 6703937 6784942 6768285 6827872 6891158 6940853 7059718
3293 7059718 7079099 7207240 7273129 7239805 7322978 7447800 7495567 7663275 7661748 7769302 7858050
3282 7858050 7958028 8094393 8146082 8250370 8330652 8322479 8496475 8610891 8594589 8687313 8701843
3271H701843O6782J51412L4349J87125L6888K6576Q7635Q5665L8174L3427P8928
3260I528804L6443Q6197L0193m883k0829N4849M9680J26181N889M9532R9477M1143
3248A0082676L9710J12056M0464J67889J82646K15278K59150K07877K58939J76304
3238A1742989K31241K08340L54043K43336L08418K64001M29211M44616L78719
3229A4604914N00588L96013L53091M38640M52320L85478N56138L40450L19448
3220A8347080L92054L40152L23395L54023K10859K88003K81715K25080J41056
3211B0903417J29726J7132R8062O5826q4697r939J6770L2410L5190r6030J1720
3200B1119587r926m9563R5061k8132J5409J17j36140j17219q6840j23706q6978
$$ plain form
3271 8701843 8768625 8920037 8954386 9141511 9178399 9204975 9292610 9378275 9416449 9449876 9528804
3260 9528804 9565247 9651444 9681637 9676754 9655925 9710774 9760454 9886635 9892524 9942056 10041533 10082676
3248 10082676 10122386 10234442 10274906 10442795 10625441 10840719 11099869 11307746 11566685 11742989
3238 11742989 11974230 12182570 12536613 12779949 13088367 13352368 13781579 14226195 14604914
3229 14604914 15105502 15501515 15854606 16293246 16745566 17131044 17687182 18027632 18347080
3220 18347080 18739134 19079286 19402681 19756704 19967563 20255566 20537281 20762361 20903417
3211 20903417 21033143 21050275 21148337 21214163 21129466 21119527 21136297 21168707 21203897 21107867 21119587
3200 21119587 21109661 21060098 21155159 21127027 21142436 21142553 21006413 20889194 20802354 20678648 20591670
3189B0591670j30868j82667q0360n8060O7736l1583Q6020Q4336P2358J14640J38637
3178B0671859R3415M4798O3784M7539O2805Q6791P0523J69163K53172K66081K54700
3167B2084630M66343L65227M25807N09161M83133N35783O15705O97596P59069
3158B6942454P94290Q63003R66283Q92646J033068J241275J241845J346730J573151
3149C6894745J688927J967099K081141K425106K711662K922491L207862L505781
3141E7404814L818181M072021M103051M141640L954493L601131L038711K363255
3133H6497297J679278J199890P26082L79633J96368J91195L65996N32160N93354
3124I2361253N45357L10403j618m98996j212680j778400k332233k793531k948199
$$ plain form
3189 20591670 20460802 20278135 20197775 20139715 20207451 20175868 20261888 20346224 20418582 20533222 20671859
3178 20671859 20765274 20810072 20873856 20921395 20984200 21070991 21141514 21310677 21563849 21829930 22084630
3167 22084630 22550973 22916200 23342007 23851168 24334301 24870084 25485789 26183385 26942454
3158 26942454 27736744 28599747 29566030 30458676 31491744 32733019 33974864 35321594 36894745
3149 36894745 38583672 40550771 42631912 45057018 47768680 50691171 53899033 57404814
3141 57404814 61222995 65295016 69398067 73539707 77494200 81095331 84134042 86497297
3133 86497297 88176575 89376465 90102547 90482180 90678548 90869743 91235739 91767899 92361253
3124 92361253 92906610 93217013 93215395 92716399 91503719 89725319 87393086 84599555 81651356
3115H1651356l147570l134828k887897k589961k372481k094384j638114j392245
3107F2393876j171811q82070n86527m76779k65577N0155J57220L82260M58316
3098F0059063N22654P48217R56686J175111J208215J196078J549402J704337J806750
3089G0926513J941941K211692K378180K437252K580701K715135K870875K890730
3081I0953019K969632K969326L026374L106036L259204L409394L620276L843942
3073A17157203M319100M648152M898404N528359N979240O505242O941732P409703
3065A63387135P547897P344376O755696O023913M818228L396024J961411O06150
3057B01840830m58982j205068j490100j559633j263085j006522q42831j054782
$$ plain form
3115 81651356 78503786 75368958 72481061 69891100 67518619 65424235 63786121 62393876
3107 62393876 61222065 60339995 59753468 59276689 59011112 59061267 59218487 59600747 60059063
3098 60059063 60581717 61329934 62286620 63461731 64669946 65866024 67415426 69119763 70926513
3089 70926513 72868454 75080146 77458326 79895578 82476279 85191414 88062289 90953019
3081 90953019 93922651 96891977 99918351 103024387 106283591 109692985 113313261 117157203
3073 117157203 121476303 126124455 131022859 136551218 142530458 149035700 155977432 163387135
3065 163387135 170935032 178279408 185035104 191059017 195877245 199273269 201234680 201840830
3057 201840830 201381848 200176780 198686680 197127047 195863962 194857440 194014609 192959827
3049A92959827j619061k445364l730647n028935o194714p424615q262249q662112
3041A49592130q657165q360382p964162p250752o566517n908185n230858m642711
3033I5011398m118392l578664l099388k824322k459562k229355k000918j741258
3025G2959539j672916j435191j429336j226003j150413j037196j064804q51907
3017F3091773o91427n93903n01812m85455k59354k22003j61173l35014l11428
3008E9530204m18713n45820o50450o68154q69775q70296j045376r13838r10064
2999E2637718q61569q45591n82980n38253n10519l50243o5777o3027q9183J15157
2989D8845733K70149K53230L96242O24688P21758P71625R56501J228479J270435
$$ plain form
3049 192959827 191340766 188895402 185164755 180135820 173941106 166516491 158254242 149592130
3041 149592130 140934965 132574583 124610421 117359669 110793152 104884967 99654109 95011398
3033 95011398 90893006 87314342 84214954 81390632 78931070 76701715 74700797 72959539
3025 72959539 71286623 69851432 68422096 67196093 66045680 65008484 63943680 63091773
3017 63091773 62400346 61806443 61304631 60819176 60559822 60337819 60176646 59841632 59530204
3008 59530204 59111491 58565671 57915221 57247067 56377292 55506996 54461620 53547782 52637718
2999 52637718 51776149 50930558 50347578 49809325 49298806 48948563 48882786 48819759 48730576 48845733
2989 48845733 49115882 49369112 49765354 50390042 51111800 51883425 52839926 54068405 55338840
2980E5338840J503645J713705J911460K058191K476872K806847L206315L701935
2972G4717810M205748M828083N267297N798545O511234O812801P156254P210657
2964A22508429P229626O838977O402055N800278M949973M061495L099764K268939
2956A63159536J338102N32190j76884o83364j414319j785364k154477k689473
2948A56125947l086113l492173m073477m468150m879181n118175n316421n374696
2940A20317561n108184m964132m527661m020480l552638l044110k558110k169528
2932I0372718j566127j335368q52133l66167K1548L12512P13030R68581J085767
2923H9354361J301765J376341J392024J089642Q40342O21685K41826j32737n57695
$$ plain form
2980 55338840 56842485 58556190 60467650 62525841 65002713 67809560 71015875 74717810
2972 74717810 78923558 83751641 89018938 94817483 101328717 108141518 115297772 122508429
2964 122508429 129738055 136577032 142979087 148779365 153729338 157790833 160890597 163159536
2956 163159536 164497638 165029828 164852944 164169580 162755261 160969897 158815420 156125947
2948 156125947 153039834 149547661 145474184 141006034 136126853 131008678 125692257 120317561
2940 120317561 115209377 110245245 105717584 101697104 98144466 95100356 92542246 90372718
2932 90372718 88806591 87471223 86619090 86252923 86274471 86586983 87300013 88268594 89354361
2923 89354361 90656126 92032467 93424491 94514133 95354475 95976160 96217986 96085249 95527554
2914I5527554r56726j295992j634944j860458j872448j742429j711413j417272
2906H3035872j204147q00078n50527l61515j02446O465J0147k89037n96828r37589
2896G8210317j409607j628480k206053k529540k762687k987320k986775l254366
2888E8445489l023998k965887k840912k528518k492949k251309j886717j764050
2880C8691149j715648j538195j366084j190577j240578j083922q77678q36069
2872B8842398q55233p73430o26755p04509o02620n39203n07341m28038k88695
2863B3516574l17858l25372l70784k61566l24692l02587q4125j69688j43291Q3426
2853B1300037L0635M8976L610j2257j6847N4650m182p353p7314j50813k93822
$$ plain form
2914 95527554 94570828 93274836 91639892 89779434 87906986 86164557 84453144 83035872
2906 83035872 81831725 81031647 80481120 80119605 80017159 80023624 80033771 79744734 79147906 78210317
2896 78210317 76800710 75172230 72966177 70436637 67673950 64686630 61699855 58445489
2888 58445489 55421491 52455604 49614692 47086174 44593225 42341916 40455199 38691149
2880 38691149 36975501 35437306 34071222 32880645 31640067 30556145 29678467 28842398
2872 28842398 27987165 27213735 26586980 25882471 25279851 24740648 24233307 23805269 23516574
2863 23516574 23198716 22873344 22502560 22240994 21916302 21613715 21529590 21359902 21216611 21300037
2853 21300037 21330672 21379648 21383258 21371001 21354154 21408804 21404622 21397269 21319955 21169142 20875320
2842B0875320l62619n13003n48108n03700n39663n59805n21710l69139l65420
2833A6592153n14051m69600j64806k70187l18939j74428j10771j20555q4798n5653
2823A4308365p2326o1153l2131l3035K5464j80656J8235O0943o1268k015j1509
2812A3958914O9865Q9666M7293N4362N3946J5363P5361N5897N7455K5180J7617
2801A4520919J60503K65573P5263J62703L17731K72085L58178M88535M53831N64747
2791A7640068N20828N40118N02148K58552J37704P9575J22654N5827N0161J17908
2781B0025543J03199J52092L64198L94224M43981M62585M79644M53308M72786
2772B3351560M38793M73363M52972N38891O03621P31553O73364Q05420P94049
$$ plain form
2842 20875320 20512701 19999698 19451590 18947890 18408227 17848422 17326712 16957573 16592153
2833 16592153 16078102 15608502 15443696 15173509 14854570 14680142 14569371 14448816 14364018 14308365
2823 14308365 14236039 14174886 14142755 14109720 14135184 13954528 13972763 14033706 13972438 13970423 13958914
2812 13958914 14028779 14118445 14165738 14220100 14274046 14289409 14364770 14420667 14478122 14503302 14520919
2801 14520919 14681422 14946995 15022258 15184961 15502692 15774777 16132955 16621490 17075321 17640068
2791 17640068 18160896 18701014 19203162 19461714 19599418 19678993 19801647 19857474 19907635 20025543
2781 20025543 20128742 20280834 20645032 21039256 21483237 21945822 22425466 22878774 23351560
2772 23351560 23790353 24263716 24716688 25255579 25859200 26590753 27264117 28069537 28863586
2763B8863586R78865Q85901R16203J036442Q90777Q38836Q00470P35172J003851
2754C6950103R22081J024962J279591J397341J492098J517827J624053J607426
2746D7815482J583979J812986J892212J852672K084716K199956K439964K550823
2738F4232790K815165L232296L690111L946165M438303M687024M957293N174662
2730I7173809N598353O154762P135491P968016R200562J0823682J2495164J4334151
2722A70883990J6435939J8664932K1137257K4000746K6983359L0415777L3723296
2715C42245296L6070859L6082811L1493487K1087145N354455j2263786k6792331
2708D33277936l6276213l9792867l8314040l4098724k9280990k4938543k1428585
$$ plain form
2763 28863586 29842451 30728352 31644555 32680997 33571774 34410610 35211080 35946252 36950103
2754 36950103 37872184 38897146 40176737 41574078 43066176 44584003 46208056 47815482
2746 47815482 49399461 51212447 53104659 54957331 57042047 59242003 61681967 64232790
2738 64232790 67047955 70280251 73970362 77916527 82354830 87041854 91999147 97173809
2730 97173809 102772162 108926924 116062415 124030431 133230993 144054675 156549839 170883990
2722 170883990 187319929 205984861 227122118 251122864 278106223 308522000 342245296
2715 342245296 378316155 414398966 445892453 466979598 472334053 460070267 433277936
2708 433277936 397001723 357208856 318894816 284796092 255515102 230576559 209147974
2701B09147974j8270696j5953902j4052213j2382627j0953867r791764q807144
2694A18935761p968574p148360o412727n918293n144687m549909m069006l718494
2686G4005711l488445l103806k852602k669287k510584k318712k023715j917619
2678E3120941j808606j825851j732108j672077j398366j375146j399189j208919
2670D0700679j120270j228858j188142j192332j063735j103326j080323j094673
2662C1629020j033823j001537q95055q28733q41674q19218p52750q73413q36462
2653B3746355p21587o21098o53357n56434n21202n90397n23520m70697m14829
2644A8673234l83081m80040o17997m05835n30911n37377m33204m62230m30429
$$ plain form
2701 209147974 190877278 174923376 160871163 148488536 137534669 127742905 118935761
2694 118935761 110967187 103818827 97406100 91487807 86343120 81793211 77724205 74005711
2686 74005711 70517266 67413460 64560858 61891571 59380987 57062275 55038560 53120941
2678 53120941 51312335 49486484 47754376 46082299 44683933 43308787 41909598 40700679
2670 40700679 39580409 38351551 37163409 35971077 34907342 33804016 32723693 31629020
2662 31629020 30595197 29593660 28698605 27869872 27028198 26208980 25456230 24582817 23746355
2653 23746355 23024768 22403670 21750313 21193879 20672677 20082280 19558760 19088063 18673234
2644 18673234 18290153 17810113 17192116 16786281 16255370 15717993 15284789 14822559 14392130
2635A4392130k32628l22642l11706l35448j40172k51765j65665j82800k95537
2626A2153767j47682k92986k93187k13293k80086k73424l42950k35284j79331
2617I895544j65016k36122j65554j96513k63237j53411j59142j77533q2410j63386
2607H133220k78553j30693j02184j52641n8266j71587r2530o0097j12578p6154
2597F897937J7067L928o9823r7627j64069j71070n8992l4882q9675p0648o2094
2586F100052r1643j54435j11033o9664j55015j51600J8114j51149j70830m7489
2576E015308j14774n8350m7704q2379n751j13562n8786j23213n7462m258k8554
2565D320515N6974q5511r6327Q7042l0837n0694L9872J4306j16640L1033j51304
$$ plain form
2635 14392130 14159502 13836860 13525154 13189706 13049534 12797769 12632104 12449304 12153767
2626 12153767 12006085 11713099 11419912 11206619 10926533 10653109 10310159 10074875 9895544
2617 9895544 9730528 9494406 9328852 9132339 8869102 8715691 8556549 8379016 8296606 8133220
2607 8133220 7854667 7723974 7621790 7469149 7410883 7239296 7146766 7086669 6974091 6897937
2597 6897937 6915004 6918932 6849109 6751482 6587413 6416343 6357351 6322469 6232794 6162146 6100052
2586 6100052 6008409 5853974 5742941 5673277 5518262 5366662 5384776 5233627 5062797 5015308
2576 5015308 4900534 4842184 4794480 4712101 4706350 4592788 4534002 4410789 4353327 4349069 4320515
2565 4320515 4377489 4291978 4195651 4282693 4251856 4201162 4241034 4255340 4138700 4169733 4018429
2554D018429r2641J2914J0487q8334j1026r7714l9718l8489j37210q6922j33506
2543C316270Q1070o1535l9454j6300j08736K2060J0612P5865r2101Q00O8716J0264
2531C267531q9645o7744N3745m0454o3592n3528O4237K0941k44934j24057m4403
2520B678097j12672p9556j71108j52294j13453r9506k68791j01181n2059n594
2510A521883j5816L7498J12122k692m2426M0212n941O5161L4927R996k4113k1195
2498A709616l4204q6687J9922L7246m5985K4772M5791j0926M4412l2477n2401
2487A619079O065J9419m1523l6905P6988O2757O6039o4R7089L0092N884J05514
2475B010434O9963m7162p2784O4554J95129N2873J3952N2985J05115L1854J14537
$$ plain form
2554 4018429 3925788 3938702 3949189 3860855 3849829 3752115 3712397 3673908 3536698 3449776 3316270
2543 3316270 3397340 3335805 3296351 3280051 3171315 3193375 3203987 3279852 3187751 3188551 3257267 3267531
2531 3267531 3177886 3110142 3163887 3123433 3059841 3006313 3070550 3091491 2846557 2722500 2678097
2520 2678097 2565425 2485869 2314761 2162467 2049014 1949508 1680717 1579536 1527477 1521883
2510 1521883 1506067 1543565 1655687 1652995 1610569 1650781 1644840 1710001 1744928 1754924 1730811 1709616
2498 1709616 1675412 1588725 1608647 1645893 1599908 1624680 1670471 1659545 1703957 1671480 1619079
2487 1619079 1625144 1644563 1603040 1566135 1643123 1705880 1771919 1771855 1868944 1899036 1904920 2010434
2475 2010434 2080397 2033235 1960451 2025005 2220134 2273007 2286959 2339944 2445059 2476913 2591450
2464B591450R8127Q8488P4680K47218J98757O4588R8563Q9501O8626j289j19955
2453C498754j94838k14689j27181j77440k06464j10963j16910l4260j91066j08164
2443B016779L5042p9666o1168n4631j75553o0077o5999n8260l2849k8556M9608
2432A484670L664r9774k7197m2106J3705L5645l3088o836j416l0950r0957j25119
2420A080241L6612n981N6247l8433n7912N4597K300M9058o85j32802o786o8175
2408I68281p3862Q5684k948L3295K6327R93p2398j31913l8789K2050P8984j00378
2396G95326K5800N0977K8954k9006O716M1191j15819m0122m7819l002N3338O7748
2384H34282l1940J5548k2904K4318r4977j6907Q8860j16328R5940M8973j9820
$$ plain form
2464 2591450 2689577 2778065 2852745 3099963 3298720 3363308 3461871 3551372 3619998 3618709 3498754
2453 3498754 3303916 3089227 2962046 2784606 2578142 2467179 2350269 2316009 2124943 2016779
2443 2016779 2051821 1972155 1910987 1856356 1680803 1620726 1554727 1496467 1463618 1435062 1484670
2432 1484670 1488334 1388560 1361363 1319257 1332962 1368607 1335519 1328683 1327267 1296317 1205360 1080241
2420 1080241 1116853 1110872 1167119 1128686 1070774 1125371 1127671 1176729 1176044 1043242 1036456 968281
2408 968281 894419 980103 977155 1010450 1036777 1037770 965372 833459 794670 816720 895704 795326
2396 795326 821126 872103 901057 872051 878767 919958 804139 764017 716198 713196 766534 834282
2384 834282 802342 817890 794986 819304 724327 707420 796280 679952 775892 824865 805045
2373H05045q7127J0064q5620M3502J7986j0018L0260J643r8692o9776J10807k2894
2361F45180J07160p3127j09566L5814N8686k2105o1211J5923j6805O1324q8959
2350E52314j1162L0311m4146K3514K007o5625m6225N2705L6011k3751P0415J8067
2338E94435q4899J3602l328r0232m1520j6436j6117k0947k7356N6261L3867N0288
2326D47618j29763p6719Q0654l1849j9416J6075O6403J8571K8340k7897R689p4191
2314C07515J084Q4624l8529j6945N0359k2602n4049q900m724l3189J03503n285
2302C62862n7330M2644L5338L7355k7501L565q2016Q5977r0123R274n8785N4050
2290C15310J0691q842n884J34584q3815L3747J11021n035o7585N084K9236O1231
$$ plain form
2373 805045 717918 727982 642362 685864 703850 693832 724092 725735 627043 557267 668074 645180
2361 645180 752340 679213 569647 605461 664147 642042 580831 596754 579949 641273 552314
2350 552314 541152 571463 527317 550831 552838 487213 440988 493693 529704 505953 576368 594435
2338 594435 509536 523138 519810 429578 388058 371622 355505 334558 307202 363463 397330 447618
2326 447618 317855 241136 321790 289941 270525 286600 353003 371574 399914 372017 381706 307515
2314 307515 308599 393223 354694 337749 388108 365506 311457 302557 297833 264644 368147 362862
2302 362862 305532 348176 383514 420869 393368 396933 314917 400894 310771 320045 261260 315310
2290 315310 326001 317159 311275 445859 362044 395791 506812 501777 434192 439276 468512 529743
2278E29743J9309l7256j1736j7348J154j7175q419l6318j04163P268J07588m8570
2266C84077p7940l9556o888Q6910j9962j42846N2707L7494P7285M6335K2756p061
2254D13311M358n0510m2435O2519j0281j1196K8833k2804k4967J18917n8584j16026
2242B91135J40061L3792k764p556k8262K6923J28839j28976q8478l9377Q12o837
2230C19312o2870O7183J09305q1306k8371q8120L0452O1594j2036n9948M6804
2219C01999l7532L163O2108l4633J5163r2876Q533M9536j3465J9038N5205l2886
2207C03353J1930n7596N9836m1046q7118O9323J1046R331l0926K2247R0780j2472
2195C48688l2361l6153r9977J2171J322l018K3498L9375L7320o4343j5599k7195
$$ plain form
2278 529743 549052 511796 500060 482712 483866 466691 458272 421954 317791 325059 432647 384077
2266 384077 306137 266581 259693 346603 326641 183795 236502 273996 351281 397616 420372 413311
2254 413311 417669 367159 324724 387243 376962 365766 394599 371795 346828 465745 407161 291135
2242 291135 431196 464988 462224 454668 426406 453329 582168 453192 364714 325337 326149 319312
2230 319312 256442 323625 432930 351624 323253 235133 265585 327179 315143 255195 301999
2219 301999 264467 267630 329738 295105 310268 217392 225925 275461 261996 281034 336239 303353
2207 303353 315283 257687 317523 276477 189359 258682 269728 279059 248133 270380 361160 348688
2195 348688 316327 280174 180197 192368 193690 190672 214170 253545 290865 226522 210923 183728
2183A83728L9117L2260K5370K6607j35177k7910o08Q2531J9447L8397P7960j41622
2171B20100O1659J04432j91264N7428N8657l8354Q7204k3297L481n7991p2376
2160B09679R124N5377j8937P6366l1471K5757j0743J1800j4755O7545K5400o8961
2148C36181K8711L965J02041o8924J4471k0149L9429k2265m7643K3818j6577p4124
2136B98934N6688L5181o093J8059J4383l2071m6779j1969J15466J3248J1646p8579
2124C88114l5540P3275j2852K0685J16264O8552j32482j9973O2234J9406q3101
2113D64582o658N909M0467L7187N3644O4277l828j1148R652K594q0109j3463J14381
2100F77487L9908K301q254P1950J4118P1067l9918P682k9504m0267O5145Q7118
$$ plain form
2183 183728 222845 255105 280475 307082 171905 143995 143387 225918 245365 283762 361722 220100
2171 220100 281759 386191 194927 252355 311012 272658 359862 336565 340046 282055 209679
2160 209679 218803 274180 255243 331609 300138 325895 315152 326952 312197 379742 405142 336181
2148 336181 364892 368857 470898 401974 416445 396296 435725 413460 365817 389635 373058 298934
2136 298934 355622 390803 384710 402769 417152 385081 338302 326333 441799 455047 466693 388114
2124 388114 352574 425849 412997 433682 549946 618498 486016 466043 528277 547683 464582
2113 464582 457924 463833 504300 541487 595131 659408 655580 644432 654084 656678 576569 563106 677487
2100 677487 717395 719696 711442 783392 797510 868577 828659 836341 806837 766570 831715 918833
2088I18833J4724l5977O2847j1825k6730N4717K2805n168l784R3539J73493J0933
2076A268407k4076M9337Q3306P5773J49584N3179J54440Q6243q4064k3535R8311
2065A886905J75058J18808M9887Q9128J60039J79050K42613J66124J73600J61491
2055C402703K61343L25124L56330M21506L41163L78338M92436N21591O30345Q57842
2045G988721J056775J553361J872408K273323K779076L559252L315368K892771
2037B7291055N07133k582616k709533l776468l706868k568451j829187j345104
2029I279961j049447q91375o07979m67696m12266l58227m53267m40989l52280
2020D246435l30117k83737k57048k59013j73393j20729j87140j01871j26778p9655
$$ plain form
2088 918833 933557 897580 960427 948602 921872 976589 999394 994226 990442 1083981 1257474 1268407
2076 1268407 1244331 1293668 1376974 1452747 1602331 1655510 1809950 1896193 1812129 1788594 1886905
2065 1886905 2061963 2180771 2230658 2319786 2479825 2658875 2901488 3067612 3241212 3402703
2055 3402703 3664046 3989170 4345500 4767006 5108169 5486507 5978943 6500534 7130879 7988721
2045 7988721 9045496 10598857 12471265 14744588 17523664 21082916 24398284 27291055
2037 27291055 27798188 25215572 22506039 18729571 15022703 12454252 10625065 9279961
2029 9279961 8230514 7339139 6731160 6263464 5851198 5492971 5039704 4598715 4246435
2020 4246435 3916318 3632581 3375533 3116520 2943127 2822398 2635258 2533387 2406609 2326954
2010B326954j03591j92929n2360p8773j2874j23314q5152J3455m760j31120Q753
1999A564289n0829o6159j9022p1542n1902n1095Q287l7912q2658r7706o3199R3330
1987A073882o986n1434j9814k9285n4220j896J2486n3010m5883L5130m0251K6251
1975H44970n0921q2834n1590l0071l4548j8851j5947N5257J8330m6312L0947q4269
1963E34161O637N2768r208j11831o4529M2080P8709p9615j4637P435K6734n368
1951D63336p7637p5411r9435P1423K1155J9124K9121p3624L714J03931p8485J7454
1939C24666j4088J0196j32906K7237K6926M2809J15463K1728r3706L226J3122
1928C44673m2602K2856k8102P5510M03m7042l5502o432O8309k5910p3918J899
$$ plain form
2010 2326954 2223363 2030434 1978074 1899301 1886427 1763113 1677961 1691416 1686656 1555536 1564289
1999 1564289 1513460 1447301 1428279 1356737 1304835 1253740 1262027 1224115 1141457 1043751 980552 1073882
1987 1073882 1066896 1015462 995648 966363 912143 910247 922733 869723 823840 858970 818719 844970
1975 844970 794049 711215 659625 629554 595006 576155 560208 615465 633795 587483 618430 534161
1963 534161 540798 593566 584358 472527 407998 450078 528787 449172 434535 441970 468704 463336
1951 463336 385699 310288 210853 282276 303431 322555 351676 278052 281766 385697 307212 324666
1939 324666 310578 320774 187868 215105 242031 284840 400303 422031 328325 331551 344673
1928 344673 302071 324927 296825 372335 372738 325696 290194 283762 352071 326161 252243 254142
1916B54142k1167O307J4663r6303J3579Q6401o354m1907J1884l3210j9106N3722
1904B22651l445N637l3936r7235n766O7697O9985J991j10903Q3766N2437k3578
1892B29301l8651J4888j8441M5641r1626P6632O4185j19110j0758N3403l9356
1881A66108J1097n1770m311J34643p5542l2116Q1477k5378k7835K9876k9976P489
1869A83762O230L6346L08j04163J03415p2943n2840P4923p8429K0224k2424k7087
1857F7322N1406k5076J06878P1281m5164n5375O3344L2808j37655K5346N189k4449
1845A35855K3424J4118J2403j3410r7253m68p427p3387J19420N6685o1755L594
1833A11799J1230J835o9113Q5370n3891M55k6301O784J0452q802M4656j01276
$$ plain form
1916 254142 232975 239282 253945 157642 171221 257622 251268 209361 221245 188035 168929 222651
1904 222651 219206 224843 190907 93672 87906 155603 225588 227579 116676 200442 252879 229301
1892 229301 190650 205538 187097 232738 141112 217744 281929 162819 152061 205464 166108
1881 166108 177205 125435 121124 255767 180225 148109 229586 204208 176373 206249 176273 183762
1869 183762 189992 226338 226646 122483 225898 152955 100115 175038 96609 116833 94409 67322
1857 67322 118728 93652 200530 271811 226647 171272 234616 267424 129769 155115 160304 135855
1845 135855 159279 173397 185800 172390 75137 74669 67242 -6145 113275 169960 108205 111799
1833 111799 123029 124864 55751 141121 87230 87685 61384 68168 78620 69818 114474 13198
1821A3198R956K4003L779N7034O2779j01655l5151n3632K9909j11577K4965Q6121
1809I729j4915M6247M6746j618m1862n8698N3780J16964L674l7705N8413L0048
1797B10803m2792j5099N474n0370j03660Q8317M269o1029L534L4890O9843O054
1785A50234K6147k221j86512M520N8134L4612j6751n0305N379M7498j3973j14541
1773e7779m5358J08961N5252n3212M1380K660q1547J08636J1606p6615p501l4117
1761b7634O6105K3080L8674O679L745k0480k7726K4122O6465K6465j25163l4233
1749B0099R642J8510P2032k7324l0261O8799j15222r6911Q641k4209J04757k6176
1737a7623p881k6417K3398Q5453m2273m1431P0730o2348r0028J06863O8965K3254
$$ plain form
1821 13198 23154 47157 50936 107970 170749 69094 33943 -19689 10220 -101357 -76392 9729
1809 9729 -5186 41061 87807 86189 44327 -14371 39409 156373 160047 122342 180755 210803
1797 210803 168011 152912 158386 108016 4356 92673 96942 35913 39447 74337 144180 150234
1785 150234 176381 174160 -12352 -7832 50302 84914 68163 17858 23237 70735 56762 -57779
1773 -57779 -103137 5824 61076 7864 49244 51904 -29643 78993 90599 13984 6483 -27634
1761 -27634 38471 61551 100225 106904 110649 90169 62443 86565 153030 179495 54332 20099
1749 20099 29741 48251 120283 92959 62698 131497 16275 -80636 -71995 -96204 8553 -17623
1737 -17623 -25504 -51921 -28523 56930 14657 -26774 43956 -18392 -108420 -1557 67408 90662
1725I0662J9508q3716R4703M2439r1205K1663n9955O9174p3182q8968K725P0396
1713A4244m4684L3339l1618M7957M8247K1629N1811m472m7533j5965j9642m1987
1701A1326K3262l2886K3258k6317J013P2668l1331q3041j8960P0814K4518n3225
1689a8901O9279j8110M4005j4061p4839M2970O1151j22149k8420O7898j2881j1939
1677a5997L6098O530q3097J5620M29j7704N461O096k4151J0159L3897Q5969L1123
1664I0433n3085l5336k5169P0086N2251o4685K9814M6547m6472o6881o334l301
1652a2132q1520L4812J26810k9619O590k1190l3991j8652O6511K2228p9460K2475
1640B862M6986L7354o0652l1957j7749J01891q2177L105Q1246L5643O8881q9728
$$ plain form
1725 90662 110170 26454 121157 163596 72391 94054 34099 103273 30091 -58877 -56152 14244
1713 14244 -30440 2899 -28719 19238 67485 89114 140925 136453 88920 72955 53313 11326
1701 11326 34588 1702 24960 -1357 -344 72324 40993 -42048 -61008 9806 34324 -18901
1689 -18901 50378 32268 76273 62212 -12627 30343 91494 -30655 -59075 8823 -4058 -15997
1677 -15997 20101 26631 -56466 -40846 -40417 -58121 -52660 -46564 -70715 -60556 -26659 59310 90433
1664 90433 37348 2012 -23157 46929 99180 34495 64309 110856 64384 -2497 -8831 -12132
1652 -12132 -93652 -58840 67970 38351 44941 23751 -10240 -28892 37619 59847 -19613 2862
1640 2862 49848 87202 26550 -5407 -23156 78735 -3442 -337 80909 116552 185433 95705
1628I5705j10902o642P7495L3197M2580o4912m484k5925J8720q4016l0348L9966
1616a9566K266K6611m4922K2633m9550j1630K2887q991j7092m373P951Q9904r8391
1603h2263M0100j7976R7920M2040m9734J03058q9917p3342P9836l4028j3773L622
1591E543J0398K277m2532R317O3809l6586p4368R8413n6725J4594J21201r7730
1579A7611K6437k5591k4847j7653M3534J57313n6832l6133J493l9767k4906n9066
1567c8407n8834P0657K8541p033o41q431O2792p4433j00333m14K7965J18252m4359
1554b4678n1929m915J5341r287O0271M4834O1195o9508p702N0633n7154o8853
1542f1752Q736R3492r6536N1267l3929J2090M3615j5600j8063m374M7943o0176
$$ plain form
1628 95705 -15197 -21839 55656 88853 131433 66521 62037 36112 54832 -29184 -59532 -19566
1616 -19566 -17300 9311 -35611 -12978 -62528 -74158 -51271 -60262 -77354 -81727 -73776 16128 -82263
1603 -82263 -42163 -60139 37781 79821 30087 133145 43228 -30114 49722 15694 1921 5543
1591 5543 15941 18218 -24314 -14997 48812 12226 -62142 36271 -20454 -5860 115341 17611
1579 17611 44048 18457 -6390 -24043 19491 176804 119972 83839 85332 45565 20659 -38407
1567 -38407 -97241 -26584 1957 -5076 -5717 -14148 48644 -25789 -126122 -126536 -98571 19681 -24678
1554 -24678 -76607 -81522 -66181 -75468 -15197 29637 90832 21324 13622 64255 7101 -61752
1542 -61752 -53016 40476 -56060 -4793 -38722 -26632 16983 1383 -16680 -21054 26889 -33287
1530c3287M0901O3701o170o3465N7769j9630k708P6589o5566p3988Q2037o7677
1518a1494n8837P0593m5330r3862P9354j9660m708M5850l1388N6128p5919J9916
1506f9357J3655N427K309j2449P9277l9500L1580J5711R203K3020m949l9620K6783
1493D1090j2777k7465k8281r05q271K6226o0951J300J03068j26400L7704N1337
1481d325o366k8900N7869O5924o550L3459q7114l1688j2757O764O8571p3904j38488
1468a57505R6050N9837o0237J12237j9476j1998l6764O5002J500m5498p0069j1206
1456g8127P9827l2117J3410k0576j6102O1999K291L4744m3881N2488k2553m4509
1444a3106R930O1886M8505m6233o1319m8277j7862M1198j0186l6249N3722K5144
$$ plain form
1530 -33287 7614 71315 65145 1680 59449 39819 37111 113700 48134 -25854 56183 -11494
1518 -11494 -70331 262 -45068 -138930 -59576 -79236 -83944 -38094 -69482 -13354 -89273 -69357
1506 -69357 -55702 -50275 -47966 -60415 18862 -20638 10942 26653 35856 58876 53927 14307 41090
1493 41090 28313 848 -27433 -28338 -36609 -10383 -71334 -70034 33034 -93366 -55662 -4325
1481 -4325 -10691 -39591 18278 84202 77652 111111 23997 -7691 -20448 -13684 54887 -19017 -157505
1468 -157505 -61455 -1618 -61855 50382 30906 18908 -17856 47146 48646 3148 -66921 -78127
1456 -78127 1700 -30417 -17007 -37583 -53685 8314 10605 45349 1468 53956 31403 -13106
1444 -13106 -3176 58710 107215 60982 -337 -48614 -66476 -25278 -35464 -71713 -17991 7153
1432G153N1113q0827j1934q074R3853q0882k9817N7953K2631J1489l6763K7351
1420B3246p556l8915k6466l5739K3603p863R9932l1846j7298P4652k1912m9872
1408a6034K1911p8863o2043N6719j2422P8760M8064K6488K4091Q988m7096o4640
1396a6077J7545l1532M9288l5720k1881J7682R4863P6578j2496p1408j10289o490
1384d9937L0833M8183j28781O7477J4470q5513L781L1257K7100O0933Q0681k9997
1372G0487q7776o7123m743P6438O017P5973j3372n5489K8523K0386l8344p8098
1360f7121P0237j8358l6784j2574J20732L0637j08961J3570K822J8633m0973P104
1348b1036L3647L8584n8499J17447N1389k8605j46984k5500L5043M3977K471m4189
$$ plain form
1432 7153 58266 -22561 -34495 -42569 51284 -29598 -59415 -1462 21169 32658 -4105 23246
1420 23246 15690 -23225 -49691 -85430 -61827 -69690 30242 -1604 -18902 55750 33838 -16034
1408 -16034 5877 -72986 -135029 -78310 -90732 -11972 36092 62580 86671 95659 48563 -16077
1396 -16077 1468 -30064 19224 -16496 -38377 -20695 74168 150746 138250 66842 -43447 -49937
1384 -49937 -19104 29079 -99702 -32225 -17755 -103268 -99487 -68230 -41130 19803 100484 70487
1372 70487 -17289 -84412 -89155 -12717 -6700 69273 55901 412 28935 49321 10977 -67121
1360 -67121 3116 -15242 -52026 -64600 56132 86769 -22192 -8622 -5800 12833 -28140 -21036
1348 -21036 12611 51195 -7304 110143 161532 132927 -14057 -39557 -4514 39463 41934 -2255
1336b255Q1034l802q9315O572j848l9332L2534O138k0558r9601L0769J13914L878
1323A8128p8718k5028O9119M9055l3037K2297K1659O5139j7527j24122M7780J5175
1311B9920m1102L3183K0014o4922L8991j05600K9903O549J09914n1088n3173J9618
1299b7793K304o1347l5761R5144l5508j2727l8996J44066M6042p0730l5214J0480
1287b0040n6703j5030m3236M0521M5271Q1775m947P6227J839j04377K1051Q3759
1275A06110j05314J686k3221M9083k0912M8860r2274q8388O1330J0415j3663Q9767
1263B3479o1707o9756P4929N4483P41j0708o445l3856P7761o6601j606n349P626
1250a7009l0613O6136o6308P0560k6810K5134K7550l5756L8387p2434N9486Q672
$$ plain form
1336 -2255 78779 74977 -14338 -7766 -9614 -48946 -16412 -10274 -30832 -130433 -99664 14250 18128
1323 18128 -60590 -85618 -16499 32556 -481 21816 43475 108614 91087 -33035 14745 29920
1311 29920 -11182 22001 42015 -22907 16084 -89516 -59613 -53064 56850 5762 -47411 -27793
1299 -27793 -25489 -86836 -122597 -27453 -62961 -75688 -114684 29382 75424 4694 -30520 -20040
1287 -20040 -76743 -91773 -135009 -94488 -49217 32558 27611 103838 105677 1300 22351 106110
1275 106110 796 2482 -20739 28344 7432 56292 -35982 -124370 -63040 -52625 -66288 23479
1263 23479 -38228 -107984 -33055 21428 22169 11461 5016 -28840 48921 -17680 -19286 -24635 -17009
1250 -17009 -47622 18514 -47794 22766 -4044 21090 48640 12884 51271 -21163 38323 46995
1238D6995k3235p5142M6636p091o1390L9972J0795K9149J1665o6309L9838j9815
1226b7932J121O6027O996m4231O036k9390L2077k6252R6988l5161r0081Q8032
1214D4230n7452N4892N4176o0764K2764j07578N4542j7306J8418Q9584r3352Q326
1202A0480M3474j0806r2642P2064k3502K5844J0901p4131n918L8746k436j9902
1190b7828l2404K3572J26803l843M057l0897n685l024J0059J4239n7653j6079
1178A317L859M2804l5546o1646o0376N0290N5907R7202o122o4675p2514k0276
1166f9776O4528o678o4596P2952N5927O7335m5228j29181k1595N9944l2217k3073
1154g1658L2649K6016J4821j1369K9158p882J7972N0242j16279m1377M361M0875
$$ plain form
1238 46995 23760 -51382 -4746 -11837 -73227 -33255 -22460 6689 18354 -47955 -8117 -27932
1226 -27932 -26811 39216 46212 1981 8017 -21373 10704 -15548 81440 46279 -43802 44230
1214 44230 -13222 41670 95846 35082 57846 -49732 4810 -12496 5922 95506 2154 10480
1202 10480 53954 43148 -49494 22570 -932 24912 35813 -38318 -44236 -5490 -7926 -27828
1190 -27828 -60232 -36660 90143 86300 90357 59460 53775 50751 60810 75049 17396 1317
1178 1317 5176 47980 12434 -49212 -109588 -59298 -3391 93811 87689 23014 -49500 -69776
1166 -69776 -5248 -11926 -76522 -3570 52357 119692 74464 -54717 -76312 -16368 -48585 -71658
1154 -71658 -39009 -12993 1828 -9541 19617 11735 29707 79949 -36330 -77707 -73346 -32471
1142c2471K5280M9354M4655j9332K9792L659o7599o3887j7203l1914J9160N1692
1130h814M7253L3065n577l3427k0734k9869k8162Q11J7254J00283m9910j16647
1118i4474N5193K311m8352L7741l6628J170N7354J09326N3832q7432n4461R1816
1106H7396n6042r8074k3067J5074P457Q9850K1158l4615m2411M1492J0730N7914
1094G6862M034r5931l649m4715k0814K4364J4609O0771Q744j0535K3508k8168
1082I080M8707o0798K2052j1929K027O4349O534p8524k3378O6604k0645N921P6291
1069A06291o9978q834m5638L4345J9417n6307p364L9314j823k3870j5870O6620
1057C6303j00627q3814K4804J76556j4806j1123n4419J4459P031o5820j1856O0717
$$ plain form
1142 -32471 -7191 42163 86818 67486 97278 100937 33338 -30549 -47752 -79666 -60506 -8814
1130 -8814 38439 71504 65927 32500 11766 -18103 -46265 -45454 -28200 72083 22173 -94474
1118 -94474 -39281 -36970 -85322 -47581 -84209 -83039 -25685 83641 137473 50041 -4420 87396
1106 87396 31354 -66720 -89787 -74713 -67256 22594 43752 9137 -33274 8218 18948 76862
1094 76862 80896 -15035 -18684 -63399 -84213 -59849 -45240 15531 24275 13740 37248 9080
1082 9080 57787 -3011 19041 7112 9139 73488 80022 1498 -21880 44724 24079 30000 106291
1069 106291 36313 27479 -18159 16186 35603 -20704 -28068 11246 9423 -14447 -30317 36303
1057 36303 -64324 -148138 -123334 53222 38416 27293 -27126 -12667 -5636 -71456 -83312 -22595
1045b2595N8741j10247l3103R1377K693k8828j39894J14076N8435K5167j8176
1034b354j5271L8806N562M0942K2097l3975j73955M6389M358J2680r915J22458
1022E7822p5485j5591m473n1940Q6181Q1701q3250j47193J19955O1917K0299L9638
1010H9581j8803K7116o698l5794m2429m6918k8528O3130L8252L5918K685j0880
998F6632o093j8382M4267j1384K5025m2727j967L8432k9414n0797r2055J0558
986f7905L4905K5376L1272o3912J1462q908N6539n2877l0597N6770O6156l7597
974B0684o9403L6044R0116M25m6108J9314m5768K8749j8767o2738J3761L7946
962D255o4478Q70j6855J03303j21162K2287J2003Q1929k914m7546K5123P286j3219
$$ plain form
1045 -22595 36146 -74101 -107204 -15827 -13134 -41962 -181856 -67780 -9345 15822 -2354
1034 -2354 -17625 21181 26743 67685 89782 55807 -118148 -71759 -67401 -54721 -64636 57822
1022 57822 -17663 -33254 -37727 -89667 -3486 78215 -5035 -152228 -32273 29644 49943 89581
1010 89581 70778 97894 91196 55402 12973 -33945 -62473 657 38909 74827 77512 66632
998 66632 60539 42157 86424 75040 100065 57338 55371 93803 64389 13592 -78463 -67905
986 -67905 -33000 -7624 23648 -40264 -28802 -37710 18829 -34048 -64645 -7875 58281 20684
974 20684 -48719 -12675 77441 77866 31758 51072 5304 34053 15286 -47452 -33691 4255
962 4255 -60223 -59353 -76208 27095 -94067 -71780 -59777 22152 19238 -28308 -3185 4101 -9118
949i118j9160L3372L3924M437j6003m5697p8127N8406M4584r6146K3047j6040
937h2521l4769O3384R6136q299L7964l59n2419L4238q0013o8887J6349N7821l3232
924e4607o2359L6226q74Q911Q899J31515o5929n3980Q1151p6733J8986M7772m8707
911b9729R024N028r7977L6021M3500N0443r980n1263j9338K7352J3533J272L005
898a9109k598k9658N131R6265Q46l3519l366j17250K5044J19509l2051m339M2209
885D7114K4010J1071r8798l6222n3161l824J03206m2796r1857J21292j5271k2893
873e8129J6463L1280J02757p2878k8975L7524j13401j5815N8242M0977M6539N5627
861A00211j5738l0171p9332p62L4025n1345R8100j5349k5927k6595j03146N5424
$$ plain form
949 -9118 -28278 5094 39018 43455 27452 -18245 -96372 -37966 6618 -89528 -66481 -82521
937 -82521 -117290 -53906 42230 33931 71895 71536 19117 53355 -26658 -95545 -79196 -21375 -54607
924 -54607 -116966 -80740 -81614 -72703 -63804 67711 1782 -52198 28953 -47780 -28794 18978 -29729
911 -29729 -20705 -15677 -113654 -77633 -34133 16310 6330 -44933 -64271 -36919 -23386 -22114 -19109
898 -19109 -21707 -51365 -46234 50031 50877 17358 13992 -103258 -78214 41295 9244 4905 47114
885 47114 71124 82195 -16603 -52825 -105986 -109810 -6604 -49400 -141257 -19965 -35236 -58129
873 -58129 -41666 -10386 92371 19493 -9482 28042 -85359 -101174 -42932 -1955 44584 100211
861 100211 84473 54302 -25030 -25792 8233 -43112 54988 39639 13712 -12883 -116029 -60605
849f0605O8354j8226k2080L374Q128J3493J4741N6589K301N111l6375k5283k4533
836a5011Q2064l5187k499k3965l6541K4725R804o5051Q9202k9222o7957P5409
824E771K2842p6055j1925K7573L4367o472l9784J9659j9202j07527o158M5040
812a11871p294J39110p3195m4854m2750O8841N2448O1719P8514l4772j42465o2102
800a18671L1052K981M8213j19684M4488J11484k1612m2227K5606P4478j0853m1022
788a5767N5029n413K8180k4044o6653j6213M7504K1790l1059r711p2690J20146
776C1099L2423j0679k9773n822n5950L2678L1950M3146j15880j6285P0579l95
764G091o0896k6510L748p6071l9620Q5656L4387J55161j0836r8801j9903k4383
$$ plain form
849 -60605 7749 -10477 -32557 -29183 -21055 -7562 7179 63768 66069 71180 34805 9522 -15011
836 -15011 67053 31866 29367 5402 -31139 -6414 3390 -61661 27541 -1681 -69638 5771
824 5771 28613 -47442 -59367 -31794 2573 -3899 -43683 -24024 -43226 -150753 -156911 -111871
812 -111871 -119165 19945 -53250 -98104 -140854 -72013 -19565 42154 120668 85896 -56569 -118671
800 -118671 -87619 -84638 -36425 -156109 -111621 -137 -21749 -63976 -38370 36108 25255 -15767
788 -15767 39262 33849 62029 37985 -28668 -44881 2623 24413 -6646 -16357 -89047 31099
776 31099 63522 52843 23070 17248 -38702 -6024 25926 69072 -46808 -63093 7486 7091
764 7091 -53805 -80315 -76567 -152638 -192258 -106602 -72215 82946 72110 -26691 -46594 -70977
752g0977L907k0581N4223j0380O6006m367j35785P8800q520N0169L7387k6297
740A3585P0500L216l7374n2146j9258j4985M2805o000L3745L538K441K7604l6790
727C0881m4938k1388q8815R7429j8132j5131L7611m5937R6529J0918l8634K9948
715C0341M238N7921j55784k3077R4378J4249Q6280l9904m7023N1017n0513l0592
703h469J1648j8542k814j9526R045j157M4397j7222L1225N9817o1655J8358L3353
690G8458l9202O606j9285M1684k3960j2007p4267J5541n4786j9531R2504q87Q9894
677H0762o0793k223M4030N9720q5390j27759k965K925M1323O5416p3945K4134
665c4765J2268K1242J2550k1200K7352K453o746m1418j41873N4439R1899n6684
$$ plain form
752 -70977 -67070 -87651 -33428 -43808 22198 17831 -117954 -39154 -47674 2495 39882 13585
740 13585 84085 87301 49927 -2219 -21477 -36462 6343 343 34088 37626 40067 67671 30881
727 30881 -14057 -35445 -124260 -26831 -44963 -60094 -22483 -68420 28109 39027 393 30341
715 30341 34579 92500 -63284 -86361 8017 22266 108546 68642 21619 72636 22123 -8469
703 -8469 3179 -15363 -18177 -37703 -28658 -29815 14582 -2640 28585 88402 26747 45105 78458
690 78458 39256 45862 26577 68261 44301 32294 -41973 -26432 -81218 -100749 -8245 -9132 80762
677 80762 19969 17746 61776 121496 36106 -91653 -94618 -91693 -50370 15046 -58899 -34765
665 -34765 -22497 -1255 11295 -9905 17447 19900 13154 -28264 -170137 -115698 -23799 -80483
653h0483K5130m8505J06926O4530q3542N6286L4571j02180j476N0413R779j6824
641A4625K8566q24j8453K2957N832n8099l9236N2904J1503L4609p6421P0896J6275
628F5134l0706J6033N1576j9594n4567N0158o7488L275n5275k2442J769J017j0324
615g1434J4107J0926L8355l0418K2726j9990L4707L3481O044l8061j2085M9796
603C8154l1906R393n825K4225j5342j0261J4795l9832K1758N8621p4385L8567
591B7962L2049l2885K6952j6633o003J173r4021M5694K1255r8289N7586Q2990
579D7830n1206q398M3615o038k380J07345o3530j10116J0505N0657O50q374p7517
566f6957L7397J34N059j3310N4508O6464j07375O5072m3256O5256K475r7233m0457
$$ plain form
653 -80483 -55353 -103858 3068 67598 -15944 40342 74913 -27267 -28743 21670 31449 14625
641 14625 43191 42367 23914 46871 52703 -5396 -44632 8272 19775 54384 -22037 48859 65134
628 65134 34428 50461 102037 82443 27876 78034 10546 13821 -41454 -63896 -62127 -61110 -71434
615 -71434 -57327 -46401 -8046 -38464 -15738 -35728 -1021 32460 38504 443 -11642 38154
603 38154 6248 15641 9816 34041 18699 8438 23233 -16599 5159 63780 -10605 27962
591 27962 60011 27126 54078 37445 31442 32615 -61406 -15712 5543 -92746 -35160 47830
579 47830 -3376 -11774 31841 25803 23423 130768 67238 -42878 -32373 18284 18934 10560 -66957
566 -66957 -29560 -29426 -24367 -37677 16831 83295 -24080 40992 -2264 62992 65467 -31766 -72223
553g2223Q3939l6532M6457j3124m726L9829p6175m838R8121m0023p6880j0609
541f6784M7383J01029J9000o844n9593n7146L2071N396o1514J26237o597k6645
529D5993k7712O6183J2501o2216N6023j6364q5390L1917o540j69l8008P8022k5577
516B8663j38173K9757J09377n897k6171Q2914q9271k4925q163K8830P8708j8296
504D7353m7937k1552M4799J6541q7305k073K9958M6699N3943N3422l7305n4248
492D2295p9841l5816M1020k2026L8219Q2359J4008k6113m5496r389o7113P1020
480C127k7417K5869N4673j9833J8862l3177k0992n046J5630m1654p729l0349P7657
467I621J25058r6364o8738N3288o0774K1991k6628R6638R606p9808q977N6638
$$ plain form
553 -72223 11716 -24816 21641 8517 3791 43620 -32555 -37393 60728 20705 -56175 -66784
541 -66784 -19401 81628 100628 93784 34191 -22955 9116 14512 -47002 79235 72638 45993
529 45993 18281 84464 96965 34749 90772 74408 -10982 20935 14395 14226 -23782 54240 28663
516 28663 -109510 -79753 29624 23727 -2444 80470 -8801 -33726 -41889 -13059 65649 47353
504 47353 -584 -22136 22663 39204 -48101 -50174 -20216 26483 80426 133848 96543 42295
492 42295 -37546 -73362 -32342 -54368 -16149 66210 80218 54105 8609 -780 -67893 3127
480 3127 -24290 1579 56252 36419 55281 22104 1112 -3934 11696 -29958 -37687 -68036 9621
467 9621 134679 38315 -30423 22865 -37909 -15918 -42546 54092 63698 -16110 -25087 31551
455C1551l8703N7495P26j4127J561o7311L1588l3007j09910M5010J25181o0674
443c0620P1938K1794N8680n5237m9933M6563O2644q4263q1215L2707K3441M2950
431E9449N1132q0602l3766K8545n3972m351M6411J494O1210P2169l0865k4034
419I2820o9448k0976O5713r1725J32092Q8391l1443r8138r0542j8592N2221L5882
407D6255q1526m074K619m9795m933P1256M3895P2704o2679n3031j7244M9359K25
394A3031m2139m453J4853K975n087q7878Q0493R306M2817J7794n910n024j9147
381A1631m2796M4683p4095N5477L8298r3836J5279n2316j4238J22830J1891J681
369B4489O5065n2469L5825O202o949j256k2711N685n3671j03827P3473O6845k7181
$$ plain form
455 31551 -7152 50343 51069 36942 38503 -28808 2780 -30227 -140137 -95127 30054 -30620
443 -30620 41318 63112 121792 66555 16622 63185 125829 41566 -39649 -6942 16499 59449
431 59449 110581 29979 -3787 24758 -29214 -33565 12846 14340 75550 147719 116854 92820
419 92820 23372 2396 68109 -23616 108476 196867 165424 67286 -23256 -41848 10373 46255
407 46255 -35271 -39345 -36726 -86521 -91454 -20198 23697 96401 33722 -19309 -36553 12806 13031
394 13031 -29108 -33561 -18708 -15733 -20820 -108698 -28205 -18899 23918 41712 35802 30778 11631
381 11631 -31165 13518 -60577 -5100 33198 -60638 -45359 -97675 -111913 10917 22808 24489
369 24489 89554 37085 72910 79112 72163 70907 48196 53881 210 -103617 -30144 36701 9520
356I520o646N3285j3962M790J3189n1452p5585R9622p5213p4000J04987J8685
344G220m2696L5558M9002j05120l2242N5769R0196p2611n5937o572J3818O0255
332c360Q0643k6083p4612L9142k5751j489k4701k233L5858j4763K8042Q410J964
319B1067o3120m4858o739M6749j0749R0295J24133j58775J0823M5000J7788l8288
307C3326k4733L7840l907J7421n8952j2225r853K991P5540j04212N2659N8017
295F3912K745m0271o1400M389r9498M8863P4347p9910J42557m844j214L4287m3584
282D0379k4279J4078j11l6006J1247K9989N9850j1526n3097n8748N5313m1842
270a4753O731l4806k4772m9647J5995J04278p364M2750q3318l7407J2059J7719
$$ plain form
356 9520 2874 56159 42197 46987 60176 8724 -66861 32761 -42452 -116452 -11465 7220
344 7220 -35476 82 49084 -56036 -88278 -32509 57687 -14924 -70861 -77433 -63615 -3360
332 -3360 77283 51200 -23412 15730 -10021 -11510 -36211 -38444 -2586 -17349 10693 19103 21067
319 21067 -42053 -86911 -93650 -46901 -57650 32645 156778 -1997 8826 53826 71614 33326
307 33326 8593 46433 42526 59947 995 -11230 -21083 -18092 57448 -46764 5895 63912
295 63912 66657 26386 -35014 -30625 -130123 -81260 -6913 -86823 55734 50890 49676 83963 40379
282 40379 16100 30178 30067 -5939 5308 35297 95147 83621 30524 -28224 27089 -14753
270 -14753 -8022 -42828 -67600 -117247 -101252 3026 -4338 38412 -44906 -82313 -70254 -52535
258e2535L2286r6337N1012n9546m994J26982R6499l8120l6679K0914n6701J8204
246I85N663K9447K2196M4111j33432J4272J4215L668J5032M9487k4334r528J9374
233E1156k1803n5343L1200N6834L4471k7170q0455M9316L650k7706n2137P9863
221D1876Q5629k6368q4088L2610q0336J13398j1778m9823j05145Q3211L520n78
209B128J4453j623j3219l7154Q8250j8720m4230l7147r736L6952K0140J0708j5843
196e041K442J0101Q99K2606K6654k3266K8540k6266J2853O170J5487j5699q8684
183c3204K3607L4202O6487p4791J9832j9955l6534k8215N7597k9238L6488l1076
171a4800K3650k9400O2848k4506J0741P366l6107j2540q8797N4803J04804J5127
$$ plain form
258 -52535 -20249 -116586 -65574 -125120 -130114 -3132 93367 55247 18568 39482 -17219 985
246 985 6648 36095 58291 102402 -31030 -16758 -2543 1125 16157 65644 41310 31782 51156
233 51156 29353 -25990 5210 62044 96515 69345 -11110 38206 41856 14150 -37987 41876
221 41876 127505 101137 17049 49659 -30677 82721 70943 21120 -84025 -814 2706 2128
209 2128 16581 14958 1739 -35415 52835 34115 -10115 -47262 -56998 -20046 94 10802 -5041
196 -5041 -2599 7502 8401 31007 57661 34395 62935 36669 49522 55692 71179 55480 -33204
183 -33204 -9597 24605 91092 16301 36133 16178 -20356 -48571 9026 -20212 16276 -14800
171 -14800 8850 -20550 42298 17792 28533 35899 -208 -12748 -101545 -46742 58062 73189
159G3189m6589O2178j9582m2494k4158O9904j7506o1858L8917N826k5521L6870
147D9176k885L5299n8182L2982l4987k4914j2356L0679L5608q256j6871j8288
135G005q29K2034o3506j6102Q8016J2690P435k7932q82L448j7609l4510l3286
122e4028o6312J15445j9872o204Q043J06285l4353j3134l7390M8001M4283Q621
110I9385r7726n4667J19449l94p8436M7981O2768n6918m5303J6734N6494o8202
98A165N449J6152l9255J06415o1684r6932O0869j8666K3316L4171J1874n4159
86a1285K3690J2281J9379m0979p171K1547M1810K5631n2178m8834P2817j1608
74D5100l0020J9505N344n0783M9782K1508n447J0667o7703Q249M4015O0326k5896
$$ plain form
159 73189 26600 88778 69196 26702 2544 72448 54942 -6916 32001 37827 12306 49176
147 49176 46291 81590 23408 56390 21403 -3511 -15867 14812 50420 42164 25293 7005
135 7005 6176 28210 -35296 -51398 36618 49308 56743 28811 27929 31377 13768 -20742 -54028
122 -54028 -120340 -4895 -24767 -30971 -22928 83357 49004 35870 -1520 46481 90764 99385
110 99385 1659 -53008 66441 66047 -12389 35592 98360 41442 -3861 12873 69367 1165
98 1165 6614 22766 -16489 89926 28242 -68690 -7821 -26487 -3171 31000 42874 -11285
86 -11285 12405 24686 44065 3086 -4085 17462 59272 84903 32725 -16109 56708 45100
74 45100 15080 34585 39929 -10854 38928 60436 54989 65656 -2047 6202 50217 110543 84647
61H4647k3631K4131l0180k2877O6440m1346k1158j9148j9122J0868l0157L1871
49A0338J565M7201m0784p3348R340Q7738K2544m0181p0389M0043N0743M382j2329
36C6863j2899M4596N62n6996K554P743N0799n2924L65L9324m1431k329O8249J0217
22I4693l6536m5854m5249K5382K6820L5767M8669K1263o1530o133j1607p4971
10b9286p694O1586K5468l3083m872N7903K5998j5347j03179J4819
0g687
$$ plain form
61 84647 61016 85147 54967 32090 98530 57184 36026 16878 -2244 8624 -21533 10338
49 10338 11903 59104 18320 -55028 -45688 42050 64594 24413 -45976 -5933 44810 49192 36863
36 36863 23964 68560 69122 12126 14680 22423 73222 20298 20663 59987 18556 16227 84476 94693
22 94693 58157 12303 -32946 -7564 19256 55023 103692 124955 63425 57292 45685 -29286
10 -29286 -36980 24606 50074 16991 12119 70022 96020 80673 -22506 -7687
0 -7687
$$ Imaginary data points
##PAGE= N=2
##DATA TABLE= (X++(I..I)), XYDATA
16383c060804M154K7669J3757L0850M3333M8415M6626P4851j8647O9659O4596
16372b655541L7724M6293M7753R5843Q450m0343M6303O4920P7085K1441N8260
16361b191812M6297N7606M3752k0330O9431R3263L6194p67L6931k2310N4119M9979
16349a747647O5858k052j8617R6475Q2606P4073Q1018O853M2185P2942K1409L1435
16337a193462J0609k1610R7770N4430J1682Q517P7781Q0094K2848K9409N7038
16326g64894O8292k8893J3048Q9637j9619P007J28459k0556P5104K7710M9808
16315c74897P024P2556J6712N2620J5499K2326O5620k1305L7398K8514J17888
16304C9955p815M7119O386j593J24279M06O1373m8161J0903Q1092J4673N1805
$$ plain form
16383 -3060804 -3056650 -3028981 -3015224 -2984374 -2941041 -2892626 -2846000 -2771149 -2789796 -2720137 -2655541
16372 -2655541 -2617817 -2571524 -2523771 -2427928 -2419478 -2459821 -2413518 -2348598 -2271513 -2250072 -2191812
16361 -2191812 -2145515 -2087909 -2044157 -2064487 -1995056 -1901793 -1865599 -1866366 -1829435 -1851745 -1797626 -1747647
16349 -1747647 -1681789 -1683841 -1702458 -1605983 -1523377 -1449304 -1368286 -1361433 -1319248 -1246306 -1224897 -1193462
16337 -1193462 -1182853 -1204463 -1106693 -1052263 -1040581 -1032064 -954283 -874189 -851341 -821932 -764894
16326 -764894 -696602 -725495 -712447 -622810 -642429 -635422 -506963 -527519 -452415 -424705 -374897
16315 -374897 -367873 -295317 -278605 -225985 -210486 -188160 -122540 -143845 -106447 -77933 39955
16304 39955 32140 79259 85645 84052 208331 208737 270110 221949 232852 313944 328617 380422
16292C80422L1113Q3271M8339k1165l5104R3272N4038K9334m7754N5366N1218
16281G22350J1596P6671L1365k1770N418K2727J00035k6070O1412M1363l2048
16270I93049l744Q8998K2513O7346M011P7796K4153j36M4236n9914M8322K9509
16258A336139J5226J24791L1087p543M3206O6654J7312L2925q026j14146M8421
16247A586046K8581J07635L3773j0916j6635J4954O4460J4581J7636P3957j445
16236A912627M954k8566P4261M32O0441j3678M105O0858n324m8765K226N4811
16224B078382R117J24520J1839o317j8767K5018L0346J572L3194O2918k1724j771
16212B328327K9541J15507o9578K757Q7086k7661R4653n2541k4222M9545J4263
$$ plain form
16292 380422 411535 494806 543145 521980 486876 580148 634186 663520 615766 671132 722350
16281 722350 733946 810617 841982 820212 825630 848357 948392 922322 983734 1025097 993049
16270 993049 989305 1078303 1100816 1168162 1172173 1249969 1274122 1273986 1318222 1258308 1306630 1336139
16258 1336139 1351365 1476156 1507243 1499700 1542906 1609560 1626872 1659797 1651771 1537625 1586046
16247 1586046 1614627 1722262 1756035 1745119 1728484 1743438 1807898 1822479 1840115 1914072 1912627
16236 1912627 1917581 1889015 1963276 1963708 2024149 2010471 2014576 2075434 2070110 2021345 2023571 2078382
16224 2078382 2087499 2212019 2223858 2217541 2198774 2223792 2254138 2255710 2288904 2351822 2330098 2328327
16212 2328327 2357868 2473375 2403797 2406554 2493640 2465979 2560632 2508091 2483869 2533414 2547677
16201B547677o2697K454P0266L5616J2855O500Q291J9848L7559m1015N2390R368
16189B699112J6921j6229o6219J5585o969O7153J01526J3242k5253K6055n1026
16178B773898J8559J32443L3605R13o9749r40K7858M5963K2530j2820j10471j6075
16166B845714Q9601M086K310k9361O9780P7721k4639N8406M4215r6876O1651l6566
16154C066042p4242J13299O1833q0500l397l3987J04124M6766R535r2889l5838
16143C080746P2253Q6783j8558n1770K8630O9367j1071j2318k3552K3150m7860
16132C195800k3665n2739R4501M3962P9800N0744p7550j4129J6008n9312J53k4908
16120C228665L1839O7099j28627R0632k0281L078K4689L3573L73j1585p6217j8836
$$ plain form
16201 2547677 2484980 2487434 2557700 2593316 2606171 2612671 2620962 2640810 2678369 2637354 2689744 2699112
16189 2699112 2716033 2699804 2633585 2649170 2642201 2709354 2810880 2824122 2798869 2824924 2773898
16178 2773898 2792457 2924900 2958505 2959418 2889669 2888729 2916587 2962550 2985080 2972260 2861789 2845714
16166 2845714 2935315 2939401 2941711 2912350 2982130 3059851 3035212 3093618 3137833 3040957 3102608 3066042
16154 3066042 2991800 3105099 3166932 3086432 3083035 3049048 3153172 3199938 3209473 3116584 3080746
16143 3080746 3152999 3239782 3221224 3169454 3198084 3267451 3256380 3244062 3220510 3243660 3195800
16132 3195800 3172135 3119396 3213897 3257859 3337659 3388403 3310853 3296724 3312732 3253420 3253573 3228665
16120 3228665 3260504 3327603 3198976 3289608 3269327 3272405 3297094 3330667 3331040 3319455 3243238 3224402
16108C224402P8548J3103k0728L3094j2610J2597k3042k9719j1785N9926L02J6669
16096C340757k9905M0055R612o9345P7256Q182K8724l0200M0413R5330n1659p5067
16084C384153r7489J10350J6928n611k4355q0861L100M9873M2627n1507L3119
16073C380327J10504J4137l248o2827J1382j0157J4336k0374Q6212M6967n0027
16062C517232k5211n1634n1541L8549L4117L2314L7684l5040q3301O9257o1349
16051C421077P727J09781m6681J923J6769K6122o7533n7911J45665N1075l6349
16040C571665K0203m9383r7486k4688J1296J07041J78q3960O0199L1453L619k0322
16028C529815j2797Q074L5920j9006J4422l1088o591p2550L661K2087N9964k2384
$$ plain form
16108 3224402 3302950 3316053 3295325 3328419 3315809 3328406 3305364 3275645 3263860 3323786 3324088 3340757
16096 3340757 3310852 3350907 3360519 3291174 3368430 3376612 3405336 3375136 3415549 3510879 3459220 3384153
16084 3384153 3286664 3397014 3413942 3408331 3383976 3303115 3306215 3356088 3398715 3347208 3380327
16073 3380327 3490831 3504968 3501720 3438893 3450275 3440118 3454454 3434080 3520292 3567259 3517232
16062 3517232 3492021 3440387 3388846 3427395 3461512 3493826 3531510 3496470 3413169 3482426 3421077
16051 3421077 3428804 3538585 3491904 3493827 3510596 3536718 3469185 3411274 3556939 3608014 3571665
16040 3571665 3591868 3542485 3444999 3420311 3431607 3538648 3538826 3454866 3515065 3546518 3550137 3529815
16028 3529815 3517018 3525092 3561012 3542006 3556428 3525340 3518749 3446199 3449860 3471947 3531911 3509527
16016C509527k2903N4522o7000n6792L3838K7841M4706J861Q802p452N4014j5390
16004C565574j7627m7257p5261K7701Q0801N650N1965n6335l4462k4218N843L7905
15992C520279M734j17223P3822M5423r947P2614l9055j34187K7182L2838k6465
15981C450015O5426O7229J8936j17927N0817j6318p5372Q1820j2421K1424k9252
15970C504377k3725L9957K1687j191n0648K0184M5461J5576n6465K6001p4405
15959C466809N2035J6236o691k0019L9164L5419n7701l2173P9709N0726M141k1724
15947C605931p8994P7502J780p7650J0554j4988M0459k8982o790r7956K5394L8563
15935C494823k6986M5780J34859j03449l9302J39391n3313k7765q9917J470L7718
$$ plain form
16016 3509527 3486624 3541146 3474146 3417354 3451192 3479033 3523739 3525600 3534402 3526950 3580964 3565574
16004 3565574 3547947 3500690 3425429 3453130 3533931 3539581 3591546 3535211 3500749 3476531 3482374 3520279
15992 3520279 3525013 3407790 3481612 3527035 3517088 3589702 3550647 3416460 3443642 3476480 3450015
15981 3450015 3515441 3582670 3601606 3483679 3534496 3518178 3442806 3524626 3512205 3533629 3504377
15970 3504377 3480652 3520609 3542296 3541105 3490457 3510641 3556102 3571678 3515213 3541214 3466809
15959 3466809 3518844 3535080 3528389 3508370 3547534 3582953 3525252 3493079 3572788 3623514 3627655 3605931
15947 3605931 3526937 3604439 3606219 3528569 3539123 3524135 3564594 3535612 3528822 3430866 3456260 3494823
15935 3494823 3467837 3513617 3648476 3545027 3505725 3645116 3591803 3564038 3474121 3475591 3513309
15924C513309N0482N6413n0407o9300L2792P1935q0206q8146K056Q280n0876J05022
15912C501354O5063K3389k1924k4253P1388q2857j24684P9376P8963L2318r31
15901C597202m4895O5142m2249n8604O3759l5216M7793L7949q2308P418N811O3860
15889C625662p2474P889m5767J4956j6832M7513J1456l3026l3067k2330m3377
15878C440603N8261O269L0240m3218N5499M4989n4647K1452P6781l422p6976j2016
15866C543815j41010R5987R1350J5960N920J5891p4668l3503K7296O1938n1666
15855C557310o8178J57823J0907j32252n1981J1605Q3192L873J5632K3289M992
15844C616212l7516N878J40977m9507j15521p3712P9163m2140k5635P5709k1598
$$ plain form
15924 3513309 3563791 3620204 3569797 3500497 3533289 3605224 3525018 3436872 3438928 3447208 3396332 3501354
15912 3501354 3566417 3589806 3567882 3543629 3615017 3532160 3407476 3486852 3565815 3598133 3597202
15901 3597202 3552307 3617449 3575200 3516596 3580355 3545139 3592932 3630881 3548573 3555991 3561802 3625662
15889 3625662 3553188 3561077 3515310 3530266 3513434 3560947 3572403 3539377 3506310 3483980 3440603
15878 3440603 3498864 3505133 3535373 3492155 3547654 3592643 3537996 3559448 3636229 3632807 3555831 3543815
15866 3543815 3402805 3498792 3590142 3606102 3612022 3627913 3553245 3519742 3547038 3608976 3557310
15855 3557310 3489132 3646955 3657862 3525610 3473629 3485234 3568426 3572299 3587931 3611220 3616212
15844 3616212 3578696 3584574 3725551 3676044 3560523 3486811 3565974 3523834 3498199 3573908 3552310
15833C552310L802k4236O7246q3449k694L4276K6216N8702o0024l7603p3395P0437
15821C531588K1865l1076l2235Q8651R7141k4337J03431j14296j7158q3241n1265
15810C489068K3169K8162K3760m7431k0345j18095N8956Q2778O3472O120J2086
15799C601700m0420k8741M886k2162L7831p3765K7689k7302N3240P4204O1897
15788C669057j0296q5627K0062L3209j01756J09635K4206r4354k1570J1949N738
15777C560253r61q556N6815J8355j03811m0319P4499K6499L074K7857J8440P3960
$$ plain form
15833 3552310 3556112 3531876 3599122 3515673 3512979 3547255 3573471 3632173 3572149 3534546 3461151 3531588
15821 3531588 3553453 3522377 3490142 3578793 3675934 3651597 3755028 3640732 3623574 3540333 3489068
15810 3489068 3512237 3540399 3564159 3516728 3496383 3378288 3437244 3520022 3583494 3589614 3601700
15799 3601700 3561280 3532539 3537425 3515263 3553094 3479329 3507018 3479716 3532956 3607160 3669057
15788 3669057 3658761 3573134 3593196 3626405 3524649 3634284 3658490 3564136 3542566 3554515 3560253
15777 3560253 3559292 3550736 3607551 3625906 3522095 3481776 3556275 3582774 3585848 3613705 3632145 3706105
$$ [...]
##END NTUPLES=NMR SPECTRUM
##END=
