##TITLE=1H_CA-8891-1
 CDCl3, 8 sc, 
 7.07.2021
##JCAMPDX= 6.0         $$ Bruker NMR JCAMP-DX V2.0
##DATA TYPE= NMR SPECTRUM
##DATA CLASS= NTUPLES
##ORIGIN= UXNMR, Bruker Analytische Messtechnik GmbH
##OWNER= root
$$ XWIN-NMR		Version 3.5
$$ Thu Jul  8 08:37:37 2021 Russian Standard Time (UT+4h)  she@DPX200
##.OBSERVE FREQUENCY= 200.131506
##.OBSERVE NUCLEUS= ^1H
##.ACQUISITION MODE= SIMULTANEOUS
##.ACQUISITION SCHEME= undefined
##.AVERAGES= 8
##.DIGITISER RES= 18
##SPECTROMETER/DATA SYSTEM= spect
##.PULSE SEQUENCE= zg30
##.SOLVENT NAME= CDCl3
##.SHIFT REFERENCE= (INTERNAL, CDCl3, 0, 17.4825)
##AUDIT TRAIL= $$ (NUMBER, WHEN, WHO, WHERE, WHAT)
$$ ##TITLE= Audit trail, XWIN-NMR		Version 3.5
$$ ##JCAMPDX= 5.01
$$ ##ORIGIN= Bruker BioSpin GmbH
$$ ##OWNER= she
$$ F:/spectra/data/she/nmr/H-F/1/pdata/1/auditp.txt
$$ ##AUDIT TRAIL=  $$ (NUMBER, WHEN, WHO, WHERE, WHAT)
(   1,<2021-07-08 08:36:04.04 +0400>,<she>,<DPX200>,
      <created by zg, POWCHK disabled, PULCHK disabled
       configuration hash MD5:
       00 E9 B6 7A A2 85 ED C7 34 08 36 98 17 FE 4E 26
       data hash MD5: 16K
       00 EF 6D 38 6E C0 B2 8B 92 D3 E4 66 F0 41 25 03>)
(   2,<2021-07-08 08:36:09.18 +0400>,<she>,<DPX200>,
      <Start of raw data processing
       efp BC_mod = 2 LB = 0.24 FT_mod = 6 PKNL = 1 PHC0 = -12281.47 PHC1 = 22.201 SI = 16K 
       data hash MD5: 16K
       0B A3 16 53 00 D4 33 38 4E A0 B1 03 F1 04 45 38>)
(   3,<2021-07-08 08:36:34.87 +0400>,<she>,<DPX200>,
      <pk PHC0 = -148.423 PHC1 = -13.59999 
       data hash MD5: 16K
       29 16 D8 42 BD 5D F6 74 32 FF B7 B6 2B 67 66 C4>)
(   4,<2021-07-08 08:36:38.20 +0400>,<she>,<DPX200>,
      <abs ABSG = 5 
       data hash MD5: 16K
       AB 3B 52 4B A9 C1 45 6A 57 58 32 27 41 C2 AC 32>)
(   5,<2021-07-08 08:36:52.92 +0400>,<she>,<DPX200>,
      <pk PHC0 = 2.741816 PHC1 = -3.4 
       data hash MD5: 16K
       E5 34 F4 A1 67 CC 43 54 8B B1 ED BD C7 41 94 99>)
(   6,<2021-07-08 08:36:56.20 +0400>,<she>,<DPX200>,
      <abs ABSG = 5 
       data hash MD5: 16K
       EE 0F 1B 17 23 84 FB 67 54 04 96 8D F9 9E D0 61>)
$$ ##END=
$$ 
$$ hash MD5
$$ F5 06 C7 39 16 23 C0 2D E0 30 DD 59 83 F0 3B 2C
##$RELAX= 
##$RELAX= 
##$RELAX= 
##$RELAX= 
##$RELAX= 
##$RELAX= 
$$ Bruker specific parameters
$$ --------------------------
##$DU= <F:/spectra>
##$EXPNO= 1
##$NAME= <H-F>
##$PROCNO= 1
##$TYPE= <nmr>
##$USER= <she>
##$AMP= (0..31)
100 100 100 100 100 100 100 100 100 100 100 100 100 100 100 100 100 100 
100 100 100 100 100 100 100 100 100 100 100 100 100 100 
##$AQSEQ= 0
##$AQ_mod= 1
##$AUNM= <au_zg>
##$AUTOPOS= <>
##$BF1= 200.13
##$BF2= 200.13
##$BF3= 200.13
##$BF4= 200.13
##$BF5= 200.13
##$BF6= 200.13
##$BF7= 200.13
##$BF8= 200.13
##$BYTORDA= 1
##$CFDGTYP= 0
##$CFRGTYP= 5
##$CHEMSTR= <none>
##$CNST= (0..31)
1 1 145 1 1 1 1 1 1 1 1 1 1 1 1 1 1 1 1 1 1 1 1 1 1 1 1 1 1 1 1 1 
##$CPDPRG= <>
##$CPDPRG1= <>
##$CPDPRG2= <>
##$CPDPRG3= <>
##$CPDPRG4= <mlev>
##$CPDPRG5= <mlev>
##$CPDPRG6= <mlev>
##$CPDPRG7= <mlev>
##$CPDPRG8= <mlev>
$$ [...]
##$SUBNAM3= <"">
##$SUBNAM4= <"">
##$SUBNAM5= <"">
##$SUBNAM6= <"">
##$SUBNAM7= <"">
##$SUBNAM8= <"">
##$SUBNAM9= <"">
##$SW= 20.0188882624521
##$SWIBOX= (0..15)
0 0 2 0 0 0 0 0 0 0 0 0 0 0 0 0 
##$SW_h= 4006.41025641026
##$TD= 16384
##$TD0= 1
##$TE= 0
##$TE2= 300
##$TE3= 300
##$TEG= 300
##$TL= (0..7)
0 120 120 120 120 120 120 120 
##$TP= (0..7)
150 150 150 150 150 150 150 150 
##$TP07= 0
##$TPNAME0= <>
##$TPNAME1= <>
##$TPNAME2= <>
##$TPNAME3= <>
##$TPNAME4= <>
##$TPNAME5= <>
##$TPNAME6= <>
##$TPNAME7= <>
##$TPOAL= (0..7)
0.5 0.5 0.5 0.5 0.5 0.5 0.5 0.5 
##$TPOFFS= (0..7)
0 0 0 0 0 0 0 0 
##$TUNHIN= 0
##$TUNHOUT= 0
##$TUNXOUT= 0
##$USERA1= <user>
##$USERA2= <user>
##$USERA3= <user>
##$USERA4= <user>
##$USERA5= <user>
##$V9= 5
##$VALIST= <valist>
##$VCLIST= <CCCCCCCCCCCCCCC>
##$VD= 0
##$VDLIST= <DDDDDDDDDDDDDDD>
##$VPLIST= <PPPPPPPPPPPPPPP>
##$VTLIST= <TTTTTTTTTTTTTTT>
##$WBST= 1024
##$WBSW= 4
##$XGAIN= (0..3)
0 0 0 0 
##$XL= 0
##$YL= 0
##$YMAX_a= 378356
##$YMIN_a= -277458
##$ZGOPTNS= <>
##$ZL1= 120
##$ZL2= 120
##$ZL3= 120
##$ZL4= 120
##$ABSF1= 17.47878
##$ABSF2= -2.540257
##$ABSG= 5
##$ABSL= 3
##$ALPHA= 0
##$AQORDER= 0
##$ASSFAC= 0
##$ASSFACI= 0
##$ASSFACX= 0
##$ASSWID= 0
##$AUNMP= <proc_1d>
##$AZFE= 0.1
##$AZFW= 0.1
##$BCFW= 0
##$BC_mod= 2
##$BYTORDP= 0
##$COROFFS= 0
##$CY= -3
##$DATMOD= 1
##$DC= 0
##$DFILT= <>
##$DTYPP= 0
##$F1P= 0
##$F2P= 0
##$FCOR= 1
##$FTSIZE= 16384
##$FT_mod= 6
##$GAMMA= 0
##$GB= 0
##$INTBC= 1
##$INTSCL= 1.334414e-10
##$ISEN= 128
##$LB= 0.24
##$LEV0= 0
##$LPBIN= 0
##$MAXI= 10000
##$MC2= 0
##$MEAN= 0
##$ME_mod= 0
##$MI= 1.114404
##$NCOEF= 0
##$NC_proc= -7
##$NLEV= 6
##$NOISF1= 3.799351
##$NOISF2= 2.8
##$NSP= 0
##$NTH_PI= 0
##$NZP= 0
##$OFFSET= 17.48245
##$PC= 1
##$PHC0= -12427.15
##$PHC1= 5.20101
##$PH_mod= 1
##$PKNL= yes
##$PPARMOD= 0
##$PSCAL= 0
##$PSIGN= 0
##$REVERSE= no
##$SF= 200.130010442593
##$SI= 16384
##$SIGF1= 3
##$SIGF2= 2
##$SINO= 5.538805
##$SIOLD= 16384
##$SREGLST= <1H.CDCl3>
##$SSB= 0
##$STSI= 16384
##$STSR= 0
##$SW_p= 4006.41025641026
##$SYMM= 0
##$S_DEV= 0
##$TDeff= 16384
##$TDoff= 0
##$TI= <>
##$TILT= no
##$TM1= 0
##$TM2= 0
##$TOPLEV= 0
##$USERP1= <user>
##$USERP2= <user>
##$USERP3= <user>
##$USERP4= <user>
##$USERP5= <user>
##$WDW= 1
##$XDIM= 16384
##$YMAX_p= 402900811
##$YMIN_p= -365243
$$ End of Bruker specific parameters
$$ ---------------------------------
##NTUPLES= NMR SPECTRUM
##VAR_NAME=  FREQUENCY,     SPECTRUM/REAL,   SPECTRUM/IMAG
##SYMBOL=    X,             R,               I
##VAR_TYPE=  INDEPENDENT,   DEPENDENT,       DEPENDENT
##VAR_FORM=  AFFN,          ASDF,            ASDF
##VAR_DIM=   16384,         16384,           16384
##UNITS=     HZ,            ARBITRARY UNITS, ARBITRARY UNITS
##FACTOR=    0.24454680195387, 1,            1
##FIRST=     3498.76299817109, 0,            0
##LAST=      -507.647258239167, 0,           0
##MIN=       -507.647258239167, -365243,     0
##MAX=       3498.76299817109, 402900811,    0
$$ Real data points
##PAGE= N=1
##DATA TABLE= (X++(R..R)), XYDATA
$$ [...]
7084D86509l6585N746m7820N3935m4890L865M4046j3581J9557M0143l5100J1744
7072D87569p2394L292j190k2276N5335k8991L0123l199K6817k5531l8552j9345
7060C91658q298P3477j8931N6059N3844n5757j6394k3952l9059N8014J2303l360
7048D79604q196P8871q5414J07409p4288l198R1142q1424j7447j7562K2117M2987
7036E34601j0826K0210L0975o107k8471J0064l6463O9411O0890k1986m5279j4664
7024E62355j7245j5324N9448m5445r761K2956J0724O281N0589n1555J4501o2001
7012E25523l6883M7132Q0476k4059N225k1974O2497L9934j53020J2184L8232M9629
7000F24896P603M4823p8144L3963Q784J7214m3197L0049J6431k6147J377j8708
$$ y = [486509, 449924, 455670, 407850, 461785, 416895, 420760, 464806, 451225, 470782, 510925, 475825, 487569, 415175, 418467, 417277, 395001, 450336, 421345, 451468, 448269, 475086, 449555, 411003, 391658, 383360, 456837, 437906, 493965, 547809, 492052, 475658, 451706, 412647, 470661, 482964, 479604, 471408, 550279, 464865, 572274, 497986, 494788, 585930, 504506, 487059, 469497, 491614, 534601, 523775, 543985, 574960, 568853, 540382, 550446, 513983, 583394, 644284, 622298, 577019, 562355, 545110, 529786, 589234, 543789, 534028, 556984, 567708, 573989, 624578, 573023, 587524, 525523, 488640, 535772, 616248, 592189, 597414, 575440, 637937, 677871, 524851, 537035, 575267, 624896, 632499, 677322, 599178, 633141, 641925, 659139, 615942, 645991, 662422, 636275, 637652, 618944]
6988F18944o4651J2301P4887o984n562K6327L7269L7093j0034l2579M840l78L6341
6975G27814j3238K4590K9251k6672m9024N3786Q6921j12992o0942k016k5518R2610
6963G24570M8354j0733r422J4707J2867M3314j8850J9040k5334o06K142k7510
6951G72539j4522J8459P627l2692M7393q00K9099L0967k0551J7817J382o4825
6939G91893K8796J4733n3585L8002k2487N32o8885o727L7265J9831J8616R2405
6927H90389l1050k3517M1838m965l5632K2601l7991O8413m3219k1j8778Q793J7615
6914H54476k1794L1938Q5647o5432m9496K3551J650j527M2794l1299K7432J0185
6902I08125l2171N1793N4442j7081o7366K1699M1305l4660k1951R0737l3100n5603
$$ y = [618944, 554293, 566594, 641481, 634497, 628935, 655262, 692531, 729624, 719590, 687011, 691851, 691473, 727814, 714576, 739166, 768417, 741745, 692721, 746507, 833428, 720436, 659494, 657478, 631960, 724570, 772924, 762191, 752769, 767476, 780343, 823657, 804807, 823847, 798513, 797907, 800049, 772539, 758017, 776476, 784103, 751411, 798804, 798004, 827103, 858070, 837519, 855336, 856718, 791893, 820689, 835422, 781837, 819839, 797352, 797884, 728999, 722272, 759537, 779368, 797984, 890389, 859339, 835822, 877660, 872695, 837063, 859664, 821673, 890086, 846867, 846846, 828068, 836861, 854476, 832682, 864620, 950267, 884835, 835339, 858890, 860540, 859013, 901807, 870508, 897940, 908125, 875954, 927747, 982189, 965108, 897742, 919441, 960746, 926086, 904135, 994872, 961772, 906169]
6890I06169q845O2136L6806J6407J1503k4062p2701r597R1223j294j5871J6843
6878A008717j4910J3795N4623l7673l2913Q3851l1421K1550M0422o7920j14K5547
6866A063554j9758j4556K8876L6473k1745J9777p8024J3828J13543J9204q3671
6855A077501L2800K61K4804K9760L8951p4923j4453L394j2350K167N3752k5818
6843A135846k4599N8248k0430Q857N4445Q468m951k7718R63K2878J4608K6198
6831A252813r240n5991K1835K0972O4184P374M9470J3991p5598j2723l1315L373
6819A249145K4226l0697j6721J02297m454N321j3265k6850R787M83N2733P341
6807A359346N8220n8313N9176N1130j5203r5132K3848P0088o7427L0699j3514
$$ y = [906169, 897324, 959460, 996266, 1012673, 1024176, 1000114, 927413, 917816, 1009039, 1007745, 991874, 1008717, 993807, 1007602, 1062225, 1024552, 991639, 1075490, 1044069, 1065619, 1106041, 1038121, 1038007, 1063554, 1043796, 1029240, 1058116, 1094589, 1072844, 1092621, 1014597, 1028425, 1141968, 1161172, 1077501, 1110301, 1110562, 1135366, 1165126, 1204077, 1129154, 1114701, 1118095, 1105745, 1107912, 1161664, 1135846, 1111247, 1169495, 1149065, 1157922, 1212367, 1220835, 1215884, 1188166, 1189129, 1212007, 1226615, 1252813, 1243573, 1187582, 1209417, 1230389, 1294573, 1301947, 1351417, 1365408, 1289810, 1277087, 1245772, 1249145, 1273371, 1242674, 1225953, 1328250, 1323796, 1329117, 1315852, 1289002, 1298789, 1299272, 1352005, 1359346, 1417566, 1359253, 1418429, 1469559, 1454356, 1359224, 1383072, 1453160, 1385733, 1416432, 1402918]
6796A402918N8775Q8211k5607L2796K9788m1462L7754m5616j9829P0139N9110
6785A646977j2639K2770K9495P6606o1049p2160N17m8578K3084l952J8570k3171
6773A596470p231P8723l2403l3110K378j6921K6836K9189J1800q2877j4127m545
6761A554182N3713j6004J5187P4112o5824j7464n534j232P390K1495J3869j0425
6749A623465J6797m0049m457M6077o9628M6505k6420P108J00680K6271N715L477
6737A735541m7879J1966K1230j6166K3181N0378o4046J3302m4565j3554L8371
6726A707759N5742M3101o142L7818N8873l2041m1559O7540K8010o4397k2745J12034
6714A943993q051q0365M8907k4192l5228K5740n732P6785N375l3214P2764m0379
$$ y = [1402918, 1461693, 1549904, 1524297, 1557093, 1586881, 1545419, 1583173, 1537557, 1517728, 1587867, 1646977, 1634338, 1657108, 1686603, 1763209, 1702160, 1630000, 1630517, 1581939, 1605023, 1601071, 1619641, 1596470, 1589239, 1667962, 1635559, 1602449, 1604827, 1587906, 1614742, 1643931, 1655731, 1572854, 1558727, 1554182, 1607895, 1591891, 1607078, 1681190, 1615366, 1597902, 1592368, 1591136, 1598526, 1620021, 1633890, 1623465, 1640262, 1600213, 1595756, 1641833, 1572205, 1618710, 1592290, 1599398, 1700078, 1726349, 1732064, 1735541, 1687662, 1699628, 1720858, 1704692, 1727873, 1778251, 1714205, 1727507, 1682942, 1669388, 1707759, 1763501, 1806602, 1800460, 1838278, 1897151, 1865110, 1823551, 1891091, 1919101, 1854704, 1831959, 1943993, 1935942, 1855577, 1904484, 1880292, 1845064, 1870804, 1865072, 1941857, 1947232, 1914018, 1986782, 1946403]
6702A946403K7431J229j4591j4235K1474M5335K7675l5388l1857P1658M3159R711
6690B098004L8479j18796J470Q0545j496m4139K6980P0755k1360k5666n3450m898
6678B046428R627J5107P6682K3167j6292M1793P17l4581l2777m8881O5605k046
6666B144549k4978M9672J6037K276P3533k5766m1912O1042M238N4127Q001m7883
6654B272936O9247j4675L0728M8698r958j1901l2499n818J9879M8085M928k7847
6642B391803l5771P5296j8213N3456j4902J9614o3023q021O618J2770N7856o0885
6630B416598K8241K2287k507J42310n7568l2596n7836J5413O8664r470J9279L9756
6618B592571k9402P2711o2819N86N459K7623L0918m8278R334L8312N6432m2164
$$ y = [1946403, 1973834, 1975063, 1960472, 1946237, 1967711, 2013046, 2040721, 2005333, 1973476, 2045134, 2088293, 2098004, 2136483, 2017687, 2019157, 2099702, 2098206, 2054067, 2081047, 2151802, 2130442, 2104776, 2051326, 2046428, 2056055, 2071162, 2147844, 2171011, 2154719, 2196512, 2197229, 2162648, 2129871, 2080990, 2146595, 2144549, 2119571, 2169243, 2185280, 2187556, 2261089, 2235323, 2193411, 2254453, 2258691, 2312818, 2320819, 2272936, 2342183, 2327508, 2358236, 2406934, 2396976, 2385075, 2352576, 2346758, 2366637, 2414722, 2419650, 2391803, 2356032, 2431328, 2413115, 2466571, 2451669, 2471283, 2408260, 2400239, 2406857, 2419627, 2477483, 2416598, 2444839, 2467126, 2464619, 2606929, 2549361, 2516765, 2458929, 2474342, 2543006, 2533536, 2552815, 2592571, 2563169, 2635880, 2573061, 2573647, 2579106, 2606729, 2637647, 2589369, 2598703, 2637015, 2693447, 2651283]
6606B651283N1741L3959n7609J6913K7551M4358n0282k0721k1691Q7997O4564
6595B828063m0883M4441k857L4329k2780L1666k666j620K4037K0119j0676m3866
6583B857307J1435K8306M2900l4795J1920j7564M1754K201n51J8078q8849L8461
6571B910603P9721J6147k1894K045L2602n855k7234N7308m901J9557n1381K0247
6559C026965l6570O1337j6980l1705P8816N5833K5229j4487J5758n6153l4754
6548C073289K1603k5218L7603P3602m9523K8706L5474K2177l5465j2981l110K6963
6536C193120o7543J4802O1567N9776k1410J036J5428m3960l0729l5473M4237l828
6524C187023R6959K6826Q9596o4687p3173j773N4329q2250J2249J6988L9439J6330
$$ y = [2651283, 2703024, 2736983, 2679374, 2696287, 2723838, 2768196, 2717914, 2697193, 2675502, 2763499, 2828063, 2787180, 2831621, 2828764, 2863093, 2840313, 2871979, 2869313, 2867693, 2891730, 2911849, 2901173, 2857307, 2868742, 2897048, 2939948, 2905153, 2917073, 2899509, 2941263, 2943464, 2942913, 2960991, 2872142, 2910603, 2990324, 3006471, 2984577, 2986622, 3019224, 3013369, 2986135, 3043443, 3038542, 3058099, 3006718, 3026965, 2990395, 3051732, 3034752, 3003047, 3081863, 3137696, 3162925, 3148438, 3164196, 3108043, 3073289, 3094892, 3069674, 3107277, 3180879, 3131356, 3160062, 3195536, 3217713, 3182248, 3169267, 3166157, 3193120, 3125577, 3140379, 3201946, 3261722, 3240312, 3241348, 3256776, 3212816, 3182087, 3146614, 3190851, 3187023, 3283982, 3310808, 3400404, 3335717, 3262544, 3260771, 3315100, 3232850, 3245099, 3262087, 3301526, 3317856]
6512C317856L4171m2260L6048q690J5168q1008M2129R0364K7320j9364o0314J8314
6500C369734J4699O0285J7148j8942M1640l0089k7048J9618L7026P0671j3127
6489C541615L6680j21636K1501M418J7231n1466M9289L5045J0995M0511j9065
6478C565118j1974j6041N7172o0975M0197O4069o9928j1189J7804k6052R6042
6467C644243L6534l3958M1337m1784l2519P2507M7924K2770J05144j02773p0152
6456C689273p883J37L3633J650r155j14231N8783N8124K8541n5463l6182L8671
6444C685898P1122K9653j05126O8336n197R10k6298M0396j3350K916l5569M2988
6432C756679M057O4765p9346R557J06170n5027o4860J3411L7934j3216N4299Q008
$$ y = [3317856, 3352027, 3309767, 3345815, 3337125, 3352293, 3271285, 3313414, 3403778, 3431098, 3411734, 3351420, 3369734, 3384433, 3444718, 3461866, 3442924, 3484564, 3454475, 3427427, 3447045, 3484071, 3554742, 3541615, 3578295, 3456659, 3478160, 3482578, 3499809, 3448343, 3497632, 3532677, 3543672, 3584183, 3565118, 3553144, 3537103, 3594275, 3533300, 3573497, 3637566, 3567638, 3556449, 3574253, 3548201, 3644243, 3680777, 3646819, 3688156, 3646372, 3613853, 3686360, 3734284, 3757054, 3862198, 3759425, 3689273, 3681390, 3681527, 3715160, 3716810, 3707655, 3593424, 3652207, 3710331, 3738872, 3683409, 3647227, 3685898, 3757020, 3786673, 3681547, 3749883, 3744686, 3745596, 3719298, 3759694, 3746344, 3749260, 3713691, 3756679, 3760736, 3825501, 3746155, 3755712, 3861882, 3806855, 3741995, 3755406, 3793340, 3780124, 3834423, 3842431]
6420C842431k3997P3849j8977m324m6732K0805R9053p2393k1505K0184L626P5073
6408C947093J7653J5297N6954L366J7247Q254Q3509L9251l8135K660J7648N1349
6396D222146M0942m1971L841M3695L141r3356p9406o8713o9600L9792N1217r3182
6384C958546m3656J9368n2100j7562J6245l0118N3237K4378k3773o3892k326L184
6372C841531k0381J3870o7980p2544K5077N4858K6264j9313m0939J231P0256J5630
6360C827560q2123j9203j2044k0360L996K4268L5745n4880P6878k2252j4709l3599
6348C709277r02j4517J3152J3084l227n0220q1862K173P7123J2784l1671j4146
6336C631048l7510P1926o1179k2720J5277m906J8994N29l3791j373M2232M877
$$ y = [3842431, 3818434, 3892283, 3873306, 3868982, 3822250, 3843055, 3942108, 3869715, 3848210, 3868394, 3872020, 3947093, 3964746, 3980043, 4036997, 4040363, 4057610, 4065864, 4149373, 4188624, 4150489, 4153149, 4170797, 4222146, 4263088, 4221117, 4224958, 4268653, 4271794, 4178438, 4099032, 4030319, 3960719, 4000511, 4051728, 3958546, 3914890, 3934258, 3882158, 3864596, 3880841, 3850723, 3903960, 3928338, 3904565, 3840673, 3838347, 3841531, 3821150, 3835020, 3767040, 3694496, 3719573, 3774431, 3800695, 3781382, 3740443, 3741674, 3811930, 3827560, 3745437, 3726234, 3714190, 3693830, 3697826, 3722094, 3757839, 3702959, 3779837, 3757585, 3742876, 3709277, 3708375, 3693858, 3707010, 3720094, 3716867, 3666647, 3584785, 3586958, 3664081, 3676865, 3645194, 3631048, 3593538, 3665464, 3604285, 3581565, 3596842, 3591936, 3610930, 3611459, 3577668, 3576295, 3618527, 3623404]
6324C623404m438l8664K1149L8742p4767j9114k1252k9904j4625M0971O0535M455
6312C586492L5596k8597o9498J768Q223N15m2952J6978p4342R0238j1388l7926
6300C475107L6872j12056R9933K5918m0236L4676L3458p4526o5850l2949l4579
6289C345768j1300l410J2218K8758m835L9292p3498K9665L4071J246m1785j1263
6277C344927j1553p5208k4812P3344O5546n4453k8937J7596k274N6215k9250o4382
6265C266759M1880k859m0819m4045L2094l5129J4346J3542k7937k6898J240r8462
6253C093712n999O0661K7085k3159L3481l6653m0561J6265J2648k7935K4650K4965
6241C159160j3412K7601j2423k9974p0022K1424p5723K7760N6425j11164k2661
$$ y = [3623404, 3618966, 3580302, 3601451, 3640193, 3565426, 3546312, 3525060, 3495156, 3480531, 3521502, 3582037, 3586492, 3622088, 3593491, 3523993, 3525761, 3533984, 3534499, 3491547, 3508525, 3434183, 3524421, 3513033, 3475107, 3511979, 3399923, 3499856, 3525774, 3485538, 3520214, 3553672, 3479146, 3413296, 3380347, 3345768, 3334468, 3331058, 3343276, 3372034, 3367199, 3406491, 3332993, 3362658, 3396729, 3397975, 3356190, 3344927, 3333374, 3258166, 3233354, 3306698, 3372244, 3317791, 3288854, 3306450, 3304176, 3360391, 3331141, 3266759, 3308639, 3305780, 3264961, 3220916, 3253010, 3217881, 3232227, 3245769, 3217832, 3190934, 3192174, 3093712, 3087713, 3148374, 3175459, 3152300, 3185781, 3149128, 3108567, 3124832, 3137480, 3109545, 3134195, 3159160, 3145748, 3173349, 3160926, 3130952, 3060930, 3082354, 3006631, 3034391, 3090816, 2979652, 2956991]
6230B956991P0159P681m0844J8781r2142l2861J22379J3519j05222L3369o4288
6219B887522K6588P6563j71078m843Q5397m2452k0442K3784Q9582j6596j31625
6208B802400K9519M4560K7438L1753J1939p9433n5297l3804K5410j4976M5371
6197B834880J0272o2514m207M903j5589n6978N2193o3742o6404J16872n8060m8272
6185B643354L2746j6771K4048O986o3806r2410P5882J4712k1654K1781n7240M2430
6173B610058L7995P523M4033n7798K2875k158r3510l3549N6272n2503R167j8103
6161B530302M6071J5635m7759l7880l0376P950n016K7843q2359j2637Lk0529L6011
6148B427259J4440m5794M1010k8297j3834N9634Q656j13981k8416N9577J9661
$$ y = [2956991, 3027150, 3034831, 2993987, 3012768, 2920626, 2887765, 3010144, 3023663, 2918441, 2951810, 2887522, 2914110, 2990673, 2819595, 2814752, 2900149, 2857697, 2837255, 2861039, 2950621, 2934025, 2802400, 2831919, 2876479, 2903917, 2935670, 2947609, 2868176, 2812879, 2779075, 2804485, 2789509, 2834880, 2845152, 2782638, 2778431, 2783334, 2767745, 2710767, 2762960, 2699218, 2632814, 2749686, 2691626, 2643354, 2676100, 2659329, 2683377, 2690363, 2626557, 2534147, 2610029, 2624741, 2603087, 2624868, 2567628, 2610058, 2648053, 2655576, 2699609, 2641811, 2664686, 2662528, 2569018, 2535469, 2591741, 2539238, 2548405, 2530302, 2576373, 2592008, 2544249, 2506369, 2475993, 2483943, 2478927, 2506770, 2424411, 2411774, 2411777, 2391248, 2427259, 2441699, 2395905, 2436915, 2408618, 2394784, 2454418, 2463074, 2349093, 2320677, 2380254, 2399915]
6137B399915j00903LL7574j2592J2287M1520P625k2038n6428n1749O7035K2277
6125B344526M8721n0861N0718K2209p956j09386J1727n5142K7798N3814n9617
6114B276551P054j1536R0766q7608n8130k2136K7131k327l2860j6041J1981M9622
6102B232467m4984M1214j4608o6828M4137n9522J8517j1716J9795L4340q7113
6091B105699l7529O622L9673l806l0852K9725L1071k0005O167L2964n8174m1123
6079B060432j236P4291m7922j16367j5304O5518P327J6222n0349o930L0341k0263
6067A995760j5447k2489p1512M0045L4182R365j6093l5664j1481K049M0915n86
6055A949044O9959k3337k434P4388n7367J4360o5162J1139j6060q5660l0299J7886
$$ y = [2399915, 2299012, 2299015, 2336589, 2323997, 2336284, 2377804, 2385429, 2363391, 2306963, 2255214, 2322249, 2344526, 2393247, 2342386, 2393104, 2415313, 2407357, 2297971, 2309698, 2254556, 2282354, 2336168, 2276551, 2283605, 2272069, 2362835, 2275227, 2217097, 2194961, 2222092, 2219765, 2186905, 2170864, 2182845, 2232467, 2187483, 2228697, 2214089, 2147261, 2191398, 2131876, 2150393, 2138677, 2158472, 2192812, 2105699, 2068170, 2074792, 2114465, 2110659, 2079807, 2109532, 2140603, 2120598, 2126765, 2159729, 2101555, 2060432, 2059196, 2133487, 2085565, 1969198, 1953894, 2019412, 2026739, 2042961, 1992612, 1985682, 2016023, 1995760, 1980313, 1957824, 1886312, 1926357, 1960539, 1969904, 1953811, 1918147, 1906666, 1908715, 1949630, 1949044, 2019003, 1995666, 1993232, 2067620, 2010253, 2024613, 1959451, 1970590, 1954530, 1868870, 1838571, 1856457]
6043A856457N4885J3351K5009j4680N4900L0938q6540m8739p743n0012Q4098R3604
6031B005528q5737n8389K5318k2822N8227M9557m5093p0294J12068m0370r6075
6020A831918O0297q508l861K0883q5831N640j214K3123K9205O4139j38134o6811
6008A730846m6732N1095N0171K9471m7280q393K7309M4551j2408O087k8269P044
5996A803492M4612M0955J7736n5818q571j2726j2776K3853q529l0957n4363J2167
5984A759075J24317n4357j2371j7069k8988L4047n4303k7289J42377m5815J4595
5973A834219q1295k4765R772N2160n5822p2740M3725l3776M2358J9466m7849M6747
5961A732200n8320N322J082l9595J01403J4957l5599N5332P115o7432P4464N4031
$$ y = [1856457, 1911342, 1924693, 1949702, 1935022, 1989922, 2020860, 1934320, 1885581, 1877838, 1827826, 1911924, 2005528, 1919791, 1861402, 1886720, 1863898, 1922125, 1971682, 1926589, 1856295, 1968363, 1927993, 1831918, 1892215, 1883707, 1879846, 1900729, 1814898, 1820538, 1819324, 1842447, 1871652, 1935791, 1797657, 1730846, 1684114, 1735209, 1785380, 1814851, 1767571, 1759178, 1786487, 1831038, 1818630, 1824717, 1796448, 1803492, 1848104, 1889059, 1906795, 1850977, 1842406, 1829680, 1816904, 1840757, 1832228, 1801271, 1746908, 1759075, 1883392, 1829035, 1816664, 1799595, 1770607, 1804654, 1750351, 1723062, 1865439, 1819624, 1834219, 1752924, 1728159, 1737931, 1790091, 1734269, 1661529, 1705254, 1671478, 1713836, 1733302, 1685453, 1732200, 1673880, 1679202, 1680284, 1640689, 1742092, 1757049, 1721450, 1776782, 1783897, 1716465, 1790929, 1844960]
5949A844960l3589p452k4570L4331K8408O8257j8009m8326l2545l369k687m7713
5937A757696N2343J08195n615j01845M7556J01513N4800k5351j1011j4368M2027
5926B005940l9318L0693R8447k1265k4379K2242j4172N4335M3422M1037Q5255
5915B282237j966N1934J01175J32445M5512k5543O9723R5090O4131J4521O0213
5904B889472L5398m6629O1140j64247k5704M1873j3432p4337j9261q2516L0560
5893B632317K5221L6373J7640l3379n4823m71p184k872k4093j4738j047j8382
5881B554562P1832n945L4109M0500N9030N4391Q7159P5860P3212R378J38767O5691
5869C258546J6316J37706P1395J97205N8420R2893J84286J86006J56704J45103
$$ y = [1844960, 1811371, 1803919, 1779349, 1813680, 1842088, 1910345, 1892336, 1844010, 1811465, 1808096, 1805409, 1757696, 1810039, 1918234, 1912619, 1810774, 1858330, 1959843, 2014643, 1989292, 1978281, 1963913, 2005940, 1966622, 1997315, 2095762, 2074497, 2050118, 2072360, 2058188, 2112523, 2155945, 2196982, 2282237, 2280271, 2332205, 2433380, 2565825, 2611337, 2585794, 2655517, 2750607, 2814738, 2829259, 2889472, 2924870, 2878241, 2939381, 2775134, 2749430, 2791303, 2777871, 2703534, 2684273, 2601757, 2632317, 2657538, 2693911, 2711551, 2678172, 2623349, 2622878, 2615694, 2612822, 2588729, 2573991, 2572944, 2554562, 2626394, 2620449, 2654558, 2695058, 2754088, 2808479, 2895638, 2971498, 3044710, 3054088, 3192855, 3258546, 3274862, 3412568, 3483963, 3681168, 3739588, 3832481, 4016767, 4202773, 4359477, 4504580]
5859D504580K47528J17798J27789R8498J5933j3209j57945k36744j05076k47872
5849D351280j45269j14117j53606j40260p3951j23844p9757m3617l5082l4978
5839C406799J8396j26845o8215r6780k3718k0001j12614n4910K9261l0919p9613
5828B840841m1279K7751L1679J0104o0058J0956L6155P702O7071L292j00408j9100
5816B814706L1812J4073J3611P5482o9324l8217j13175j19282p3087o0697q3862
5805B392040l4243o6453K1072J126j48171j6748q287j5226m9029L1352q8872j627
5793B016934J1157j2464o1820o1920J4106j6793n4760Q3391m3087o7284P0654
5782A878114Q5478o0849j15416n8343N3456l870K0375j9210K1473P5892l9639
$$ y = [4504580, 4752108, 4869906, 4997695, 5096193, 5112126, 5098917, 4940972, 4704228, 4599152, 4351280, 4206011, 4091894, 3938288, 3798028, 3724077, 3600233, 3520476, 3476859, 3441777, 3406799, 3425195, 3298350, 3230135, 3133355, 3109637, 3089636, 2977022, 2922112, 2951373, 2920454, 2840841, 2799562, 2827313, 2858992, 2869096, 2809038, 2819994, 2856149, 2863851, 2930922, 2934214, 2833806, 2814706, 2846518, 2860591, 2874202, 2949684, 2880360, 2842143, 2728968, 2609686, 2536599, 2475902, 2392040, 2357797, 2291344, 2312416, 2313542, 2165371, 2148623, 2140336, 2125110, 2076081, 2107433, 2018561, 2016934, 2028091, 2015627, 1953807, 1891887, 1905993, 1889200, 1834440, 1917831, 1874744, 1807460, 1878114, 1963592, 1902743, 1787327, 1728984, 1782440, 1778570, 1798945, 1779735, 1801208, 1877100, 1837461]
5771A837461J7451P3718r4752j555J6225n9229M1615k0999K3386K6165k6729Q1881
5759A914638m2213M8734P0925k2314m485Q80j8120k1920l0890O2446K8787k4064
5747A962404o8166J0002k6187L8958K5569q742J8895N1289m9107q755K5822J0600
5735A982582J7742j9800L9008l7063n1928Q7387m151k8294l7514j9491j8916j3677
5723A895885j1428k228m82n3278m3517J7781J2168m3113o585J3693P298J9531
5711A805725M2845l3886n3588m8888M6545L8747j5000L826N2267j3604M14K9125
5699A854528K1501r194l1703k5288O6591n4996o5424M1858L0315o434K1153l1265
5687A811642o7655m645R3763l8708k3043O966P0293P829J1106m9141N3935M6941
$$ y = [1837461, 1854912, 1928630, 1833878, 1832323, 1848548, 1789319, 1830934, 1809935, 1833321, 1859486, 1832757, 1914638, 1872425, 1921159, 1992084, 1969770, 1965285, 1966165, 1948045, 1926125, 1895235, 1957681, 1986468, 1962404, 1894238, 1904240, 1878053, 1917011, 1942580, 1933838, 1952733, 2004022, 1954915, 1946160, 1971982, 1982582, 2000324, 1980524, 2019532, 1982469, 1930541, 2017928, 2013777, 1985483, 1947969, 1928478, 1909562, 1895885, 1884457, 1882229, 1881747, 1828469, 1784952, 1802733, 1814901, 1771788, 1765203, 1778896, 1786194, 1805725, 1848570, 1814684, 1761096, 1712208, 1758753, 1797500, 1782500, 1786326, 1838593, 1824989, 1825403, 1854528, 1876029, 1866835, 1835132, 1809844, 1876435, 1821439, 1756015, 1797873, 1828188, 1821754, 1842907, 1811642, 1743987, 1739342, 1833105, 1794397, 1771354, 1778320, 1848613, 1856442, 1867548, 1818407, 1872342, 1919283]
5675A919283L8475K159L231Q4838L8749L6837L8201L719P9910J42660J529J19120
5663B508711J13373M248n6337J3454m7442o3987p9181m3586L7122O0147P421q0953
5651B372990K7185O8611R7448m7452M2439L8023J03876M2473k4691L1245J62987
5640B915134P1165J85257J78748J13869R3567J68248K67749J41756J72593J71231
5630D479317J85340J58703j6052o5458l262k3677M1579k6889J83561O5572J35079
5619E113813K05496K13276J74075K24299L43474K97376L02663L16910M59602K47480
5609G898464K04823L27403K32999K31933K00699N2957J97893K21256K59520K27792
5599A0055739K19787L37447M02348L98223M11671N00195N57335O84792O74312
$$ y = [1919283, 1957758, 1959917, 1963148, 2047986, 2086735, 2123572, 2161773, 2165492, 2245402, 2388062, 2389591, 2508711, 2622084, 2626332, 2569995, 2583449, 2536007, 2472020, 2392839, 2349253, 2386375, 2446522, 2453943, 2372990, 2400175, 2468786, 2566234, 2518782, 2561221, 2599244, 2703120, 2745593, 2720902, 2752147, 2915134, 2986299, 3171556, 3350304, 3464173, 3557740, 3725988, 3993737, 4135493, 4308086, 4479317, 4664657, 4823360, 4807308, 4741850, 4738588, 4714911, 4756490, 4729601, 4913162, 4978734, 5113813, 5319309, 5532585, 5706660, 5930959, 6274433, 6571809, 6874472, 7191382, 7650984, 7898464, 8103287, 8430690, 8663689, 8895622, 9096321, 9149278, 9347171, 9568427, 9827947, 10055739, 10275526, 10612973, 11015321, 11413544, 11825215, 12325410, 12882745, 13567537, 14241849]
5590A4241849P87232Q72375Q56995J044790R72106P38110P35096M95750K63668
5581B1007971l8330k34195l39673m19280m26282l98571k79435r4192j02171K8344
5571A8704186K35735L97065M86225O15216Q56287Q89657J000646J173907J283725
5562B5642649J358177J117067J116793Q51523M59371K3051m97042q34434j023671
5553B8213484j212177j135638j226911j087961r69892q09524o64228m43587k60740
5544B0402826j50908j18953J03099K75414K62663L77616M65502O19486M54530
5535B2691275L73549K33046j9911k99133n15105q21157r98745r91325r23458r58976
5525A7770060r55266q77004q10750o50616o16414n48976m79165m12962l45150
$$ y = [14241849, 15029081, 15901456, 16758451, 17803241, 18775347, 19513457, 20248553, 20744303, 21007971, 20969641, 20735446, 20395773, 19976493, 19550211, 19151640, 18872205, 18778013, 18675842, 18704186, 18939921, 19336986, 19823211, 20438427, 21294714, 22184371, 23185017, 24358924, 25642649, 27000826, 28117893, 29234686, 30086209, 30545580, 30568631, 30071589, 29237155, 28213484, 27001307, 25865669, 24638758, 23550797, 22580905, 21771381, 21107153, 20663566, 20402826, 20251918, 20132965, 20236064, 20511478, 20774141, 21151757, 21617259, 22236745, 22691275, 23064824, 23297870, 23277959, 22978826, 22463721, 21642564, 20643819, 19652494, 18729036, 17770060, 16814794, 15937790, 15127040, 14476424, 13860010, 13311034, 12831869, 12418907, 12073757]
5516A2073757l85915j71328k60618k58521j65037j34268j02379k16451k37872
5507A0141368k43822l30146m24082l60905l78654m97859m23355k96798l11050
5498F874697k41523k37636k95838j70846j82223q4615j58073j64341j91960j40318
5488E007324j89520k15015j60238j85108m9716r7609j88751Q321o6904j98014
5478C664770j69529k9350j7904L3082j33887l2368j02124n8788j03261l4629m0768
5467B975244p5115p897N7l8407r9943J6938l49L9511l3013P4676O483m1163r4094
5454B722928l0224J9796O9559K3818j5074L1780N3001k3136M741N2932J07861
5443C017982N5422Q2457J22696O5570K4684J50191K07250J3138M5777J91050K62294
$$ y = [12073757, 11687842, 11516514, 11255896, 10997375, 10832338, 10698070, 10595691, 10379240, 10141368, 9897546, 9567400, 9143318, 8782413, 8403759, 7905900, 7482545, 7185747, 6874697, 6633174, 6395538, 6099700, 5928854, 5746631, 5662016, 5503943, 5339602, 5147642, 5007324, 4817804, 4602789, 4442551, 4257443, 4207727, 4110118, 3921367, 3929688, 3862784, 3664770, 3495241, 3465891, 3447987, 3481069, 3347182, 3314814, 3212690, 3153902, 3050641, 3016012, 2975244, 2900129, 2892232, 2892289, 2853882, 2753939, 2770877, 2770528, 2810039, 2777026, 2851702, 2858185, 2817022, 2722928, 2692704, 2712500, 2782059, 2805877, 2790803, 2822583, 2875584, 2852448, 2857189, 2910121, 3017982, 3073404, 3155861, 3278557, 3344127, 3368811, 3519002, 3726252, 3739390, 3785167, 3976217, 4238511]
5432D238511J32558J38597O2059j2719n8264j3264j70746k04884j46169j55243
5422C810436j59075j37977j09422j94190m7703j94659j03059j05584k615q6270
5412B669882j02982l8129o0089j45134L598k3642n6697L353p3902n7516k1780
5401B096962l8407M0858M6077L524J6620j05379j8781n273m4217q3030n4103j9164
5389A835687l366k9338J1422n1247n1716K9420j6888N329l0711J7456J7571j0917
5377A722702r3786j0788l9262K8140j5931J3242O7850j5492N9580n4883m0962
5366A620410O0198j139L7922L0245m6702J9661k1335L1816l5263l0989J00758
5355A765582K7186n6448N2544L1428Q0104j8918p7508Q8124P5625K2438m453m598
$$ y = [4238511, 4371069, 4509666, 4571725, 4559006, 4500742, 4487478, 4316732, 4111848, 3965679, 3810436, 3651361, 3513384, 3403962, 3209772, 3162069, 2967410, 2864351, 2758767, 2756152, 2669882, 2566900, 2528771, 2468682, 2323548, 2327146, 2303504, 2246807, 2250160, 2176258, 2118742, 2096962, 2058555, 2099413, 2145490, 2149014, 2165634, 2060255, 2041474, 2036201, 1991984, 1908954, 1854851, 1835687, 1832321, 1802983, 1814405, 1763158, 1711442, 1740862, 1723974, 1729303, 1698592, 1716048, 1733619, 1722702, 1628916, 1618128, 1578866, 1607006, 1591075, 1604317, 1672167, 1656675, 1716255, 1661372, 1620410, 1680608, 1679469, 1717391, 1747636, 1700934, 1720595, 1699260, 1731076, 1695813, 1664824, 1765582, 1792768, 1736320, 1788864, 1820292, 1900396, 1881478, 1803970, 1892094, 1967719, 1990157, 1985704, 1981106]
5343A981106N9603N7737P5645J893P79J7965L0406L6872k6773r7644O985o1733
5331B082841J3934m9361L8243j07134j27783n4317L3541k8799j36430P3633j5674
5320A722694l4624L8862r5496j2526N5362n8282j4757j3547N0420k2235j2514
5309A603357q8983J8446o261Q738j3027J6074l7759M9747M129n7399M3281M024
5297A544367J2531N1356k1907K2964J6908l6216K3524j697J8123N3783O876j7897
5285A672715q4984m2778J54402J6990k1071M6094M5484k24l497M8578N1514l4503
5273A848720o1954J20832L2291J9551J3204M83O6315J0705O1930p976j1505M4238
5261B136834M4808R5205K6740j6014N0836n1487K1236m2024N897k3231l1939P8815
$$ y = [1981106, 2040709, 2098446, 2174091, 2175984, 2176763, 2194728, 2225134, 2262006, 2235233, 2137589, 2144574, 2082841, 2096775, 2047414, 2085657, 1978523, 1850740, 1796423, 1829964, 1801165, 1664735, 1738368, 1722694, 1688070, 1726932, 1631436, 1618910, 1674272, 1615990, 1601233, 1587686, 1638106, 1615871, 1603357, 1514374, 1532820, 1526559, 1535297, 1522270, 1538344, 1500585, 1550332, 1554461, 1497062, 1540343, 1544367, 1556898, 1608254, 1586347, 1609311, 1626219, 1590003, 1613527, 1611830, 1629953, 1683736, 1690612, 1672715, 1587731, 1544953, 1699355, 1716345, 1695274, 1741368, 1786852, 1786628, 1783131, 1831709, 1883223, 1848720, 1786766, 1907598, 1939889, 1959440, 1972644, 1973127, 2039442, 2050147, 2112077, 2104101, 2092596, 2136834, 2181642, 2276847, 2303587, 2287573, 2338409, 2286922, 2308158, 2266134, 2272031, 2248800, 2216861, 2295676]
5249B295676M6803L1183l6782q6307p9051R3437Q7549n4260k2734m2369m8976
5238B184169J1359m2101L6291m7514M9327J5978k9536P0086k5297j1424r276O5813
5226B267875Q3295Q3407L2856K0390m2090K3515r560M091R7443L4467N7542J9548
5214B672779R441P8107J8212j8430K5045M7401P8371R2804J4398P3838J5808J7644
5202C125418N5160p9844J2311R3561J06633J3902p8072K5883L8330K5500J43399
5191C482181m3826J11187N4215J14819q751l7681L7736J9925P1326Q3496J00400
5180C985027K9526M761O8519Q7905j1420P0856J6283N8190j850m578O0754j7801
5168D346172J2562R7013O9055L0679N8968J08191J24763M0907M0680O2746R2102
$$ y = [2295676, 2342479, 2373662, 2336880, 2250573, 2171522, 2264959, 2352508, 2298248, 2275514, 2233145, 2184169, 2195528, 2153427, 2189718, 2142204, 2191531, 2207509, 2177973, 2248059, 2222762, 2211338, 2202062, 2267875, 2351170, 2434577, 2467433, 2487823, 2445733, 2469248, 2459688, 2463779, 2561222, 2595689, 2653231, 2672779, 2682220, 2760327, 2778539, 2760109, 2785154, 2832555, 2910926, 3003730, 3018128, 3091966, 3107774, 3125418, 3180578, 3100734, 3113045, 3206606, 3313239, 3327141, 3249069, 3274952, 3313282, 3338782, 3482181, 3438355, 3549542, 3603757, 3718576, 3709825, 3672144, 3709880, 3729805, 3801131, 3884627, 3985027, 4014553, 4019314, 4087833, 4175738, 4164318, 4235174, 4251457, 4309647, 4307797, 4303219, 4363973, 4346172, 4358734, 4455747, 4524802, 4555481, 4614449, 4722640, 4847403, 4888310, 4928990, 4991736, 5083838]
5157E083838J20861M2662J02529Q4892L8223L2202P1902R8521K6407N5878J47254
5146E905169J66090Q2093P3206J22170K05506J62656J28219J72881R4130K09761
5136G321881J97188J36696J27110J82874K90590K26063K40792J69863K25975L26624
5126I445656K61564L13428K36301L47565K36668K32731M11777M16856K47377L15353
5116A2465276L55103M51733M04800L44331M91730M86778N40128M56229M77097
5107A6473205N54016O20909O61296N78063O46539P52774P64483P88045Q22843
5098B2662173Q17343R99284J011002R94046J185698J303878J261340J435911J544506
5089C3215181J699366J888914K130532K279312K546235K957519L198976L693587
$$ y = [5083838, 5204699, 5247361, 5349890, 5434782, 5473005, 5505207, 5577109, 5675630, 5702037, 5757915, 5905169, 6071259, 6153352, 6226558, 6348728, 6554234, 6716890, 6845109, 7017990, 7112120, 7321881, 7519069, 7655765, 7782875, 7965749, 8256339, 8482402, 8723194, 8893057, 9119032, 9445656, 9707220, 10020648, 10256949, 10604514, 10841182, 11073913, 11485690, 11902546, 12149923, 12465276, 12820379, 13272112, 13676912, 14021243, 14512973, 14999751, 15539879, 15996108, 16473205, 17027221, 17648130, 18309426, 18887489, 19534028, 20286802, 21051285, 21839330, 22662173, 23479516, 24478800, 25489802, 26483848, 27669546, 28973424, 30234764, 31670675, 33215181, 34914547, 36803461, 38933993, 41213305, 43759540, 46717059, 49916035, 53609622]
5081E3609622M139526M589093N188462N888866O656164P394194Q157465Q964036
5073A04587428R699647J0361792J0857973J0975203J0814100J0623589R953426
5066A77873158Q791844P102581M723770J525838j915410n231993p697943r553447
5058A75618398j0688859j1274140j1577842j1446284j1027916j0334573r533064
5051I9735720q503094p478645o693200n736283n160185m503607l897691l564127
5043E4198888l207238k722233k537189k304555k187307j992124j683210j614506
5035C5950526j434774j455636j441379j201053j115490j060321r41760r45100
5027B6355013q70031q44352o93377p29169p18064n80195n86631n13984m49955
$$ y = [53609622, 57749148, 62338241, 67526703, 73415569, 80071733, 87465927, 95623392, 104587428, 114287075, 124648867, 135506840, 146482043, 157296143, 167919732, 177873158, 186665002, 193767583, 198491353, 200017191, 198101781, 192869788, 185171845, 175618398, 164929539, 153655399, 142077557, 130631273, 119603357, 109268784, 99735720, 91232626, 83753981, 77060781, 71324498, 66164313, 61660706, 57763015, 54198888, 50991650, 48269417, 45732228, 43427673, 41240366, 39248242, 37565032, 35950526, 34515752, 33060116, 31618737, 30417684, 29302194, 28241873, 27300113, 26355013, 25484982, 24640630, 23947253, 23218084, 22500020, 21919825, 21333194, 20819210, 20369255]
5018B0369255n04131m67354n33872m02160l34459l32013k78287l19620k91369
5009A6905990k81746k66572k30390k52862l09328k07327k62630k32862l31599
5000A4530674k33325k04759j95344j58817j64025j90742k45978k51079k16425
4991A2670180k02998k90041k04774l16405l34549l06078k87403k20431k82208
4982A0225293k31639j04739j84418k27927j62377j26265j74394j45345j66700
4973H701489l1359j17872j01126j24461o6173o9449o5489l6870j14854j08262
4963G865574k50209r7726j04201p7467j06079k31039p7599j64277r8607j13090
4953F545280j50285j40128j02326j40283q7172r8294j26455n7729j02264p8216
$$ y = [20369255, 19865124, 19397770, 18863898, 18461738, 18127279, 17795266, 17516979, 17197359, 16905990, 16624244, 16357672, 16127282, 15874420, 15565092, 15357765, 15095135, 14862273, 14530674, 14297349, 14092590, 13897246, 13738429, 13574404, 13383662, 13137684, 12886605, 12670180, 12467182, 12177141, 11972367, 11655962, 11321413, 11015335, 10727932, 10507501, 10225293, 9993654, 9888915, 9704497, 9476570, 9314193, 9187928, 9013534, 8868189, 8701489, 8670130, 8552258, 8451132, 8326671, 8260498, 8191049, 8125560, 8088690, 7973836, 7865574, 7615365, 7517639, 7413438, 7335971, 7229892, 6998853, 6921254, 6756977, 6658370, 6545280, 6394995, 6254867, 6152541, 6012258, 5925086, 5826792, 5700337, 5642608, 5540344, 5462128]
4943E462128j17524o1873m961m2816q9908m9947k991j01334r6356j9159p3971
4932D801288q9002q5681l6615N3174K5719J6242l617r7327j7531J2777M416k1958
4920D561885l3192P6041P7079K1632O3614Q4463j5648J9183Q9742J08919R9906
4909E153624O9524k507k7573m7089k7505n6849m7786j6822j7222K8870L2831J8128
4897E059624K4722j735J431n0374O4590J6942N7832R8947Q797k3958P6119M1650
4885E374587n4308m6807q8363l7756p0827j6936n5545O508l3884m8921N5653q7462
4873D895939R322j2546l7367O8901P0857K9169l4871J09820O3774l1380R6831
4862E228449M2550p668P8168k2258M0125M5419L1454k4809j9091m7827L9926k1947
$$ y = [5462128, 5344604, 5282731, 5277770, 5234954, 5145046, 5095099, 5092108, 4990774, 4894418, 4875259, 4801288, 4712286, 4626605, 4589990, 4643164, 4668883, 4685125, 4681508, 4584181, 4566650, 4579427, 4583843, 4561885, 4528693, 4604734, 4681813, 4703445, 4767059, 4851522, 4835874, 4855057, 4944799, 5053718, 5153624, 5223148, 5220641, 5193068, 5145979, 5118474, 5061625, 5013839, 4997017, 4979795, 5008665, 5041496, 5059624, 5084346, 5082611, 5084042, 5033668, 5098258, 5115200, 5173032, 5271979, 5280776, 5256818, 5332937, 5374587, 5320279, 5273472, 5185109, 5147353, 5076526, 5059590, 5004045, 5010553, 4976669, 4927748, 4983401, 4895939, 4905261, 4892715, 4855348, 4924249, 4995106, 5024275, 4989404, 5099224, 5162998, 5131618, 5228449, 5270999, 5263331, 5341499, 5319241, 5359366, 5404785, 5436239, 5411430, 5392339, 5344512, 5384438, 5362491]
4850E362491L4802J26964N8492J0226R6472P0311l3511M1970O8001j0464L6294
4839E862048Q1036O4215J7665o3737P4587Q3679R9152l1252M3309J03447O4697
4828F398846R0494J07171K01516R9092O6663N1979J40464J13456J90178J08680
4818G568539J93014J97128K30240K49472K39169K89939K32982K59191K20527K75765
4808I955966L84147L54942L35826L84904M84237M01422N92529N80339O41322P87166
4798A4902800Q72449Q86126R74449J109896J290227J387380J483959J682513J847022
4789B6436821J941262K012477K036155J825598J596287J223080P80648M41212
4781C8293540J67140l2673j04037k14655k32620k13239j60535j17191o0684J51758
$$ y = [5362491, 5397293, 5524257, 5582749, 5592975, 5689447, 5759758, 5726247, 5768217, 5836218, 5825754, 5862048, 5943084, 6007299, 6024964, 5961227, 6035814, 6119493, 6218645, 6187393, 6230702, 6334149, 6398846, 6489340, 6596511, 6798027, 6897119, 6963782, 7015761, 7156225, 7269681, 7459859, 7568539, 7761553, 7958681, 8188921, 8438393, 8677562, 8967501, 9200483, 9459674, 9680201, 9955966, 10340113, 10695055, 11030881, 11415785, 11900022, 12301444, 12893973, 13474312, 14115634, 14902800, 15775249, 16661375, 17635824, 18745720, 20035947, 21423327, 22907286, 24589799, 26436821, 28378083, 30390560, 32426715, 34252313, 35848600, 37071680, 37852328, 38293540, 38460680, 38428007, 38323970, 38109315, 37876695, 37663456, 37502921, 37385730, 37325046, 37476804]
4771C7476804L41625N75970R11322J115091J519941J948774K229416K498686K799056
4762E1416685K926561L048810K855368K384675J887852J291050P72865M11638
4754F6995504O0997j28347n20528j113895j730850k310039k641306k906462k918150
4745E2786924k587434k318217j879115j507064j128773o82792l58180n4819K77963
4736D2548493K98651N10569M81473N16957K67375K78490J99169O4287j70300l37957
4726D4657207q03710j311395j857978k105189k425240k518329k394808k256555
4718B8984003k086000j847967j650621j385407j191461j198366r50817r25498
4710A7747866q09272o95653o71308n58615n20484n18494l72865l11191k96873
$$ y = [37476804, 37818429, 38394399, 39305721, 40420812, 41940753, 43889527, 46118943, 48617629, 51416685, 54343246, 57392056, 60247424, 62632099, 64519951, 65811001, 66583866, 66995504, 67056501, 66928154, 66407626, 65293731, 63562881, 61252842, 58611536, 55705074, 52786924, 50199490, 47881273, 46002158, 44495094, 43366321, 42683529, 42325349, 42270530, 42548493, 42847144, 43357713, 43839186, 44356143, 44623518, 44902008, 45101177, 45165464, 44995164, 44657207, 43853497, 42542102, 40684124, 38578935, 36153695, 33635366, 31240558, 28984003, 26898003, 25050036, 23399415, 22014008, 20822547, 19624181, 18673364, 17747866, 16938594, 16242941, 15571633, 15013018, 14492534, 13974040, 13601175, 13289984, 12993111]
4701A2993111k42401k67179k94249k53903m98216m47122m11262l41113k84133
4692I953533k84747k72765k23991k70920k01405n9641k4128j13954j65151j07162
4682H229669r5824m1583p4993p1527m3477r0241n7715k4565P4885m5095l0444
4671G729090o1789j23387k26346q8236j07371q4679r3354l8364j19809N2374k0956
4660F817173j9483L5598P5272J3732j8912p553N7206M4173J2384K3167Q3757k8950
4648G087564P2105R4559J00780M5915J11603J40741Q7745Q0182J62906J90775
4638H174875P8195J70405J44056J89485K08089K01756J82244K30309K61110K66154
4628A0106678K64523L08901L10709L17430L76371L58827M37558M83285M13077
$$ y = [12993111, 12750710, 12483531, 12189282, 11935379, 11437163, 10990041, 10578779, 10237666, 9953533, 9668786, 9396021, 9172030, 8901110, 8699705, 8640064, 8615936, 8501982, 8336831, 8229669, 8133845, 8092262, 8017269, 7945742, 7902265, 7812024, 7754309, 7729744, 7804629, 7759534, 7729090, 7667301, 7543914, 7317568, 7229332, 7121961, 7037282, 6943928, 6905564, 6785755, 6838129, 6817173, 6797690, 6833288, 6908560, 6922292, 6903380, 6895827, 6953033, 6997206, 7009590, 7032757, 7116514, 7087564, 7159669, 7254228, 7355008, 7400923, 7512526, 7653267, 7741012, 7821194, 7984100, 8174875, 8253070, 8423475, 8567531, 8757016, 8965105, 9166861, 9349105, 9579414, 9840524, 10106678, 10371201, 10680102, 10990811, 11308241, 11684612, 12043439, 12480997, 12964282, 13377359]
4619A3377359N46877O09620O40148P11390Q67446Q53654J087971J048216J180273
4610B0922954J344571J502293J693230J855216J981376K138787K359047K469115
4602C6266589K498416K432940K198295J786491J277296P75853K96521j34042l27834
4593D7070525l49583m38934m26081m23549m03838k44167o9235J30740K14428O05971
4583D5666277Q80211J147891J616680J957108K207793K441605K616363K607541
4575F1141469K558858K016760J365486P57927K77421j84292n41081p75933j032897
4566F5583718j508707j894770k318565k609569k785124k762698k617277k396729
4558D6690279k084647j676101j370162j042098p06276m41845j49495L2182L2559
$$ y = [13377359, 13924236, 14533856, 15174004, 15885394, 16752840, 17606494, 18694465, 19742681, 20922954, 22267525, 23769818, 25463048, 27318264, 29299640, 31438427, 33797474, 36266589, 38765005, 41197945, 43396240, 45182731, 46460027, 47235880, 47532401, 47398359, 47070525, 46720942, 46282008, 45855927, 45432378, 45028540, 44784373, 44715138, 44845878, 45060306, 45666277, 46546488, 47694379, 49311059, 51268167, 53475960, 55917565, 58533928, 61141469, 63700327, 65717087, 67082573, 67840500, 68117921, 67933629, 67392548, 66616615, 65583718, 64075011, 62180241, 59861676, 57252107, 54466983, 51704285, 49087008, 46690279, 44605632, 42929531, 41559369, 40517271, 39810995, 39369150, 39219655, 39251837, 39284396]
4549C9284396J66199K32678J24748J30912J47071R6001r5469k76583p40038j093435
4539C7976480j461598j733729k034282k060548j956515j800632j718540j495560
4531B3715076j261100j115887j020157q80808q15384n79029o45341o55961m55397
4522A6286012n28725l02758m76956l54828k73794l55582k68050k52936j56429
4513A3315954j01504j71410j94181j58792r3013j84865k02081j22703j39010n8312
4503A1890083n9500j04199p2580M3292k477p6319n1131l4741m2603K7581R2281
4492A1609687O1272J10637J15544Q7623J0831P0791M4929R5004P4940O401P8497
4481A2366156J16826J21762J51250R9216J71507J86437R3721J47221J37123J78988
$$ y = [39284396, 39450595, 39683273, 39808021, 39938933, 40086004, 40182005, 40086536, 39809953, 39069915, 37976480, 36514882, 34781153, 32746871, 30686323, 28729808, 26929176, 25210636, 23715076, 22453976, 21338089, 20317932, 19437124, 18621740, 18042711, 17397370, 16741409, 16286012, 15757287, 15454529, 14977573, 14622745, 14348951, 13993369, 13725319, 13472383, 13315954, 13214450, 13043040, 12848859, 12690067, 12597054, 12412189, 12210108, 12087405, 11948395, 11890083, 11830583, 11726384, 11653804, 11697096, 11694619, 11618300, 11567169, 11532428, 11489825, 11517406, 11609687, 11670959, 11781596, 11897140, 11984763, 11995594, 12066385, 12111314, 12206318, 12281258, 12287659, 12366156, 12482982, 12604744, 12755994, 12855210, 13026717, 13213154, 13306875, 13454096, 13591219, 13770207]
4471A3770207J36433J65748J94950J63425K56984K64362L17979L60115K81865
4462A5912068M20807M41109M71254L94882M25852M65841M07500L38111L86711
4453A9664135M02291M62048N55051N32310O56929N76503O83006P71086P66529
4444B5069888P80729R61939J035978J189775J372476J395005J648978J864828
4436C5319596K166748K511151L047016L564778M023153M747822N394322O152459
4428F6927045P187513Q052914R298681J1362125J4362750J8207318K0988935J9893407
4420A76280688J2172825J171450j0275672j8857658k0782707j9609224j6147330
4413A03952372j1687669q164839n859448m066712k841676j895141q32413Q9422
$$ y = [13770207, 13906640, 14072388, 14267338, 14430763, 14687747, 14952109, 15270088, 15630203, 15912068, 16332875, 16773984, 17245238, 17640120, 18065972, 18531813, 18939313, 19277424, 19664135, 20066426, 20528474, 21083525, 21615835, 22272764, 22849267, 23532273, 24303359, 25069888, 25850617, 26812556, 27848534, 29038309, 30410785, 31805790, 33454768, 35319596, 37486344, 39997495, 43044511, 46609289, 50632442, 55380264, 60774586, 66927045, 74114558, 82167472, 91466153, 102828278, 117191028, 135398346, 156387281, 176280688, 188453513, 189624963, 179349291, 160491633, 139708926, 120099702, 103952372, 92264703, 84099864, 78240416, 74173704, 71332028, 69436887, 68604474, 68693896]
4405F8693896P86528J521090K239969K965220M071730M973649O087788P694310
4397I9034180R960113J2810308J6173510J8722939J6538001Q831204J480992p101182
4389A76450065j7440942k0549341j8881221j7026395j3645538r969017p502458
4382G1435153n785397m517018l600277k937926k321349j883090j612536j464226
4374D7313334j236194j107427r87239p87678o73734m58832l94722k77664k08160
4365D1181684j08378j02287k6973J25971J70273K29874M09491M46526M51226P01742
4355D3479149P06979Q46302R28984R85219J202557J291171J334571J487145J600599
4346E3862676J700941J654806J680751J727048J624948J584499J453109J299513
$$ y = [68693896, 69480424, 71001514, 73241483, 76206703, 80278433, 85252082, 91339870, 99034180, 108994293, 121804601, 137978111, 156701050, 173239051, 182070255, 183551247, 176450065, 159009123, 138459782, 119578561, 102552166, 88906628, 78937611, 71435153, 65649756, 61132738, 57532461, 54594535, 52273186, 50390096, 48777560, 47313334, 46077140, 44969713, 43982474, 43194796, 42521062, 42062230, 41667508, 41389844, 41181684, 41073306, 40971019, 40944046, 41070017, 41240290, 41470164, 41879655, 42326181, 42777407, 43479149, 44186128, 45032430, 45961414, 46946633, 48149190, 49440361, 50774932, 52262077, 53862676, 55563617, 57218423, 58899174, 60626222, 62251170, 63835669, 65288778, 66588291]
4338F6588291J276991J223712J075645J184795R91375J017363J008058J139839
4330G5506069J200827J581065J807213K026272K512008K825857L103804L336637
4322I3899752L581053L691348M040181M171915M273102M402620M227712L703951
4314A25991634K892463J337202n02065k040381l502737m019278m140851l726910
4306A12289077l067355k126658j409744o56572J32675Q07586J389038J744478
4298A09102525K109414K169964J889499J348984N93459n32767j566735k611517
4290A12502826l474487m164241m634897m876656m690978m392251m046432l740006
4282G8482878l224138k917759k702099k173152k068306j691787j478923j242569
$$ y = [66588291, 67865282, 69088994, 70164639, 71349434, 72340809, 73358172, 74366230, 75506069, 76706896, 78287961, 80095174, 82121446, 84633454, 87459311, 90563115, 93899752, 97480805, 101172153, 105212334, 109384249, 113657351, 118059971, 122287683, 125991634, 128884097, 130221299, 129719234, 127678853, 124176116, 120156838, 116015987, 112289077, 109221722, 107095064, 105685320, 105028748, 105161423, 105969009, 107358047, 109102525, 111211939, 113381903, 115271402, 116620386, 117213845, 116681078, 115114343, 112502826, 109028339, 104864098, 100229201, 95352545, 90661567, 86269316, 82222884, 78482878, 75258740, 72340981, 69638882, 67465730, 65397424, 63705637, 62226714, 60984145]
4274F0984145r68205p51530n84078l42076l6616J17636L32199M28632O49975P80736
4264F0610818J044640J261169J457263J762918J926951K221346K406209K642447
4256G5333761K819495K935915L115103L220807L235115L114957L001316K791488
4248I9567957K467147K120621J663904J273895Q44139L88714Q1865k85202l09468
4239A07813572l68687k98811k15146L1977K54740N17275P74181Q79419R98420
4230A10386940J194008J163034J078426R38157N70984J64305l47050p81633j304819
4221A13062352j847886k113232k322214k560299k748535k855600k823087k746485
4213I3045014k734809k494702k304743k172618j933291j764840j590258j477651
$$ y = [60984145, 60015940, 59264410, 58680332, 58338256, 58301640, 58419276, 58751475, 59180107, 59830082, 60610818, 61655458, 62916627, 64373890, 66136808, 68063759, 70285105, 72691314, 75333761, 78153256, 81089171, 84204274, 87425081, 90660196, 93775153, 96776469, 99567957, 102035104, 104155725, 105819629, 107093524, 107937663, 108326377, 108408242, 108123040, 107813572, 107444885, 107146074, 106930928, 106962905, 107217645, 107734920, 108509101, 109388520, 110386940, 111580948, 112743982, 113822408, 114760565, 115331549, 115495854, 115148804, 114367171, 113062352, 111214466, 109101234, 106779020, 104218721, 101470186, 98614586, 95791499, 93045014, 90310205, 87815503, 85510760, 83338142, 81404851, 79640011, 78049753, 76572102]
4205G6572102j406970j272156j221440j217028j236434j197644j188829j144416
4197F6687185j218017j379499j358262j429125j416850j311832j382742j398724
4189E5792134j324200j317077j210595j133307r63800q74139o74720o13203n11856
4180D7169237k40913k04643r0460P7962K32100J70448K71383K99054M32387L96141
4170D8512696N02623N87878O95486Q06595R49200J193463J263829J345655J483545
4161E7340970J736496J927263K209352K458207K811242L194010L549150L955933
4153G9182623M516859N105905N723170O692820P840984Q919772J0237498J1451333
4145A39670964J2930015J4631926J6742417J9149088K1826885K4938049K8734796
$$ y = [76572102, 75165132, 73892976, 72671536, 71454508, 70218074, 69020430, 67831601, 66687185, 65469168, 64089669, 62731407, 61302282, 59885432, 58573600, 57190858, 55792134, 54467934, 53150857, 51940262, 50806955, 49843155, 48969016, 48294296, 47681093, 47169237, 46928324, 46723681, 46633221, 46711183, 46943283, 47113731, 47385114, 47684168, 48116555, 48512696, 49015319, 49603197, 50298683, 51105278, 52054478, 53247941, 54511770, 55857425, 57340970, 59077466, 61004729, 63214081, 65672288, 68483530, 71677540, 75226690, 79182623, 83699482, 88805387, 94528557, 101221377, 109062361, 117982133, 128219631, 139670964, 152600979, 167232905, 183975322, 203124410, 224951295, 249889344, 278624140]
4138B78624140L2433248L4251051L1514354K1592004M486014j4156214k7967445
4131C60777152l5477145l7515526l4934856l0035576k4940155k0491013j6990094
4124A60392787j4118431j1976028j0136861q806380p606189o781022o007528n459896
4116H9500452m848416m257977l900433l476914l046104k717644k465461k255319
4108F2532184k148075j951375j904751j753819j629311j513867j346741j216519
4100D9067726j252505j254685j320547j495481j475000j558055j443273j297041
4092C7971139j312722j167426j093847j016656r75228r30474r65460q63138q08077
4083B8838111p88253p17075o01832o31272o73748o34163n85518n29878m56101
$$ y = [278624140, 311057388, 345308439, 376822793, 398414797, 402900811, 388744597, 360777152, 325300007, 287784481, 252849625, 222814049, 197873894, 177382881, 160392787, 146274356, 134298328, 124161467, 115355087, 107748898, 100967876, 94960348, 89500452, 84652036, 80394059, 76493626, 73016712, 69970608, 67252964, 64787503, 62532184, 60384109, 58432734, 56527983, 54774164, 53144853, 51630986, 50284245, 49067726, 47815221, 46560536, 45239989, 43744508, 42269508, 40711453, 39268180, 37971139, 36658417, 35490991, 34397144, 33380488, 32405260, 31474786, 30509326, 29646188, 28838111, 28049858, 27332783, 26730951, 26099679, 25425931, 24791768, 24206250, 23676372, 23220271]
4074B3220271n63629m60832m33979m15924l92990l49848k78647k97930k88465
4065A9738027l40277k76250l07518k65568j62036k45622k87950k57825k13475
4056A7381506k27523k18731k47348k16693k19576j99050j72627j76323o0106j63548
4046A5479981j72530j96699k40740k40792k49149k20131k61290k29726k44626
4037A3424298k37827j51620r3374k10849k10976j26990j27725j27446j43049j86000
4027A1808442j82880p3937r4837j92765j32845j8521n7139j30670l5680p1817
4017A0817351m1356j03980q4407J0079j471K7405K7125O2561R253Q7742R113k1830
4005A0797585j56605j31716j82488k49290j36155j61817j09198o5920j88083l5978
$$ y = [23220271, 22656642, 22195810, 21761831, 21345907, 20952917, 20603069, 20324422, 20026492, 19738027, 19397750, 19121500, 18813982, 18548414, 18386378, 18140756, 17852806, 17594981, 17381506, 17153983, 16935252, 16687904, 16471211, 16251635, 16052585, 15879958, 15703635, 15643529, 15479981, 15307451, 15110752, 14870012, 14629220, 14380071, 14159940, 13898650, 13668924, 13424298, 13186471, 13034851, 12941477, 12730628, 12519652, 12392662, 12264937, 12137491, 11994442, 11808442, 11625562, 11551625, 11456788, 11264023, 11131178, 11112657, 11055518, 10924848, 10889168, 10817351, 10775995, 10672015, 10587608, 10597687, 10596216, 10623621, 10650746, 10713307, 10722560, 10810302, 10819415, 10797585, 10640980, 10509264, 10326776, 10077486, 9941331, 9779514, 9670316, 9604396, 9416313, 9380335]
3995I380335j2330o8252p8891j3772j00136k6238q8365q254l1257M7352M3324
3984I043516K6330k3143j37152J09766P0434r2676l571j8803m2855O9476L7929
3973I039251n173N5117l8370q5116R1857m7849j3201K434K5546k6691O973p2902
3961H931876l498Q4134r1997Q882j2925N3100N3695k0392M2653M1621P1943M022
3949I163114N6557Q8080n3168M2946N0694J45813J27888J30496O9157Q4966O0270
3938I966813J93738J65616K03215K59964K41913K75303L17305M07363L40848M48339
3928A2820417L21293K48330K61595L1634j30822j2088r2850l0661j30968r1185
3918A3194695j03066j21291k43363k69347k06611k26692k21922j98619k72824
$$ y = [9380335, 9368005, 9299753, 9220862, 9207090, 9106954, 9080716, 8992351, 8984097, 8952840, 9000192, 9043516, 9069846, 9046703, 8909551, 9019317, 9089751, 8997075, 8993504, 8974701, 8931846, 9001322, 9039251, 9034078, 9089195, 9050825, 8965709, 9057566, 9009717, 8996516, 8998950, 9024496, 8997805, 9004778, 8931876, 8928378, 9012512, 8920515, 8929397, 8916472, 8969572, 9023267, 9002875, 9045528, 9087149, 9159092, 9163114, 9219671, 9307751, 9254583, 9297529, 9348223, 9494036, 9621924, 9752420, 9821577, 9906543, 9966813, 10160551, 10326167, 10529382, 10789346, 11031259, 11306562, 11623867, 12031230, 12372078, 12820417, 13141710, 13390040, 13651635, 13683269, 13552447, 13540359, 13447509, 13416848, 13285880, 13194695, 13091629, 12970338, 12726975, 12457628, 12251017, 12024325, 11802403, 11603784, 11330960]
3909A1330960k95216k29787j89065k52004k25981j64942j00246j40931j46873
3900I585915j56621m9671k2828o7999q5008o0788j0436L949K80K1701j1828L5670
3888I182336K5851m6945M4692p0895p4785m3741j41799q4711j49861k4916o385
3877H608841n6597l2293K3289N9167n501J25134R0830J8710L3254k987J36522
3866H998369J24227O6138O6076K36226J12414O9966R7626n6989m9081p8397j86708
3855I399867j52500q8492k07589j1206j04645j16582p4280p2118o1561n109m5399
3844H460386R0195J9329P9715L0968P3866J21465Q6060J5283J13610J97051J05906
3833I393834J40719J70225J62432K24494J63697K98813K94961L28081L77398L11323
$$ y = [11330960, 11035744, 10805957, 10616892, 10364888, 10138907, 9973965, 9873719, 9732788, 9585915, 9429294, 9379623, 9356795, 9288796, 9203788, 9143000, 9132564, 9136513, 9136793, 9158494, 9146666, 9182336, 9208187, 9161242, 9205934, 9135039, 9060254, 9016513, 8874714, 8790003, 8640142, 8615226, 8608841, 8552244, 8519951, 8543240, 8602407, 8596906, 8722040, 8812870, 8831580, 8864834, 8861847, 8998369, 9122596, 9188734, 9254810, 9491036, 9603450, 9673416, 9771042, 9714053, 9664972, 9586575, 9399867, 9247367, 9158875, 8951286, 8940080, 8835435, 8718853, 8644573, 8572455, 8510894, 8505785, 8460386, 8550581, 8569910, 8649625, 8680593, 8754459, 8875924, 8961984, 8977267, 9090877, 9287928, 9393834, 9534553, 9704778, 9867210, 10091704, 10255401, 10554214, 10849175, 11177256, 11554654, 11865977]
3823A1865977L17184K74610K13044J24072N873j76277j82730j97019j00331k14326
3813A1930077j36160m7493J01667J10358k013P0978P3509K02620K40498L2669
3803A2576710J11170J82646J65898J98007K20949K68951K24762M00642L00301
3794A4650036K53213L62518L23501M30168M26327M51651N08266N25003N73709
3785A8504392N97427N94766N96678O78366P15627P27638Q13291R10589J034569
3776B5173343R61915J038176J121254J121299J165492J374831J446607J445569
3768C4848486J566834J603512J741381J858820J903579K055751K053657K303913
3760D9935933K339562K422374K610458K788078K716763K796307K997426K904602
$$ y = [11865977, 12183161, 12457771, 12670815, 12794887, 12800760, 12624483, 12441753, 12244734, 12144403, 11930077, 11793917, 11746424, 11848091, 11958449, 11956436, 12027414, 12100923, 12303543, 12544041, 12576710, 12687880, 12870526, 13036424, 13234431, 13455380, 13724331, 13949093, 14349735, 14650036, 14903249, 15265767, 15589268, 16019436, 16445763, 16897414, 17405680, 17930683, 18504392, 19101819, 19696585, 20293263, 20971629, 21687256, 22414894, 23228185, 24138774, 25173343, 26135258, 27173434, 28294688, 29415987, 30581479, 31956310, 33402917, 34848486, 36415320, 38018832, 39760213, 41619033, 43522612, 45578363, 47632020, 49935933, 52275495, 54697869, 57308327, 60096405, 62813168, 65609475, 68606901, 71511503]
3752G1511503L081314L133161L185711L222505L266176L207242L307825L322583
3744I7238020L186794L183929L205754L063878K819986K656704K483119K340193
3736A20178377K123945J776251J662987J349848J122918R61169O54711L10419
3728A30140625L029k38749n57288q81951j264298j484589j778628j929220k061901
3719A19947030k314040k460077k629779k829625k927350l096675l219447l254053
3711I7215984l435117l551641l452209l429467l483111l339444l278530l255488
3703F9990977l139154l045690k964041k880126k868288k734149k690795k467928
3695D7200806k387101k225114k108906k009113j821104j774738j639285j572396
$$ y = [71511503, 74592817, 77725978, 80911689, 84134194, 87400370, 90607612, 93915437, 97238020, 100424814, 103608743, 106814497, 109878375, 112698361, 115355065, 117838184, 120178377, 122302322, 124078573, 125741560, 127091408, 128214326, 129175495, 129830206, 130140625, 130143654, 129904905, 129347617, 128465666, 127201368, 125716779, 123938151, 122008931, 119947030, 117632990, 115172913, 112543134, 109713509, 106786159, 103689484, 100470037, 97215984, 93780867, 90229226, 86777017, 83347550, 79864439, 76524995, 73246465, 69990977, 66851823, 63806133, 60842092, 57961966, 55093678, 52359529, 49668734, 47200806, 44813705, 42588591, 40479685, 38470572, 36649468, 34874730, 33235445, 31663049]
3687C1663049j502629j362116j201717j224228j122436j018341r75969q67332
3679B2388281q83967p62457o75148p43596o51305n65902m94546n03897n77053
3670A6530410n35667m55844m05455m56176l54299l59017l68889l93100k23596
3661A2978367k97300l30748k53617k86082k78886k29884k20586k59202j34732
3652A0687330k19386j65471r4973j63826k00053j57757j73962j17848p9621o2725
3642I251708j65551p9733j12048k2770O916r7286j28933j0575m3611J112n1457
3631H547772m8884q5345k8106o7367l1096q2829j89044o8112m5255j9140n5307
3620G827287j38174m4434m8985j24491r1750j15596j3130q4254j01695r1730r7573
$$ y = [31663049, 30160420, 28798304, 27596587, 26372359, 25249923, 24231582, 23255613, 22388281, 21504314, 20741857, 20066709, 19323113, 18671808, 18105906, 17611360, 17107463, 16530410, 15994743, 15538899, 15133444, 14677268, 14322969, 13963952, 13595063, 13201963, 12978367, 12681067, 12350319, 12096702, 11810620, 11531734, 11301850, 11081264, 10822062, 10687330, 10467944, 10302473, 10207500, 10043674, 9843621, 9685864, 9511902, 9394054, 9314433, 9251708, 9086157, 9006424, 8894376, 8871606, 8878522, 8781236, 8652303, 8641728, 8598117, 8599229, 8547772, 8498888, 8413543, 8385437, 8318070, 8286974, 8204145, 8015101, 7946989, 7901734, 7882594, 7827287, 7689113, 7644679, 7595694, 7471203, 7379453, 7263857, 7250727, 7166473, 7064778, 6973048, 6875475]
3609F875475k5346p33j15885j6757o6389n9097j14180m9034m6376j15154q7705
3598F178819o681M7070J9688n4337R405O7444q2477o4865n0671o3565J0248j5942
3586E994136M536K028m1106j2825k2913l5158P9712l904r0180k26n6725l7187
3574E780188O4803K4167L307J5916J3394P1646J20086J6271j2036K7014L7410
3563F162166K93P4418R9396K9998j4430L0874l1477P193J52850O0896j8074P3923
3551F628026P8307K7237N3350Q9314J04015L3759Q796j7025J16219J4292J37277
3540G273567J69031J19746J17189P1835N3853J53405J58213R3252L6818J17113
3530H364022J61570J41331J05084N2280J21772J20425L8606J29006R3875M6859
$$ y = [6875475, 6850129, 6849396, 6733511, 6716754, 6650365, 6591268, 6477088, 6428054, 6381678, 6266524, 6178819, 6172138, 6219208, 6238896, 6184559, 6193964, 6261408, 6178931, 6114066, 6063395, 5999830, 6010078, 5994136, 5998672, 6000700, 5959594, 5946769, 5923856, 5888698, 5968410, 5964506, 5874326, 5874100, 5817375, 5780188, 5844991, 5869158, 5872465, 5888381, 5901775, 5973421, 6093507, 6109778, 6097742, 6124756, 6162166, 6162459, 6236877, 6336273, 6366271, 6351841, 6382715, 6351238, 6358431, 6511281, 6572177, 6554103, 6628026, 6706333, 6733570, 6786920, 6876234, 6980249, 7014008, 7022804, 7005779, 7121998, 7136290, 7273567, 7442598, 7562344, 7679533, 7751368, 7805221, 7958626, 8116839, 8210091, 8246909, 8364022, 8525592, 8666923, 8772007, 8824287, 8946059, 9066484, 9105090, 9234096, 9327971, 9374830]
3520I374830J72359R9138L2704J40558J48085J29539N2458Q6394J72287O6720
3510A0475072J10865k0825J13617K00999P3943R2175Q0360J76035J14284J27195
3500A1543720J49437J24631K46918J22799J45182J55405J65640J88045J78704
3491A3020481K22557K42544J80682L05719K19122K39274L20396K52802K45897
3482A5249474L38387L79510K62880M23111L68838M03626N16577M42621M81247
3473A8866271M45308N90942N25514N94505N55222O01705N71951O96604O98812
3464B4146834P07329P23123Q10754Q32721P76622Q56859R48692R68083R18470
3455C1689487J041820J019405J076922J118904J252930J274753J296440J370909
$$ y = [9374830, 9547189, 9646327, 9679031, 9819589, 9967674, 10097213, 10149671, 10236065, 10408352, 10475072, 10585937, 10565112, 10678729, 10879728, 10953671, 11045846, 11126206, 11302241, 11416525, 11543720, 11693157, 11817788, 12064706, 12187505, 12332687, 12488092, 12653732, 12841777, 13020481, 13243038, 13485582, 13666264, 13971983, 14191105, 14430379, 14750775, 15003577, 15249474, 15587861, 15967371, 16230251, 16653362, 17022200, 17425826, 17942403, 18385024, 18866271, 19311579, 19902521, 20428035, 21022540, 21577762, 22179467, 22751418, 23448022, 24146834, 24854163, 25577286, 26388040, 27220761, 27997383, 28854242, 29802934, 30771017, 31689487, 32731307, 33750712, 34827634, 35946538, 37199468, 38474221, 39770661, 41141570]
3447D1141570J558894J441546J518969J636077J686506J784057J645394J697211
3439E4110224J750739J600757J627357J627746J519504J417323J395311J292679
3431F6341640J433529J347031J262101J150317J169822J035810R10756P02963
3423G5353969O24238O03892M11246L89953M71557N05414N42027N04278N66822
3414G9973396O38986O11381Q02274P57828P50974R20844R79362J098380J194333
3405H7727758J395245J580079J735144J914553K066856K343088K698713K809257
3397A04270693L049721L323124L544396L672478L839765M079820M064832M370573
3389A34215402M268892M103968M039884L883658L665481L520144L288290L236061
$$ y = [41141570, 42700464, 44142010, 45660979, 47297056, 48983562, 50767619, 52413013, 54110224, 55860963, 57461720, 59089077, 60716823, 62236327, 63653650, 65048961, 66341640, 67775169, 69122200, 70384301, 71534618, 72704440, 73740250, 74651006, 75353969, 75978207, 76582099, 76993345, 77383298, 77854855, 78360269, 78902296, 79406574, 79973396, 80612382, 81223763, 82026037, 82783865, 83534839, 84455683, 85435045, 86533425, 87727758, 89123003, 90703082, 92438226, 94352779, 96419635, 98762723, 101461436, 104270693, 107320414, 110643538, 114187934, 117860412, 121700177, 125779997, 129844829, 134215402, 138484294, 142588262, 146628146, 150511804, 154177285, 157697429, 160985719, 164221780]
3381A64221780L042025K845097K530534K217703J894656J447683Q39639L88874
3373A79427991o5185n23043j019774j380456j597786j656271j789217j999974
3365A69396285k021379k223869k285725k343567k305724k343590k277669k044560
3357A51550202j969155j570422j202182q56939o21345k93650O8353L43159N68066
3348A46016087P71101J002709J085213J132081J146695J212109J174902J338805
3340A54879702J346920J466853J352645J354957J257189J199216Q00180N82662
3332A64240324J48909k92775o74583j435706j745298k091861k488626k715467
3324A52944917k943459k970850l115236l166413l023484l123983l108986l217011
$$ y = [164221780, 167263805, 170108902, 172639436, 174857139, 176751795, 178199478, 179039117, 179427991, 179362806, 178839763, 177819989, 176439533, 174841747, 173185476, 171396259, 169396285, 167374906, 165151037, 162865312, 160521745, 158216021, 155872431, 153594762, 151550202, 149581047, 148010625, 146808443, 145951504, 145330159, 145036509, 145104862, 145448021, 146016087, 146787188, 147789897, 148875110, 150007191, 151153886, 152365995, 153540897, 154879702, 156226622, 157693475, 159046120, 160401077, 161658266, 162857482, 163657662, 164240324, 164389233, 164096458, 163421875, 161986169, 160240871, 158149010, 155660384, 152944917, 150001458, 147030608, 143915372, 140748959, 137725475, 134601492, 131492506, 128275495]
3316A28275495l255351l360920l424034l382361l194065l007012k777445k469960
3308A03404347k029766j571918j131405p71857l80620J18528M74682Q28941J273084
3299A00214016J533614J743436K176225K528773K803268L251735L527372L885094
3291A21663533M510404N037301N789570O331084P124428Q026436Q893173R692002
3283A77067931J0455592J1449003J2153443J2899729J3325216J3550326J3164279
3276B64065519J2250607J0723811Q835331O600855M363143K385636O40049o82048
3268C09182903j589608k143478k601545l197281m000215m985941o328907q125147
3260B76210781j0143785j1874947j3497738j4537781j5180401j5135037j4584500
$$ y = [128275495, 125020144, 121659224, 118235190, 114852829, 111658764, 108651752, 105874307, 103404347, 101374581, 99802663, 98671258, 97899401, 97518781, 97637309, 98111991, 98940932, 100214016, 101747630, 103491066, 105667291, 108196064, 110999332, 114251067, 117778439, 121663533, 126173937, 131211238, 137000808, 143331892, 150456320, 158482756, 167375929, 177067931, 187523523, 198972526, 211125969, 224025698, 237350914, 250901240, 264065519, 276316126, 287039937, 295875268, 302476123, 306839266, 309224902, 309864951, 309182903, 307593295, 305449817, 302848272, 299650991, 295650776, 290664835, 284335928, 276210781, 266066996, 254192049, 240694311, 226156530, 210976129, 195841092, 181256592]
3253A81256592j3776894j2711886j1517960j0362624r284350q305497p438734
3246A07858647o689189n934761n354648m916413m430434m015087l733931l376700
3238F9407484l032168k995568k700491k418060k383534k209699j982435j945144
3230D9740385j749336j665910j701381j512872j477508j400897j436891j337216
3222C7458374j191504j187453j115836j039501r52003r91004r41602q26605q25083
3213B8387783p36758o70774q05878o82461p12195p18043o27766n60265n20930
3204B2352713o15175n65593m92919m98452m10201n25779m20012m46273m41861
3195A7936448m31978l90109l87787l81460l56805l70703l69229l96591k35558
$$ y = [181256592, 167479698, 154767812, 143249852, 132887228, 123602878, 115297381, 107858647, 101169458, 95234697, 89880049, 84963636, 80533202, 76518115, 72784184, 69407484, 66375316, 63379748, 60679257, 58261197, 55877663, 53667964, 51685529, 49740385, 47991049, 46325139, 44623758, 43110886, 41633378, 40232481, 38795590, 37458374, 36266870, 35079417, 33963581, 32924080, 31972077, 30981073, 30039471, 29212866, 28387783, 27651025, 26980251, 26174373, 25491912, 24779717, 24061674, 23433908, 22873643, 22352713, 21737538, 21171945, 20679026, 20180574, 19770373, 19244594, 18824582, 18378309, 17936448, 17504470, 17114361, 16726574, 16345114, 15988309, 15617606, 15248377, 14851786, 14616228]
3186A4616228l23525l42704k57300l15411k52710k53847k95581k17993k39004
3177A2118153j93370k26521k50532k05058j93856j32827k30888k16908k43407
3168A0224786r4008j04790k43211j07307r8037j40407j42155l7864j12980j99291
3158H944736j69282j40995j15657j22671r5436r1404n8035q9476j48675j22397
3148G790708j25955k5414n8698p3721j31381n1289j02202K6743j8775r3507r2508
3137G044001p9369K0788O3816p9227L8755L7624k3254q126K5170N9781k4640J0021
3125G085340Q163J6025R5980K7514N3646O6675J44485O7096R4519Q5282J56808
3114G901533J70562J68372J29513J35346J49258J52368K35481K51238K51205J84430
$$ y = [14616228, 14292703, 13949999, 13692699, 13377288, 13124578, 12870731, 12575150, 12357157, 12118153, 11924783, 11698262, 11447730, 11242672, 11048816, 10915989, 10685101, 10468193, 10224786, 10130778, 10025988, 9782777, 9675470, 9577433, 9437026, 9294871, 9257007, 9144027, 8944736, 8775454, 8634459, 8518802, 8396131, 8300695, 8209291, 8151256, 8061780, 7913105, 7790708, 7664753, 7639339, 7580641, 7506920, 7375539, 7324250, 7222048, 7248791, 7230016, 7136509, 7044001, 6964632, 6985420, 7049236, 6970009, 7008764, 7046388, 7023134, 7015008, 7040178, 7099959, 7075319, 7085340, 7093503, 7109528, 7205508, 7233022, 7286668, 7353343, 7497828, 7564924, 7659443, 7744725, 7901533, 8072095, 8240467, 8369980, 8505326, 8654584, 8806952, 9042433, 9293671, 9544876, 9729306]
3104I729306K19215l837Q0866n0868k41127k02452k71003k80320k17915j50500
3094H611365l01952k41617q4837k04629j48813j96210p7829j28463r1123p3460
3084G062432j62881j14741p0060j41441r1546j78169p3732j42049p4984j24115
3074E888714p3851j00467j78056j15897l0242r2987j51590j00562p9597r8516
3064D866949j36708l0642j58790o0979n3848l1837o2362j22859j27142m8744o6589
3053C966449j0686r0782p8114o6569r1844j9180k7459n9186q8920j28383k429
3042C302897M1549j4573p1313j14674o6127J1215M463K0400j1021N044m0276j3612
3030C053972J9405m4808R1139j08804L0207k9163L7482J29205J03875k8248J1868
$$ y = [9729306, 9948521, 9944684, 10025550, 9974682, 9733555, 9531103, 9260100, 8979780, 8761865, 8611365, 8309413, 8067796, 7982959, 7778330, 7629517, 7433307, 7355478, 7227015, 7135892, 7062432, 6899551, 6784810, 6714750, 6573309, 6481763, 6303594, 6229862, 6087813, 6012829, 5888714, 5814863, 5714396, 5536340, 5420443, 5390201, 5297214, 5145624, 5045062, 4965465, 4866949, 4730241, 4699599, 4540809, 4479830, 4425982, 4394145, 4331783, 4208924, 4081782, 4033038, 3966449, 3955763, 3864981, 3786867, 3720298, 3628454, 3609274, 3581815, 3522629, 3433709, 3305326, 3302897, 3344446, 3329873, 3258560, 3143886, 3077759, 3088974, 3093437, 3113837, 3102816, 3107860, 3067584, 3053972, 3073377, 3028569, 3119708, 3010904, 3041111, 3011948, 3049430, 3178635, 3282510, 3254262, 3266130]
3019C266130O4616n982J26996P3836o9957M4872l0720l8383j3125K0920K190r31
3007C440462L065q0007o1314p7758m0825j4348j66077r3282L0589j48766q593
2996B783146l6189p5069j27869j23691l8442l4718j46740k5733k1867q3721p0773
2985A998334m6489L910m1887m2387N880k4054L873p2063j6946l1795J9561q1738
2973A674199n3831K3592K2870M8761j8135N311j42507k8275N6352N6659o7227
2962A577769K2063M0867j33925o7471K5088M2320l1074r747J480j2136k4081J0214
2950A441367L0750m7335p3410J9469l120P257l3131k9024J1471j9898J6081o1298
2938A259179j364M9050l7939l045l0626L0140r6994J8497O7175n3973n708q0618
$$ y = [3266130, 3330746, 3324764, 3451760, 3525596, 3455639, 3500511, 3469791, 3431408, 3418283, 3439203, 3441393, 3440462, 3443527, 3363520, 3302206, 3224448, 3183623, 3169275, 3003198, 2909916, 2940505, 2791739, 2783146, 2746957, 2671888, 2544019, 2420328, 2381886, 2347168, 2200428, 2174695, 2152828, 2069107, 1998334, 1951845, 1955755, 1913868, 1871481, 1877361, 1853307, 1857180, 1785117, 1768171, 1736376, 1755937, 1674199, 1620368, 1643960, 1666830, 1715591, 1697456, 1702767, 1560260, 1531985, 1588337, 1644996, 1577769, 1599832, 1640699, 1506774, 1439303, 1464391, 1506711, 1475637, 1465890, 1467370, 1455234, 1431153, 1441367, 1472117, 1424782, 1351372, 1370841, 1367721, 1374978, 1341847, 1312823, 1324294, 1304396, 1320477, 1259179, 1257815, 1306865, 1268926, 1265881, 1235255, 1265395, 1168401, 1186898, 1254073, 1200100, 1194392, 1113774]
2926A113774l3796M7596n685N375l6466o3675k167l6883n7463K1549p743L1303
2914I75719l8966K3542j2548R8327k7768k9108j9602Q5389L463j12234J8457l8269
2902I26402M0651O1439J1495o8933r111K0919J56611l5352l7188k6968M0620K4662
2890A105247p624K8089L7432j47310N7858K965O2404l1382r9570P3869j7884r4662
2878I69432J4994M1132j4209m994j6292J0385o5265P0400R2400L0901m6187n3429
2866A029268J60610P8846o9170J088J05010K4810M3888Q5628L4342j8184r2352
2855A383784r5202L0709K6823K4045n0147Q5477j02952q2199J539q3229k912k339
2843A133397r8145j5022m6204r213L6709r5121P4611J0693O5706j7339M7204l4388
$$ y = [1113774, 1079978, 1127574, 1121889, 1127264, 1090798, 1027123, 1024956, 988073, 930610, 952159, 944416, 975719, 936753, 960295, 947747, 1046074, 1018306, 989198, 969596, 1054985, 1058448, 946214, 964671, 926402, 967053, 1028492, 1039987, 971054, 961943, 982862, 1139473, 1104121, 1066933, 1039965, 1080585, 1105247, 1097623, 1125712, 1163144, 1015834, 1073692, 1076657, 1139061, 1107679, 1008109, 1081978, 1064094, 969432, 984426, 1025558, 1011349, 1006355, 990063, 1000448, 935183, 1005583, 1097983, 1128884, 1082697, 1029268, 1189878, 1268724, 1199554, 1200642, 1305652, 1330462, 1374350, 1459978, 1494320, 1476136, 1383784, 1288582, 1319291, 1346114, 1370159, 1320012, 1405489, 1302537, 1220338, 1221877, 1138648, 1135736, 1133397, 1035252, 1020230, 974026, 964813, 1001522, 906401, 981012, 991705, 1057411, 1040072, 1087276, 1052888]
2831A052888M387J04163M2882J3254O9767j931O8687p7568L3917l5350j09900
2820A165196M5477M0592n098O0309L6495q3030l1837K3870n7904j2568K6034L0765
2808A238301j17801M7404j9317j13272Q7043J4246M8860n7758m37O8245K3902
2797A219416N2549R8327L2671k1381p2319m3115R187N4696k0833j09687n794j6134
2785A177583j1214M0275o5041K1186L5544j6166L3349K8185j3302k0039J4910
2774A225270q240K5283L4017k1618l4262P2886J06363r2625p4180L9602M4122
2763A316618j342J5989m2727o9148L4013R1080K4482L3002j5349K1468k3685P2408
2751A456809P351N1793R3794N7002O2903J02875J67397Q8562K1993L2764J11014
$$ y = [1052888, 1057275, 1161438, 1204320, 1217574, 1287341, 1285410, 1354097, 1276529, 1310446, 1275096, 1165196, 1210673, 1251265, 1246167, 1306476, 1342971, 1259941, 1228104, 1251974, 1194070, 1181502, 1207536, 1238301, 1120500, 1167904, 1148587, 1035315, 1122358, 1136604, 1185464, 1127706, 1127269, 1195514, 1219416, 1271965, 1370292, 1402963, 1381582, 1309263, 1266148, 1275335, 1330031, 1309198, 1199511, 1193717, 1177583, 1166369, 1206644, 1141603, 1162789, 1198333, 1182167, 1215516, 1243701, 1230399, 1210360, 1225270, 1217030, 1242313, 1276330, 1254712, 1220450, 1293336, 1399699, 1307074, 1232894, 1272496, 1316618, 1315276, 1331265, 1288538, 1219390, 1253403, 1344483, 1368965, 1401967, 1386618, 1408086, 1384401, 1456809, 1464160, 1515953, 1609747, 1666749, 1729652, 1832527, 1999924, 2088486, 2110479, 2143243, 2254257]
2740B254257J14518P0761l2330j00090r3072j13139r9001j18984j14112j69470
2730A599338j78123r0770r0832n9235p5832K1178M293j23936j13435K8591m804
2719I16433j02865l2506m6997k8561r6284o962M9404k6092k6325q4346N9097o227
2707E67769m6484K8780l6834n7541j2844r555M3489p6124l9794o2980M2867K8646
2695C69395j26138j9265J10346m0484K5168N0549q6020L1150m1J755n437o1852
2683B49126p037o3804O9668j6180j5349N5137n9874l5205J0371j0254j0518o4118
2671A01963k9983N3931k3650K0481n0937R250l5183J4328L0869k1944J7193P437
2659I3755n0291j462R2732K1762l2665J9249K3269l4686m1704J940n3970K8384
$$ y = [2254257, 2368775, 2439536, 2407206, 2307116, 2214044, 2100905, 2001904, 1882920, 1768808, 1599338, 1421215, 1330445, 1239613, 1180378, 1104546, 1125724, 1130017, 1006081, 892646, 921237, 916433, 813568, 781062, 734065, 705504, 609220, 602258, 651662, 625570, 599245, 514899, 573996, 567769, 521285, 550065, 513231, 455690, 442846, 433291, 476780, 400656, 360862, 297882, 340749, 369395, 243257, 223992, 334338, 293854, 319022, 369571, 283551, 314701, 314660, 316415, 310978, 249126, 242089, 178285, 247953, 231773, 216424, 271561, 211687, 176482, 186853, 176599, 166081, 101963, 71980, 125911, 102261, 122742, 71805, 81055, 45872, 60200, 91069, 69125, 86318, 93755, 43464, 42002, 134734, 156496, 123831, 143080, 166349, 131663, 89959, 91899, 37929, 66313]
2647F6313j4324J335N2283j9804p80J1970N8365p3232n3963J5322M6733K3813
2635A14031r5827J0311P7386K5787p7101k0329M596J4927M463j5128P0844k8788
2623H5172l8225l0669m4964k7587O1900m2414R9369j1931l0404R640N725n6940
2611b1328m829K0795m242N9162J6508j4311l672O4668n720m9929J3839m0761L533
2598C3713M5284q8591n8550N3054O5234k2601k0479r4917N8227K1898L7021J3924
2586D3217k6279j519J2415l7885R6585q3529n4683M0942N3029K8814j8780L4251
2574H6578M3716k2855k8556m3690L5049O1236o3408J4651k5984m7368O7631J9304
2562I6304O9151m9778o6667K1006O5566M1523m3879J7200M1524k448m8149r866
$$ y = [66313, 51989, 53324, 105607, 85803, 85023, 96993, 155358, 82126, 28163, 43485, 90218, 114031, 18204, 28515, 105901, 131688, 54587, 34258, 38854, 53781, 58244, 43116, 113960, 85172, 46947, 16278, -28686, -56273, 5627, -36787, 62582, 50651, 20247, 29887, 35612, -21328, -26157, -5362, -9604, 49558, 66066, 51755, 48083, 112751, 107031, 57102, 70941, 30180, 33713, 78997, -9594, -68144, -15090, 50144, 27543, 7064, -87853, -29626, -7728, 29293, 43217, 16938, 15419, 27834, -10051, 86534, 3005, -51678, -10736, 42293, 71107, 52327, 86578, 130294, 107439, 78883, 35193, 70242, 131478, 68070, 82721, 56737, 9369, 77000, 96304, 165455, 115677, 49010, 70016, 135582, 177105, 133226, 150426, 191950, 189502, 141353, 131487]
2550A31487K1885o177j9104N9269n5945J1114M5416k2157N1642N7685o661J332
2538B69786L3883o1613n4817k7930M7538M0798M1540k3949o6415P8927j0572q6753
2526A80423n4507J15042J8285K6184n9415m2757J16412J9871n8822P6413m2055
2515B95074j3130k9233p6548Q7820m8196l1081J780l6232o8330Q4834M1965K8852
2503B37575j8415j04945P0044M2692k4458p0809m7558m89L3708K0092K4709J6764
2491A78910l8252K7367P6175O255J02755p7088j6268m5079m8712M1956o4132k3411
2479A20476K8983p662l0710K7222n0115k9596M5162j1644Q739J0284m6257p7144
2467a2262P2602j7018j5388k7843M9801M0635l2648k2468L505l6700J4867M830
$$ y = [131487, 153372, 147195, 128091, 187360, 131415, 142529, 187945, 165788, 217430, 275115, 268454, 269786, 303669, 242056, 187239, 159309, 206847, 247645, 289185, 265236, 198821, 277748, 267176, 180423, 125916, 240958, 259243, 285427, 226012, 183255, 299667, 319538, 260716, 337129, 295074, 281944, 252711, 176163, 263983, 215787, 184706, 186486, 150254, 81924, 166758, 208723, 237575, 219160, 114215, 184259, 226951, 202493, 131684, 84126, 83637, 117345, 137437, 162146, 178910, 140658, 168025, 244200, 250455, 353210, 276122, 259854, 214775, 166063, 208019, 143887, 120476, 149459, 141797, 111087, 138309, 88194, 58598, 103760, 92116, 100855, 111139, 64882, -12262, 60340, 43322, 27934, 91, 49892, 90527, 57879, 35411, 38916, 2216, 17083, 21913]
2455B1913j09654N4789K5497k6750m944Q5516j01216k13J29971k9042p6526o0337
2443i0996P0900m225p3881J4127j6498l6527n0009J09777O3168k9264K8041K3786
2431H399n1067k9746j5700L9089l0277l1012J2487K5858l8000k9860Q168K6288
2419a05373k7563j1849J9840p549J6191r534n9846J9928M1909K2581J4947j4289
2407a00607l1331n330N9004p6204m054R6476J2787L3116q3115j0736K578J6765
2395i0651o602l1416r335J1204O7057l0799j9257J8360M99p3450k8870L6357N012
2382a51891J6269L765j3936K1707m7587l4790L8225J9056o6837Q324l5897N0292
2370a93300M792K5048N5100L2862o20r2603K7276L6701j7614n1565m0720o097
$$ y = [21913, -87741, -32952, -7455, -34205, -39149, 46367, -54849, -55062, 74909, 45867, -30659, -90996, -20096, -24321, -98202, -84075, -100573, -137100, -187109, -77332, -14164, -43428, -15387, 8399, -42668, -72414, -88114, -49025, -79302, -110314, -97827, -71969, -109969, -139829, -131661, -105373, -132936, -144785, -124945, -132494, -116303, -125837, -185683, -165755, -123846, -101265, -86318, -100607, -131938, -137268, -78264, -154468, -158522, -62046, -49259, -16143, -99258, -109994, -107416, -90651, -97253, -128669, -138004, -126800, -59743, -90542, -109799, -91439, -90940, -164390, -193260, -156903, -151891, -135622, -131857, -145793, -124086, -171673, -206463, -168238, -149182, -216019, -207695, -243592, -193300, -188508, -163460, -108360, -75498, -76118, -168721, -141445, -104744, -122358, -173923, -214643, -220740]
2358b20740n060P9733M417M0595M6919o4673N5774J4790j2175j3113m4014O3476
2346e4071Q8242l0006q052p2304K7445k0379r422j4969j6014L1320L5115j8010
2334f1105j771m5306l5804J8708j2413L5901L8504q070m4452l5077k3011O0757
2322a13139l8070J0869j5054o883K9458O5015m1085O1090k5167L535L1531p8862
2310a16762K6390l7157o7878J4775n612k2563L5718j5367Q7446K9913l5848J4211
2298i2734J3646K098L1330M7768m5159k3318o0084J2859O2507j6835k0159J9931
2286f8150M157l0538J0359l2096J7945p907N845J8419l2791Q725k3875q462N2189
2273h6180N5260j1597q8628L684L7346Q045L3936M1501m2360m722J617L1311k0430
$$ y = [-220740, -225800, -146067, -141650, -101055, -54136, -118809, -63035, -48245, -60420, -73533, -117547, -54071, 34171, 4165, -3887, -76191, -48746, -69125, -78547, -93516, -109530, -78210, -43095, -61105, -62876, -108182, -143986, -125278, -137691, -101790, -63286, -71356, -115808, -150885, -173896, -113139, -151209, -140340, -155394, -162277, -132819, -67804, -108889, -47799, -72966, -69431, -37900, -116762, -90372, -127529, -195407, -180632, -186244, -208807, -173089, -188456, -101010, -71097, -106945, -92734, -79088, -76990, -45660, 2108, -43051, -66369, -126453, -113594, -51087, -67922, -88081, -68150, -63993, -94531, -84172, -116268, -98323, -106230, -100385, -81966, -114757, -106032, -129907, -138369, -86180, -30920, -42517, -131145, -127461, -90115, -82070, -48134, -6633, -48993, -53715, -52098, -20787, -41217]
2260d1217J8716n6768L466K4988j3751P8570l4206j3224r3840N2655K6085n0309
2248i8835j1400j4903K6059k2381Q3200k2494j0490M923j8069k1672k312o6731
2236a75105m885p766O9242P2939M580k5638j16768P9653m503O2941J1818P184
2224b6308m6153j9062l9908O2097K7760N1279J3724m9644P0702p0478o2593L1494
2212e7090L4059q826k6027k5364K9145N0804j203k6324n5089M1193N3813j3920
2200d829m6545N995K16n3127L1914O8051n9996j4586O7462m4817p2830R151P6050
2187c7891M5224l6089p814k2977O7031K9398j05910Q196J6853o083J2457O0602
2175B2997l5175k7216M3478K5856r0726o6170O0946Q8798l3088J1929M2817K6348
$$ y = [-41217, -22501, -79269, -75803, -50815, -64566, 14004, -20202, -33426, -127266, -74611, -48526, -98835, -110235, -125138, -99079, -121460, -38260, -60754, -71244, -66321, -84390, -106062, -108374, -175105, -179990, -187756, -118514, -45575, -40995, -66633, -183401, -103748, -108251, -45310, -33492, -26308, -72461, -91523, -131431, -69334, -41574, 9705, 23429, -26215, 44487, -25991, -88584, -57090, -23031, -31857, -57884, -83248, -54103, -3299, -4502, -30826, -85915, -44722, 9091, -4829, -51374, -45379, -45163, -98290, -66376, 1675, -58321, -72907, -5445, -50262, -123092, -113941, -37891, 7333, -28756, -36570, -59547, 7484, 36882, -69028, -60832, -43979, -50062, -37605, 22997, -12178, -39394, 4084, 29940, -60786, -126956, -66010, 22788, -10300, 1629, 44446, 70794]
2163G0794K629P340k9041J4662n3393M2782j6962l6774l4416j2699M5955K836
2151C713M6640q0694Q9159L6971p9523L3672J9592q992N7681P4762k181r6557
2139I4243L8208l393O496J6066N1706n5127O8180N7118q1522J2167J7190P9280
2127C00612J5383p2495j8385L6938M7682O006r85K0040J00320J7231N069M5397
2115E02813L4458N8734m5099K0210j3989K46J6767R1579O6643P742n2493o710
2103F80901j837O4494M5411N3889L3823R3142J16851Q4216J06820R7779J05553
2092A481042K15318J70167K99074J75724K46165K53378J86556L56413M66304N04713
2082D354854O47462Q45092J041462J364466J739109J790645P06680j101478j702182
$$ y = [70794, 73423, 80763, 51722, 66384, 12991, 55773, 38811, 2037, -32379, -45078, 877, 3713, 50353, -30341, 58818, 95789, 16266, 49938, 69530, 60538, 118219, 192981, 190800, 94243, 132451, 129058, 135554, 151620, 203326, 148199, 216379, 273497, 191975, 204142, 221332, 300612, 315995, 243500, 225115, 262053, 309735, 315741, 314756, 334796, 435116, 452347, 457416, 502813, 537271, 596005, 550906, 571116, 557127, 557373, 574140, 665719, 732362, 740104, 687611, 680901, 679064, 743558, 788969, 842858, 876681, 969823, 1086674, 1170890, 1277710, 1375489, 1481042, 1696360, 1866527, 2165601, 2341325, 2587490, 2840868, 3027424, 3383837, 3850141, 4354854, 5002316, 5847408, 6888870, 8253336, 9992445, 11783090, 12489770, 11388292, 9686110]
2073I686110j439179j669885j323378q87874n85040m68281m74953k62162q2608
2064B492750j90506j54736j49312k11474k04968j13054m5353j55635l7426o4317
2054A165969j08388o4935q9938m0368l5469K92J6899j25373p5174k0977J5854
2043F38392L7201m7911p005n6518O5l1997j23213L2450l7160n1816j8929j9394
2031C14165Q7743m2858R712o3415o8062m0350P9214J898K5488N60l7379n5509
2019B11207j6917P2965k6496j06957L4178l9354J0769N4039n1936n9519M0607
2008A22586k513o0258L293N2901K6231r195p5028N718k4906M8613j9834k4310
1996D3298k8894M850k2220k6864m939l0211K2694m0161J17111J0555j0639J4617
$$ y = [9686110, 8246931, 6577046, 5253668, 4365794, 3780754, 3312473, 2837520, 2575358, 2492750, 2302244, 2147508, 1998196, 1786722, 1581754, 1468700, 1423347, 1267712, 1230286, 1165969, 1057581, 992646, 902708, 862340, 826871, 827163, 844062, 718689, 643515, 622538, 638392, 675593, 627682, 620677, 564159, 564224, 532227, 409014, 441464, 404304, 352488, 333559, 314165, 401908, 359050, 368762, 305347, 237285, 196935, 276149, 278047, 303535, 304095, 266716, 211207, 194290, 267255, 240759, 133802, 167980, 128626, 139395, 193434, 141498, 81979, 122586, 120073, 59815, 63108, 116009, 142240, 133045, 58017, 63735, 38829, 87442, 67608, 43298, 14404, 19254, -2966, -29830, -34769, -64980, -42286, -82447, 34664, 45219, 34580, 49197]
1984D9197j24591k5426M7830K2357O4207m1043q9198n9975M6985R4222L1604o7939
1972e1770M1725N0482k8271n7731R3253L1674l2421l4731n4348l64K7589j8870
1960c3783K6498k0909m5603j441P2330J5512j00735l6542P2137J6547L4154p1767
1948g3602o154O2642j2168j1358k8508l9457Q0342j9578M3573L0594l8280L3465
1936B1511k7272l4630j1396l297p914M959L0709L0432N1058q6843j5577m2908
1924i1168O9144n2593m6309K6275m8362R1050k2120j9873J1910j2324q720l026
1912a06116L2965K0138l3973J0281N4136r625K0231k4815k1294j1415O551K2521
1900d0415j3487P262J0113J778J7m8865p7468R9766J2442j3701K5358m3577J0244
$$ y = [49197, -75394, -100820, -52990, -30633, 33574, -7469, -96667, -156642, -109657, -15435, 16169, -51770, -10045, 40437, 12166, -45565, 47688, 79362, 46941, 12210, -42138, -42502, -14913, -33783, -7285, -28194, -73797, -75238, -2908, 12604, -88131, -124673, -52536, -35989, -1835, -73602, -79756, -17114, -29282, -40640, -69148, -108605, -28263, -47841, -4268, 26326, -11954, 21511, -5761, -40391, -51787, -55084, -62998, -58039, -27330, 3102, 54160, -32683, -48260, -91168, -22024, -74617, -120926, -94651, -143013, -51963, -74083, -93956, -82046, -94370, -103090, -106116, -73151, -53013, -86986, -76705, -22569, -32194, -11963, -36778, -58072, -69487, -62936, -40415, -53902, -46640, -36527, -34749, -34732, -83597, -161065, -61299, -48857, -62558, -37200, -80777, -70533]
1887g0533M8007r619k1841K7955L3829j12437K1460k363k9545M8693j1286K4220
1875e3460N2974o4332J2263K4347l8294l0420n814K5150J2523o0306K6648L5425
1863f3296o342o163K1579n5618P187L4200j1331p2366N677n861J9956L9407j106
1850i4077J7250J5201J7290K2728k4071J238j0605J4823r542p2920J8299L4819
1838f9567M7637K5484j3693L2348M4171j1164n3572n7381J6266k7562P33M3031
1826b3269j1510O438K8504l2955r0509L8616q403M844P9431p3702l3391J06383
1814i523j8467j4836l6990r7889K0415M3504j2638K6157K8783K8792k8017j03291
1802a74000J5945M9768R7736j2805j4573k2795r647o2250q577K5380J4833N801
$$ y = [-70533, -22526, -32145, -53986, -26031, 7798, -104639, -83179, -85542, -115087, -66394, -77680, -53460, -486, -64818, -52555, -28208, -66502, -96922, -102736, -77586, -65063, -125369, -98721, -63296, -69638, -75801, -54222, -109840, -102653, -68453, -79784, -152150, -146473, -152334, -132378, -92971, -94077, -76827, -61626, -44336, -21608, -45679, -44441, -55046, -40223, -49765, -122685, -104386, -69567, -21930, 3554, -10139, 22209, 66380, 55216, 1644, -55737, -39471, -67033, -66300, -23269, -34779, -28341, 163, -32792, -123301, -84685, -93088, -88244, -8813, -82515, -115906, -9523, -27990, -42826, -79816, -177705, -157290, -113786, -126424, -100267, -71484, -42692, -70709, -174000, -158055, -108287, -10551, -23356, -37929, -60724, -70371, -132621, -141198, -115818, -100985, -95184]
1790i5184j1244N9217m1498K7618K5268l218N1728O906J1657k3539m1261r5587
1778a29137Q2383J7367k2223m588j0K468j3540o43J670M2477j3607P473j436o9545
1764a00891K702K1103N779J280l4731p1662P1700o216J8975j140K6777L257J6006
1751d7061O1385o6894l582K1908N1583J5707j9954k7595j5312O4457o9437j7185
1739e1980L2309k6478J6661Q540j7424o1667N5700n7617L580n6980P1271N7460
1727b6625L9575n023m3256m7562r806L6075J1737R823M0530N162L2235r5216l7950
1714i0301P7596J582L1229r4119n533J06421k23k4612n9962P6346L5224l5436
1702A8212l86l3371l2854o9787O436M6073K9660k4619N746r340L1774J9710m4321
$$ y = [-95184, -106428, -47211, -88709, -61091, -35823, -39041, 12687, 19593, 31250, 7711, -33550, -129137, -46754, -29387, -51610, -56198, -56208, -53740, -67280, -67923, -66253, -23776, -37383, -29910, -31346, -100891, -98189, -77086, -71307, -70027, -104758, -176420, -104720, -110936, -91961, -93101, -66324, -63067, -47061, 14324, -52570, -56152, -34244, 17339, 33046, 13092, -14503, -29815, 34642, -34795, -51980, -19671, -46149, -29488, -20948, -38372, -100039, -44339, -101956, -98376, -155356, -84085, -26625, 12950, 7927, -35329, -82891, -92697, -56622, -44885, -35062, 5468, 10630, 42865, -52351, -90301, -12705, -11123, 20106, -74013, -79546, 26875, 26652, 2040, -57922, 18424, 53648, 18212, 17826, -15545, -48399, -118186, -111750, -65677, -36017, -60636, -54890, -64230, -32456, -12746, -57067]
1689e7067l1870L0461K650Q5539m0854p0983J0711O9697M199o4049k9883K1759
1677f9690O723K8316n1194O203L5228n53k3771j8517p7590P5963O8748L068j7467
1664c4533r4990P5455j2753O3392J9502j01288Q884J1745n3238p323N6019J4013
1652e5115m4705o014J5355l643J7260n7462j657l362K2202P2450n475l0576j5710
1639i6452j774k0757N9012l3417k0646M8427L3281m9060q798M2289p009K6608
1627b8296k4068m0651J6552j8597P6065J6156n8783j1090P545O7272L7880J4218
1615E4203l9839l2604O6096j5325n0709P544j2379r020m3575k1404N9361J6523
1603b1128l8119m835N5476p9144R627P840q1422J4159M476k2419K9743J8017P292
$$ y = [-57067, -88937, -58476, -55826, 29713, -11141, -82124, -71413, -1716, 2483, -61566, -91449, -69690, -62967, -34651, -85845, -79642, -44414, -44967, -68738, -87255, -164845, -88882, -20134, -17066, -34533, -129523, -54068, -66821, -3429, 16073, -85215, -76331, -64586, -117824, -125147, -69128, -55115, -99820, -105834, -90479, -94122, -76862, -134324, -135981, -139343, -117141, -44691, -50166, -80742, -96452, -98226, -118983, -59971, -93388, -114034, -65607, -32326, -81386, -90184, -47895, -54904, -28296, -52364, -93015, -76463, -95060, -18995, -2839, -61622, -72712, -65167, 2105, 39985, 54203, 14364, -18240, 47856, 32531, -18178, -10634, -23013, -32033, -75608, -97012, -37651, -21128, -59247, -64082, -8606, -87750, -78123, -70283, -151705, -137546, -133070, -155489, -125746, -107729, -100437]
1590a00437N6898k8715l6431N664J0770R9763p5234k3709L1351L5050K3968J559
1578D97n1964R313m005L9033l7728m2087M1089k779K9261j2721K2660k1513j0023
1565d0967r4791J4335Q0458L8095q1675K1003j5561j8669P5740j3645L1316M06
1553c955Q559m1142j390q6629j2198O4127K8056P0835o2801K6810K3321J0893
1541B4486m0912j0286m0438k3794O4571k0469J152k5296L6304j4870O309p1965
1529a15208N1489N8265o8157M4350j3589m2402o8557N0219O9783k2386P042J30643
1517H1492q8229n8436J04950j3001q0774L8497K3887O38j8822J7012n2086J20765
1505G5893m4834j2509k2058p848j9009j5582N325n2376N8952l5611J6506o699
$$ y = [-100437, -43539, -72254, -108685, -103021, -92251, 7512, -67722, -91431, -60080, -25030, -1062, 497, -51467, -42154, -46159, -7126, -44854, -86941, -45852, -48631, -19370, -32091, -9431, -30944, -40967, -135758, -121423, -40965, -2870, -84545, -63542, -79103, -97772, -22032, -35677, -4361, -3955, 4604, -36538, -37928, -124557, -136755, -72628, -44572, 26263, -36538, -9728, 13593, 24486, -16426, -26712, -67150, -90944, -26373, -46842, -45690, -70986, -34682, -49552, -43243, -115208, -63719, -5454, -73611, -29261, -42850, -85252, -153809, -103590, -33807, -56193, -49151, 81492, -6737, -65173, 39777, 26776, -53998, -15501, 8386, 9024, -9798, 7214, -44872, 75893, 31059, 18550, -3508, -11356, -30365, -45947, -40622, -92998, -34046, -69657, -53151, -59850]
1493e9850o127J1700p8019K8661N1081K969K7212l705M6874n0766l0558j8067
1481g8595M5082K0259j7769L1993M5390n1974j21J4195j6827n1107l2024R4460
1469B962J5487l5998M5981L3161j03195n5207N1143K6818K3867Q031L362l4607
1457a8195r718k5362N435K7837M9059L8867j0578p8981L8062m4442n5212J5697
1445f7531J8349Q383O6130n2426l8854M2422L1243P0935J5837o0548O8565l3892
1433F8613p8587o6481m090k8910m768K3124j1562k6493Q0836O357n0403L5520
1421e6844j1044K7704P235J5090p6373j4732J5901M9214M69j7360M5653l136j7895
1408c6118j1527L8040N325O74p318j9090K9632n2802O9495M6905r999j01434j5490
$$ y = [-59850, -65977, -54277, -132296, -103635, -52554, -49585, -22373, -26078, 20796, -29970, -60528, -78595, -33513, -13254, -31023, 970, 46360, -5614, -5735, 8460, -8367, -59474, -91498, 2962, 18449, -17549, 28432, 61593, -41602, -96809, -45666, -18848, 5019, 13050, 16412, -18195, -27913, -53275, -47840, -20003, 29056, 67923, 57345, -21636, 16426, -28016, -83228, -67531, -49182, -40799, 25331, -27095, -65949, -23527, 7716, 78651, 94488, 33940, 102505, 68613, -9974, -76455, -80545, -109455, -114223, -91099, -102661, -129154, -48318, -41961, -92364, -56844, -67888, -40184, -32949, -17859, -94232, -108964, -93063, -43849, -43380, -60740, -15087, -18223, -36118, -47645, -9605, -4280, -3606, -10924, -30014, -382, -53184, 16311, 63216, 53217, -48217, -63707]
1395f3707J8526n1636m01M8989o1231J23068J9661o1942Q825l6863r123L1674
1383c4160O0190j7401m45r127n6655M9886K3164M6799p9362m7367M4053M7814
1371B7389m1549m5187k4772N1942O9996P2469n7493m8240Q958o3666K9762M6783
1359B6392l4959j2928q979M2608K3037J7545O7839j17629K60N8499r3940J6305
1347a5950R3120k7241n8834k0403p707K9796j8531j08070L5959L1702P532O78
1335e7949L1581N90M8002k8951m9398J3530J0713n6564O0879O8574J0665j04845
1323e3173O273o2632N6927P4687j4705R322k776n550J5028R929j8329M163J6922
1310C6086J226j8279m3462M0460L1204k7828m1891P3480j8866k8232n2745m4428
$$ y = [-63707, -45181, -96817, -97218, -48229, -109460, 13608, 33269, -28673, -19848, -56711, -65834, -34160, 26030, 8629, 8184, -943, -57598, -7712, 15452, 62251, -17111, -64478, -20425, 27389, -14160, -59347, -84119, -32177, 37819, 110288, 52795, 4555, 13513, -50153, -20391, 26392, -8567, -21495, -30474, 12134, 35171, 52716, 120555, 2926, 3186, 61685, -32255, -15950, 77170, 49929, -8905, -29308, -37015, -7219, -25750, -133820, -97861, -66159, -58627, -57949, -26368, -25778, 22224, -6727, -56125, -42595, -31882, -88446, -27567, 41007, 51672, -53173, -46900, -109532, -52605, 22082, 7377, 16699, 13923, 8373, 23401, 33330, 15001, 19164, 36086, 37312, 19033, -24429, 16031, 47235, 19407, -22484, 50996, 32130, 3898, -48847, -93275]
1298i3275J0416K2963r850N7119M5892m3228j8776j685M3512k9617R6769n8334
1286B1906m9975p1115L7528o794L9770Q9940j4035l7222o9571j942l566r091j0649
1273h4816L2872j7712N6216P430k7596K9788N455N1606m6698j7066L2212L2940
1261E4631n2324J3220m2560n745K9106k6755m1793N8548J3899J450J2305l0891
1249a6909L5879L0073j0944l1780k889R8344l7125n9790O0660n3259p1858j1381
1237g0979L6154J22188m4178j0631l3319L4920m7616p269L4869q2076J9898L8061
1225i978L2581N2053J6517m6431p0412l280L4854k5571J4300N6537j3347n7963
1213b0140O2729O219j6049j00591K7906J1883r618J1047P5952q8204N5497m873
$$ y = [-93275, -82859, -59896, -69746, -12627, 33265, -9963, -28739, -30424, 13088, -16529, 80240, 21906, -28069, -99184, -61656, -68450, -28680, 61260, 47225, 10003, -59568, -61510, -65076, -74167, -84816, -51944, -69656, -13440, -6010, -33606, -3818, 1637, 53243, 6545, -10521, 21691, 54631, 2307, 15527, -27033, -32778, -3672, -30427, -72220, -13672, 227, 1677, 13982, -16909, 18970, 49043, 38099, 6319, 3430, 101774, 64649, 4859, 65519, 12260, -59598, -70979, -34825, 87363, 43185, 32554, -765, 34155, -13461, -20730, 14139, -67937, -48039, -9978, 22603, 74656, 91173, 44742, -25670, -28950, 5904, -19667, -5367, 51170, 37823, -20140, 42589, 48808, 32759, -67832, -39926, -28043, -37661, -26614, 49338, -38866, 16631, 11758]
1201A1758L7693K3468q4077R6328j0857k8235k2924K5688j9116Q8745p3294p2516
1189b7339m4709j4543n0347L5764R6184j402j5671j6376J4079l2965J3479J1071
1177c2775P3232p266n0169l2644J5551l1693L4538K6665J4889n2609N2580n908
1165D391R540R9915p0759j2622r4496J2493m37r432J1024j1330J9768M4460R6083
1152I8598m84J518m4251K158j2361q603J2979p3311m8465n6224N9282J3380J0933
1139d4851k0213l1587O8324k8498J4090L9299j560l5964k2287N7231K4732o828
1127A1888N076m9690l7852J9609K1025J1045P154j5109l2565O1408n6983R04J56406
1114A02316j7090r2484j7741J6039m45P9600k5782p3589p104M0903m10n547P8896
$$ y = [11758, 49451, 72919, -11158, 85170, 74313, 46078, 23154, 48842, 29726, 118471, 45177, -27339, -72048, -86591, -136938, -101174, -4990, -6392, -22063, -38439, -24360, -57325, -43846, -32775, 40457, 33191, -16978, -49622, -34071, -65764, -31226, -4561, 10328, -42281, 10299, 4391, 13931, 113846, 43087, 30465, -64031, -51538, -51975, -61407, -50383, -61713, -41945, 2515, 98598, 98114, 99632, 55381, 57539, 45178, 36575, 49554, -23757, -72222, -128446, -69164, -55784, -44851, -65064, -96651, -28327, -56825, -42735, -3436, -4996, -40960, -63247, -6016, 18716, 11888, 16964, -32726, -70578, -50969, -29944, -18899, -11745, -26854, -59419, 1989, -54994, -54090, 102316, 85226, -7258, -24999, -8960, -9405, 70195, 44413, -29176, -36280, 4623, 4213, -1334, 77562]
1101G7562k4364o9444l794j3464N2677J09000m4711j0022J019K1842n4018N711
1089D7994k0910n5435P959m5082k2083J21269L4496j54284J0990M4218L6324p6397
1077g0941L1347l1334N61Q2254O3544j01204o3045O4561K4892n6547J3076j1665
$$ y = [77562, 53198, -16246, -20040, -33504, 19173, 128173, 83462, 73440, 74459, 96301, 42283, 47994, 27084, -28351, -20392, -65474, -87557, 33712, 68208, -86076, -75086, -30868, 5456, -70941, -39594, -70928, -70367, 11887, 75431, -25773, -88818, -24257, 635, -55912, -42836, -54501]
$$ [...]
##END NTUPLES=NMR SPECTRUM
##END=
