##TITLE=1H_CA-8890-3
 CDCl3, 8 sc, 
 6.07.2021
##JCAMPDX= 6.0         $$ Bruker NMR JCAMP-DX V2.0
##DATA TYPE= NMR SPECTRUM
##DATA CLASS= NTUPLES
##ORIGIN= UXNMR, Bruker Analytische Messtechnik GmbH
##OWNER= root
$$ XWIN-NMR		Version 3.5
$$ Tue Jul  6 10:50:31 2021 Russian Standard Time (UT+4h)  she@DPX200
##.OBSERVE FREQUENCY= 200.131506
##.OBSERVE NUCLEUS= ^1H
##.ACQUISITION MODE= SIMULTANEOUS
##.ACQUISITION SCHEME= undefined
##.AVERAGES= 8
##.DIGITISER RES= 18
##SPECTROMETER/DATA SYSTEM= spect
##.PULSE SEQUENCE= zg30
##.SOLVENT NAME= CDCl3
##.SHIFT REFERENCE= (INTERNAL, CDCl3, 0, 17.4861)
##AUDIT TRAIL= $$ (NUMBER, WHEN, WHO, WHERE, WHAT)
$$ ##TITLE= Audit trail, XWIN-NMR		Version 3.5
$$ ##JCAMPDX= 5.01
$$ ##ORIGIN= Bruker BioSpin GmbH
$$ ##OWNER= she
$$ F:/spectra/data/she/nmr/H-F/1/pdata/1/auditp.txt
$$ ##AUDIT TRAIL=  $$ (NUMBER, WHEN, WHO, WHERE, WHAT)
(   1,<2021-07-06 10:49:05.53 +0400>,<she>,<DPX200>,
      <created by zg, POWCHK disabled, PULCHK disabled
       configuration hash MD5:
       00 E9 B6 7A A2 85 ED C7 34 08 36 98 17 FE 4E 26
       data hash MD5: 16K
       9C 9B AA 9E 6E D4 63 B7 38 91 D8 C7 C0 5F EE 7B>)
(   2,<2021-07-06 10:49:09.84 +0400>,<she>,<DPX200>,
      <Start of raw data processing
       efp BC_mod = 2 LB = 0.24 FT_mod = 6 PKNL = 1 PHC0 = -11913.45 PHC1 = 11.60099 SI = 16K 
       data hash MD5: 16K
       91 04 7E 61 BF 00 65 D1 08 01 8D AF B4 2D 34 65>)
(   3,<2021-07-06 10:49:32.64 +0400>,<she>,<DPX200>,
      <pk PHC0 = -1.357991 PHC1 = 4.2 
       data hash MD5: 16K
       4C B8 B6 2C 61 4E 21 EC 7C 55 01 82 29 E0 44 BC>)
(   4,<2021-07-06 10:49:35.92 +0400>,<she>,<DPX200>,
      <abs ABSG = 5 
       data hash MD5: 16K
       93 62 D3 A6 8D 21 CA D0 AB F9 99 BE BA C4 1E 04>)
$$ ##END=
$$ 
$$ hash MD5
$$ 26 54 D3 27 58 70 8C 77 68 B7 BE E7 FC 28 9E 80
##$RELAX= 
##$RELAX= 
##$RELAX= 
##$RELAX= 
##$RELAX= 
##$RELAX= 
$$ Bruker specific parameters
$$ --------------------------
##$DU= <F:/spectra>
##$EXPNO= 1
##$NAME= <H-F>
##$PROCNO= 1
##$TYPE= <nmr>
##$USER= <she>
##$AMP= (0..31)
100 100 100 100 100 100 100 100 100 100 100 100 100 100 100 100 100 100 
100 100 100 100 100 100 100 100 100 100 100 100 100 100 
##$AQSEQ= 0
##$AQ_mod= 1
##$AUNM= <au_zg>
##$AUTOPOS= <>
##$BF1= 200.13
##$BF2= 200.13
##$BF3= 200.13
##$BF4= 200.13
##$BF5= 200.13
##$BF6= 200.13
##$BF7= 200.13
##$BF8= 200.13
##$BYTORDA= 1
##$CFDGTYP= 0
##$CFRGTYP= 5
##$CHEMSTR= <none>
##$CNST= (0..31)
1 1 145 1 1 1 1 1 1 1 1 1 1 1 1 1 1 1 1 1 1 1 1 1 1 1 1 1 1 1 1 1 
##$CPDPRG= <>
##$CPDPRG1= <>
##$CPDPRG2= <>
##$CPDPRG3= <>
##$CPDPRG4= <mlev>
##$CPDPRG5= <mlev>
##$CPDPRG6= <mlev>
##$CPDPRG7= <mlev>
##$CPDPRG8= <mlev>
##$CPDPRGB= <>
##$CPDPRGT= <>
##$D= (0..31)
0 1.2 0 0 0 0 0 0 0 0.06 0 0.03 0 0 0 0 0.0002 0 0 0 0 0 0 0 0 0 0 0 0 
0 0 0 
##$DATE= 1625554145
##$DBL= (0..7)
120 120 120 120 120 120 120 120 
##$DBP= (0..7)
150 150 150 150 150 150 150 150 
##$DBP07= 0
##$DBPNAM0= <>
##$DBPNAM1= <>
##$DBPNAM2= <>
##$DBPNAM3= <>
##$DBPNAM4= <>
$$ [...]
##$SUBNAM3= <"">
##$SUBNAM4= <"">
##$SUBNAM5= <"">
##$SUBNAM6= <"">
##$SUBNAM7= <"">
##$SUBNAM8= <"">
##$SUBNAM9= <"">
##$SW= 20.0188882624521
##$SWIBOX= (0..15)
0 0 2 0 0 0 0 0 0 0 0 0 0 0 0 0 
##$SW_h= 4006.41025641026
##$TD= 16384
##$TD0= 1
##$TE= 0
##$TE2= 300
##$TE3= 300
##$TEG= 300
##$TL= (0..7)
0 120 120 120 120 120 120 120 
##$TP= (0..7)
150 150 150 150 150 150 150 150 
##$TP07= 0
##$TPNAME0= <>
##$TPNAME1= <>
##$TPNAME2= <>
##$TPNAME3= <>
##$TPNAME4= <>
##$TPNAME5= <>
##$TPNAME6= <>
##$TPNAME7= <>
##$TPOAL= (0..7)
0.5 0.5 0.5 0.5 0.5 0.5 0.5 0.5 
##$TPOFFS= (0..7)
0 0 0 0 0 0 0 0 
##$TUNHIN= 0
##$TUNHOUT= 0
##$TUNXOUT= 0
##$USERA1= <user>
##$USERA2= <user>
##$USERA3= <user>
##$USERA4= <user>
##$USERA5= <user>
##$V9= 5
##$VALIST= <valist>
##$VCLIST= <CCCCCCCCCCCCCCC>
##$VD= 0
##$VDLIST= <DDDDDDDDDDDDDDD>
##$VPLIST= <PPPPPPPPPPPPPPP>
##$VTLIST= <TTTTTTTTTTTTTTT>
##$WBST= 1024
##$WBSW= 4
##$XGAIN= (0..3)
0 0 0 0 
##$XL= 0
##$YL= 0
##$YMAX_a= 92155
##$YMIN_a= -184156
##$ZGOPTNS= <>
##$ZL1= 120
##$ZL2= 120
##$ZL3= 120
##$ZL4= 120
##$ABSF1= 17.513
##$ABSF2= -2.506039
##$ABSG= 5
##$ABSL= 3
##$ALPHA= 0
##$AQORDER= 0
##$ASSFAC= 0
##$ASSFACI= 0
##$ASSFACX= 0
##$ASSWID= 0
##$AUNMP= <proc_1d>
##$AZFE= 0.1
##$AZFW= 0.1
##$BCFW= 0
##$BC_mod= 2
##$BYTORDP= 0
##$COROFFS= 0
##$CY= -3
##$DATMOD= 1
##$DC= 0
##$DFILT= <>
##$DTYPP= 0
##$F1P= 0
##$F2P= 0
##$FCOR= 1
##$FTSIZE= 16384
##$FT_mod= 6
##$GAMMA= 0
##$GB= 0
##$INTBC= 1
##$INTSCL= 1.334414e-10
##$ISEN= 128
##$LB= 0.24
##$LEV0= 0
##$LPBIN= 0
##$MAXI= 10000
##$MC2= 0
##$MEAN= 0
##$ME_mod= 0
##$MI= 1.114404
##$NCOEF= 0
##$NC_proc= -8
##$NLEV= 6
##$NOISF1= 3.799351
##$NOISF2= 2.8
##$NSP= 0
##$NTH_PI= 0
##$NZP= 0
##$OFFSET= 17.48611
##$PC= 1
##$PHC0= -11914.81
##$PHC1= 15.80099
##$PH_mod= 1
##$PKNL= yes
##$PPARMOD= 0
##$PSCAL= 0
##$PSIGN= 0
##$REVERSE= no
##$SF= 200.13000971009
##$SI= 16384
##$SIGF1= 3
##$SIGF2= 2
##$SINO= 5.538805
##$SIOLD= 16384
##$SREGLST= <1H.CDCl3>
##$SSB= 0
##$STSI= 16384
##$STSR= 0
##$SW_p= 4006.41025641026
##$SYMM= 0
##$S_DEV= 0
##$TDeff= 16384
##$TDoff= 0
##$TI= <>
##$TILT= no
##$TM1= 0
##$TM2= 0
##$TOPLEV= 0
##$USERP1= <user>
##$USERP2= <user>
##$USERP3= <user>
##$USERP4= <user>
##$USERP5= <user>
##$WDW= 1
##$XDIM= 16384
##$YMAX_p= 279438718
##$YMIN_p= -1225132
$$ End of Bruker specific parameters
$$ ---------------------------------
##NTUPLES= NMR SPECTRUM
##VAR_NAME=  FREQUENCY,     SPECTRUM/REAL,   SPECTRUM/IMAG
##SYMBOL=    X,             R,               I
##VAR_TYPE=  INDEPENDENT,   DEPENDENT,       DEPENDENT
##VAR_FORM=  AFFN,          ASDF,            ASDF
##VAR_DIM=   16384,         16384,           16384
##UNITS=     HZ,            ARBITRARY UNITS, ARBITRARY UNITS
##FACTOR=    0.24454680195387, 1,            1
##FIRST=     3499.49550163222, 0,            0
##LAST=      -506.914754778036, 0,           0
##MIN=       -506.914754778036, -1225132,    0
##MAX=       3499.49550163222, 279438718,    0
$$ Real data points
##PAGE= N=1
##DATA TABLE= (X++(R..R)), XYDATA
$$ [...]
9089 257411 296402 -215092 -230067 147578 9110 267077 191014 -54433 -420976 -298344
9079 -298344 53750 -33688 -63651 66885 93487 272790 486783 713347 885980 192134
9069 192134 -200192 -197807 194558 -70528 -378928 -288735 -469798 -744620 -584352 -344098
9059 -344098 79663 207023 -118041 -63035 -340869 41044 238212 327749 290526 441541
9049 441541 552330 669659 839310 712838 494500 637145 352797 121401 305537 225894
9039 225894 150421 -184064 50036 9954 -73072 -271290 -45808 113160 90126 111753 114690
9028 114690 16747 -448378 -477439 268450 426161 925053 1050506 689641 677993 509652
9018 509652 680894 615029 239502 198742 508148 667894 1197244 819249 743981 816602
9008 816602 898579 870325 716351 685043 800037 767401 704389 526454 1084622 1528765 1039143
8997 1039143 484891 734138 1359573 1555125 1523079 1406512 1812712 2059491 1994897 2117351
8987 2117351 2516446 2411402 2680515 2934756 2776920 3162893 3947139 4263539 4240819 4711101
8977 4711101 5139821 5282350 5598548 5513141 5545693 4420149 4353085 4298475 3430735 2711161
8967 2711161 2753841 3192594 2578403 2352752 2356626 1735110 1627738 1438208 1655924 1147346
8957 1147346 1000260 1127106 1249913 921389 777596 800190 879931 1041007 1131530 1189645
8947 1189645 951147 1039264 422354 310057 587517 581259 808554 901308 310505 407762
8937 407762 268890 805630 779031 834821 964579 556434 979640 1359934 874323 966812
8927 966812 459994 454441 593161 738718 906049 989087 1236180 1484719 1365057 1058027
8917 1058027 1001083 1035657 1313316 968154 1002828 877614 894526 796907 204640 511072
8907 511072 339121 443153 1010261 982626 637353 144682 228977 299633 543609 165756
8897 165756 -279001 26325 51514 305530 355926 -146616 -189462 66572 138099 673566
8887 673566 730671 541050 315224 186417 759886 540782 79347 548211 405476 75809
8877 75809 42090 123530 90734 272455 49520 -87983 400557 -76591 -84275 56242 -218494
8866 -218494 -88104 -93130 14463 -252235 88333 244652 582641 141005 120155 294072
8856 294072 -30529 -209961 -593051 -77616 173761 -119496 -193004 469439 455469 505703
8846 505703 579380 631564 1152036 384291 -168409 63023 319788 578917 736458 393744
8836 393744 -224449 96355 53230 225036 94141 496260 392118 413396 262255 -136933
8826 -136933 -153554 327543 318762 61947 -286317 190109 383976 234003 564854 180676
8816 180676 -120823 592416 122970 200499 166339 217407 144428 81871 871414 1153470 329984
8805 329984 -110872 260771 469237 521635 175862 111675 71390 -330767 -321568 273036 61350
8794 61350 91937 269964 357063 -30496 397234 248295 -99669 -205186 -310815 -378975
8784 -378975 7431 199874 323931 11358 310583 397266 431464 265342 339235 508340
8774 508340 543007 542305 -118879 15153 72738 -217562 116577 37780 -13948 358842 300633
8763 300633 12408 -69598 -76566 -143041 -19281 368046 783223 263297 140019 536903
8753 536903 -33767 -208092 -599082 -75620 319998 321555 558437 471230 298091 216366
8743 216366 255068 150315 504049 268478 383455 329729 349984 697050 1018940 605295
8733 605295 590464 434700 448041 772188 422962 612032 785539 526272 590687 328014
8723 328014 32077 449457 633099 581202 764268 395083 535046 763115 1074959 941939
8713 941939 651868 1086981 874316 547431 385821 361398 575513 193318 365465 507499
8703 507499 577787 632846 428586 495616 678043 727563 744806 901616 590194 802513 1087829
8692 1087829 1363503 1768537 1636129 1434124 1246054 652938 750108 1157247 1465130 1606164
8682 1606164 1754529 1638157 1427833 1654073 2100099 2097383 1861332 1743288 1589742 1423065
8672 1423065 1730211 1385611 1440060 1569366 2060288 2095877 1909308 1768087 2128303 2332473
8662 2332473 2157959 2295131 2655868 2407060 2413760 2982304 3318797 4103754 3504649 3717245
8652 3717245 3704274 3952181 4031173 4019792 4214586 4189020 4632795 5086687 5223756 5042054
8642 5042054 5265827 5643957 5802853 5924116 5887967 6103661 6373202 6188016 6506808 6945163
8632 6945163 7057578 7227639 7656731 7638935 7218831 7432898 6813069 6080741 5557499 5675163
8622 5675163 5242086 4886728 4788959 4533942 4218722 3961154 3987673 3283647 2664826 2565714
8612 2565714 2741838 2569461 2546221 2938872 2514005 2347807 2604131 2472186 2171930 2625881
8602 2625881 2653172 1999265 2035379 1859484 2031761 1644250 1702010 2107787 2686262 2747399
8592 2747399 2597841 2124771 1616270 1556257 1696785 1543596 1716107 2059768 1725816 2021464
8582 2021464 1449447 1570123 1837673 1097639 1253361 1484095 1532242 1426167 1408622 1210578
8572 1210578 1136789 1227112 761334 580930 641530 1367621 1126797 699367 671986 438675
8562 438675 712593 898538 779810 1118114 1265425 954247 1333527 1329352 850185 775123
8552 775123 811842 570759 262472 900806 933816 895012 933005 1072830 1266251 -460335
8542 -460335 251715 1025240 578455 692394 822554 1000491 706382 503935 773806 1230924
8532 1230924 948295 406057 585709 761137 554052 147131 456940 1082338 919748 967671
8522 967671 1340901 1119765 918228 904089 766611 593561 756858 1033112 739234 731250
8512 731250 1182455 1350214 1210044 1192556 851184 955793 1133354 859010 1187863 811953
8502 811953 636093 705396 469558 655251 467728 450962 1033155 1520010 1195524 996930
8492 996930 1234889 781758 666256 476858 726198 1070275 719865 1265042 655826 247096
8482 247096 714692 742697 607787 989881 891914 731513 959587 615763 976582 499734
8472 499734 746600 414949 769647 704342 555353 1045597 955498 1115273 1103129 881680
8462 881680 1080530 1474040 1336426 1514271 1002003 973585 1354399 676460 633545 456421
8452 456421 667642 1134328 628635 936791 1189279 1562509 1476720 1198097 888611 1007106
8442 1007106 609958 1513292 1489419 1523091 917269 1679654 1571129 1110772 1422288 1248872
8432 1248872 530308 455519 776229 754118 909050 1209725 1246889 1085407 1043244 1147547
8422 1147547 1208191 1325916 1475306 1545104 1732400 1380166 1626792 977753 1180689 1617476
8412 1617476 1180831 998627 1204210 1166802 1613627 1431088 807021 441090 348743 852312
8402 852312 1387872 981867 961638 1020940 1043767 576412 771365 1453022 1178448 939975
8392 939975 1015169 1309448 1151546 840504 1130039 1395382 1055727 754224 687662 985586
8382 985586 1398873 1179589 1253150 896704 1438015 1402566 1506601 1591103 1645303 1295075
8372 1295075 1596828 1676569 1509058 1601828 1715841 1745846 1445716 1194959 1675512 1887558
8362 1887558 1861782 1324495 1168032 1659558 1576774 1463551 1631764 1554805 1736418 2089487
8352 2089487 2340407 2252977 2574149 2220119 1872927 1927883 1821901 2216374 2185856 2038549
8342 2038549 2073742 2211513 1874003 2195883 2151920 2258600 1918890 2195576 1523728 1267950
8332 1267950 1209149 1369918 1851057 1495048 1165362 1098053 1732518 1752513 1618733 1877842
8322 1877842 1138162 1500806 1815880 1703775 1352284 1450108 1846268 1505802 1546033 1733011
8312 1733011 1541639 1367686 1046910 1153696 1581342 1656679 1550012 1759074 1704899 1457427
8302 1457427 1854329 1668235 1031964 1362484 1641026 1416219 1202712 1066862 1560069 1911527
8292 1911527 1388598 1148282 1271802 1331793 1421142 1106865 1274411 1042812 1142347 1300724
8282 1300724 1782846 1503268 1032064 1194718 1056474 1333050 1677957 1472756 1300254 1807434
8272 1807434 1484819 1764831 1744596 1468518 1376957 1279809 1409768 1178490 1039500 1107554
8262 1107554 1583520 1571929 1882356 2074978 1741875 1941109 2147594 2039786 1707277 1960248
8252 1960248 2040012 1699952 1876941 1807373 1401953 1776070 1627953 2085248 2067871 2238602
8242 2238602 2088441 1751824 1890298 1398217 1647226 2149114 2548431 2573852 2233255 2278333
8232 2278333 2361620 2252936 2688171 2804311 2218488 2087920 2327093 2241740 2246103 2439232
8222 2439232 2722361 2808189 2856027 3432569 3475332 3089094 3158667 3299310 3037100 2309926
8212 2309926 2540903 2840358 3064795 3038696 2768334 2913819 3294169 3379572 3471042 3399085
8202 3399085 3242262 3237001 3220743 3027235 2653740 2892596 3304182 2912259 3248932 1997285
8192 1997285 3870405 5727209 4859344 4529328 3859959 3980288 4136130 4104324 4699564
8183 4699564 4709091 4951354 4969074 4464839 5139988 4873319 4566990 4592453 4626962 4623547 5238148
8172 5238148 5231051 4808868 5377552 5738918 5661863 5753684 5749245 5904767 5533438 5842224 5634968
8161 5634968 5633966 5692224 5692708 5609016 6109031 6482073 6412306 5994991 5928478 5761850 5776702
8150 5776702 5852497 5938923 6232413 5693993 5827905 5887892 5797717 5566044 5745109 5436020
8140 5436020 6133227 6183361 6082048 6130548 6086916 6168297 6200268 6621032 6310026 6338442 7184251
8129 7184251 7250674 7053679 6602079 6649022 6560194 6637509 6704764 7017712 7018848 7074270 7002740
8118 7002740 6978509 7206754 7290597 7569904 7640863 7847552 7780071 7691786 7987077 7839842
8108 7839842 8064795 8233451 8124163 8384680 8656849 9049456 8993469 9127544 9812680 9832263
8098 9832263 10259878 10307018 9797327 9837577 9867534 10376114 10865304 11182360 11118899 11548065
8088 11548065 11330289 11844526 12624920 13052963 13076716 13440235 13996548 14257656 14331395 14600100
8078 14600100 15346620 15905772 16202763 17063314 17669910 18541574 18984729 19744278 20418584
8069 20418584 20715725 21406503 21773512 22118194 22438149 22864068 23145708 23105695 22832949 22776507
8059 22776507 22634082 23013973 24060547 23315481 23509290 24637789 25187179 25837246 26444214
8050 26444214 27679632 28758235 29522680 30724854 32205646 33672076 35874208 38235805
8042 38235805 40291271 42751735 45679884 49265826 53311841 57075311 60665222 64780761
8034 64780761 68505717 72116403 75783949 78854183 81140247 82736512 83827236 83848603
8026 83848603 83084786 81214462 78913875 76910769 74988914 72997252 71704080 71128435
8018 71128435 71147318 71583549 72886860 75259215 79710175 86701555 96788462 108214069
8010 108214069 114850688 109279239 98606701 87655823 76721460 68737879 62914851 58900788
8002 58900788 56162104 54391186 53145281 51831768 51251789 51759598 52470552 53110817 52872327
7993 52872327 52623071 51411358 50469200 49165010 48157066 47020047 45844047 43651700
7985 43651700 42414964 41714980 40500341 39474369 37666921 36454859 35433497 34316137
7977 34316137 33200046 32916077 32764615 32005849 32153500 32747862 32569051 31626989 31721802
7968 31721802 31798074 31502448 31702843 31055582 30997143 30960540 30301188 28902470 28528641 27367324
7958 27367324 27097875 26782287 26905162 26898360 25919863 25522821 25230891 24128810 23363069 23218465
7948 23218465 22171322 21952867 21654464 21248224 20763067 20714096 20493271 20251539 20161174 20358535
7938 20358535 20268184 20254807 20283191 20035041 20224356 20247568 20852251 20687105 20672500 20899931
7928 20899931 20366942 20408097 21103209 20868002 20758935 21456027 21588126 21326921 21551258 21489292
7918 21489292 20820803 20346497 19145632 18531407 18755869 18520337 18043823 17660443 17401153
7909 17401153 17012684 17146028 16959643 16900769 17124430 17216872 17042612 16484595 16566398 16769181
7899 16769181 17590277 17756622 17873276 18218278 18597604 19017367 19225590 19441201 20146614
7890 20146614 21399267 22207077 23273217 24101200 25445298 26943165 28937923 30565344
7882 30565344 32624515 34692862 36793539 38608384 38547629 38562377 38157732 37207889 36048993
7873 36048993 34910282 34202839 33741588 33222807 32490912 31054777 30518674 29421873 28261852
7864 28261852 27506687 26678011 26422910 26024319 26230800 26540685 27252745 27561420 28339763
7855 28339763 29669603 30734962 32124090 34028064 36102579 38912524 42726831 46016128
7847 46016128 49373392 52087334 54379676 55355919 54463458 52954506 50916705 48137880
7839 48137880 46557051 45060223 43870877 42763806 40991375 38684740 36118277 33654499
7831 33654499 30827616 28745701 27294604 25238618 23282798 21972589 21427549 20836804
7823 20836804 19768302 19391198 19036550 18686517 18080826 17858367 17481444 17232338 16698186
7814 16698186 16648139 16896407 16378636 16478724 16037828 15758323 15627020 15572878 15648959 16040961
7804 16040961 16124188 15836715 15819694 15623739 15839224 15632359 15063903 15442076 15511069 16038607
7794 16038607 16071901 16340661 17016655 17218857 17271914 17474869 17766290 17824027 18455349 18708563
7784 18708563 19233411 19826078 20773404 21447343 21848585 22526599 23724079 24518465 25596455
7775 25596455 26214998 27027695 28097752 29421983 31025029 32168335 33729580 35780444
7767 35780444 38303188 40522113 43153335 45879046 47999692 49520872 51262069 52387141
7759 52387141 52948694 52912370 52768484 52464452 51338749 50014285 48344266 45846854 44655403
7750 44655403 43049259 41225996 40158724 38794902 37851132 37111518 36348308 35397137 34398955
7741 34398955 33691117 33185041 32518365 32248368 32060082 32406166 32716575 33671643 34962641
7732 34962641 35928553 36864734 38054035 39031403 39258421 39693876 40045269 39789363 39460668
7723 39460668 39231880 39212596 37940628 36581750 35700919 34251961 32802913 32238854 30952414
7714 30952414 29884730 29147048 28846133 28227285 27471023 27065975 25779793 25278456 24302796
7705 24302796 23494382 23781617 24038013 24642426 24363865 24673144 24998212 24983310 24820779 25036405
7695 25036405 24270473 23658539 23551792 23219153 23044022 21910958 21033492 20460243 19709026
7686 19709026 19028577 18425522 17980843 17122363 16409207 16049278 15545569 15239714 15234659 15379529
7676 15379529 14816062 14559729 14015250 14158415 14010302 14183160 14319249 14621793 14668095 14744971
7666 14744971 14865353 14939093 14959767 15103083 15068372 14446156 14546209 13938410 13029833 12626296
7656 12626296 12087548 11582287 10926329 10134085 9685654 9285769 8778367 8793676 8517280 7932616
7646 7932616 7909842 7962530 7789111 7910754 7812538 7929662 8400812 8218509 8006813 8004064
7636 8004064 7784942 7519883 6804302 6646663 6276380 5772666 5734829 5701825 5929545 5646217
7626 5646217 5710305 5632995 4929162 4702561 4669184 4409829 4470488 4781063 4685882 4268742
7616 4268742 4502881 4348713 4077351 4124364 4035488 3602484 4081685 4408567 4274009 3903593
7606 3903593 4007266 4138699 3748737 3314281 3604454 3418810 3152689 3941337 3633453 3376228
7596 3376228 3520004 3299215 2908091 3205671 3385532 3276512 3224856 3331485 3312226 3406153
7586 3406153 3138832 3753200 3837149 3425205 3310244 3371305 3342679 3190399 4033894 3961858
7576 3961858 3432858 3219955 2822576 2959120 2888859 2640687 2382657 1978056 2354391 2780976
7566 2780976 2455071 2531590 2192512 2532217 2396998 2406782 2646024 2144644 2230350 2257776
7556 2257776 2121616 2171349 2353936 2244750 2845048 2888279 2542249 2219879 2069145 1916805
7546 1916805 1701162 1957260 1999743 1886606 2376895 2247375 1951755 1899266 1799635 1827258
7536 1827258 1916885 1630109 1953892 2389064 2082743 1826988 1590783 1971563 1902581 1613980
7526 1613980 1782448 1674757 2019054 2225648 1871750 1973631 2213727 1869371 1837824 1845409
7516 1845409 1414164 1206813 1600211 1829431 1989999 1861407 1393492 1498289 1651179 1383347
7506 1383347 697221 946797 1399617 986561 818158 1079787 966674 1255791 1462471 1404532
7496 1404532 1897347 1755150 1413171 1015031 1129400 784210 749789 1448713 867093 942106
7486 942106 1099666 1225918 1305744 1335172 1398403 1290282 1062139 1066815 831233 1115745 1805549
7475 1805549 1505748 1238847 1403402 1238695 982343 907302 978354 1242349 1113221 1362397
7465 1362397 1178991 1203995 1154693 1304451 1325861 1433258 1139366 1233440 1526873 930380
7455 930380 1322294 1615604 1293630 1373092 1331233 810523 1129756 1180915 1363945 1275426
7445 1275426 1145330 1713157 1531486 1124920 956073 1480671 1394755 1286484 1133577 1183952
7435 1183952 982918 1072939 1223146 676656 678319 967024 977582 1036753 1071458 1515318 988930
7424 988930 713963 702667 656974 623704 1013759 842611 503998 582675 664787 403488 536039
7413 536039 819226 1116434 1484652 1102447 608612 832533 1002352 858739 1010743 450928
7403 450928 781164 483729 1094672 889246 947457 1075424 845599 621965 675083 704464
7393 704464 648278 460234 220744 674323 1085033 1080300 916463 1165108 991066 917322
7383 917322 820753 1651429 1083894 949094 1438789 1023453 438867 792516 995561 716170
7373 716170 856624 638130 678571 652246 1133019 1215403 1050157 778912 683277 266585
7363 266585 792251 885952 1149225 1263455 1219236 263471 584497 405787 -16905 155621
7353 155621 455520 181427 -292270 42410 -172999 -439318 11012 33154 314700 779973
7343 779973 590950 161368 -31344 -171723 187843 356317 278141 262813 207109 92944
7333 92944 502471 423641 385483 772529 497887 934847 773532 1137829 837102 756778
7323 756778 570427 227554 125676 -25485 -84184 282587 343731 195519 143401 89803
7313 89803 40210 -39380 185102 110594 358034 970634 145041 -172429 63131 501332
7303 501332 -19632 263175 205477 589797 761665 858718 659080 513112 452871 364759
7293 364759 421346 42716 24281 167328 368476 141246 524093 305715 217453 390153
7283 390153 659998 587620 264204 229736 557166 236237 433239 331211 331801 312836 328538
7272 328538 301965 298643 183888 -12919 251221 -19442 293234 194443 268561 274489 135726
7261 135726 -427926 -267203 -111101 78406 221044 366890 -226700 -143286 260677 220156
7251 220156 10312 72371 125090 427974 156693 -195514 -299082 -190970 -43874 -422281
7241 -422281 -157038 238214 305417 541360 29006 -293458 128697 -13643 288974 165280
7231 165280 -32243 301048 486742 247741 432199 519264 236007 -239885 -364532 -184617
7221 -184617 253859 83271 -26326 326977 363669 162979 259100 253463 243708 71535 474558
7210 474558 39792 52129 224997 382628 491169 -55931 167093 -292929 -275509 104418
7200 104418 5055 62297 305430 22553 317583 334512 -158258 -97522 -281515 -684120
7190 -684120 -122003 145783 -198999 539955 957464 705877 337090 363023 34037 330100
7180 330100 478819 274681 220075 617330 302286 176429 -76267 277867 46814 158150
7170 158150 -27968 -395080 -373048 149280 146069 -387478 -92030 130208 216312 148660 264332
7159 264332 171295 117040 -97542 -352565 -336530 229999 534811 423371 -87135 -235577
7149 -235577 201816 113186 172818 -256167 220777 159027 319422 171437 -310483 75040
7139 75040 253190 -181721 -377291 133389 69368 453576 -146720 -365917 -403886 -153641
7129 -153641 -196599 -67660 302381 165570 -215393 -407143 -7800 -156306 -137535 310438
7119 310438 275071 403173 -187759 159683 188427 23065 -5612 59866 -241166 226267
7109 226267 162538 -125921 -171724 184478 149165 -176127 82888 -29512 147480 430153
7099 430153 223143 -542712 183752 807300 811267 592928 -552304 -2879 -41761 -297397
7089 -297397 -617955 -654188 -649404 -595826 -498608 -193644 180140 -146354 11005 197780 368366
7078 368366 59936 110495 390114 329852 -43866 114812 565537 795397 577457 -59339
7068 -59339 209636 476329 77822 -46336 -308107 103112 35534 231028 431608 194119
7058 194119 211285 183008 363041 263043 97931 173160 -38287 171142 213228 209398 232632
7047 232632 493307 348709 361510 372564 -62670 83216 586303 625677 -210342 -249968
7037 -249968 -141642 -152647 200518 115390 51912 -118396 73319 -167864 -90333 -294475
7027 -294475 -44864 158472 173937 204166 -123000 -334657 -208818 -117541 -161810 -471913
7017 -471913 -652602 -290365 -148776 -364619 -368695 -404770 -242953 -159051 -289131 7058
7007 7058 -300365 61220 196433 140384 91369 131896 209082 556001 634243 -113719 43971
6996 43971 186980 231584 444382 -162445 -127555 160663 248263 280580 126830 181211 -5240
6985 -5240 -77469 -151032 57533 -59539 313660 -42006 70683 45904 242295 515710 -308102
6974 -308102 -167637 122830 252171 -279338 -449601 52961 509123 70311 187781 434210
6964 434210 60924 -372189 -193401 -360664 251438 580647 212817 -329870 347871 428722
6954 428722 285800 -189017 -139219 -212922 -237836 201086 155518 219496 -232061 257656 208529
6943 208529 450462 235121 -88471 19974 -200523 215804 167663 195194 -6216 -301888
6933 -301888 -473025 -212802 283870 9507 24753 -146103 370725 297643 -275796 -173309
6923 -173309 89260 274925 69248 290543 -202507 -447090 -317579 -312427 223386 168989
6913 168989 109206 -474014 -594272 -623245 -438581 -357761 -23036 73482 -59173 178483
6903 178483 258009 140820 44695 147858 161309 -425190 -138290 203426 116726 33648 -142187
6892 -142187 215939 740412 752580 773421 399029 115908 489222 445050 377029 381044 118689
6881 118689 127902 243568 244092 -110515 142919 536651 -43943 156941 447227 113831 244011
6870 244011 479550 172017 198340 147368 -265251 -290156 -161303 268733 274292 375277 350399
6859 350399 -270233 124996 229077 -289374 -13730 -64503 52689 425163 506699 133865
6849 133865 -251728 -241703 -143779 -253392 172823 777689 659156 912624 526913 -24325
6839 -24325 502868 302275 -15815 417748 56786 168735 -113408 -47530 -159242 -132058
6829 -132058 151115 168052 158616 207727 54205 6744 194706 -51450 203839 309727 71508
6818 71508 82621 -100007 -146981 1412 45409 -256324 -130248 505493 244814 381591
6808 381591 -153978 -92210 171642 -156494 -42290 -201870 -122398 -132062 50188 -273135
6798 -273135 49606 357170 -8186 -42468 230526 192151 435689 666066 210073 84354
6788 84354 -109989 -151536 30394 199359 157488 404005 306755 -73564 -195176 -109913 -76662
6777 -76662 -262571 -189267 -144109 -137839 -321705 -205953 33896 346029 424437 310711 98429
6766 98429 284473 420361 205778 80274 588272 106015 76274 132016 139615 266734 283483
6755 283483 166226 424027 401801 381745 688449 250669 646346 398049 28470 -154243
6745 -154243 223055 519611 -86584 331362 612786 21644 -74155 477925 527898 242655
6735 242655 355260 -4378 66850 426066 1027406 579705 301520 126072 25326 183004
6725 183004 283431 311190 378319 -186809 -419268 -166027 104931 498635 400927 221345
6715 221345 358366 181975 111433 285865 231288 183072 156451 792921 948923 544519
6705 544519 462907 392296 286640 629425 946837 339560 166273 -38239 -264398 -129662
6695 -129662 -83965 416105 506828 422975 451926 584840 -172549 46553 530814 621532 366438
6684 366438 486653 556231 636873 540032 318160 393653 726035 819249 465204 392698 435149
6673 435149 531603 469097 607514 767579 563255 577815 616702 640906 982157 878611 847804
6662 847804 529413 542192 302981 534295 809173 1425830 841265 892515 819779 886434
6652 886434 1002116 694208 812460 1202180 1112993 1017243 1027050 1145118 1124483 586476 565376
6641 565376 644959 672331 735060 902211 984031 772321 861620 1103446 860123 662499 854544
6630 854544 1191855 867377 855749 1339146 1096471 664541 710392 830808 1088259 1168684
6620 1168684 803304 710221 1101488 697364 676742 772294 768435 787045 626306 757769 747079
6609 747079 832419 1071487 1174245 997351 504487 750883 850338 943168 759435 1190276
6599 1190276 1151544 1353163 1210819 894405 573579 1067871 1460011 1035991 1306897 1522270
6589 1522270 1343045 1113149 1298697 1608527 1813092 1768159 1386943 1517920 1388410 1624459
6579 1624459 1734890 1254989 1219579 1443517 1644417 1912328 1821150 1506445 1917363 1647141
6569 1647141 1733670 1685134 1765140 2309529 2386582 2280184 2335613 2830199 3233711 3474381
6559 3474381 3655747 4063061 4463955 4813437 5268328 5321138 4316664 3564737 3061046 2901350
6549 2901350 3296090 2788406 2055697 2015334 2095001 2165728 2048303 2017629 2297552 1905129
6539 1905129 1600412 1664197 1917804 1628459 1650197 2061948 1682423 1281512 1460318 1628221
6529 1628221 1867083 1942423 1983407 2028990 1981056 1794722 1721473 1798894 1873352 1890955 1776800
6518 1776800 1730183 2006007 1553899 1373216 1661909 1829202 2257361 2183991 1967047 1465228
6508 1465228 1664130 2052556 1931489 2073546 2147508 2163766 2278050 2546650 2703148 2556290
6498 2556290 2528988 2444555 2390527 2215445 2682567 2397328 2719702 2622004 2840224 3369101
6488 3369101 3117445 3414930 3995403 4406425 4418069 4739349 4406671 4314261 3409837 3292831
6478 3292831 3346424 3465565 3228347 3135446 2867002 2522708 2204673 2439704 2353026 2297842
6468 2297842 2109726 2047525 1942703 1663176 1497303 1552225 1661276 1484829 1555499 1771905
6458 1771905 1862759 1589109 1494897 1542148 1497364 1468161 1412277 1925508 1505385 1134066 1525371
6447 1525371 799284 1277649 1166806 991948 1183272 1087934 1081517 1291103 924965 1231323
6437 1231323 983469 971210 1128613 965066 1090338 1014874 1224116 1502935 1149977 808727
6427 808727 413500 803531 1078465 1283623 1520923 1282274 1068450 1227478 1356110 1229478
6417 1229478 950977 1170115 1258050 1083064 1318986 1390814 1385774 1570251 1777379 1250346
6407 1250346 1312994 1140340 1229394 761918 1298383 1001246 847265 1390328 1300778 803599
6397 803599 977042 720777 854686 1295183 1144092 1325295 1506023 1203409 1510428 1743050
6387 1743050 1137453 1458765 1795667 1884651 2140562 1993794 1829015 1657691 1588533 1953551
6377 1953551 1469503 1523487 1496827 1462040 1561056 1870833 1404610 1339271 1162732 1104478 1052866
6366 1052866 1664221 1494282 1007478 1081677 1091810 1034390 834185 1038142 1166110 940072
6356 940072 710410 1059931 1327388 1167337 963524 1529648 1642627 1616605 2090442 2134889
6346 2134889 2382724 2384976 2552219 1992545 1908139 2012606 2349789 2534746 2113831 2619338
6336 2619338 2829745 2990603 3565759 4785329 4716562 4800127 4824030 4185177 4148888 4548794
6326 4548794 4370605 3520717 3263465 2380164 1585385 2279396 2221422 2181321 2739330 2627537
6316 2627537 2203003 2445731 2261218 2036534 1975691 2278434 2389541 2192692 2230622 1995374
6306 1995374 1996487 2022305 2518780 1849645 1681267 1710117 1359896 1963957 2544725 2488143
6296 2488143 2154315 2243952 2472148 2882840 3234630 4047175 3783242 4461030 4998451 5220034
6286 5220034 5016057 4642693 4987826 4748954 4560968 3839908 3549507 3420577 3060474 2462096
6276 2462096 2348480 2170967 2604223 2401340 2061594 1951558 2077124 2656815 2413311 1930905
6266 1930905 1688410 1803263 2086110 1906604 1499350 1499194 1929120 2203786 1608788 1212134
6256 1212134 1640347 1884881 1493631 1002041 1022727 1284360 1365959 1710723 1236789 1769167
6246 1769167 2083110 2217936 1944507 1874415 2563273 2233632 2138227 2174963 1957702 1870241
6236 1870241 2078032 1758840 1485259 1328314 1797514 1824397 1871614 1485273 1416097 1479859
6226 1479859 923531 1369530 1560801 1696375 1317746 1013199 1578791 1426156 1585651 1255500
6216 1255500 1564636 1822585 1761704 1717198 1502684 1707602 1402289 1394424 1596832 1286828
6206 1286828 1488981 1844919 1686559 1467049 1053392 1077679 1150573 1220787 1381830 1228064
6196 1228064 1234012 1213528 1253621 1613532 1358321 1632326 1149190 1173403 1723097 1729670 1664646
6185 1664646 1382724 1343184 2009820 2035906 1907206 1843615 2002824 2329285 2413399 2497243
6175 2497243 2657318 2323962 2259898 2038116 2526302 2211148 2252717 2227838 2650353 2606682
6165 2606682 2452297 2397588 2563052 2248278 2194878 2112668 1973767 2524984 2697517 2947640
6155 2947640 2337721 2628574 2158627 2194192 2114459 1986455 2290664 1852805 1869711 2245143
6145 2245143 1888837 2229541 2472225 2192381 2384640 2410882 2112477 2314407 2751235 2641071
6135 2641071 2417799 2621754 2030199 2408498 2401166 2080900 2064740 2513014 1940503 2453031
6125 2453031 2408455 2418714 2581274 2170537 2119832 2133392 1722271 1680095 1663563 1846273 1994649
6114 1994649 2065299 2020978 2173893 2136400 2083051 2039289 1963065 2284304 2435260 2174457 1818176
6103 1818176 1612676 1893415 2311597 2349687 2183273 1909418 2004763 2140656 2023652 1530496
6093 1530496 2125112 1682269 1597223 1642623 1359651 1501026 1834235 1678813 2026661 2068126
6083 2068126 1689040 1730417 2035703 1687782 1531242 1935883 2053729 2437352 2501406 2142968
6073 2142968 2106313 2477403 2317504 2010021 2208050 1975279 1732039 1948065 2199193 1972398
6063 1972398 1990747 2089170 1947349 2319074 1971974 1913368 2090341 2019658 2115399 2048650 2118484
6052 2118484 2182233 2393891 2358093 2245917 2114203 2314037 2193110 2049845 2100174 2612098
6042 2612098 2911253 2800674 2796182 2565594 2451734 2631699 2567516 2731285 2329919 2777835
6032 2777835 3082833 2665250 2622494 2473802 2330451 2461621 2376090 2087309 2568549 2641674
6022 2641674 2977047 3354699 3238765 3031797 2990885 2821625 2875895 2710529 2468014 2764568
6012 2764568 3062752 2601828 2184075 2627593 3039178 3081997 3385085 3827531 3733862 3549524
6002 3549524 3017599 3068903 3229589 3017025 3085767 3527135 3506900 3658268 3742730 3684031
5992 3684031 4118304 3876816 3465533 3798848 4422406 4426663 4129465 4109091 4735927 4420720
5982 4420720 4261848 4758315 5025832 5096326 5256173 5301639 4889624 4574202 5084632 5551315
5972 5551315 5433317 5261266 5130421 4808383 4781334 5096013 5483379 5477070 5602787 5628260
5962 5628260 5100753 5508981 5931689 5924849 5606898 5433239 5317685 5747570 5789004 5816072
5952 5816072 5862145 5537424 5471925 5454137 5669221 5757366 5181964 5528105 5686624 5560001
5942 5560001 6056052 5916081 5704320 6246538 6256355 5956274 6882366 6801864 7328425 7281667
5932 7281667 6594150 7119678 7083297 7565803 7923662 8302991 8513465 8283891 8351325 8567377
5922 8567377 9153953 9539261 9594435 9858697 9667175 9809241 10042188 10073883 10919286 10742533
5912 10742533 11106431 11235263 11738986 12129366 12245666 12529639 12740389 13234711 13258809 13585464
5902 13585464 14461113 14531287 15012753 15602341 15815587 16155191 17224259 17743670 17944928
5893 17944928 19127065 19960286 20434042 21164679 22358030 23222088 24401224 26127184 28411217
5884 28411217 30114392 32291038 35208426 37906578 41237280 45736031 50210186 55686132
5876 55686132 61404602 67543010 75395995 84416040 94344524 105136313 115237589 123215063
5868 123215063 126337880 123951876 117721252 109006045 100010647 91579190 85013111 78731325
5860 78731325 73420894 68886400 65012296 62480476 60516210 58878930 58139206 58157163 58140366
5851 58140366 58271741 57915506 56721280 55792999 54265458 51652945 48524422 45877593 43345499
5842 43345499 40855697 37904353 35306638 33870472 31082090 29332758 28224720 26902991
5834 26902991 25848303 24450552 23468966 22829959 21843458 21084214 20406872 19940759 18962762
5825 18962762 18255976 17673449 17052101 16509718 16114753 15924965 15434553 15060764 14473002
5816 14473002 14162262 13805834 13699895 13447746 13123165 12668811 11959922 11893209 11784795 11613520
5806 11613520 11188808 10756552 10349005 10466523 10769913 10123508 9748943 9678477 9691014 9768619
5796 9768619 9801291 9331060 9444775 9478509 9462388 8886351 8501770 8428950 8621464 8830178
5786 8830178 8412729 8086481 8461882 8542514 8191429 8009952 8196653 7632046 7297131 7649845
5776 7649845 7391801 7585181 7663328 6926350 6791188 6968036 7483273 7451283 6836861 7392750
5766 7392750 7124943 7154853 6914078 6940886 6800822 6412757 6197376 6087547 6590632 6951279
5756 6951279 6594076 7035637 6880782 6267561 6062799 6280954 6515617 6448210 6035319 6445818
5746 6445818 6109202 6402687 6242935 5371223 5646280 5432100 5594421 5799753 5952425 5831210
5736 5831210 5438122 5266448 5706787 5976905 6454589 6478468 6233301 6075861 5721312 6141763
5726 6141763 6381457 6632806 6364357 6168563 5864522 5800005 5747668 5862116 6360061 5762258
5716 5762258 5929811 6527383 6135533 5969616 6293273 6244245 6483828 6321458 6338352 6174954
5706 6174954 6190462 6565089 6953352 7035789 6684145 6375112 6847732 6651779 7090187 7247589
5696 7247589 7159268 7128978 6848014 6732189 6901287 7116499 7431673 7164528 6911036 7094279
5686 7094279 7346555 7671387 7645702 7893210 7991237 7981241 7951386 8483472 8666834 9087949
5676 9087949 8686813 8546157 8809493 8722207 8636748 9067408 9516703 9331471 9461020 9667411
5666 9667411 9959105 9936898 9728779 10184756 10114410 9926055 10170179 10147804 9962862 10098121
5656 10098121 10173764 9848697 9943394 10414294 10667878 11211586 10954265 10696940 10949409 10689564
5646 10689564 10320854 10215044 10477912 10935644 11458292 10904811 10292180 10355495 10294463 10184853
5636 10184853 10221873 10050373 10475829 10297823 10688135 10586235 10126109 9586993 10088409 10160668
5626 10160668 9651481 9620295 9274544 9517324 9663348 9898435 9842592 9382986 9212693 9403396
5616 9403396 9186315 9230746 8934844 8463524 8746893 8265429 7968422 7836451 8024110 8125334
5606 8125334 8102208 7878663 8194118 8470917 8040675 8079582 8108716 8212561 7955575 7713777
5596 7713777 7419178 7967225 8092523 8236850 7954756 7247616 7500943 7142784 6757304 7191262
5586 7191262 7828832 7782251 7599454 7707442 7763399 7726420 7620387 8166620 7647471 7654776
5576 7654776 8317234 8358702 8520765 8373182 8265784 8118141 8151974 8205527 7857742 7778155
5566 7778155 7739066 7363611 7298422 7083638 6881872 7010760 7148660 7395573 7273067 7358638
5556 7358638 7205185 7503590 7322703 7113957 6928439 6661271 6415535 6942198 7006617 6926849
5546 6926849 6690978 6972707 6883727 6501338 6721919 6789289 7161275 6680772 6152283 6577880
5536 6577880 7036330 6902076 7058087 7206571 7185499 6685370 6636767 7059420 7503098 7125689
5526 7125689 6747500 7059160 7273612 7309114 7150287 6637622 6793545 6711528 7031119 7022554
5516 7022554 7236455 7120694 7265408 7232943 7145615 7167692 7402625 7482073 7648765 8100647
5506 8100647 7673224 8155188 8582953 8112948 7731769 7910141 7879717 7983565 8195293 8341376
5496 8341376 8234075 8781497 8655078 8805901 8974381 8875502 9125575 9792183 9909654 9666120
5486 9666120 9733886 9926999 9936782 10028605 10758442 11642716 11697300 11813465 12335698 12775567
5476 12775567 13325650 14050289 14791644 15832828 17013666 18371488 19058842 19677155 20707810
5467 20707810 21439453 21796628 21128973 20363071 19873651 18842892 17997809 17215279 16481096
5458 16481096 15788247 15326554 14820842 14564115 14075778 13380600 13569401 13410809 13347648 13680311
5448 13680311 13540775 12964273 12777405 12958491 12934656 12665189 13073847 13506884 13411874 13847982
5438 13847982 13944748 13812830 14362405 14156281 14195266 13868198 14381341 14505883 14910542 15471135
5428 15471135 16075237 16162400 16624344 17196912 17381443 17712990 18827712 19869827 20177227
5419 20177227 20727463 22013560 22806423 24455781 25332585 25627901 26878014 27679354 29420838
5410 29420838 30501804 31600273 33320316 35502256 37465611 40170225 42736053 45153184
5402 45153184 47333422 49937009 53237738 56261172 59291460 63004821 66408274 69935432
5394 69935432 73632162 75813470 77756831 77868895 76228845 74061130 71446757 67663542
5386 67663542 64083836 60205325 56000763 51675816 48418667 44853255 42329682 39956672
5378 39956672 36922678 35011803 32543611 30853928 29482688 28049107 26042054 25078226
5370 25078226 24197713 23329312 22389303 21513496 20873853 19865085 18963811 18417036 18001136
5361 18001136 17517268 16735936 16039551 16141545 15874546 15229557 15227098 14851350 14642803 13746436
5351 13746436 13406026 13311113 13215059 13326893 12253354 11344458 11326743 11536703 11158489 10606341
5341 10606341 10614571 10834253 10475660 9957870 10018569 9561208 9805973 9758348 9545664 9736490
5331 9736490 9284140 8762876 9049957 9524225 8802755 8654342 8687928 8615188 8629370 8252854
5321 8252854 8173218 8701825 8711231 8111191 8045102 8171711 8569185 8760340 8839693 8617990
5311 8617990 8163441 8248908 8160238 8377723 8268372 7489754 7487710 7449357 7715348 7717887 7448487
5300 7448487 7571765 7759288 7848425 7669855 7459785 7326067 7364011 7100721 7132325 6872023
5290 6872023 6671620 6481652 6713410 7124227 7164351 7131319 7150825 7028832 6198700 6592514
5280 6592514 7006948 7044913 7091236 7035815 6980700 6633407 7091921 7239963 6993364 6840611
5270 6840611 6727043 6960173 6890056 7360062 7582984 7646408 7318347 7413278 7521750 7077267
5260 7077267 7036764 6967224 6887531 6615177 6583058 6886467 6875360 6736256 6986883 7033554 6601228
5249 6601228 6680915 7127519 7380490 7205640 7430801 6905309 6777502 6810325 7138681 7218248
5239 7218248 6820757 6999463 6970506 6959367 6603260 6609548 6614036 6636638 7031728 7091454 7025670
5228 7025670 6815275 6874681 6961451 6733704 7054785 7018142 6900049 6514091 7452568 7031754
5218 7031754 6735401 7077019 7367119 6940995 6822287 7273934 6844750 6395043 6490100 6563004
5208 6563004 7026456 6959506 7185315 7294192 6521805 6366605 6751487 6776894 6407330 6317318
5198 6317318 6382948 6626489 6516808 6731649 6551011 6307167 6096702 5876901 6259248 6114062
5188 6114062 5854069 5772418 5766484 6067131 5687868 5566922 5804271 5642492 5754628 5438075
5178 5438075 5465015 5275658 5688879 5679861 5311522 5067821 5147816 5024331 5487832 5568094
5168 5568094 5003557 5136433 5191351 5122997 4955868 5374050 5598681 5213319 5255778 5367312
5158 5367312 5065959 5177129 5142778 4565003 4721199 5161932 4848933 4557246 4689450 4474499
5148 4474499 4540831 4775448 5005593 5388409 4788000 4798666 4898183 5209780 5266625 5429158
5138 5429158 4975931 5372706 5155689 5062868 5035756 4981964 4357975 4302594 4437297 4549151
5128 4549151 4574259 4688398 5061510 5276509 4901951 4644761 4327949 4032664 4172881 4665694
5118 4665694 4236667 4005838 4660094 4617848 4929559 4094620 4497825 4620409 4278984 4196637
5108 4196637 4384665 4593162 4555649 4377147 4391335 4437480 4711825 4429280 4434960 4394264 4348685
5097 4348685 4626755 4902927 4510399 4291494 4595525 4604294 4619167 4054404 3973431 4484466
5087 4484466 4891270 4699314 4648249 4507454 4220426 4083902 4403330 4350133 4688456 4439069
5077 4439069 4053559 4128237 4976876 4942308 4686654 4564227 4699441 5146665 5379737 5544500
5067 5544500 5348971 4668291 4615267 4685407 4410161 4555098 4950514 4923319 4863406 4491679
5057 4491679 4860347 5170198 4839879 5645151 5465148 5203224 4910969 4828483 5108064 4464471
5047 4464471 4759128 5457349 5326571 4984263 5039313 5174890 4704044 4818696 4796751 4760731
5037 4760731 4588899 4651208 4721038 4659560 4780349 4749525 4144958 4588341 4633139 4640990 4351145
5026 4351145 4415980 4425383 4579113 4914130 4570050 4605683 4952647 5043189 5054219 4975318 5080115
5015 5080115 5259120 5144489 5201194 4730787 4864406 5219600 5210307 5583259 5082025 4717047
5005 4717047 4934374 4949191 5161179 4827119 5120993 5256652 4974591 5096517 5087171 5170235
4995 5170235 5208494 5259126 5517408 5493706 5388748 5727675 5278909 5431714 5806634 6209818
4985 6209818 6641853 6585368 6368671 5863545 6038511 6330605 6302239 6140160 6189854 6037540
4975 6037540 6174414 6231609 6352890 6255115 6098304 5956920 5766330 5377152 5165558 5226012
4965 5226012 5390338 5345386 5265570 5835849 5871145 5371023 5568814 6081363 5843095 5950180
4955 5950180 5608376 5568731 5178415 5653152 5565437 5092150 5028658 5188511 4780870 4106624
4945 4106624 4913090 4957095 4939977 5526298 5263938 4727628 4872146 5046641 4855157 4570459
4935 4570459 4567815 4929536 4886680 4582851 4875974 4947100 4374731 4443827 4968664 4916737 4753450
4924 4753450 4434985 4615433 4744800 4842458 4653842 4426781 4702795 4825302 4315718 4186074
4914 4186074 4582297 4485285 4813699 5127919 4669182 4628815 4862603 4935626 4654213 4653491 4356677
4903 4356677 4372172 3964303 3865928 4400293 4472802 4339807 3892448 4028860 4351563 4210117
4893 4210117 4254877 4552846 4433919 4496817 4419191 4249759 4649979 4492221 4023541 3864683
4883 3864683 3800544 3872089 4034264 3900213 3745873 4134795 4139164 3373938 3950163 4073123
4873 4073123 3746372 3969482 3938584 4347488 4473831 4136438 4185028 4119296 4217566 4274118
4863 4274118 4352494 4506214 4548522 4706315 4395898 4477117 4756961 4357122 4238887 4109405
4853 4109405 3987058 4236074 4349863 4061019 4033343 4293192 4068090 4183255 4552294 4088391
4843 4088391 3726357 3649190 4166838 4595499 4977508 5068558 4447709 4946335 5439968 5372542
4833 5372542 5290314 4863423 5087436 5540624 5258362 5156292 5021265 5132940 5214397 5507098
4823 5507098 5742695 5547289 5593232 5247812 5624896 5237196 5066070 5380466 5594873 5492844
4813 5492844 5374304 5570386 5811276 5815301 5898241 5435297 5520309 5541360 5572597 6040273 5478070
4802 5478070 5768098 5511602 5612225 5879970 6062733 6495957 6351989 5824851 5867480 5777573
4792 5777573 5739139 5865139 6053335 5304989 5174576 5279620 5177416 5348150 5621576 6440423
4782 6440423 5990671 5906273 5975013 6172901 6050306 5946007 6101674 5852185 5804700 5990428
4772 5990428 6390353 5688819 6300466 6131250 6192419 6459619 6309048 5931588 5830004 5591682
4762 5591682 5817390 5537725 5564085 5404286 5034674 4684601 4703333 4329476 4316576 4943714
4752 4943714 4890162 5126266 4259766 4234072 4741138 4477482 4457177 4748741 4308082 4261878
4742 4261878 4387422 4726848 4659048 4883873 5390803 4767613 4986274 4869750 4785351 4926910
4732 4926910 5028738 4852411 4942244 4967978 4724406 5057927 4483629 4497809 4785105 4820203
4722 4820203 4584139 4643599 4883173 5131657 5267227 5070638 4820886 5167545 5126637 4732560
4712 4732560 5013439 5384089 5400556 5308985 5492394 5433975 5123648 5124211 5214404 4997783 4913049
4701 4913049 5309151 4891536 4564126 5128915 4993748 5098530 5043729 4510556 4557473 4598390
4691 4598390 4526212 4492807 4757941 4677343 5000311 4705322 4784655 4650192 5004189 5086018
4681 5086018 4708024 4912929 4738472 5034105 5180329 5297412 4912050 4939092 5318673 5440651
4671 5440651 5149861 5032755 5980512 5714775 5151707 4905483 5620274 5283121 5190634 5284983
4661 5284983 5520075 5838800 6060962 6583084 6197283 5728138 5755720 5684728 5945369 5871337
4651 5871337 5319350 5186443 5674687 5676771 5835423 5979718 6153349 6269635 6693367 6184708
4641 6184708 6028874 6242853 5999078 5950162 6311823 6447040 6083149 6503992 6640067 6368323
4631 6368323 6348004 6212893 6494002 6671384 6158096 6718112 6556316 6446982 6134084 7197987
4621 7197987 7154126 6676957 6977109 7236957 7219627 7337155 7323939 7622528 7921643 7387630
4611 7387630 7212778 7810228 7985360 7599836 7891470 7924539 8167914 8249967 8503940 8779796
4601 8779796 8376599 8780322 9077271 9562454 9750533 9848672 9875843 9996494 9959201 10243447
4591 10243447 10565053 10828570 10937340 11106115 11399059 11663607 11107717 10875087 11111510
4582 11111510 11136209 11398495 11640140 10852412 11308822 11512715 11237481 11766581 12333169 12340805
4572 12340805 11927635 11748636 11345288 12120235 12450166 12298164 12116327 12583397 12251906
4563 12251906 12828915 12527250 12115533 12750751 12650601 12462433 12536241 12727922 12620193 12362665
4553 12362665 12595275 12360739 12844411 13488978 13095534 13249128 13463126 14270970 14137918
4544 14137918 14114626 13923661 13897072 14812161 15555634 15394542 15660851 15639953 15545190 15995539
4534 15995539 16157463 16432326 16310630 16473391 16773294 16491657 16803023 16520104 16059998
4525 16059998 16259137 16208908 16603275 16770858 16788489 16986936 16986475 17076441 16776943 16580183
4515 16580183 16794859 16588600 17058512 16959159 16990879 17076195 16567056 16866839 17068485 17015928
4505 17015928 17442167 17384225 17504233 17817130 17853619 18556006 19025572 20034607 21069257
4496 21069257 21361954 21762382 22663172 24111985 25345196 26692751 27754918 29129776 31633795
4487 31633795 34866934 37822382 40540868 41725474 40992621 38347291 34697071 31902446
4479 31902446 29133813 27058681 25855927 24204102 23150930 22460513 22130823 21834302 21582550
4470 21582550 21568010 21141381 20585397 20309360 20086392 19986916 20317161 20343571 20200060 20640463
4460 20640463 20482520 20621878 20802562 20901758 21084199 21180524 21401315 21820404 22344605 22566211
4450 22566211 23215999 23586098 23883349 24919563 25092034 25963828 26604487 27059440 28055587
4441 28055587 29096166 30180442 31246097 32941459 35021157 37010414 39251855 41336860
4433 41336860 44125564 46976717 50311620 54081692 56706071 58103705 58678799 57405280
4425 57405280 55095395 53286612 51633983 50386829 49140980 48740331 49130018 49541315 49623080
4416 49623080 50543188 50641985 51531875 52292240 52917430 53911345 54853099 55577803 57136213
4407 57136213 59254164 61098583 63827304 66319205 68597269 71384458 73651472 74521665
4399 74521665 74449782 73424859 72723889 71515455 69765523 69031022 68835270 68854149 68661690
4390 68661690 69681350 70866957 72675493 74243863 76521171 79247764 81573022 83898409
4382 83898409 85633848 86899187 87602236 87339366 85981819 84409305 82671244 80640107
4374 80640107 79224471 77678939 76049101 74731778 74003124 73070326 72411440 72170820 72349160
4365 72349160 72928925 73240097 74374836 75943246 77392263 79076128 81313663 84163996
4357 84163996 86679795 88803912 91301943 93646834 95364353 95245888 96002260 95570165 93942147
4348 93942147 91857620 89616469 86780210 84274290 82562499 80913971 80075658 79445080
4340 79445080 78812304 79035166 80061606 80975781 82692155 84613147 86439545 87570288 88636740
4331 88636740 88754663 88120921 86452307 84088765 82346516 80231046 78009859 76342932
4323 76342932 74155227 72375580 71436691 70764364 69852966 68371227 67758904 67373169 66734023
4314 66734023 66175412 65463817 64873036 64639085 64222256 64085616 64031333 63952096 64236821 63950051
4304 63950051 63472333 63197624 62834070 62634145 62030403 61730614 60753908 59450071 58523556
4295 58523556 56981999 56449770 55832262 55501980 54319677 53979684 54194755 53649009 53779642
4286 53779642 53378664 53378361 53495003 53058419 52582194 52573320 51768919 50689778 50455575 49453405
4276 49453405 49231982 48717863 47329097 46406573 46241898 46316885 46055723 45955556 45485432
4267 45485432 45208215 44884289 44413958 43858035 44205047 43998043 43600260 43475948 43320487
4258 43320487 42586593 42163651 41089392 40603375 40263418 39430957 39397415 39194309 38635365
4249 38635365 38493642 38029847 37738900 36905432 36219071 36142031 35592011 35434181 35006973 34381124
4239 34381124 33975385 33537763 32965021 32598044 32273442 31926475 31624355 31366938 30778689
4230 30778689 30560153 30192046 30135727 29898051 29223456 29191565 28891465 28595433 28687236 28429554
4220 28429554 28138434 27889783 27434772 27353992 27455851 27154011 26482560 26052608 26277598 26728014
4210 26728014 26717865 26681843 26616641 26491507 26747157 26942534 26495389 26681850 26540625 26616136
4200 26616136 26517677 26730892 26832227 27046784 27274035 27544122 27643359 27764168 28073452 27942547
4190 27942547 28122825 28304073 28730836 28841504 28794662 29178719 30251900 29951392 29977133 29804535
4180 29804535 30280419 30820821 31855206 32383626 32483099 33397327 33940576 34295041 34681660
4171 34681660 35306234 36334244 36989812 37671547 37972941 38459868 38838425 39092374 39107270
4162 39107270 39437722 39975969 40343006 40850373 41921585 42644477 43263424 44262237 45001905
4153 45001905 46202524 47324231 48339278 50047358 52170187 54546010 57109863 59909056
4145 59909056 63389888 67051086 70751513 74519151 78634345 84413117 90192474 96436889
4137 96436889 103802065 112114879 121741726 133809125 148597875 165120621 180934108 192070924
4129 192070924 193941552 186476695 174480567 161487010 150142363 141430973 135849772 132709277
4121 132709277 130797518 130163431 131106116 131685969 131511814 129781768 126816272 123788487 120653411
4112 120653411 118497771 117491925 116906441 118223608 119628815 120220723 120173924 117583794 112601252
4103 112601252 108048058 102487507 97836826 93471106 89439695 86294339 83878188 81569017
4095 81569017 79277592 77199130 75535056 74312880 72856662 71359397 70103180 69150386
4087 69150386 68428437 67981341 67825712 67823114 67701080 67605600 67426622 67482655 67781409 67799949
4077 67799949 67323154 67041243 66985119 67104692 66505580 66945533 66928673 67682598 68185110 68806431
4067 68806431 69738962 69923709 70930619 71576294 72800064 73783634 74600299 75053641 76014248
4058 76014248 77414315 78367192 79523118 80844451 82110613 83440194 84841396 86789634
4050 86789634 88982536 90756973 93616887 97211575 101113727 106198417 111916134 118487486
4042 118487486 125384926 132429254 139974430 147278631 154910156 162771870 171859561 183055399
4034 183055399 195841059 211980391 229953158 247621843 263183338 274672796 279438718
4027 279438718 276527818 267432642 253029975 236222760 219661622 204440441 190585220
4020 190585220 178767523 168458145 160426934 153327424 146508991 141424856 136651159 133726594
4012 133726594 130751680 128168382 126613918 126278538 126338394 126937687 126781167 125640417 124496967
4003 124496967 121781338 118201458 113398331 108292850 103447268 98501181 94008383 89888823
3995 89888823 85873201 81948433 78873407 76186184 73882843 72355429 70235629 68410849
3987 68410849 67467253 66688933 65481551 64606153 64284811 63899500 63386257 63706290 63824781
3978 63824781 64824085 66446412 67879077 68392276 69471684 68986248 68300754 66962594 64436210
3969 64436210 61413297 58828961 56457781 54720067 53473883 51666957 50372743 49385912
3961 49385912 48686453 47463463 46315500 45195529 44113102 42923406 42571421 41966445 41064986
3952 41064986 40441414 39617019 38908080 38266149 37865640 37732659 37428456 37499204 37298019 36707033
3942 36707033 36104387 36056966 35354925 35224917 35426426 35134730 35384295 35088591 35056327 34926306
3932 34926306 35165627 35338478 34911511 34246151 34608296 34311732 33493565 32906481 32569135
3923 32569135 32034010 31792554 31539060 31506506 31646674 31217476 31543138 31617550 31033047 31157851
3913 31157851 30986856 31096511 31107029 31169132 31200916 30779775 30335124 30136809 30076529 30087794
3903 30087794 29868627 29474273 29425279 29276944 29047340 28788142 28718537 28865246 29452323 29519155
3893 29519155 29705175 29814036 30213065 29844790 30200662 30550274 30724429 31524452 32311111
3884 32311111 32722343 33692775 34628420 35673221 36484407 36931106 37663420 38263549 38083534
3875 38083534 37642515 36304736 35631037 34661402 33841874 33240867 32595775 31743185 32049726
3866 32049726 32058715 31844966 31569228 31252521 31189548 31289226 31644292 31414926 31050983 30872627
3856 30872627 31084967 30798615 30642469 30513798 30075358 29886905 29837073 29757988 30017879 29872163
3846 29872163 30189846 30501609 30312220 30275819 30623259 30902951 31205480 31323120 31557135 31802450
3836 31802450 31619135 31496407 31311395 31765850 32175022 32282002 32444736 32519276 32918137 32635734
3826 32635734 32692451 33380402 33602539 33405112 33372720 33671962 33867878 33591654 33248117 33140318
3816 33140318 33163994 33487334 33851369 33467106 33380515 33562516 34087000 34490548 34317744 34282481
3806 34282481 34685991 35137262 34740517 34604234 34660740 34605359 34949067 34885967 34573113 35008426
3796 35008426 35630869 35257669 35269872 35191325 35427382 35337674 35189694 35835708 35992378 36011033
3786 36011033 36766875 36871051 36715761 36946155 36869178 37532125 38125804 38037416 38457254 38612065
3776 38612065 38878481 39333528 39662946 40019503 40237846 40702848 40913381 41151298 41791278
3767 41791278 42012356 42414674 42384087 42879919 43548829 44166031 44809985 44792083 45492549 46190863
3757 46190863 46400142 47339886 47536754 47997080 48520416 49559289 49839677 50773918 51120332
3748 51120332 51603320 52482089 52636883 53235412 54034901 54619760 54976429 55307477 55767000
3739 55767000 56576195 57027794 57262306 57746024 58229194 58879695 59354386 59669228 60387731
3730 60387731 60994642 62298188 62936466 63605204 64990951 66348943 67370792 68983142 69942971
3721 69942971 71454352 73474207 75955479 77256851 77706042 77947258 76458388 73719812
3713 73719812 70542296 66717384 63022774 59953454 57283782 54050040 51289493 49211016
3705 49211016 47789313 45518629 43792020 42924081 41741094 40623951 39991387 39310666 37832634
3696 37832634 37045626 36127050 35631642 35123254 34197628 33683485 33169759 32772068 32263437
3687 32263437 32135276 32069073 31960632 31561378 31133608 30626835 30431682 30441409 29810228 29455323
3677 29455323 29216812 29301909 29324894 29312122 28678056 28127422 27953917 28135461 28186607 27947229
3667 27947229 28205601 28044461 28114386 28168858 28042762 27958249 28084110 28088644 27871448 28110425
3657 28110425 28513388 27652844 27434082 27558386 27439915 27495786 27160106 27184782 27182051 27155829
3647 27155829 27404387 27239927 27044001 26928478 26854388 26637817 27038837 27065829 26860879 26888151
3637 26888151 27099748 27191429 27294500 26725890 26502468 26684467 26336508 26273805 26448035 26702048
3627 26702048 26951384 26812200 26369329 26620449 26623110 27207846 27874531 28075846 28192883 28124205
3617 28124205 29069462 29585332 29479070 29598472 30499809 30847730 30686092 31682448 32288237
3608 32288237 33185472 33315081 33695002 33876749 34539317 35181045 35703519 36107292 35988194
3599 35988194 35989697 36301015 37016150 37032994 37038134 36801792 36936139 37015614 36376269 36628565
3589 36628565 36599059 36055978 35776238 35711502 35919725 36257018 36060125 36384242 36405883 36077069
3579 36077069 35931422 36562579 36679915 36529589 36847140 37545057 37911509 38641894 39282796
3570 39282796 39311012 39749220 40888715 41992101 42903786 44330551 45423289 46375052 47689373
3561 47689373 48979076 50401463 51204277 52598723 53896368 55061813 56021215 57070488
3553 57070488 58182773 59094157 59936312 60338553 61275138 61877791 62188713 62281200 61988811
3544 61988811 61641269 61021623 59913906 58943918 57969776 57402672 56458362 55265554 54231367
3535 54231367 52422856 51313520 50184497 48883694 47753947 46233210 44979891 43937459
3527 43937459 43331117 41669631 40160665 38661382 37558775 37163107 36174978 35432569 34750013
3518 34750013 33515002 32992928 32545446 32106904 31430177 30846211 30466327 30722696 30343532
3509 30343532 29831996 29791974 29944699 29664734 29124931 28969388 28699961 28600498 28677814 28597096
3499 28597096 28888641 28879837 28373225 28188910 28712972 28912141 28279784 28495865 28582255 28322133
3489 28322133 28168864 28259693 28815493 29181775 29353248 29223967 29237795 29389604 29054405 29177191
3479 29177191 29112980 29224620 29786927 30084657 30180442 29985147 30289082 30781868 31305214 31468513
3469 31468513 31824464 32312860 32404832 32698482 32913721 33692346 34402955 34762744 34825585 34979481
3459 34979481 36335459 36813715 37865624 38784149 39536039 40215467 41240271 42258602 43058718
3450 43058718 44041579 45176078 46280517 46901237 47726776 48315724 49250353 50078544 51014625
3441 51014625 51789631 52871135 53877079 54513122 55677783 55765538 56126559 56969379 57594178
3432 57594178 57745736 58339822 58931519 59254902 60095743 60189668 60581818 60911456 61180251 61446722
3422 61446722 61685291 62194112 62591134 62501005 63043469 62959598 62691048 63129453 63410819 63050575
3412 63050575 63283481 63384554 63681151 63396084 63054649 63168441 62994822 63139890 63555749
3403 63555749 63249899 63231530 63801923 63274057 62863440 63348371 63092116 63143389 62798485 62669163
3393 62669163 62888035 62800958 62555530 62903524 63271178 63511582 63357497 62609535 62544551 63067960
3383 63067960 63417231 63306816 63681005 63645682 63578518 64018027 64084015 64082168 64326578 64087038
3373 64087038 63990892 63701853 63249035 62796997 62867471 62413315 61947130 61368515 60668439 59507694
3363 59507694 58817696 58639534 57990716 57641264 56614295 55727988 55221704 54823456 54134911
3354 54134911 53404837 52607291 51848842 51356618 51414233 51174184 50494397 50056838 49584022 49806365
3344 49806365 49537705 48859530 49325848 48740129 48486281 48860811 48698585 49037243 49137142 49203225
3334 49203225 48554326 49388503 49047112 48615745 48332905 48004572 47485964 47406236 47645017 46934766
3324 46934766 46199937 45340719 44481817 43648931 43289061 42257892 41105587 39862617 38829020
3315 38829020 38214789 37209498 36871246 36280312 35141168 33962365 32836138 31918619 30856894
3306 30856894 30394842 29766158 28955691 28047538 27380195 27370755 26164103 25513118 25011068 25030001
3296 25030001 24921489 23922711 23384181 23470186 22998970 23055883 23311533 22964379 23290069 22947529
3286 22947529 22960643 22478567 22379912 22131648 22154164 21975820 22270741 22038279 21746763 21551625
3276 21551625 21385026 21499204 21604072 21287117 20941194 20533524 20005902 19722088 19747583 19233737
3266 19233737 19004515 18205979 17456201 17257154 17350788 17048085 16325261 15835378 15727230 15532816
3256 15532816 15014867 14926316 14801663 14080837 13602076 13507253 13292923 12798235 12013380 11926449
3246 11926449 12168089 11848956 11398070 11156386 10762400 10755134 10619631 10349785 10313859 10485682
3236 10485682 9938368 9671941 9765227 9700461 9661067 9534600 9598327 9519422 9277471 9090240
3226 9090240 8696882 8622516 8773504 8426874 8071185 7976965 7860322 8322627 8232529 7751044
3216 7751044 7891043 7982450 7283265 7633221 7152965 7121862 7622761 7407160 7061197 7412958
3206 7412958 7946574 7755705 7548885 7279750 7183146 7181129 7700300 7831622 7336538 6911244
3196 6911244 7007606 7238904 7355004 7496752 7301496 7224472 7008604 7302690 6950407 7178281
3186 7178281 7107270 7063704 7347059 7270123 7465839 7427477 7073607 7374581 7559322 7293075
3176 7293075 7481411 7105195 7315470 7780104 7423647 7580197 7522588 7649130 7628589 7392751
3166 7392751 7674429 7651149 7265971 7326919 7148505 7254404 7231362 7678557 8054185 7774661
3156 7774661 7624379 7905140 8107029 7740490 7969338 7946629 7815891 8398954 8828892 8739316
3146 8739316 8507921 8659289 8905578 8994757 9116325 9137106 9367498 9170758 9115661 8545440
3136 8545440 8962118 9434754 9801614 9358971 9202664 9320845 9483246 9620831 9844653 9694648
3126 9694648 10189694 10650266 10438071 10511705 10860789 10872444 11233726 11092287 11238261 11539840
3116 11539840 11778850 12383502 12742071 13062591 13301265 13846476 14489086 14902747 15161933
3107 15161933 15494966 16132551 16680854 17240214 17773677 18275522 19153430 19480896 19754862
3098 19754862 20004002 19823886 19257697 18913919 18260425 17547923 16491872 15653946 15287379
3089 15287379 14632301 14290060 13525348 13532470 12950895 12449408 12166530 11602421 11325835 11171094
3079 11171094 11490685 11086397 11004584 10512778 10068661 9947532 9352843 9210704 9237999 9034687
3069 9034687 8591486 8745135 8718934 8313041 8394863 8389211 8266244 7427505 7389509 7431448 6889097
3058 6889097 6745604 6999096 6973299 6939359 7382593 7094436 6577735 6476089 6848300 7055720
3048 7055720 6133897 6077417 6104333 6144877 5979165 5649848 5730346 5876140 6132266 5675983
3038 5675983 5556059 5828048 5289931 5057135 5175097 4882087 4817312 4917768 4708275 5012319
3028 5012319 4829899 4385336 4745829 4983070 5090595 5051683 5010136 5060176 4958579 5043006
3018 5043006 4617712 4273292 3891050 3856984 4510766 4738776 4355008 4039339 4219218 4155649
3008 4155649 3920400 3862128 3678676 3671228 3450541 3080479 3718980 3393773 3483575 3649320
2998 3649320 3761049 4043990 4068858 3663200 3618853 3666775 3045408 3294348 3810797 3627447
2988 3627447 3629222 3861188 3690484 3436173 3786577 4122318 4042699 3915835 3593960 3350029
2978 3350029 3359167 3591940 3841972 3914894 3254922 3416342 3265810 3500566 3525753 3172372
2968 3172372 3181736 3324156 3349753 3383951 3626248 2908573 2590571 2941616 3047931 2531471
2958 2531471 2294480 2704956 2183918 2539341 2639642 2690784 2508222 2394724 2497338 2848085
2948 2848085 2878311 2840808 2216918 2075324 2281758 2331894 2839241 2929086 2702252 2419633
2938 2419633 2544512 2832871 2281920 2332834 2755448 2465816 2400366 2048407 2249159 2213936
2928 2213936 2079630 2290265 2353271 1615412 2013035 1939981 1830755 2161635 2166899 2137644
2918 2137644 2277560 2023598 2339104 2142590 1929110 1771996 1623615 1871087 1780989 2204451
2908 2204451 2150543 2068918 1887886 1809641 1635605 1564835 1824222 1780306 1933400 2111247
2898 2111247 1881900 1639101 2122032 2026364 2029916 1813077 1594097 1949832 2085488 2349267
2888 2349267 2598308 2324167 1948331 1567839 1237530 1667996 1836731 1491614 1550848 1581223
2878 1581223 2005312 1932236 1948440 1551569 1529462 1491040 1225486 1530788 1669695 1712804
2868 1712804 1843106 1521287 1528869 1622318 2063462 2025478 1607529 1402888 1183216 1817667
2858 1817667 2015447 2086069 2262575 2203057 2006660 2002401 1879785 1701969 2105869 2550676
2848 2550676 1967170 1762324 1804729 1531557 1625464 1967033 2167435 2076140 2239548 2387952
2838 2387952 2193970 1930398 2336712 2524117 2551609 2242375 2914821 2972950 2747694 3050047
2828 3050047 2997537 2593606 2540446 2778714 2405952 2263287 2255473 2687980 2187814 2283158
2818 2283158 2064406 2528993 2631892 2716122 2656618 2544319 2883042 3164539 2548785 3039274
2808 3039274 3114618 3040158 3106207 2895925 3392057 3495607 3659870 3691817 3726103 4153791
2798 4153791 4344477 3697047 3822354 3647174 3563181 3725481 4158831 4326232 4138855 4121255
2788 4121255 4348873 4185958 3927195 3980617 3821678 3725640 4035115 4702928 4692968 4511581
2778 4511581 4347904 4193838 4030451 4271558 4282588 4782835 5132678 4839474 4920702 4953342
2768 4953342 4809390 4762108 4741226 5054093 4809372 4670929 4795297 5275697 5413494 5540574
2758 5540574 4867794 4673374 4644425 4499104 4771604 4965869 5038416 4289280 4772179 4922844
2748 4922844 4804100 4669249 4836358 5072049 5452875 5175955 4895736 4753649 4548696 4936711
2738 4936711 4716737 4463447 4408072 4161596 3718871 3581717 3567898 3085569 3126278 2968023
2728 2968023 3319933 3079626 2874453 2618859 2846249 2839903 2430371 2423505 2108094 2410695
2718 2410695 2614458 2746912 2379392 2096421 2135181 1668596 2191726 2092471 2192174 2499757
2708 2499757 2221025 2374463 1639753 1645781 1547880 1672272 2071509 2305266 2358063 1983846
2698 1983846 1543814 1732889 2075196 1727383 1336174 1476646 1358791 1368374 1258872 1465229
2688 1465229 1689783 1939333 1647689 1519175 1645927 857195 849065 1204917 1110197 1161057
2678 1161057 1155023 1340080 1638220 1431011 1637961 1279497 943407 1037103 1045435 1268605
2668 1268605 1865180 1274258 755556 1061345 1129669 1026932 1354510 1229736 981293 821990
2658 821990 491021 774103 1024538 822003 588828 597563 928418 1036963 961893 873800
2648 873800 877708 1149615 1251011 1007831 1446060 1168833 376509 590673 404152 802980
2638 802980 878961 401874 442982 149240 281916 410565 568514 565903 459599 626563
2628 626563 532558 340937 809023 1072367 966349 903772 837574 771179 811530 142100 223921
2617 223921 438034 776604 825040 733123 633337 751932 534117 921911 1092155 764971
2607 764971 800887 455162 349863 274301 699306 218664 255740 424544 195580 166724
2597 166724 368304 469869 420044 492578 185356 -206266 436578 600507 338632 340435
2587 340435 781100 421722 -138922 50072 398935 511970 626160 433350 853623 347754
2577 347754 838411 672392 698356 212487 -211200 131741 606092 616839 359370 185216
2567 185216 507775 859570 141100 -137535 -144694 26099 -43951 360482 130205 631419
2557 631419 516214 256558 500500 1045505 684038 384459 987568 699864 15886 156331
2547 156331 583137 641795 546302 747497 498194 458515 596997 758522 911326 336900
2537 336900 -111195 -125912 -155935 233584 36878 205132 262611 95779 345677 480629
2527 480629 399663 339339 112133 189818 -357713 -387831 -82636 -454442 17586 -71493 -93073
2516 -93073 -206228 132292 301405 484830 384778 157718 357855 889601 246802 5273
2506 5273 -459214 111234 371241 500417 153712 175792 426896 -266750 -292180 -11999
2496 -11999 437782 493942 195817 349225 120640 -43419 643331 275544 279980 60542
2486 60542 -110873 -25231 506088 -28807 -131102 394 207823 279558 84871 372275
2476 372275 40186 -148985 110298 184545 17859 32780 -116672 -347922 -242859 -235285
2466 -235285 -77694 137027 85471 -364045 223352 312374 43865 -291320 -144947 393393
2456 393393 516836 660074 768715 589489 90187 -166806 149036 -95091 -322155 -413286
2446 -413286 135420 80001 -186715 -147 647540 693705 455913 104670 -235058 -60679
2436 -60679 550837 860606 272142 -133991 -103118 -35350 247551 55256 -204295 359657
2426 359657 170873 5626 7918 655487 376599 -203036 -443057 230822 328744 392047
2416 392047 229072 396456 176041 301623 194305 263872 390622 -79978 110846 284152
2406 284152 -256670 -355795 70641 94931 -314440 -437618 -376991 -793836 -363232 -181013
2396 -181013 -16637 -56390 10500 398742 473195 500620 581301 289684 -256629 -39962 267186
2385 267186 15624 -210786 -164047 128752 19779 242704 -276718 -409126 -162820 -285255
2375 -285255 -496581 -409993 -115450 151819 163585 76252 27210 438689 331455 183356
2365 183356 34295 60165 -194145 -381135 34919 353203 568222 605446 189486 499114
2355 499114 675410 200499 49495 73379 103927 -227978 68073 588030 630476 -90910
2345 -90910 58080 606753 384914 379564 752326 207673 -171833 -291100 167679 -340961
2335 -340961 -364396 482671 247195 -243495 123761 447201 397999 -62740 207061 -110743
2325 -110743 -184457 38887 -200516 170611 603956 369133 400445 498481 230932 293046
2315 293046 305989 216604 543905 464706 418432 625069 553485 74658 -186466 -184714 -283142
2304 -283142 -226101 -261979 -372238 -137541 198066 411535 348827 191548 196820 106544 330636
2293 330636 708020 326734 -44808 146546 -69164 -232908 -558781 -451329 -161937 -136386
2283 -136386 -216704 54375 -203338 -344698 184154 678739 291527 63598 139504 368145
2273 368145 35347 -21312 12888 -133950 -693207 -910456 -735020 -125445 -39635 152326
2263 152326 250245 187270 15350 92896 156972 -81432 280885 121706 -458428 -66252
2253 -66252 410188 339415 325070 538555 863099 543023 313311 365522 110616 -15021
2243 -15021 106574 461131 555546 533897 343521 284610 244878 102145 257371 451385 16078
2232 16078 -317133 363053 220070 100639 -212894 262839 226600 -1952 215853 179631
2222 179631 21082 140196 -139025 468444 63277 117441 430739 533390 365229 331965
2212 331965 730622 399147 215712 206059 535302 787106 1020170 862957 485121 806716
2202 806716 959160 204744 206169 473998 827707 411801 373952 829752 843854 937726 821489
2191 821489 868607 866051 287651 101830 277208 404588 176758 -36034 359749 784563
2181 784563 668543 499845 386300 837773 1160609 1042457 652782 715091 827502 1185272
2171 1185272 1165676 796963 850704 377270 431580 426624 905848 1067926 1060691 1114435 643561
2160 643561 436475 444598 1099825 1138512 929020 904661 924651 1504551 1214262 1089086 1591828
2149 1591828 1257369 1504674 1799463 1964411 1772769 1650842 1919399 2063774 2011997 2155478
2139 2155478 1666370 1548281 1909138 1788386 1884804 2097356 2484700 2931107 2830818 2569739
2129 2569739 2641250 2938061 3015668 3099405 3282206 3528574 3400094 3543244 3682877 3867316
2119 3867316 3982523 4003104 4291277 4768946 4685026 4471287 4823444 5023148 4939681 5176823
2109 5176823 5345827 5019452 5362765 5818397 5740459 6338645 6869547 6972206 7210949 7897701
2099 7897701 8764227 9354268 10180455 10691542 11552594 12004871 12376221 13392632 14406750
2090 14406750 15789523 16885109 18850249 21566429 23700926 26110755 28333660 31545588
2082 31545588 35051943 38964990 43958093 50568278 57752045 65626527 77268849 93335564
2074 93335564 112764324 135165684 146336775 135758698 117519728 98332662 79279467
2067 79279467 65558122 55432033 47921015 42191184 37791928 33807348 31594455 29603197
2059 29603197 27630061 25612437 23447848 21933909 19972158 18516981 17507737 15916392
2051 15916392 15475617 14366423 13798154 13242966 12438413 11712116 11088642 10819696 10604941
2042 10604941 9879295 9515058 9330122 9026629 8559071 7737537 7663272 7273499 7243997 7198520
2032 7198520 6686090 6126866 6209467 5793632 5085347 4650704 5173665 5341633 4707801 4568695
2022 4568695 4080254 4172727 4474047 3963045 3806825 3969198 4087412 3821374 3781406 3566069
2012 3566069 3715823 3859341 3630447 3475536 3443375 3191649 2917135 2667780 3391642 3290973
2002 3290973 3307729 3382437 2961799 2658261 2561655 2660074 2810794 3028640 3403114 2877061
1992 2877061 2202054 2080305 2186407 2454564 1930207 2188551 2453282 1795879 2005419 1770032
1982 1770032 1915617 1778773 1914308 1772502 1870952 1895541 1761632 1887586 1571448 1453642
1972 1453642 1388217 1334263 1394207 1562074 1515589 1456930 1634425 1549257 1274420 1286114 1881194
1961 1881194 1894086 1561602 1331068 1086272 968931 850972 1160312 1519508 1711250 1572591
1951 1572591 1152201 874914 872307 1028824 988114 554446 504697 893023 1102759 1022956
1941 1022956 1071581 953632 1405825 1449814 739548 495920 852401 889224 510656 663762
1931 663762 946685 1060933 1330065 1055312 1173434 953743 1510046 1217004 1035758 718618
1921 718618 339531 221158 564558 1023981 764264 668243 741385 483927 293838 821592
1911 821592 918659 775455 452650 798171 753854 267106 159416 444944 881874 835248
1901 835248 778359 818519 786547 779239 347204 424378 425959 468873 409414 83449 110111 209508
1889 209508 205108 380780 -73183 -10306 61536 10090 235970 -154494 -42702 463027 398095
1878 398095 315732 189555 209940 219565 127766 286176 411533 834636 235208 7141 342494
1867 342494 454308 604946 348714 124543 121546 75377 333224 617153 276432 -64418
1857 -64418 -4661 501772 163174 376372 420714 199563 413309 146381 530207 382979
1847 382979 725579 377589 209964 456181 416603 464166 854900 343161 -103137 203403
1837 203403 195244 88128 15498 328215 771758 284300 180843 765623 628067 440883
1827 440883 626203 403667 147965 196535 533372 666864 590562 434352 376571 -137764
1817 -137764 -50411 88233 115719 113235 -49855 11816 67929 139867 5079 183105 350927
1806 350927 258592 475622 397923 111829 266017 556757 -21325 430248 498529 465623
1796 465623 517675 187346 307120 132486 358492 304523 443819 493226 350559 472118
1786 472118 535567 -271670 -69096 69878 372030 639201 451367 -154619 365365 410590
1776 410590 316941 336410 1848 -136369 370431 622112 747636 614166 925551 842022
1766 842022 835256 342390 150488 9212 59677 256459 -112743 -190774 24790 -48180 -374824
1755 -374824 -637830 -689775 -172830 97470 -88630 -193859 32726 348912 538014 336704
1745 336704 165118 492365 712756 391276 -165623 -415350 200159 161813 28207 37120
1735 37120 -350779 -149794 111505 30382 349163 -48576 8165 95056 100261 118092 -389661
1724 -389661 -848353 -348422 -227051 -231651 -329806 272369 269460 47641 161472 -257625 -280787
1713 -280787 -77425 116648 89295 278446 281278 257589 -331859 38641 261781 169967 256634
1702 256634 -1002 -481128 -201519 -101268 -496397 -405374 146419 -152076 -154885 -380368
1692 -380368 -218025 264394 129578 362415 288142 323815 771466 777148 174794 232080 -142091
1681 -142091 -534985 -835158 -344382 -495210 -711640 66663 273716 364108 310243 269686
1671 269686 317527 285732 118568 14046 67071 109227 527348 -112192 -585207 -181180
1661 -181180 421585 400350 665514 482236 326837 78761 -178628 -50342 332639 -35297
1651 -35297 91897 381714 466013 -367138 -111913 508102 387265 319311 -118502 368486
1641 368486 312925 402915 318648 207966 191268 34058 -569612 -396941 234215 137073 -256786
1630 -256786 -257152 172635 448810 30687 -276504 36532 93762 -229067 -409663 126662
1620 126662 364122 256646 -294304 -186785 -208500 -379050 -431690 -575938 69365 226787
1610 226787 -77425 -481083 -377372 135190 240170 498330 224739 -69489 67248 133832
1600 133832 403658 9305 -232866 -160212 -376042 -249264 -494952 -604315 -262757 447741
1590 447741 312607 324349 599215 268936 177182 120467 56572 -110957 -126838 -212813 28882
1579 28882 178531 152872 -43638 -156651 34523 -173307 201215 304237 -292103 -239191
1569 -239191 -1401 233086 -365952 -84796 125574 -32246 -355577 -196683 -509677 -281972
1559 -281972 -421518 -57428 95669 365330 78927 1167 -291176 -143823 -137126 -373524
1549 -373524 -318223 -77452 -27697 -127045 -313453 -171145 -52251 138520 62055 -81506
1539 -81506 -25353 -403334 103811 172947 151705 -121907 594996 119092 180089 -26496 -261761
1528 -261761 -52020 115324 -75824 -28213 162941 354362 170082 197389 -108421 -355159
1518 -355159 31235 -39565 -115429 206764 95292 56750 -245920 -286844 -132284 -104665 -205571
1507 -205571 -101139 -63022 -42085 -76922 -13106 179813 -385073 -278104 -195238 -152064 -316963
1496 -316963 -109564 -254914 -540638 -498340 -173404 -639488 -365229 -55319 187547 -90161
1486 -90161 -156915 121691 172742 -29781 -313848 129143 -83720 114312 -72761 -96755
1476 -96755 -367209 -209037 -197008 -117531 92981 -18234 65357 173671 186408 148886 203657
1465 203657 9623 374313 465003 381293 324350 492556 622049 211541 -157449 -203175
1455 -203175 -210220 -169211 -506972 -626816 -460066 -5481 389705 97632 601338 99766
1445 99766 -346226 -244067 -287544 -213363 77526 342323 177543 -324746 -201131 102159
1435 102159 -48593 75583 172769 -144968 -162282 -313713 -228980 -470270 -416266 -156960
1425 -156960 -256610 -109002 -384766 -207857 5886 8099 -329375 -106799 545734 429584
1415 429584 69616 328249 3005 -169850 703668 117901 -385050 26427 25278 188645
1405 188645 494899 185257 -357199 649 -24132 -419416 -560118 -468702 -597867 -1073370
1395 -1073370 -1011104 -1022042 -520425 -432734 -62985 358851 -245877 -232421 -239351 -250935 -365050
1384 -365050 -385889 -86309 158684 -357369 40682 389930 254896 305617 251236 -237412
1374 -237412 -135880 62030 -71485 -182106 -369914 51411 902607 919204 481478 375621
1364 375621 148943 217338 257684 627492 224026 -88561 427749 -151314 -536282 -192620
1354 -192620 21027 156683 141231 319929 -396499 -665705 -241800 384695 384687 317984 145886
1343 145886 -38931 -226646 610922 452294 105935 115434 -165062 -357613 -202637 -462673
1333 -462673 -279974 232341 -229108 -120191 -338024 -608626 -511696 -70938 139287 490068
1323 490068 -88756 101625 206441 206097 -124838 -393905 35946 47156 440961 536566 589206
1312 589206 178486 -94000 161595 -387293 -293662 -61770 -21925 -111173 -259128 -400350
1302 -400350 -356022 -258092 -145291 138272 137677 -392731 -257334 -172137 -236997 -100729 -147825
1291 -147825 -236310 -17403 249152 155270 -619990 -451859 17359 -79737 -383109 -1012702
1281 -1012702 -633720 -184197 -476648 -26838 -312970 -378707 66238 53850 97698 284507
1271 284507 -244959 -473414 -84748 -141595 125642 375868 232007 118016 -274343 70015
1261 70015 196052 461444 851518 103601 51074 -198316 110303 -8643 72801 -208167
1251 -208167 61256 45795 -187972 -135596 -122918 65452 -423206 -50180 -140545 -688117
1241 -688117 -892384 -459685 109882 -184831 -136636 -41741 -134458 287358 -239243 -219373
1231 -219373 -252983 -6085 136825 385233 637059 178416 159524 -240062 -588032 -580469
1221 -580469 -220466 -112090 -173833 -248440 22940 178299 101825 -125164 -74005 -471099
1211 -471099 -300892 -512074 -60840 -26916 -49619 -243606 5680 -332991 35228 253817
1201 253817 168962 187627 -123018 -164862 -65498 209407 -23919 -248431 554295 574301 493336
1190 493336 85999 -501754 -89357 -222097 -116143 173290 -113139 89614 -118245 -202681
1180 -202681 204846 -105257 72666 127106 298030 79980 125793 -194127 -185994 108319
1170 108319 123498 -284529 129304 105394 324599 420845 285776 16050 -45588 -50401 -553499
1159 -553499 -131782 -315995 -244482 73252 -564027 -639056 -725605 15368 230618 -102628
1149 -102628 25111 -251406 -355340 81327 72786 -111003 -312021 -8086 -93181 -392413
1139 -392413 -276526 289140 -2741 -58250 -16559 -34831 273140 174239 360301 199355
1129 199355 47647 52601 -238232 27432 -85431 13071 479266 -355779 -487547 176002
1119 176002 -79864 -377536 -237020 -201061 -266261 -325386 -194835 9272 -367983 -641510
1109 -641510 223477 235628 -167278 -150996 162856 367179 365643 237122 463597 -100723
1099 -100723 -143939 56879 60303 67721 246678 -66266 -60499 151729 41897 -13061 325303
1088 325303 421294 -86106 202206 -115898 -419766 -472223 -79841 -358711 -113976 -106841
1078 -106841 19166 -374678 -139170 -35609 -518221 -390489 -172020 65320 -149768 -351023
1068 -351023 -384321 -6231 -87928 -117767 -45010 3232 -176762 -290226 -477384 -324710 108669
1057 108669 -164922 -532906 284573 213317 319083 -35389 -316555 48155 -198583 -518860
1047 -518860 -261687 1165 -262437 -179162 -153421 -285626 -548503 -470649 -227950 113052
1037 113052 573934 412396 -329062 -528411 -676599 -701635 -528482 -179270 319686 171585
1027 171585 192210 -178811 -169844 -411442 -92922 -160171 186378 364715 34663 -4651 -224536
1016 -224536 -213312 -262505 383440 536752 295549 -253617 -192376 63592 -213097 80127
1006 80127 -89947 210058 13970 33513 233860 163703 396791 129835 60365 -290393
996 -290393 -330962 -471437 -203507 -127352 -203359 -762384 -889366 -617191 -213152 -263184 -650875
985 -650875 -428002 -127440 -438507 -508742 -405447 19316 -192787 -238808 -396639 -446822
975 -446822 -350046 -508745 -461758 -41075 65789 -400922 -479459 -539609 -133508 481113 -50140
964 -50140 -200739 131573 -259751 120164 335457 217155 148655 47997 -114214 190011
954 190011 -127612 -253700 248151 387649 246382 -408455 -245765 67285 160466 -6323
944 -6323 284518 438974 126330 106463 -11129 101816 181126 -100591 233087 -8974 -155862
933 -155862 176946 -552696 -366830 30862 703209 273256 277703 87399 -149112 -43449
923 -43449 -84147 -106612 117649 -86122 -31889 -66107 45100 -172017 -520159 -293134 -139154
912 -139154 -109086 -118533 -153043 -407871 -144719 -72618 -85880 -602765 -580599 -398371 -248937
901 -248937 -414878 -317071 -603105 -416155 -200942 -202337 100068 93597 61380 285161 313226
890 313226 -22987 -185182 26071 257275 -151931 233375 18596 -224658 63611 164057
880 164057 229610 69836 -219186 -133237 -204544 50981 51247 -393488 -289429 178568 123961
869 123961 79973 187745 -387159 -107952 296969 182883 -110884 53093 -247905 -309070
859 -309070 -424343 -327365 -145492 -44806 103404 -108712 15310 -243492 -10788 190826
849 190826 522681 121226 -342558 -336339 -644799 -205662 -39066 494514 36636 150605
839 150605 218573 8760 -112925 -388857 -110295 -434579 -239719 133122 183512 75866
829 75866 320125 39044 -355057 -291977 -223856 311072 118590 81228 101356 342528 45734
818 45734 242343 133174 -101923 -95904 594125 212813 -173092 -283213 -183955 -31204 -16145
807 -16145 88442 -14818 -26750 172121 217753 -304640 -469621 -132278 383731 366857 437305
796 437305 105485 285679 40168 -289092 -682191 -259501 148992 153330 -211194 -341471
786 -341471 124964 267429 7851 299001 649257 -42688 -183362 12783 -21741 180028
776 180028 -306280 90369 -139540 -381108 -744476 -11420 -45040 -149346 67635 388283
766 388283 348725 248581 -62904 -541212 -361152 325166 353186 472725 345960 397900
756 397900 314334 -27188 -172429 -102284 -46858 -371246 18571 377464 312126 156304 178240
745 178240 -44019 185510 275047 357136 -92278 146320 284880 302200 440464 504184 147781
734 147781 -23918 -260416 -416606 13670 -42063 21756 101562 347842 423556 -135269 12587
723 12587 -43227 21125 62726 309349 -93706 -3305 -298555 -182988 -187912 137510 71203
712 71203 -409875 -454312 -764748 -661480 -245667 44360 -402721 -347108 -239962 213870
702 213870 892207 337580 128846 -144110 -181485 -430358 -763137 -572232 -188884 72451
692 72451 -32096 -25778 -249157 -216143 105489 17401 192952 229384 -142956 -294689 -556731
681 -556731 -316790 -98768 299552 -13682 295085 164525 16869 563364 169984 -2580
671 -2580 -370316 -294333 22044 92759 -71327 -3028 157137 7304 -533998 -123671 -9590
660 -9590 -207423 95388 86635 -254016 -238785 -63654 -21363 362968 30648 -407812 -127156
649 -127156 59340 -382326 -215791 63804 341922 101775 157563 -79381 124234 328684
639 328684 83759 -285126 -225696 -266884 -231768 -293937 -431985 -326594 -169586 393020 267038
628 267038 340876 369505 58870 358667 309022 188209 378289 387494 44452 -179390 42809
617 42809 16217 -214448 -90879 -372708 175734 84052 -194649 -95257 -14768 181935 -197914
606 -197914 -192833 50237 94243 169698 -99482 4700 138605 -16792 181612 244556 -49666
595 -49666 -208840 -152430 44724 -181415 -316154 -97196 -308358 -495118 -34995 32496
585 32496 -88250 62847 -29612 -479468 -239102 -89220 -503913 54050 220233 -55835
575 -55835 51229 599055 443014 403131 225949 269969 -168459 -184903 -209702 67986 -183322
564 -183322 -24981 -207704 -492210 -214830 -245229 -52965 -13103 -319413 -73163 290526
554 290526 230717 134014 616164 208357 341288 -45178 -80527 -318427 -585828 -35871
544 -35871 -253153 -132510 117232 -135385 -133715 200786 274132 743846 1023229 386328 182190
533 182190 580134 397614 299125 182623 452390 460234 73347 -375466 -133452 177973
523 177973 133884 114025 -260141 -790369 -341598 -307530 56218 131798 -73201 -310409 -276806
512 -276806 185016 251646 -238660 -6447 492599 276849 269810 389041 323520 432635 437810
501 437810 175124 -364209 265227 178844 -219382 -248903 -325294 -172675 496109 385213
491 385213 118840 -301550 230848 -44622 -696205 -721679 155611 238206 274836 367659 70728
480 70728 192952 369975 -253428 -650477 -63526 -326773 -24734 -60349 -250490 -78248
470 -78248 348397 163654 212559 51467 -100920 -136942 40566 -73552 89485 181725 85347
459 85347 188626 50863 215907 578628 -215166 139282 -44211 -119837 65853 455620
449 455620 292800 390139 396566 102430 263021 346717 159880 -67440 128505 -347218 -448792
438 -448792 72634 -55579 -389083 35023 145867 -90731 219201 293746 74220 -149716
428 -149716 73099 598173 405205 138305 178266 155304 74663 -565381 -736434 94742
418 94742 -226976 -314750 -429021 -16155 430350 115287 216063 15554 -194833 -256712
408 -256712 -238670 188122 123860 -97837 189918 370953 246476 -48276 32527 112529 11761
397 11761 318087 148702 299729 512605 321855 -96163 550695 892245 376323 238253
387 238253 555210 566019 235946 457261 124504 145886 -197037 -144116 538502 356970
377 356970 194675 374376 163471 -19317 -354113 8370 -19614 -151832 -384203 -99526
367 -99526 116140 271809 518796 415101 -82009 -386342 -13064 169677 156887 264917
357 264917 -265575 -251623 -74897 70904 309644 496293 515912 -125281 -158771 -146603 334314
346 334314 240830 303528 183219 500587 724349 925761 420259 448559 372610 42910 -241274
335 -241274 -143075 -245473 304160 773731 375518 -67475 25714 -188957 -430147 107620
325 107620 -147337 94217 125514 -154182 200399 566078 537413 793107 356752 367726
315 367726 479502 65228 -31542 53920 411904 551795 -37389 -309232 -121118 62974
305 62974 -190336 57517 299570 25042 348241 100744 -109011 270747 559864 349274
295 349274 118667 -33333 -116423 79486 -108070 -483389 -504993 -396042 -196530 -243821
285 -243821 255663 329086 180631 40036 194410 291242 137079 90707 -132108 -285450
275 -285450 279452 401058 349629 347323 162003 99887 421119 171020 150891 390032 139264
264 139264 218665 17550 196734 672664 689978 503467 475656 284076 304147 180490 277463
253 277463 277875 167881 71387 261976 196963 479573 69122 159392 115464 173786 -73465
242 -73465 -196081 145540 -49928 -142939 -42803 68507 493012 602464 619909 615942 404566
231 404566 243437 437226 191266 214902 612715 983465 881075 453140 237387 189546
221 189546 20456 -23393 -17555 -372484 -540289 -336556 -26182 571839 706502 582786
211 582786 519312 383108 -105496 257826 440595 276501 -13822 5841 27017 273302
201 273302 404594 433115 308609 466826 402989 -1492 -81813 -15449 -220811 -79578 -31787
190 -31787 -161175 106236 -71437 -266540 -245275 -96550 -309614 282100 294399 357153 353487
179 353487 578256 -20784 134248 142357 -21075 -3688 340369 292073 127416 -160367 219735
168 219735 747274 436054 73737 41729 -345846 205799 -85932 332236 349563 -65177
158 -65177 -83415 182839 488123 758627 214478 -187266 -17543 -30431 -63422 538798 388502
147 388502 161793 32807 91558 -139860 -180163 312172 160246 480502 268023 -180398
137 -180398 -420886 -138106 -84045 55383 264550 355348 239028 47184 381185 485597
127 485597 579532 368717 -86755 246643 152774 143185 -174482 -242517 -51258 222339 335219
116 335219 253515 234457 124736 273201 513007 77075 98765 181464 63133 116442 263826
105 263826 559333 155612 156069 225512 23907 368585 246011 823407 143114 87051 -18433
94 -18433 226205 246030 -8794 227778 494632 270937 281332 213190 81021 129899 327246
83 327246 471440 647595 455452 264377 409822 143560 55726 79637 60394 9999 162959
72 162959 318161 363008 355327 67780 -230429 -384394 -103747 202744 -22498 300383 324786
61 324786 70993 35665 25230 661496 463264 504150 433886 321641 312635 588086 334968
50 334968 -116738 34272 -24665 33832 22004 30431 -54362 185494 666100 467014 58924
39 58924 16812 378586 419362 85617 -71161 -7596 52404 234051 330197 192064 149662
28 149662 103128 319433 426605 75195 -425488 -190896 26707 -159996 100547 393345
18 393345 292804 501711 469595 326827 284876 402472 90951 153142 492759 538419 -63067
7 -63067 -13534 132471 243590 130657 231757 163121 -43752
0 -43752
$$ Imaginary data points
##PAGE= N=2
##DATA TABLE= (X++(I..I)), XYDATA
16383 -2235228 -2598904 -2687433 -2677447 -2572475 -2434506 -2122682 -2134483 -2116052 -2100920 -2044174 -2412101
16372 -2412101 -2097862 -1658669 -1758827 -1984642 -1976734 -1984869 -1958388 -1769995 -1712530 -1418254
16362 -1418254 -1874154 -1812226 -1897781 -1506190 -1394294 -1434308 -1425827 -1389668 -1519187 -1307760
16352 -1307760 -1283095 -1067450 -876999 -1041504 -1267551 -1223971 -1228504 -1128672 -1001920 -1007249 -1055159
16341 -1055159 -675305 -768056 -589624 -565789 -460230 -370841 -322030 -500072 -476641 -742985
16331 -742985 -765570 -711637 -567480 -573288 -710300 -572859 -389526 -430153 -150019 -108303 -156513
16320 -156513 24272 2428 -114848 26706 9561 218183 364356 115620 60600 2088
16310 2088 -31081 68940 478642 120351 -96029 -14769 293277 545259 357901 192271
16300 192271 268044 719299 842476 801939 1285286 1273914 1006565 437501 559377 614083
16290 614083 625644 646164 474703 884114 921403 655972 752356 751888 917733 1010950 1113157
16279 1113157 1128522 1015791 807064 974100 991996 931171 1235454 1466240 1476020 1651426
16269 1651426 1718922 1246304 965806 1460286 1232345 1158741 1557963 1472443 1808366 2021483
16259 2021483 2120998 1633848 1868086 1557948 1254339 1915921 1492514 1240365 1330483 1377084
16249 1377084 1983458 1672917 1538722 1758438 2124096 1945501 2130079 2230487 2488138
16240 2488138 2168368 1883521 1994096 1993729 2036878 2052609 1859325 1921945 2168797 2286653
16230 2286653 2257644 2696240 2739354 2204019 2461083 2273797 2161437 2282936 2145790 1824152
16220 1824152 2295331 2457931 2884341 2218088 2457089 2351939 1691961 1978163 2615022
16211 2615022 2420094 2690226 2928694 2435719 2858416 2943184 2852964 2769736 2953472 3220141
16201 3220141 3026894 2891978 2111566 2271406 2635735 2726549 2829574 2696716 2996545 2542542
16191 2542542 2526313 3084203 2571593 2723257 2664121 2658469 2600645 2759594 2815924 2893660 2769360
16180 2769360 2644571 2642152 2534446 2758217 2441925 2450044 2629335 2348103 1928537 2373391
16170 2373391 3034095 2912349 2826300 2755862 2827126 2787539 2949061 3172940 3294376 3275932
16160 3275932 3657087 3307701 2577794 2941649 3555014 3356389 3223204 3372736 3563460
16151 3563460 3307853 3214438 3080096 2884713 3184336 3659969 3157192 2925912 2958988 2850813
16141 2850813 3416206 2962884 3314720 3501659 3412143 3335547 3372066 3168830 3390034 3192364
16131 3192364 2878932 2909788 3364954 3508471 3187544 2934117 3776594 3348341 3571467 3509540
16121 3509540 3415337 3766190 3656216 3407889 3190647 3085818 2991732 2804356 2879436 3300212
16111 3300212 3469412 3706208 3886417 3384651 3025674 3152791 3280384 3456322 3297204
16102 3297204 3315094 3157577 2648980 3163562 2817736 2901363 3042239 2873394 3200639 3381283
16092 3381283 3869293 3510608 2814246 3197098 3649715 3599788 3635052 3774959 3673658 3515668
16082 3515668 3596023 3666310 3706910 3381531 3581149 3624381 3776600 3611771 3457315 3168322
16072 3168322 3190003 2847099 2848329 3012526 2992765 3069890 3384637 3500988 3314869 3465857
16062 3465857 3571937 3726322 3662633 3831603 3382164 2957578 3214242 3453940 3704413 3443576
16052 3443576 3288388 3483829 2851580 2612351 3030734 3117604 3436841 3064542 3003954 3665884
16042 3665884 3551857 3630012 3451247 3538638 3619877 3510418 3325436 3105343 3431912 3398086
16032 3398086 3409285 3356189 3451456 3660841 3445088 3385025 3826459 4021432 4214452 3947037
16022 3947037 3706140 3609243 3387244 3043389 3494603 3237782 2969343 2911459 3177009 3637127
16012 3637127 3291702 3362741 3564847 3120959 3321150 3335726 3281588 3849123 4021657 4062272
16002 4062272 3379636 3067962 3661587 3970280 3514195 3564548 4037212 3625818 4009350 4040350
15992 4040350 4090296 3832957 3385776 3106723 2797296 3052585 3381479 3719193 3386178 3162933
15982 3162933 3139608 3658773 3623870 3140275 3553372 3531580 3453099 3034277 3035165 3361686 3516383
15971 3516383 3313658 3376676 3179495 2993270 3157932 3625618 3943953 3504083 3569409 3927547
15961 3927547 3479735 3291370 2934690 3332316 3958006 3345507 3327631 3170255 3225249 3333778
15951 3333778 3386026 3372308 3658178 3289165 3093202 3418580 3513971 3641306 3627128 3405498
15941 3405498 3505421 3685773 3856081 3652072 3720666 3118229 3349086 3326694 3079182 3249814
15931 3249814 3307434 4018369 4093489 3278892 3229881 3287343 3871894 3934099 3512030 3162527
15921 3162527 3172189 3461165 3521553 3363072 3506014 3528928 3641529 3689456 3509643 4123581
15911 4123581 4260987 4133986 4340249 4277748 4185686 3913960 3740217 3968506 3663720 3450364
15901 3450364 3349993 3406318 3277069 3396581 3916114 3433955 3088439 3404375 3193504 3155798
15891 3155798 3259213 3250746 3284373 3678445 3792611 3819176 4045259 4065213 4030272 3910698
15881 3910698 3630899 3400696 3403252 3594085 3655741 3522424 3276729 3024322 3347190 3805128
15871 3805128 3911894 3539454 3436183 3550659 3494389 3102515 3630964 3901166 3554687 3405225
15861 3405225 3597544 3489552 3406512 3513607 3390155 3591027 3493758 3781456 3838510 3945901
15851 3945901 3821539 3838191 3936871 3917112 3943333 3167699 3012948 3409896 3170578 3538952
15841 3538952 3539930 3915210 3590514 3366680 3565073 3418839 3632651 4026172 4105207 3970671
15831 3970671 3730814 4111063 3794830 3449380 3529051 3771264 3698082 3424314 3762387 3571799
15821 3571799 3931561 3858400 3661963 3390594 3301058 3317963 3303325 3832706 3370921 3402907
15811 3402907 3582954 3544289 3550799 3842490 3551374 3391406 3275627 3650686 3534641 3052760
15801 3052760 3202257 3553887 3941088 3555361 3478307 3404496 3549273 3866327 3990573 3446140
15791 3446140 3130564 3312043 3557195 3739143 3717143 3600249 3688329 3929253 3783998 3562431
15781 3562431 3647385 3155341 3456938 3437406 2987200 3163725 3153726 3514408 3323310 3081698
15771 3081698 3351222 3754111 3903998 3802635 3728636 3847549 3799926 3651746 3642330 3739081
15761 3739081 3752778 3689558 3729977 3237164 3524532 2907617 3394129 3526939 3442722 3420718
15751 3420718 3211205 3176003 3168657 3489132 3981863 3781637 3552358 3535687 3583175 3815076
15741 3815076 3740022 3765658 3419504 3534691 3550479 3508554 3627209 3767046 3445362 3198475
15731 3198475 3284862 3485433 3666728 3402239 3765118 3589674 3637117 3554241 3559835 3504666
15721 3504666 3503493 3735569 3585670 3638275 3910561 4257968 3703712 3619088 3606834 3935913
15711 3935913 3740789 3588378 3514915 3041798 3281121 3498312 3084852 3096039 3352096 3162509
15701 3162509 3577205 3678804 3263881 3800069 4150484 3906875 3803141 3945667 4030707 3906474
15691 3906474 3470857 3709579 3903171 3623868 3717286 3748747 3245353 3345614 3667129 3565072
15681 3565072 3612954 3800597 4081907 3926999 3950408 4285453 4167954 4045028 4026483 4227231
15671 4227231 3873842 4119731 3391694 3533494 3765171 3730078 3784015 3543565 3352258 3435534
15661 3435534 3358966 3623406 3383062 3436444 3617202 3487416 2875222 2651147 3379430 3438436
15651 3438436 3493437 3645598 3728674 3435092 3319709 3550592 3662996 3326189 3476141 3351517
15641 3351517 3803976 3602162 3680933 3936492 3719152 3409017 3877790 3842013 3528984 3840818
15631 3840818 4143628 3501210 3555145 3509263 3626865 3276594 3264710 2977335 3293084 3693208
15621 3693208 3268002 2929660 3165149 3094546 2975587 3406193 3545466 3293372 3211287 3463439
15611 3463439 3252327 3611670 3578575 3600676 3915252 4181359 3874779 3861235 3845050 3636157
15601 3636157 3575824 3804521 3396542 3391849 3787982 3560870 3084520 3460739 3942268 3709394
15591 3709394 3192135 3075154 3359158 3722301 3567125 3529015 3400510 3404501 3531456 3427857
15581 3427857 3401646 3362192 3271159 3254187 3091329 2910576 3228978 3536848 3453343 3234883
15571 3234883 3352351 3210929 3656933 4276781 3572524 3900158 4097569 3816401 3809783 3548875
15561 3548875 4016616 3730750 3700783 3684638 3611041 3697157 3971165 4028245 4354511 4036234
15551 4036234 3381905 3721059 4392323 3967009 3424379 3419559 3696169 3867716 3229845 3379746
15541 3379746 3824021 3679536 3647081 3492675 3752068 3862666 3845328 3813331 3887293 3962176
15531 3962176 3392385 3125478 3331694 3764214 3477709 3516071 3207043 3450527 3807108 3807852
15521 3807852 3224035 3146225 3456267 3877805 3840920 3905406 3862175 3229789 3380722 3725229
15511 3725229 4035950 4089427 3609770 3861567 3807202 3576625 3362594 3873757 4113411 3836427
15501 3836427 3905418 3719136 3075461 2808783 3325024 2967961 3324969 3157176 3504188 4157740
15491 4157740 3940114 3501909 3576280 3558208 3509700 3253540 3265613 3550803 3929897 4100013
15481 4100013 3721129 3388504 3536924 3342442 3847578 3732769 3189146 3493703 3938828
15472 3938828 3791096 3875675 3496170 3559793 3711936 3441581 3467537 3397280 3593620 3482401
15462 3482401 4078785 3718322 3907445 3485622 3243335 3625476 3791351 3631704 3464309
15453 3464309 3553895 3928912 3949804 4254012 4364126 3898239 4008128 4064436 3972085 3774801
15443 3774801 3860807 3724853 3546282 3505296 3624497 3650995 3582270 3525643 3740567 4000586
15433 4000586 3348326 3400341 3859633 3618868 3101475 3191135 3580488 3352483 3365003 3097580
15423 3097580 3178013 3501924 3660315 3123109 3311493 3922730 3882469 3800561 3621923 3351086
15413 3351086 3397239 3479384 3103849 3778748 3568103 3621250 3139057 3188885 3022951 3519788
15403 3519788 4136918 3667756 3771908 3834633 4064760 3824935 4081844 3525397 3714979 3653602
15393 3653602 3327755 4034742 3737845 3408366 3313698 3533642 3975567 4013195 3521455 3420062
15383 3420062 3690980 4045383 3892548 3849094 4262467 3546496 3483153 3592346 3620430 3612681
15373 3612681 3942621 3573402 3704961 3586475 3296414 3256891 3456716 3653409 3439255 3712910
15363 3712910 3788938 4022192 3631070 3235780 3644298 3492722 3386161 3541599 3488897 3523865
15353 3523865 3258260 3174079 2916226 3288295 3795973 3443337 3652385 3944161 4108241 3853041
15343 3853041 3865717 3611976 3636640 3539808 3420228 3403448 3600942 3671014 3611109 3584701 3462749
15332 3462749 3765051 3559024 3527746 3711706 3678769 3486985 3765879 4512837 4355466 3663077
15322 3663077 3822196 3430101 3091323 3761536 4283447 3967877 3866794 3837938 4044911 3939244
15312 3939244 3756234 3525299 3501461 4146281 3857491 4181762 3951747 3579725 3921912 3937323
15302 3937323 4182213 4129455 4044204 3809827 4097746 4144013 3796204 3645284 3237269 3299863
15292 3299863 3692279 4244567 4043282 3826712 3830920 3744545 3725676 3687705 3429801 3335153
15282 3335153 4006788 3924361 3750935 3749905 3901164 3652546 3879042 3745827 3456600 3868753
$$ [...]
##END NTUPLES=NMR SPECTRUM
##END=
