##TITLE=1H_CA-8890-1
 CDCl3, 8 sc, 
 5.07.2021
##JCAMPDX= 6.0         $$ Bruker NMR JCAMP-DX V2.0
##DATA TYPE= NMR SPECTRUM
##DATA CLASS= NTUPLES
##ORIGIN= UXNMR, Bruker Analytische Messtechnik GmbH
##OWNER= root
$$ XWIN-NMR		Version 3.5
$$ Mon Jul  5 11:57:15 2021 Russian Standard Time (UT+4h)  she@DPX200
##.OBSERVE FREQUENCY= 200.131506
##.OBSERVE NUCLEUS= ^1H
##.ACQUISITION MODE= SIMULTANEOUS
##.ACQUISITION SCHEME= undefined
##.AVERAGES= 8
##.DIGITISER RES= 18
##SPECTROMETER/DATA SYSTEM= spect
##.PULSE SEQUENCE= zg30
##.SOLVENT NAME= CDCl3
##.SHIFT REFERENCE= (INTERNAL, CDCl3, 0, 17.4776)
##AUDIT TRAIL= $$ (NUMBER, WHEN, WHO, WHERE, WHAT)
$$ ##TITLE= Audit trail, XWIN-NMR		Version 3.5
$$ ##JCAMPDX= 5.01
$$ ##ORIGIN= Bruker BioSpin GmbH
$$ ##OWNER= she
$$ F:/spectra/data/she/nmr/H-F/1/pdata/1/auditp.txt
$$ ##AUDIT TRAIL=  $$ (NUMBER, WHEN, WHO, WHERE, WHAT)
(   1,<2021-07-05 11:56:01.56 +0400>,<she>,<DPX200>,
      <created by zg, POWCHK disabled, PULCHK disabled
       configuration hash MD5:
       00 E9 B6 7A A2 85 ED C7 34 08 36 98 17 FE 4E 26
       data hash MD5: 16K
       37 A7 1B 33 25 1E 98 95 EE 90 C8 60 F6 22 D7 83>)
(   2,<2021-07-05 11:56:04.04 +0400>,<she>,<DPX200>,
      <Start of raw data processing
       efp BC_mod = 2 LB = 0.24 FT_mod = 6 PKNL = 1 PHC0 = -12075.37 PHC1 = 16.40099 SI = 16K 
       data hash MD5: 16K
       F1 38 AB 5C 6E 97 AD A2 3C 65 62 AF 47 EE 2F 85>)
(   3,<2021-07-05 11:56:24.78 +0400>,<she>,<DPX200>,
      <pk PHC0 = 4.345417 PHC1 = -5.8 
       data hash MD5: 16K
       E3 6D 31 AE 26 F6 A3 BD DF 52 46 6E DA 4F 5F 1E>)
(   4,<2021-07-05 11:56:28.09 +0400>,<she>,<DPX200>,
      <abs ABSG = 5 
       data hash MD5: 16K
       C4 2B 00 88 C7 34 0B D5 4B 8F 4C 40 41 4E 0E 00>)
$$ ##END=
$$ 
$$ hash MD5
$$ 20 19 81 68 69 BA 0F 17 FF 8B 0E 18 0A 4C 1B 41
##$RELAX= 
##$RELAX= 
##$RELAX= 
##$RELAX= 
##$RELAX= 
##$RELAX= 
$$ Bruker specific parameters
$$ --------------------------
##$DU= <F:/spectra>
##$EXPNO= 1
##$NAME= <H-F>
##$PROCNO= 1
##$TYPE= <nmr>
##$USER= <she>
##$AMP= (0..31)
100 100 100 100 100 100 100 100 100 100 100 100 100 100 100 100 100 100 
100 100 100 100 100 100 100 100 100 100 100 100 100 100 
##$AQSEQ= 0
##$AQ_mod= 1
##$AUNM= <au_zg>
##$AUTOPOS= <>
##$BF1= 200.13
##$BF2= 200.13
##$BF3= 200.13
##$BF4= 200.13
##$BF5= 200.13
##$BF6= 200.13
##$BF7= 200.13
##$BF8= 200.13
##$BYTORDA= 1
##$CFDGTYP= 0
##$CFRGTYP= 5
##$CHEMSTR= <none>
##$CNST= (0..31)
1 1 145 1 1 1 1 1 1 1 1 1 1 1 1 1 1 1 1 1 1 1 1 1 1 1 1 1 1 1 1 1 
##$CPDPRG= <>
##$CPDPRG1= <>
##$CPDPRG2= <>
##$CPDPRG3= <>
##$CPDPRG4= <mlev>
##$CPDPRG5= <mlev>
##$CPDPRG6= <mlev>
##$CPDPRG7= <mlev>
##$CPDPRG8= <mlev>
##$CPDPRGB= <>
##$CPDPRGT= <>
##$D= (0..31)
0 1.2 0 0 0 0 0 0 0 0.06 0 0.03 0 0 0 0 0.0002 0 0 0 0 0 0 0 0 0 0 0 0 
0 0 0 
##$DATE= 1625471761
##$DBL= (0..7)
120 120 120 120 120 120 120 120 
##$DBP= (0..7)
150 150 150 150 150 150 150 150 
##$DBP07= 0
##$DBPNAM0= <>
##$DBPNAM1= <>
##$DBPNAM2= <>
##$DBPNAM3= <>
##$DBPNAM4= <>
$$ [...]
##$SUBNAM3= <"">
##$SUBNAM4= <"">
##$SUBNAM5= <"">
##$SUBNAM6= <"">
##$SUBNAM7= <"">
##$SUBNAM8= <"">
##$SUBNAM9= <"">
##$SW= 20.0188882624521
##$SWIBOX= (0..15)
0 0 2 0 0 0 0 0 0 0 0 0 0 0 0 0 
##$SW_h= 4006.41025641026
##$TD= 16384
##$TD0= 1
##$TE= 0
##$TE2= 300
##$TE3= 300
##$TEG= 300
##$TL= (0..7)
0 120 120 120 120 120 120 120 
##$TP= (0..7)
150 150 150 150 150 150 150 150 
##$TP07= 0
##$TPNAME0= <>
##$TPNAME1= <>
##$TPNAME2= <>
##$TPNAME3= <>
##$TPNAME4= <>
##$TPNAME5= <>
##$TPNAME6= <>
##$TPNAME7= <>
##$TPOAL= (0..7)
0.5 0.5 0.5 0.5 0.5 0.5 0.5 0.5 
##$TPOFFS= (0..7)
0 0 0 0 0 0 0 0 
##$TUNHIN= 0
##$TUNHOUT= 0
##$TUNXOUT= 0
##$USERA1= <user>
##$USERA2= <user>
##$USERA3= <user>
##$USERA4= <user>
##$USERA5= <user>
##$V9= 5
##$VALIST= <valist>
##$VCLIST= <CCCCCCCCCCCCCCC>
##$VD= 0
##$VDLIST= <DDDDDDDDDDDDDDD>
##$VPLIST= <PPPPPPPPPPPPPPP>
##$VTLIST= <TTTTTTTTTTTTTTT>
##$WBST= 1024
##$WBSW= 4
##$XGAIN= (0..3)
0 0 0 0 
##$XL= 0
##$YL= 0
##$YMAX_a= 212189
##$YMIN_a= -149157
##$ZGOPTNS= <>
##$ZL1= 120
##$ZL2= 120
##$ZL3= 120
##$ZL4= 120
##$ABSF1= 17.50688
##$ABSF2= -2.512159
##$ABSG= 5
##$ABSL= 3
##$ALPHA= 0
##$AQORDER= 0
##$ASSFAC= 0
##$ASSFACI= 0
##$ASSFACX= 0
##$ASSWID= 0
##$AUNMP= <proc_1d>
##$AZFE= 0.1
##$AZFW= 0.1
##$BCFW= 0
##$BC_mod= 2
##$BYTORDP= 0
##$COROFFS= 0
##$CY= -3
##$DATMOD= 1
##$DC= 0
##$DFILT= <>
##$DTYPP= 0
##$F1P= 0
##$F2P= 0
##$FCOR= 1
##$FTSIZE= 16384
##$FT_mod= 6
##$GAMMA= 0
##$GB= 0
##$INTBC= 1
##$INTSCL= 1.334414e-10
##$ISEN= 128
##$LB= 0.24
##$LEV0= 0
##$LPBIN= 0
##$MAXI= 10000
##$MC2= 0
##$MEAN= 0
##$ME_mod= 0
##$MI= 1.114404
##$NCOEF= 0
##$NC_proc= -8
##$NLEV= 6
##$NOISF1= 3.799351
##$NOISF2= 2.8
##$NSP= 0
##$NTH_PI= 0
##$NZP= 0
##$OFFSET= 17.47756
##$PC= 1
##$PHC0= -12071.02
##$PHC1= 10.60099
##$PH_mod= 1
##$PKNL= yes
##$PPARMOD= 0
##$PSCAL= 0
##$PSIGN= 0
##$REVERSE= no
##$SF= 200.130011420701
##$SI= 16384
##$SIGF1= 3
##$SIGF2= 2
##$SINO= 5.538805
##$SIOLD= 16384
##$SREGLST= <1H.CDCl3>
##$SSB= 0
##$STSI= 16384
##$STSR= 0
##$SW_p= 4006.41025641026
##$SYMM= 0
##$S_DEV= 0
##$TDeff= 16384
##$TDoff= 0
##$TI= <>
##$TILT= no
##$TM1= 0
##$TM2= 0
##$TOPLEV= 0
##$USERP1= <user>
##$USERP2= <user>
##$USERP3= <user>
##$USERP4= <user>
##$USERP5= <user>
##$WDW= 1
##$XDIM= 16384
##$YMAX_p= 301077779
##$YMIN_p= -714545
$$ End of Bruker specific parameters
$$ ---------------------------------
##NTUPLES= NMR SPECTRUM
##VAR_NAME=  FREQUENCY,     SPECTRUM/REAL,   SPECTRUM/IMAG
##SYMBOL=    X,             R,               I
##VAR_TYPE=  INDEPENDENT,   DEPENDENT,       DEPENDENT
##VAR_FORM=  AFFN,          ASDF,            ASDF
##VAR_DIM=   16384,         16384,           16384
##UNITS=     HZ,            ARBITRARY UNITS, ARBITRARY UNITS
##FACTOR=    0.24454680195387, 1,            1
##FIRST=     3497.78429107861, 0,            0
##LAST=      -508.625965331647, 0,           0
##MIN=       -508.625965331647, -714545,     0
##MAX=       3497.78429107861, 301077779,    0
$$ Real data points
##PAGE= N=1
##DATA TABLE= (X++(R..R)), XYDATA
$$ [...]
6902A33133K768r5833k20195o1636P3868L08213l562p3538k12961J89031o0379
$$ 133133 135901 40068 -180127 -241763 -167895 140318 136756 63218 -149743 39288 -21091
6891b1091J56502o8669j02042O3815J80124Q1964J33652q9870j42248J14464M1170
$$ -21091 135411 66742 -35300 28515 208639 290603 424255 334385 192137 306601 347771
6880C47771k92881j42712O1128J40062J37268k08568p5733Q507K94805j17996
$$ 347771 54890 -87822 -26694 113368 250636 42068 -33665 -25158 269647 151651
6870A51651j84787M2717J36755j92406N563J46348N8006k15018k92149J43878
$$ 151651 -33136 9581 146336 -46070 -40507 105841 163847 -51171 -343320 -199442
6860a99442L23894L4897j45178R5028o7864J12270M0891K07413j87769P4021j27212
$$ -199442 124452 159349 14171 109199 41335 153605 194496 401909 214140 288161 160949
6849A60949j19413K27629l8902k66314L44270J36660k61163j78660J31052K05043
$$ 160949 41536 269165 230263 -36051 308219 444879 183716 5056 136108 341151
6839C41151L9431l1555j32779j96588J11568j57818j12827N2464K46098K7587
$$ 341151 380582 349027 216248 19660 131228 -26590 -139417 -86953 159145 186732
6829A86732j037J24511n6623L2742n9771q864k67591J49016r0292J34876J94604
$$ 186732 185695 310206 253583 286325 226554 217690 -49901 99115 8823 143699 338303
6818C38303k3555k72818J20286Q1019L6264j0451Q1204J76132k19088N0748r5999
$$ 338303 314748 41930 162216 243235 279499 269048 350252 526384 307296 358044 262045
6807B62045l80755L66587j0435j59962K0507O0921L6120Q4489q9829j67941K27278
$$ 262045 -118710 247877 237442 77480 97987 158908 195028 279517 189688 21747 249025
6796B49025J47259k6150k11760k22463j65776L19400Q3922P8724n13851K08419
$$ 249025 396284 370134 158374 -64089 -229865 89535 173457 252181 -261670 -53251
6786e3251K11952m40P0769k33611Q210J82408l144K2777J54472k05060R8559k34394
$$ -53251 158701 158261 229030 -4581 3629 186037 182893 205670 360142 155082 253641 19247
6774A9247O7521J20179j32101J22734L25732p64206J1259J15321j0171R5024J29062
$$ 19247 86768 206947 74846 197580 523312 -240894 -229635 -114314 -124485 -29461 99601
6763I9601K08050L1390j34951j53599n1588J350j11403n643K29068P5821J8908
$$ 99601 307651 339041 204090 50491 -1097 253 -111150 -116793 112275 188096 207004
6752B07004p1959O6568j86074m9692K088J05746M06021q0283k49328R1258j65795
$$ 207004 135045 201613 15539 -34153 -32065 73681 479702 399419 150091 241349 75554
6741G5554K33163Q6665J49370o9791j03830j9911R3111J84193j74565l25960j99688
$$ 75554 308717 395382 544752 474961 371131 351220 444331 628524 453959 127999 -71689
6730g1689P7950O3652J95333k35047l0946P3934L2664j90341j91672K16898K12128
$$ -71689 6261 69913 265246 30199 -747 73187 105851 -84490 -276162 -59264 152864
6719A52864M61885o2152j42841j62261J5876J76726n51924K3247K98518k4109
$$ 152864 614749 552597 409756 247495 263371 440097 -111827 -88580 209938 185829
6709A85829L1801M8139j28197q4448m9709p3051r6245R1205P916K51324K2067
$$ 185829 217630 265769 137572 53124 3415 -69636 -165881 -74676 -66760 184564 206631
6698B06631q4871j58416k0470Q8437P9719R6360j9382J00921j13597P2125j22445
$$ 206631 121760 -36656 -57126 31311 111030 207390 188008 288929 175332 247457 125012
6687A25012J9048m108P7968K24691J1564N4383p548n7982k6523L1283k5840r3557
$$ 125012 144060 139952 217920 442611 454175 508558 501010 443028 416505 447788 421948 328391
6675C28391m2247M2355K14346J04600O6478l8674Q3809l43372N3872l0244o2379
$$ 328391 286144 328499 542845 647445 713923 675249 759058 415686 469558 439314 376935
6664C76935k39583q2994K33205J35965k02514Q0252r1795r5073J39028O0740O2019
$$ 376935 137352 54358 287563 423528 221014 301266 209471 114398 253426 314166 376185
6653C76185p8702p4878K13229J41135j58183j81616O3622J49613K3674o909q4441
$$ 376185 297483 222605 435834 576969 418786 237170 300792 450405 474079 467170 382729
6642C82729l7463q6460J61331J83984j15103l0444q4607k05689L11774J52201
$$ 382729 345266 258806 420137 604121 489018 458574 373967 168278 480052 632253
6632F32253J21461j78661l8839p5039J0229j54244N426k9347L52811O6743p7762
$$ 632253 753714 575053 536214 461175 471404 317160 322586 293239 646050 712793 635031
6621F35031r0219j05603J45344j52089j76590k41386J91484K08770N6011l3116
$$ 635031 544812 439209 584553 432464 255874 14488 205972 414742 470753 437637
6611D37637J74873K15639j09390l09878K09814J76894l0082k63639m536K3161
$$ 437637 612510 828149 718759 408881 618695 795589 765507 501868 497332 520493
6601E20493k25795K61681J34577j18905r8378K58241J06098l1283o1029l31522
$$ 520493 294698 556379 690956 572051 473673 731914 838012 806729 745700 414178
6591D14178k07122N4481K50897j4809J86199O4292R6912j19044k07851K76935
$$ 414178 207056 261537 512434 497625 683824 748116 845028 725984 518133 795068
6581G95068j52482J65142K89314J05495p5168j74460O8179N286l3524N24438k7165
$$ 795068 642586 807728 1097042 1202537 1127369 952909 1021088 1026374 992850 1517288 1490123
6570A490123j36054K63355J75908L25550J86408j49539L64497J77178k66325K61304
$$ 1490123 1354069 1617424 1793332 2118882 2305290 2155751 2520248 2697426 2431101 2692405
6560B692405k25155P058L7953j62969p7940k6165k08558j54884o2074k50647o7294
$$ 2692405 2467250 2474308 2512261 2349292 2271352 2245187 2036629 1881745 1819671 1569024 1501730
6549A501730P9018K07751o8669n61972O2744j01580l9276J94617k20862K61995
$$ 1501730 1580748 1788499 1719830 1157858 1220602 1119022 1079746 1274363 1053501 1315496
6539A315496Q4604J14972j48435k40617R2112M2028K4781j32254k50679K48410
$$ 1315496 1400100 1515072 1366637 1126020 1218132 1260160 1284941 1152687 902008 1150418
6529A150418P0550j79542J88614n79289k74591L60514L68171n9486m1548j07467
$$ 1150418 1220968 1041426 1230040 650751 376160 736674 1104845 1045359 1003811 896344
6519H96344J30292l12352J15757J97178J61083R3938k84542J42030n7354j66667
$$ 896344 1026636 714284 830041 1027219 1188302 1282240 997698 1139728 1082374 915707
6509I15707J15388J65692M1304K06251j44388j6989K6416K90844k18626J12003
$$ 915707 1031095 1196787 1238091 1444342 1299954 1282965 1309381 1600225 1381599 1493602
6499A493602r0859J46799L57141K5182j37192L08312K61019L48890J92615k50911
$$ 1493602 1402743 1549542 1906683 1931865 1794673 2102985 2364004 2712894 2905509 2654598
6489B654598p7055P2139m6044j16697q3151o6349J1557J06304m02647Q7402K42400
$$ 2654598 2577543 2649682 2603638 2486941 2403790 2337441 2348998 2455302 2052655 2140057 2382457
6478B382457l62639j03721j31110l35089J48712m6475j39705j61158M26395M4701
$$ 2382457 2019818 1916097 1784987 1449898 1598610 1552135 1412430 1251272 1677667 1722368
6468A722368N836p5593L16345j49400l00868k87758Q202N49822m89008J65064
$$ 1722368 1728204 1652611 1968956 1819556 1518688 1230930 1239132 1788954 1299946 1465010
6458A465010j47441m8818J6004J04225k17K19313j76528O3906O5017l28524j59600
$$ 1465010 1317569 1268751 1284755 1388980 1388763 1608076 1431548 1495454 1560471 1231947 1072347
6447A072347l0271L026p3138P861J64673k03427K1649r3492m6537r3944J76262
$$ 1072347 1042076 1045102 971964 979825 1144498 941071 962720 869228 822691 728747 905009
6436I05009N1020j66186J74291O9378O4110j02578Q5431p1254J6406O5909n3129
$$ 905009 956029 789843 964134 1033512 1097622 995044 1080475 1009221 1025627 1091536 1038407
6425A038407p6136p4575k00564j5202L29958k5127j9279k38420N77428j37658
$$ 1038407 962271 887696 687132 671930 1001888 976761 957482 719062 1296490 1158832
6415A158832j86803L14513N7884j81415K61903J77097r6997j51129J7659J61787
$$ 1158832 972029 1286542 1344426 1163011 1424914 1602011 1505014 1353885 1371544 1533331
6405A533331p2394m6600P747k75648L21463L92624J5043j15070m4395j13136j20770
$$ 1533331 1460937 1414337 1422084 1146436 1467899 1860523 1875566 1760496 1716101 1602965 1482195
6394A482195k60642N1768J02790K2219k91363K87356K9222l39884K22917N516
$$ 1482195 1221553 1273321 1376111 1398330 1106967 1394323 1423545 1083661 1306578 1312094
6384A312094j40375j593k4546j20584q5859J45932K0249N5886K19652r6458o4217
$$ 1312094 1171719 1170126 1145580 1024996 939137 1085069 1105318 1161204 1380856 1284398 1220181
6373A220181j16123j73500k08060K66348k0212P7360j64636J49243j21881J99902
$$ 1220181 1104058 930558 722498 988846 968634 1045994 881358 1030601 908720 1108622
6363A108622k49852O9636J07575K35959q2863J34255k66498r1415L47274J13742
$$ 1108622 858770 928406 1035981 1271940 1189077 1323332 1056834 965419 1312693 1426435
6353A426435r0821K19292k41751j14528L21148J75925m0525j31346J08768j24380
$$ 1426435 1335614 1554906 1313155 1198627 1519775 1695700 1655175 1523829 1632597 1508217
6343A508217j01454J19141M54269j37115M3409O61976r8491n3775J34186p777
$$ 1508217 1406763 1525904 1980173 1843058 1886467 2548443 2449952 2396177 2530363 2522586
6333B522586Q48K1989j61051n7916k03845j68625o4518L8943K8803j63170P4399
$$ 2522586 2523434 2545423 2384372 2326456 2122611 1953986 1889468 1928411 1957214 1794044 1868443
6322A868443K48914l43758l48752J12323k35957K37072J79466j35794n9039K40502
$$ 1868443 2117357 1773599 1424847 1537170 1301213 1538285 1717751 1581957 1522918 1763420
6312A763420j98400N1598L8734J62110R1728o2165M7471j72820k03042j72658
$$ 1763420 1565020 1616618 1655352 1817462 1909190 1847025 1894496 1721676 1518634 1345976
6302A345976M21470O6735J35081j23318j73283L89820J7490K12943N033K0994
$$ 1345976 1767446 1834181 1969262 1845944 1672661 2062481 2079971 2292914 2297947 2318941
6292B318941K42064K10925p5310M3583O211l83962k0453J59550r4761j08772m17095
$$ 2318941 2561005 2771930 2696620 2740203 2746414 2362452 2341999 2501549 2406788 2298016 1880921
6281A880921j80463L5438k9903q5209J40127j19695o5624Q6646O6761l6130k92400
$$ 1880921 1700458 1735896 1705993 1620784 1760911 1641216 1575592 1662238 1728999 1692869 1400469
6270A400469j70466K56754J04152K69037P2601m08280M3473j5948j07226J13315
$$ 1400469 1230003 1486757 1590909 1859946 1932547 1524267 1567740 1551792 1444566 1557881
6260A557881o3212l1925J02907J07063j75538n6101n1859o2170k04343j50213
$$ 1557881 1494669 1462744 1565651 1672714 1497176 1441075 1389216 1327046 1122703 972490
6250I72490K13253m382J10762l77467k75207l6491L08017L94239n1070q2243j64127
$$ 972490 1185743 1181361 1292123 914656 639449 602958 910975 1305214 1254144 1171901 1007774
6239A007774K31481j45558k60575J71611K4650K31861k15830J4670L89594k96336
$$ 1007774 1239255 1093697 833122 1004733 1029383 1261244 1045414 1060084 1449678 1153342
6229A153342m00512K40857K97309j09689j12931p2252k4656J614l11541K05574
$$ 1153342 752830 993687 1290996 1181307 1068376 996124 971468 973082 661541 867115
6219H67115K24434l03702M3177J26034j89463m6138M0479j7191K44048J22836
$$ 867115 1091549 787847 831024 957058 767595 721457 761936 744745 988793 1111629
6209A111629K0466J00039k17810n69226J16939J99850J42227j83728J96214M0423
$$ 1111629 1132095 1232134 1014324 445098 562037 761887 904114 720386 916600 957023
6199I57023q5246J18610N3335m2058J5971n8121L2550j31949M45972m1062k09339
$$ 957023 871777 990387 1043722 1001664 1017635 959514 992064 860115 1306087 1265025 1055686
6188A055686l34526j4803L11314j02343J27694r7242K41057J74800l6801r1628
$$ 1055686 721160 706357 1017671 915328 1043022 945780 1186837 1361637 1324836 1233208
6178A233208J70741k3652M8164R2438j24536J80377L59591n1046N1249m96249
$$ 1233208 1403949 1380297 1428461 1520899 1396363 1576740 1936331 1885285 1936534 1440285
6168A440285K55623K20851Q4618J0824j421k01530k44416l06190n2498J10528
$$ 1440285 1695908 1916759 2001377 2012201 2010780 1809250 1564834 1258644 1206146 1316674
6158A316674K74073P9773k58608j6071J73663K4680K00131j14410l26863L4047
$$ 1316674 1590747 1670520 1411912 1395841 1569504 1594184 1794315 1679905 1353042 1387089
6148A387089j62331J73965Q8526k03600j25193L10759O5579P5930n9186l59763
$$ 1387089 1224758 1398723 1487249 1283649 1158456 1469215 1534794 1610724 1551538 1191775
6138A191775j05292L17518O4476j3696J28567P3793m4969J02178J36974M0226
$$ 1191775 1086483 1404001 1468477 1454781 1583348 1657141 1612172 1714350 1851324 1891550
6128A891550J26643J04115o440k97705q2021m1621n4510O0378j02607j61442J28975
$$ 1891550 2018193 2122308 2115868 1818163 1736142 1694521 1640011 1700389 1597782 1436340 1565315
6117A565315M5182J38403j40675J44065K29450k96794j10276j67950K08471r826
$$ 1565315 1610497 1748900 1608225 1752290 1981740 1684946 1574670 1406720 1615191 1605365
6107A605365q4679j31579R6142N7904j8461N8158J6503K12314k9614k52382M1016
$$ 1605365 1520686 1389107 1485249 1543153 1524692 1582850 1599353 1811667 1782053 1529671 1570687
6096A570687j23782k19706J12255K33915j11311N3429J72202j78616M0368k28731
$$ 1570687 1446905 1227199 1339454 1573369 1462058 1515487 1687689 1509073 1549441 1320710
6086A320710J78026R4023O0356k75100L3193J72181K72368k54025J37093O480
$$ 1320710 1498736 1592759 1653115 1378015 1411208 1583389 1855757 1601732 1738825 1745305
6076A745305k16881K17081o4805j21729K3779J36936J33362Q8845J3332j36013
$$ 1745305 1528424 1745505 1680700 1558971 1582750 1719686 1853048 1941893 1955225 1819212
6066A819212m6892K78952O2259Q8725k16236K1260p7650k5314r4889K52449J01843
$$ 1819212 1772320 2051272 2113531 2202256 1986020 2007280 1929630 1904316 1809427 2061876 2163719
6055B163719L8876J0248P8318L4608Q5697q3018J5586l6648o2966k213L0872K42693
$$ 2163719 2202595 2212843 2291161 2325769 2411466 2328448 2344034 2307386 2244420 2242207 2273079 2515772
6043B515772J21056k17944K1319q2526n9826P0889K1620J13304n1583L35241k07805
$$ 2515772 2636828 2418884 2440203 2357677 2297851 2368740 2390360 2503664 2452081 2787322 2579517
6032B579517j30670p1520l11137j28424M80995K29624p9454L8734k70129M33270
$$ 2579517 2448847 2377327 2066190 1937766 2418761 2648385 2568931 2607665 2337536 2770806
6022B770806J95653k07414n5029M1611J2454L00039L0559p2708l71123J22557
$$ 2770806 2966459 2759045 2704016 2745627 2758081 3058120 3088679 3015971 2644848 2767405
6012B767405M22179L22695L6247j25408J03277J55938j09508k32417M3151q1128
$$ 2767405 3189584 3512279 3548526 3423118 3526395 3682333 3572825 3340408 3383559 3302431
6002C302431j0402j66441r7495K955Q5382J37441M9097j14655n7923p2898J7197
$$ 3302431 3292029 3125588 3028093 3031048 3116430 3253871 3302968 3188313 3130390 3057492 3074689
5991C074689k2568J4448m5613k47187j97714L33154j31389M07425l0504K06458
$$ 3074689 3052121 3066569 3020956 2773769 2576055 2909209 2777820 3185245 3154741 3361199
5981C361199J15713l33204R9282M4188L66198r1577K5892q1864P2380J52702j65413
$$ 3361199 3476912 3143708 3242990 3287178 3653376 3561799 3587691 3505827 3578207 3730909 3565496
5970C565496K2590M3593j43431Q6544J53250l9058n9085L6082L60110K5625m0173
$$ 3565496 3588086 3631679 3488248 3574792 3728042 3688984 3629899 3665981 4026091 4051716 4011543
5959D011543Q0467n9362k28854J739K45585L47037J5280l0968o9171K10737j52212
$$ 4011543 4092010 4032648 3803794 3805533 4051118 4398155 4413435 4382467 4313296 4524033 4371821
5948D371821j7604M17371j37789R251o0620M48389k02147J96131R7743j23121
$$ 4371821 4354217 4771588 4633799 4643050 4582430 5030819 4828672 5024803 5122546 4999425
5938D999425K22079L18450K81454K70299j97312j768K30266O4875J77117K20247
$$ 4999425 5221504 5539954 5821408 6091707 5894395 5892627 6122893 6187768 6364885 6585132
5928F585132J56867O8450J84766N1261o023P4741J51832O03202N44948J79305
$$ 6585132 6741999 6810449 6995215 7046476 7040453 7115194 7267026 7870228 8415176 8594481
5918H594481P9889L5951L88952j35410K71582L01440L89187P39578K36346J68977
$$ 8594481 8674370 8710321 9099273 8963863 9235445 9536885 9926072 10665650 10901996 11070973
5908A1070973L42849J08843N51135M96611L84855L98857P74272L97512K43913
$$ 11070973 11413822 11522665 12073800 12570411 12955266 13354123 14128395 14525907 14769820
5899A4769820N63203P15865L84533M67680P10283Q13592P30581J265295O47676
$$ 14769820 15333023 16048888 16433421 16901101 17611384 18424976 19155557 20420852 21068528
5890B1068528J174419J446826J128431J963108J815821K161691K491979K558605
$$ 21068528 22242947 23689773 24818204 26781312 28597133 30758824 33250803 35809408
5882C5809408L391582L643056L914738M896334M591294O188461O630379O212040
$$ 35809408 39200990 42844046 46758784 51655118 56246412 62434873 69065252 75277292
5874G5277292O027886N239379L794253K184194J319692R23844J154013J749315
$$ 75277292 81305178 86544557 90338810 92523004 93842696 94766540 95920553 97669868
5866I7669868J873998J997851J760393Q83409q24686k824964m810163o578122
$$ 97669868 99543866 101541717 103302110 104185519 103360833 100535869 95725706 89147584
5858H9147584p139480p201382o943204n889560n885892m970161m170249l458138
$$ 89147584 82008104 74806722 67863518 61973958 56088066 51117905 46947656 43489518
5850D3489518l147689k792620k153668k079182j779641j584740j617066j351512
$$ 43489518 40341829 37549209 35395541 33316359 31536718 29951978 28334912 26983400
5842B6983400j168124j113975j071589r83019p45407j018081p35737n37838o48111
$$ 26983400 25815276 24701301 23629712 22646693 21901286 20883205 20147468 19609630 18961519
5833A8961519o14912k14209m60947k99537j88843n91527o82797l87830j14260
$$ 18961519 18346607 18132398 17671451 17371914 17183071 16591544 15908747 15520917 15406657
5824A5406657p10371l01578j15106q04783k64804m63553m38924k73293n12721
$$ 15406657 14696286 14394708 14279602 13474819 13210015 12746462 12307538 12034245 11521524
5815A1521524j56540k30985k65217l69263k32234K46005n89782n27602J2336j71546
$$ 11521524 11364984 11133999 10868782 10499519 10267285 10513290 9923508 9395906 9408242 9236696
5805I236696k05278o3957r6j93756k7088l09482k53802o3666l09271L51329l51643
$$ 9236696 9031418 8967461 8967365 8773609 8746521 8437039 8183237 8119571 7810300 8161629 7809986
5794G809986r4793P9683k10542J06164k23285j98000P223Q2669m7833j43216R2700
$$ 7809986 7715193 7794876 7584334 7690498 7467213 7269213 7276436 7359105 7311272 7168056 7260756
5783G260756J5947j03759j86733J38151n455l40454N4475J72088k10730m38763
$$ 7260756 7276703 7172944 6986211 7124362 7118907 6778453 6832928 7005016 6794286 6355523
5773F355523L537J7344J54388K23553j87810j55092m7968p5187M8401R8757J08769
$$ 6355523 6359060 6376404 6530792 6754345 6566535 6411443 6363475 6288288 6336689 6435446 6544215
5762F544215k83578r9466L30221K03415j09767l02764p9698k0760j45164J74420
$$ 6544215 6260637 6161171 6491392 6694807 6585040 6282276 6202578 6181818 6036654 6211074
5752F211074j94068K7290j72269l24654L0421K50790R1028J85886p7231k16167
$$ 6211074 6017006 6044296 5872027 5547373 5577794 5828584 5919612 6105498 6028267 5812100
5742E812100J24188j26004k8575R5243m5217m2093K11680j71671j92946J75208
$$ 5812100 5936288 5810284 5781709 5876952 5831735 5789642 6001322 5829651 5636705 5811913
5732E811913k58115o3310R7729J74600Q8668K2926j84077J9287K38121J56637
$$ 5811913 5553798 5490488 5588217 5762817 5851485 5874411 5690334 5709621 5947742 6104379
5722F104379o144k77622j46665j03271K80585P9644J75142k87671j95039L02118
$$ 6104379 6098235 5820613 5673948 5570677 5851262 5930906 6106048 5818377 5623338 5925456
5712E925456j36528N6163K1736j69561k45921O6322j3709J5739J63047K49794
$$ 5925456 5788928 5845091 5866827 5697266 5451345 5517667 5503958 5519697 5682744 5932538
5702E932538L39029l08600J95097j21307L748K32712Q1495q502j37190M7250j56295
$$ 5932538 6271567 5962967 6158064 6036757 6040505 6273217 6354712 6346210 6209020 6256270 6099975
5691F099975r52j65105K58463R717r782K8625j05878j6848M18232J19553k49938
$$ 6099975 6099023 5933918 6192381 6202098 6192316 6220941 6115063 6098215 6516447 6636000 6386062
5680F386062J61636j5667K99340k30844j2201p3097K25445j2017J04082P2006
$$ 6386062 6547698 6532031 6831371 6600527 6588326 6515229 6740674 6728657 6832739 6904745
5670F904745N9489o018l22313J99058K3571J87443K73680o6566J06785K00006
$$ 6904745 6964234 6958216 6635903 6834961 6858532 7045975 7319655 7253089 7359874 7559880
5660G559880Q3399j93327k48715M03880K44071J76989q2809j24128j12009j19708
$$ 7559880 7643279 7449952 7201237 7605117 7849188 8026177 7943368 7819240 7707231 7587523
5650G587523J82191J21218n5327r5512q4961j52728M4245j42597J05005Q5270
$$ 7587523 7769714 7890932 7835605 7740093 7655132 7502404 7546649 7404052 7509057 7594327
5640G594327K96086J83602j54046L8812O7237k06555J40437R1936m24842j2801
$$ 7594327 7890413 8074015 7919969 7958781 8026018 7819463 7959900 8051836 7626994 7614193
5630G614193j5078N35557k03934J47896k1353J87713M1871j9273J23554J5551
$$ 7614193 7599115 8134672 7930738 8078634 8057281 8244994 8286865 8267592 8391146 8406697
5620H406697j29090K34567N7652K16688L72457j10364k89855l00392J64555m1942
$$ 8406697 8277607 8512174 8569826 8786514 9158971 9048607 8758752 8458360 8622915 8580973
5610H580973K73658K24720L3771m0678J37102j18480J87471Q4390N8372J49017
$$ 8580973 8854631 9079351 9113122 9072444 9209546 9091066 9278537 9362927 9421299 9570316
5600I570316K00027o9985M006M1563j18397K55268J85727j848k5521J31447o8102
$$ 9570316 9770343 9700358 9704364 9745927 9627530 9882798 10068525 10066677 10041156 10172603 10104501
5589A0104501J18673M82278j82587J42985J07104r0219j30901N71501L87031r619
$$ 10104501 10223174 10705452 10522865 10665850 10772954 10682735 10551834 11123335 11510366 11500747
5579A1500747p3064j5067K55479q3954J75444p4861n3071K13370j09358J40254
$$ 11500747 11427683 11412616 11668095 11584141 11759585 11684724 11631653 11845023 11735665 11875919
5569A1875919K07039K1882N3209O10929l42191j05377J79925j25305J33677J87573
$$ 11875919 12082958 12104840 12158049 12768978 12426787 12321410 12501335 12376030 12509707 12697280
5559A2697280K82309j25426n0132j10232L98056Q1458k18597J16924K5911k18176
$$ 12697280 12979589 12854163 12804031 12693799 13091855 13173313 12954716 13071640 13097551 12879375
5549A2879375J2186J68510j6072J21004O5673J00863Q1306J27863J940J45965
$$ 12879375 12891561 13060071 13043999 13165003 13230676 13331539 13412845 13540708 13542648 13688613
5539A3688613J4891M3223J2409K30475J71193R6582K55741p7831J73896J6197
$$ 13688613 13703504 13746727 13759136 13989611 14160804 14257386 14513127 14435296 14609192 14625389
5529A4625389M1641j84510l4551J91089J52211O3355L02526J60805N8269M681
$$ 14625389 14667030 14482520 14447969 14639058 14791269 14854624 15157150 15317955 15376224 15380905
5519A5380905p713j07093M48148J12724R8231J3446R608K36455L22830R4869l0285
$$ 15380905 15373192 15266099 15714247 15826971 15925202 15938648 15948256 16184711 16507541 16602410 16572125
5508A6572125p6886L71029O7193J07415K23276m8642j21242K34771M00935J87023
$$ 16572125 16495239 16866268 16933461 17040876 17264152 17215510 17094268 17329039 17729974 17916997
5498A7916997m5703n839L23835L79503K89788K81989L22333k7084m8461L91850
$$ 17916997 17871294 17865455 18189290 18568793 18858581 19140570 19462903 19435819 19387358 19779208
5488A9779208K10864L43663O87935J48858K45406J23347N65301M81768N56471
$$ 19779208 19990072 20333735 21021670 21170528 21415934 21539281 22104582 22586350 23142821
5479B3142821M96647P74846J041273R03104M66737M56742N35120L63971k91995
$$ 23142821 23639468 24414314 25455587 26358691 26825428 27282170 27817290 28181261 27889266
5470B7889266j90350K59339o66299n30725m14708m36154m71575l32280J36855
$$ 27889266 27698916 27958255 27291956 26761231 26346523 25910369 25438794 25106514 25243369
5461B5243369K87281l08304j64024K26437P5127p5838K10086m1998M07567K08573
$$ 25243369 25530650 25222346 25058322 25284759 25359886 25284048 25494134 25452136 25859703 26068276
5451B6068276m60821M87673K67259M37699j67800K98945L58120J08999J71794
$$ 26068276 25607455 26095128 26362387 26800086 26632286 26931231 27289351 27398350 27570144
5442B7570144N72425L66865M05784Q39626K73604M26515O93430N24364J064714
$$ 27570144 28142569 28509434 28915218 29754844 30028448 30454963 31148393 31672757 32737471
5433C2737471R68016Q26303Q55618O01474P77308J128313J478546J449953J175262
$$ 32737471 33705487 34531790 35387408 35988882 36766190 37894503 39373049 40823002 41998264
5424D1998264J538027J569959J837157K034048K154954K470849K406205K880939
$$ 41998264 43536291 45106250 46943407 48977455 51132409 53603258 56009463 58890402
5416E8890402L354839L460485M117183M314248M725486N027727N078802O244868
$$ 58890402 62245241 65705726 69822909 74137157 78862643 83890370 88969172 95214040
5408I5214040N693964N126821M971518L881415K809399J70039j498189k736390
$$ 95214040 100908004 106034825 111006343 114887758 117697157 117867196 116369007 113632617
5400A13632617m594265n279479n777479o084555o437465n577709n145223m584692
$$ 113632617 109038352 103758873 97981394 91896839 85459374 79881665 74736442 70151750
5392G0151750m340865m087840l647255k796850k687330k725821k436151j910853
$$ 70151750 65810885 61723045 58075790 55278940 52591610 49865789 47429638 45518785
5384D5518785j858547j730402j594772j470023j337053j075202j193780j323992
$$ 45518785 43660238 41929836 40335064 38865041 37527988 36452786 35259006 33935014
5376C3935014p07798p38707o53309o82686j027492o23516n81929n86358j60870
$$ 33935014 33227216 32488509 31835200 31152514 30125022 29501506 28919577 28333219 28172349
5367B8172349l38044p18284k47996l51607n69771l94120n13668r2348k77111k53664
$$ 28172349 27834305 27116021 26868025 26516418 25946647 25552527 25038859 24946511 24669400 24415736
5357B4415736k49620n73901j56314k23313m45881k55143l07245j05318k18365
$$ 24415736 24166116 23592215 23435901 23212588 22766707 22511564 22204319 22099001 21880636
5348B1880636k31110j15710l1290l1915K30486j05246l61698Q9184K73709n20682
$$ 21880636 21649526 21533816 21502526 21470611 21701097 21595851 21234153 21323337 21597046 21076364
5338B1076364K4902J49892J4704k3277O4703J74131J21032m1964j56436O8506
$$ 21076364 21101266 21251158 21265862 21242585 21307288 21481419 21602451 21560487 21404051 21472557
5328B1472557J74270O5547k30129N4144k5706k500K43447J74752j4212L40316
$$ 21472557 21646827 21712374 21482245 21536389 21510683 21508183 21751630 21926382 21912170 22252486
5318B2252486K01861j82049L19703J07719m8931K62247q587L03895O27705m50603
$$ 22252486 22454347 22272298 22592001 22699720 22650789 22913036 22904449 23208344 23836049 23385446
5308B3385446m2392J98684J68377K26015J62591K33308L83597j40643j81944M01694
$$ 23385446 23343054 23541738 23710115 23936130 24098721 24332029 24715626 24574983 24393039 24794733
5298B4794733O4050K31733J11927K73057j99212N0122J54071k82020n5273J32953
$$ 24794733 24858783 25090516 25202443 25475500 25276288 25326410 25480481 25198461 25143188 25276141
5288B5276141o0823J41705o8871J70952l53436J31756J13081K46445j00682l788
$$ 25276141 25215318 25357023 25288152 25459104 25105668 25237424 25350505 25596950 25496268 25492480
5278B5492480m1198k90306k30624N9034O213J7473j28481m15993N7641k63556
$$ 25492480 25451282 25160976 24930352 24989386 24995599 25013072 24884591 24468598 24526239 24262683
5268B4262683m8389k08626m1021L9427j77616l52190m18043l69501j62489j61990
$$ 24262683 24214294 24005668 23964647 24004074 23826458 23474268 23056225 22686724 22524235 22362245
5258B2362245j89012j89058k84091l91903j90321j96412l78394j46652k26950
$$ 22362245 22173233 21984175 21700084 21308181 21117860 20921448 20543054 20396402 20169452
5249B0169452o25953k40970r1065m78940k61017j572l01872n80353l20295m1488
$$ 20169452 19543499 19302529 19211464 18732524 18471507 18469935 18168063 17587710 17267415 17225927
5239A7225927n07187j88094k40103L1295K0440l70714l06156o8633k88247k77912
$$ 17225927 16718740 16530646 16290543 16321838 16342278 15971564 15665408 15596775 15308528 15030616
5229A5030616l09314j88322j61637p0413o3702m72929j83236j44109j30181l24019
$$ 15030616 14721302 14532980 14371343 14300930 14237228 13764299 13581063 13436954 13306773 12982754
5219A2982754j15679J05845l62781j99442K63096l7679k10476j57319k84794m253
$$ 12982754 12867075 12972920 12610139 12410697 12673793 12636114 12425638 12268319 11983525 11979272
5209A1979272O0952r3609k33241j78067j62770j16472l83387N3244J16225l44713
$$ 11979272 12040224 11946615 11713374 11535307 11372537 11256065 10872678 10925922 11042147 10697434
5199A0697434j98709J48202K21640j43011k31822j28263q2657J06282k70988J0125
$$ 10697434 10498725 10646927 10868567 10725556 10493734 10365471 10282814 10389096 10118108 10128233
5189A0128233K75256M8084j01876J88400k84594l95508N566k24444J10265j20327
$$ 10128233 10403489 10451573 10349697 10538097 10253503 9857995 9863561 9639117 9749382 9629055
5179I629055O9909k54300J85079k46787j35547J29489N0363J46676k06560k64848
$$ 9629055 9698964 9444664 9629743 9382956 9247409 9376898 9427261 9573937 9367377 9102529
5169I102529k14131J54731K44607j60383l00433l0366p8920j23891R1691k22322
$$ 9102529 8888398 9043129 9287736 9127353 8826920 8796554 8717634 8593743 8685434 8463112
5159H463112J23878n4790k56756J50568L38880q1091m25048O2334q7729K29338
$$ 8463112 8586990 8532200 8275444 8426012 8764892 8683801 8258753 8321087 8233358 8462696
5149H462696j66197j90452L25469k68961j05764Q0970o2674k1314k24441J38547
$$ 8462696 8296499 8106047 8431516 8162555 8056791 8137761 8075087 8053773 7829332 7967879
5139G967879k17539k30635k05980j18204J09152J73482n6370r3632k3021k079
$$ 7967879 7750340 7519705 7313725 7195521 7304673 7478155 7421785 7328153 7305132 7303053
5129G303053p0895l87095l4172O6124J03210P3648k04308o4988j17815J63828
$$ 7303053 7232158 6845063 6810891 6877015 6980225 7053873 6849565 6784577 6666762 6830590
5119F830590K9200L9631k47442l05456J93369K70181r2428l67738j50828J38155
$$ 6830590 6859790 6899421 6651979 6346523 6539892 6810073 6717645 6349907 6199079 6337234
5109F337234j21959L20729O3691k23806J09626N3836j85233L7473K32407m4643
$$ 6337234 6215275 6536004 6599695 6375889 6485515 6539351 6354118 6391591 6623998 6579355
5099F579355J77200k76728l40810J77709q9691J07450J5056L410L78094k76018
$$ 6579355 6756555 6479827 6139017 6316726 6227035 6334485 6349541 6352951 6731045 6455027
5089F455027k84809l4826M54593j54542m7303N5393j18273K29693Q8205j45358
$$ 6455027 6170218 6135392 6589985 6435443 6388140 6443533 6325260 6554953 6643158 6497800
5079F497800L36788j32855j38487k2247J89281j66016k3065j38748K06607Q4710
$$ 6497800 6834588 6701733 6563246 6540999 6730280 6564264 6541199 6402451 6609058 6693768
5069F693768k51985J87325J8962j20664L39650J94246L4048k51961o6966J93211
$$ 6693768 6441783 6629108 6648070 6527406 6867056 7061302 7095350 6843389 6776423 6969634
5059F969634k54698O8739N4803L7438n6661J15415K7080k8536P4825K3654m9573
$$ 6969634 6714936 6783675 6838478 6875916 6819255 6934670 6961750 6933214 7008039 7031693 6982120
5048F982120K78535l78804n7286K54204k01579r6949j76953l08451J23409J3650
$$ 6982120 7260655 6881851 6824565 7078769 6877190 6780241 6603288 6294837 6418246 6431896
5038F431896k89312l70230O7106j5008j32449r6505N6958K05657k28030n2203
$$ 6431896 6142584 5772354 5839460 5824452 5692003 5595498 5652456 5858113 5630083 5577880
5028E577880l64268N8117L42953O5233J7544l27456M3291K38830K08940q2714
$$ 5577880 5213612 5271729 5614682 5679915 5697459 5370003 5413294 5652124 5861064 5778350
5018E778350l04032j4385L4606o1361J18355n2148r8852j33128J89394r2767k04699
$$ 5778350 5474318 5459933 5494539 5433178 5551533 5499385 5400533 5267405 5456799 5364032 5159333
5007E159333L72576L5877m45101J87987M31734q2583J40274J77665q7444l67132
$$ 5159333 5531909 5567786 5122685 5310672 5742406 5659823 5800097 5977762 5890318 5523186
4997E523186K0665j4448K22614k4511J1655p9515O831L74746j85392J90549J20540
$$ 5523186 5543851 5529403 5752017 5727506 5739161 5659646 5666477 6041223 5855831 6046380 6166920
4986F166920p5369J27561l59617N3811L0281m58234K04096P1438j48807m4471
$$ 6166920 6091551 6219112 5859495 5913306 5943587 5485353 5689449 5760887 5612080 5567609
4976E567609L27983M9549k4477j88828j79958J89779k9249Q8227n4845J07639
$$ 5567609 5895592 5945141 5920664 5731836 5551878 5741657 5712408 5800635 5745790 5853429
4966E853429J75347j31898j25232j86526K11679m0474J04854N2959j61708k10934
$$ 5853429 6028776 5896878 5771646 5585120 5796799 5756325 5861179 5914138 5752430 5541496
4956E541496k23113K21755K62114j41004R931k04049o4078J21687M238K7886m2872
$$ 5541496 5318383 5540138 5802252 5661248 5671179 5467130 5403052 5524739 5528977 5556863 5513991
4945E513991k40763q5810K6164J08769J23471j33872r2827j66279J85674j91416
$$ 5513991 5273228 5187418 5213582 5322351 5445822 5311950 5219123 5052844 5238518 5047102
4935E047102L09401l5580j41147j92569Q5578R7363k21060k33979o2603M3381
$$ 5047102 5356503 5320923 5179776 4987207 5072785 5170148 4949088 4715109 4652506 4695887
4925D695887J01516N11K32317j28653l06591J66685k80417Q2507N2746j27158
$$ 4695887 4797403 4797914 5030231 4901578 4594987 4761672 4481255 4563762 4616508 4489350
4915D489350L25562m8698k0279J34157k18213O6042r3635k56046r0620K36363
$$ 4489350 4814912 4766214 4745935 4880092 4661879 4727921 4634286 4378240 4287620 4523983
4905D523983o5454K32837k8946J71559l10979j90069J51359M09683k81147j47028
$$ 4523983 4458529 4691366 4662420 4833979 4523000 4332931 4484290 4893973 4612826 4465798
4895D465798K22223j24063k47405L4086l5108l13113K79321J39983k83030K01406
$$ 4465798 4688021 4563958 4316553 4350639 4315531 4002418 4281739 4421722 4138692 4340098
4885D340098P8080j03848J06705J81689J03183k24616o3435N0911Q4659j23312
$$ 4340098 4418178 4314330 4421035 4602724 4705907 4481291 4417856 4468767 4553426 4430114
4875D430114K78269L11503J24357j43232j49673R4997j39011l17926L4785J37316
$$ 4430114 4708383 5019886 5144243 5001011 4851338 4946335 4807324 4489398 4524183 4661499
4865D661499k10127j19131J45580j5559N1642l52589J65349K05213n0302o8557
$$ 4661499 4451372 4332241 4477821 4462262 4513904 4161315 4326664 4531877 4481575 4413018
4855D413018K06178k04450O2571p4886k83268n9487M47578J53031L7812J13756
$$ 4413018 4619196 4414746 4477317 4402431 4119163 4059676 4507254 4660285 4698097 4811853
4845D811853o5340j83036j42204p3968K41556J29841l31794M1198o436q2368J45186
$$ 4811853 4746513 4563477 4421273 4347305 4588861 4718702 4386908 4428106 4421670 4339302 4484488
4834D484488P9733J76821l57330J1549m0999r6176J53388k63954J88258K40813
$$ 4484488 4564221 4741042 4383712 4395261 4354262 4258086 4411474 4147520 4335778 4576591
4824D576591k16810L0237J06886j21182k2500l8787k73887j33237p4073O6707
$$ 4576591 4359781 4390018 4496904 4375722 4353222 4314435 4040548 3907311 3833238 3899945
4814C899945L37065J5764p6627J49121N1206J79J73334o6082p9676L65982o2079
$$ 3899945 4237010 4252774 4176147 4325268 4376474 4376653 4549987 4483905 4404229 4770211 4708132
4803D708132k74669M7112J05196j51355J18074M4423o0940J27939j75332J86624
$$ 4708132 4433463 4480575 4585771 4434416 4552490 4596913 4535973 4663912 4488580 4675204
4793D675204J4376Q8751J71882J08911j46240j6916J47366R1361j38539J70875
$$ 4675204 4689580 4778331 4950213 5059124 4912884 4895968 5043334 5134695 4996156 5167031
4783E167031J48127O2301j65097j61415j74404j19096m26281K66795j44707l81314
$$ 5167031 5315158 5377459 5212362 5050947 4876543 4757447 4331166 4597961 4453254 4071940
4773D071940L72168j65636J91102o5751j20023N3005n6360L7348j86849N8581
$$ 4071940 4444108 4278472 4469574 4403823 4283800 4336805 4280445 4317793 4130944 4189525
4763D189525l53627N6568J798K57682N711j44943j17393M7237J50216j14863R7190
$$ 4189525 3835898 3892466 3894264 4151946 4157657 4012714 3895321 3942558 4092774 3977911 4075101
4752D075101J52341k06255m17585k21131J70140M66434K09489j9260j12911l32478
$$ 4075101 4227442 4021187 3603602 3382471 3552611 4019045 4228534 4209274 4096363 3763885
4742C763885L1099K89928M3449j18924K98672k17351N2944P0835J97791J42010
$$ 3763885 3794984 4084912 4128361 4009437 4308109 4090758 4143702 4214537 4412328 4554338
4732D554338l04122J98011J24277k78000K05344k9048j81502j0735j4076K74308
$$ 4554338 4250216 4448227 4572504 4294504 4499848 4470800 4289298 4278563 4264487 4538795
4722D538795k34754k6799J13745k79825K99198J39616n44679J64037J34208J53649
$$ 4538795 4304041 4277242 4390987 4111162 4410360 4549976 4005297 4169334 4303542 4457191
4712D457191j33184q0077L06570k9560j12818Q6715Q745j43043j00137l3493k80534
$$ 4457191 4324007 4243930 4550500 4520940 4408122 4494837 4503582 4360539 4260402 4226909 3946375
4701C946375L9839K05604K35254l44147J33664R806j78431K05195J99368k44085
$$ 3946375 3986214 4191818 4427072 4082925 4216589 4226395 4047964 4253159 4452527 4208442
4691D208442J29578K7119Q5911J07626j90767k3101j12756J56408M7061m4926
$$ 4208442 4338020 4365139 4451050 4558676 4367909 4344808 4232052 4388460 4435521 4390595
4681D390595p6996J07022J49323L1009J15156j21086j5010n5570M19761k45679
$$ 4390595 4313599 4420621 4569944 4600953 4716109 4595023 4580013 4524443 4944204 4698525
4671D698525k10789l4313j0414L12525L76264m33900j39566J1939Q6841O9436
$$ 4698525 4487736 4453423 4443009 4755534 5131798 4697898 4558332 4570271 4657112 4726548
4661D726548k4926J66027k51595J47946k2215K1448K86661o7915J20168K16989
$$ 4726548 4701622 4867649 4616054 4764000 4741785 4763233 5049894 4981979 5102147 5319136
4651E319136j42045j45458j38361R2385n492n5088N6136K30474L27354j19492
$$ 5319136 5177091 5031633 4893272 4985657 4980165 4925077 4981213 5211687 5539041 5419549
4641E419549K3758k5314J38718l65312j11471K17531j47751N4715J63706J91096
$$ 5419549 5443307 5417993 5556711 5191399 5079928 5297459 5149708 5204423 5368129 5559225
4631E559225j59115L316P971o93N6848L2424J08359J38935j39357l18043M6116
$$ 5559225 5400110 5403426 5411397 5410704 5467552 5499976 5608335 5747270 5607913 5289870 5335986
4620E335986J87584k13068M0072J54325k8200J05242J2010R8190L01934j31874
$$ 5335986 5523570 5310502 5350574 5504899 5476699 5581941 5593951 5692141 5994075 5862201
4610E862201J07504L7122j30026j01434J5232J67359J97685j88202j75225R4699
$$ 5862201 5969705 6006827 5876801 5775367 5790599 5957958 6155643 5967441 5792216 5886915
4600E886915N9849L2283L70243j08609K18537J16061J7202l9946p1783k45223
$$ 5886915 5946764 5979047 6349290 6240681 6459218 6575279 6592481 6552535 6480752 6235529
4590F235529K7131J84609K64236K9065P3542J29847l4920p2138p4909K01856L62296
$$ 6235529 6262660 6447269 6711505 6740570 6814112 6943959 6909039 6836901 6761992 6963848 7326144
4579G326144m7537J01580J39438k55478k6463J94002J902J47533J03918n2849
$$ 7326144 7278607 7380187 7519625 7264147 7237684 7431686 7433588 7581121 7685039 7632190
4569G632190k12957p3624o9176R3508K71101p9307J73902K681p3725k98590J160
$$ 7632190 7419233 7345609 7276433 7369941 7641042 7561735 7735637 7738318 7664593 7366003 7367163
4558G367163K07744l3213j11866J93034L13153P068j57625j57031K26038k28887
$$ 7367163 7574907 7541694 7429828 7622862 7936015 7943083 7785458 7628427 7854465 7625578
4548G625578L11570k7448q7241n902o986M84033k3093L71745r9180Q82N2517R924
$$ 7625578 7937148 7909700 7822459 7816557 7809571 8293604 8270511 8642256 8543076 8543958 8596475 8606399
4536H606399Q1080j7797K35713L4206k17954K3754j249K21422K7080k15105j00710
$$ 8606399 8687479 8669682 8905395 8939601 8721647 8745401 8744152 8965574 8992654 8777549 8676839
4525H676839J97019J47492J11020R7153l5421J09655J3654K26717K80913J2445
$$ 8676839 8873858 9021350 9132370 9229523 9194102 9303757 9317411 9544128 9825041 9837486
4515I837486j28787J40514K71289M3172K45018j6964L16755J02550L17231J92652
$$ 9837486 9708699 9849213 10120502 10163674 10408692 10391728 10708483 10811033 11128264 11320916
4505A1320916K9413O9648K71876O09899K6942J73791M70282L91148J86443K10498
$$ 11320916 11350329 11419977 11691853 12301752 12328694 12502485 12972767 13363915 13550358 13760856
4495A3760856N22918M15818P43534Q05219N56164P78010P86493J246044J237629
$$ 13760856 14283774 14699592 15443126 16248345 16804509 17582519 18369012 19615056 20852685
4486B0852685J167080K330238K223887K761020K305884J863062J251358o86904
$$ 20852685 22019765 24350003 26573890 29334910 31640794 33503856 34755214 34068310
4478C4068310k215650k783193k776215k292309j643128j246106j119975p42420
$$ 34068310 31852660 29069467 26293252 24000943 22357815 21111709 19991734 19249314
4470A9249314m18716n67626l80336l57967o9710j35597j45540M6604L73427j53854
$$ 19249314 18830598 18262972 17882636 17524669 17454959 17319362 17173822 17220426 17593853 17439999
4460A7439999l33212J11439J21831L79181J01904M05293L29489L40621J45847
$$ 17439999 17106787 17218226 17340057 17719238 17821142 18226435 18555924 18896545 19042392
4451A9042392K93086N67834L74152M32486N00089M56821P10610Q20489R78075
$$ 19042392 19335478 19903312 20277464 20709950 21210039 21666860 22377470 23197959 24176034
4442B4176034J110215Q27357J437485J181016J286399J607328K063772K016156
$$ 24176034 25286249 26113606 27551091 28732107 30018506 31625834 33689606 35705762
4434C5705762K489350L171833L249521K733120J746405P5590r35556j988005k056519
$$ 35705762 38195112 41366945 44616466 47349586 49095991 49171581 48236025 46248020 44191501
4425D4191501j945192j450152r52234n90061k68124L38693L41318L41114M67336
$$ 44191501 42246309 40796157 39843923 39253862 38985738 39324431 39665749 40006863 40474199
4416D0474199O64190Q32011J228590J324869J354142J541913J668174K006078
$$ 40474199 41138389 41970400 43198990 44523859 45878001 47419914 49088088 51094166
4408E1094166K051555K290706J754213J436562J103059O57269O43031P91313M34303
$$ 51094166 53145721 55436427 57190640 58627202 59730261 60387530 61030561 61821874 62256177
4399F2256177N59120Q47369J170437R54570J170818J637541J619023J504949J452040
$$ 62256177 62815297 63662666 64833103 65787673 66958491 68596032 70215055 71720004 73172044
4390G3172044J439989J923356K065845J954104J649002J279025J311256P96858
$$ 73172044 74612033 76535389 78601234 80555338 82204340 83483365 84794621 85591479
4382H5591479N64256O34901L64487N19083N92576L36927O46076M5619m4036k43731
$$ 85591479 86155735 86790636 87155123 87674206 88266782 88603709 89249785 89295404 89251368 89007637
4372H9007637j028169r03116r82378q64168m61928k89565k32662Q59065J075595
$$ 89007637 87979468 87076352 86093974 85229806 84767878 84478313 84245651 85104716 86180311
4363H6180311J451086J722359J776741J986326K040105K221173J730365J730089
$$ 86180311 87631397 89353756 91130497 93116823 95156928 97378101 99108466 100838555
4355A00838555Q28548K81472n2909m32379o19609p59156r60871j099423r23051
$$ 100838555 101667103 101948575 101895666 101463287 100843678 100084522 99123651 98024228 97101177
4346I7101177m68601o07596n42160j85381P5049J11342L00525j41311l0579j06897
$$ 97101177 96632576 96024980 95482820 95297439 95372488 95483830 95784355 95643044 95612465 95505568
4336I5505568j99704q3286k16806l20678O503O9593J78765M43997K8118P16659
$$ 95505568 95305864 95222578 95005772 94685094 94691597 94761190 94939955 95383952 95412070 96128729
4326I6128729O93115Q56606Q26294O44862Q40065J083205O50507R98904Q13694
$$ 96128729 96821844 97678450 98504744 99149606 99989671 101072876 101723383 102722287 103535981
4317A03535981P55309Q66582M80197o3057q2406k39792r33747j260944j319993
$$ 103535981 104291290 105157872 105638069 105575012 105492606 105252814 104319067 103058123 101738130
4308A01738130j381094j687115j578194j021025j041043r58377n70034l24353
$$ 101738130 100357036 98669921 97091727 96070702 95029659 94071282 93501248 93176895
4300I3176895j98837M64820O06469Q18856N77028O41735N34119J94671p6580m05129
$$ 93176895 92978058 93442878 94049347 94868203 95445231 96086966 96621085 96815756 96739176 96334047
4290I6334047j447573j500796k086787k356484k007505k836860k609939j992951
$$ 96334047 94886474 93385678 91298891 88942407 86934902 84098042 81488103 79495152
4282G9495152j233995j845759j592013j426477j891063j485484j125076j027582
$$ 79495152 78261157 76415398 74823385 73396908 71505845 70020361 68895285 67867703
4274F7867703p99750j073373r71967q52423p69393q15625j327827r29651r17126
$$ 67867703 67067953 65994580 65022613 64170190 63400797 62585172 61257345 60327694 59410568
4265E9410568q57067r33792j071836o75997n84838o12976q32670o52457l70446
$$ 59410568 58553501 57619709 56547873 55871876 55287038 54674062 53841392 53188935 52818489
4256E2818489m00165k43654l90019q69789q32589k76145j19479q31086n88919
$$ 52818489 52418324 52174670 51784651 50914862 50082273 49806128 49686649 48855563 48266644
4247D8266644o85544o35584m49275j58935n45608n59194n31432l20578l08572
$$ 48266644 47581100 46945516 46496241 46337306 45791698 45232504 44701072 44380494 44071922
4238D4071922j99931l60223m68540k08096N9961j46170K18621K29300k9130J73991
$$ 44071922 43871991 43511768 43043228 42835132 42895093 42748923 42967544 43196844 43167714 43341705
4228D3341705j1066M97794R408J55656L62841L14899J83989J67572K9231K1571
$$ 43341705 43330639 43828433 43837841 43993497 44356338 44671237 44855226 45022798 45052029 45073600
4218D5073600k65183p340R6196K27642j05655j62929L30660L98667N46315K99374
$$ 45073600 44808417 44801077 44897273 45124915 45019260 44856331 45186991 45585658 46131973 46431347
4208D6431347L25124N84634P67580L91881Q21378J047883R93248J008002M69912
$$ 46431347 46756471 47341105 48108685 48500566 49321944 50369827 51363075 52371077 52840989
4199E2840989Q03501K12336N5348L29623k62225l08389k21261o53823p74989m54204
$$ 52840989 53644490 53856826 53912174 54241797 53979572 53671183 53449922 52796099 52021110 51566906
4189E1566906m28916k139n62543k74116l42852l3227J6673L18930K20640R2823
$$ 51566906 51137990 51135851 50573308 50299192 49956340 49923113 49939786 50258716 50479356 50572179
4179E0572179L52752K65522K49932N20059R22281R71156R75753R18633P13345
$$ 50572179 50924931 51190453 51440385 51960444 52882725 53853881 54829634 55748267 56461612
4170E6461612R31022R52378O18031Q94983P80296R51412M96158R71085J237004
$$ 56461612 57392634 58345012 58963043 59858026 60638322 61589734 62085892 63056977 64293981
4161F4293981P78769N14964O06677J028659R24137J186229J260935Q85719J182614
$$ 64293981 65072750 65587714 66194391 67223050 68147187 69333416 70594351 71480070 72662684
4152G2662684J493786J700940J609002K031167K189481K655304K845390L350954
$$ 72662684 74156470 75857410 77466412 79497579 81687060 84342364 87187754 90538708
4144I0538708L863209L917131M411308N309469N869293O795281P835789Q324424
$$ 90538708 94401917 98319048 102730356 108039825 113909118 120704399 128540188 136864612
4136A36864612P990497O302288M344819Q12418j287414j364981o72040P90336
$$ 136864612 144855109 151157397 155502216 156314634 155027220 153662239 152990199 153780535
4128A53780535K694832M511988O371608Q074660R235298R781777R847476Q584428
$$ 153780535 156475367 160987355 167358963 175433623 184668921 194450698 204298174 212882602
4120B12882602M971895l37797n727586j0530742j3355639j3721360j2733239j0990397
$$ 212882602 217854497 217516700 211789114 201258372 187902733 174181373 161448134 150457737
4112A50457737r698497p939807o585513n814881n045392m029664l672858k639330
$$ 150457737 140759240 132819433 126233920 120419039 115373647 111343983 107671125 105031795
4104A05031795k427785k300270k040519j732969j751622j650541j379445j115145
$$ 105031795 102604010 100303740 98263221 96530252 94778630 93128089 91748644 90633499
4096I0633499o28913p98137p13648n07681m75703j97060L00668m0743l07765P6077
$$ 90633499 90004586 89206449 88492801 87985120 87509417 87312357 87613025 87572282 87264517 87340594
4086H7340594M70648L29050p3266L01096L69399K252k59630J72463j30462m834
$$ 87340594 87811242 88140292 88067026 88368122 88737521 88739773 88480143 88652606 88522144 88517310
4076H8517310K56828J50698L81208K88244M31318P55635O82746J045033J004446
$$ 88517310 88774138 88924836 89306044 89594288 90025606 90781241 91463987 92509020 93513466
4067I3513466J142909J424064Q21784J473651J400809J517747J248831J750362
$$ 93513466 94656375 96080439 96902223 98375874 99776683 101294430 102543261 104293623
4059A04293623J795512K030225K107331K467234L078712L583858L962207M536206
$$ 104293623 106089135 108119360 110226691 112693925 115772637 119356495 123318702 127854908
4051A27854908N639191O282614O999659P658190Q219224Q967897R618856J1290839
$$ 127854908 133494099 139776713 146776372 154434562 162653786 171621683 181240539 192531378
4043A92531378J2666685J4281739J5988116J7087348J7120054J5446289J1036599
$$ 192531378 205198063 219479802 235467918 252555266 269675320 285121609 296158208
4036B96158208M919571k077621q661953j3856412j6680603j7562719j6331232
$$ 296158208 301077779 299000158 290338205 276481793 259801190 242238471 225907239
4029B25907239j3624006j0269404p631809m974855k505327r52599R81772J793012
$$ 225907239 212283233 202013829 194382020 189407165 186901838 185949239 186931011 188724023
4021A88724023L274078M982369O258722N997975O003628M460934J424044j296422
$$ 188724023 191998101 196980470 203239192 209237167 215240795 219701729 221125773 219829351
4013B19829351n124853q395310j0443085j2101976j2442377j1550964j0140611
$$ 219829351 214704498 206309188 195866103 183764127 171321750 159770786 149630175
4006A49630175r064307p520055p175665o289276n821353m898676m141853l855358
$$ 149630175 140565868 133045813 125870148 119580872 113759519 108860843 104718990 100863632
3998A00863632l904424l230680k787119k886199k072566j854452j822078j388416
$$ 100863632 96959208 93728528 90941409 88055210 85982644 84128192 82306114 80917698
3990H0917698j373719j181823j153450m81224K70522L1039K15896O74409K49070
$$ 80917698 79543979 78362156 77208706 76727482 76998004 77029043 77244939 77919348 78168418
3981G8168418N10029J62144p6808k56714j037131j395452j361606j556602j708642
$$ 78168418 78678447 78840591 78763783 78507069 77469938 76074486 74712880 73156278 71447636
3972G1447636j307173j555658j484467j299511j569400j199471j098995j040575
$$ 71447636 70140463 68584805 67100338 65800827 64231427 63031956 61932961 60892386
3964F0892386j084119o95069o82599q07543j25763m18729k20069o93392l62075
$$ 60892386 59808267 59113198 58430599 57623056 57497293 57078564 56858495 56165103 55803028
3955E5803028m09888l69455j118370o07958r22615q27838j012422j136132q32262
$$ 55803028 55393140 55023685 53905315 53297357 52374742 51546904 50534482 49398350 48566088
3946D8566088o00023m59713m68458j181457p48450r43027o48209j26014J20687
$$ 48566088 47966065 47506352 47037894 45856437 45107987 44164960 43516751 43390737 43511424
3937D3511424m09082n69213j04632M6838J10623L40345M35851J06777K61851P14450
$$ 43511424 43102342 42533129 42428497 42475335 42585958 42926303 43362154 43468931 43730782 44445232
3927D4445232N40459L17909K16522Q0319K30404J55089q1052N4410J54580J05038
$$ 44445232 44985691 45303600 45520122 45600441 45830845 45985934 45904882 45959292 46113872 46218910
3917D6218910O77k43338l11621p64504n23459j027647n21646m51844k54198m49454
$$ 46218910 46219587 45976249 45664628 44900124 44376665 43349018 42827372 42375528 42121330 41671876
3907D1671876j52807k27050k17998m17066K21980k52482J6107j48758k88927o18348
$$ 41671876 41519069 41292019 41074021 40656955 40878935 40626453 40642560 40493802 40204875 39586527
3897C9586527r1137o04647n21858k93881q19723m23667l18260k54729m20066k85873
$$ 39586527 39495390 38890743 38368885 38075004 37255281 36831614 36513354 36258625 35838559 35552686
3887C5552686o6551r2306m2606J89192K58889M93864J80900O30441J13059L50849
$$ 35552686 35486135 35393829 35351223 35540415 35799304 36293168 36474068 37104509 37217568 37568417
3877C7568417O09453N51121N49292K78484P02483L82348M40933N76137P71673
$$ 37568417 38177870 38728991 39278283 39556767 40259250 40641598 41082531 41658668 42430341
3868D2430341Q50734N87479M67891P15285O97498J003432J495318J384733J460904
$$ 42430341 43281075 43868554 44336445 45051730 45749228 46752660 48247978 49632711 51093615
3859E1093615J632478K104660K529764K716934K965861L706643L934674M326157
$$ 51093615 52726093 54830753 57360517 60077451 63043312 66749955 70684629 75010786
3851G5010786M991479N414725N784449O142641O920086P395838P830211P494345
$$ 75010786 80002265 85416990 91201439 97344080 104264166 111660004 119490215 126984560
3843A26984560O349798M773578J563220j696102m795018o696875p601843p805050
$$ 126984560 133334358 138107936 139671156 137975054 133180036 126483161 118881318 111076268
3835A11076268p671958o652212o184800n209143m441920l988280l634057l072196
$$ 111076268 103404310 96752098 90567298 85358155 80916235 76927955 73293898 70221702
3827G0221702l051068k909828k126667j965481j647717j658887j260832j050650
$$ 70221702 67170634 64260806 62134139 60168658 58520941 56862054 55601222 54550572
3819E4550572j152967q01826q21680p27202m66493n57281J28849q6041o54767
$$ 54550572 53397605 52595779 51774099 51046897 50580404 50023123 50151972 50065931 49411164
3810D9411164m61079L04525O1217J24439J03808J80424J74883J06156O47797R0801
$$ 49411164 48950085 49254610 49315827 49440266 49544074 49724498 49899381 50005537 50653334 50744135
3800E0744135m1922K97426K82857K27523P72526O87660M13701P10900P99793L00560
$$ 50744135 50702213 50999639 51282496 51510019 52282545 52970205 53383906 54094806 54894599 55195159
3790E5195159P32155R99685J083602J138107R92232P82086J106785J228073J195227
$$ 55195159 55927314 56926999 58010601 59148708 60140940 60923026 62029811 63257884 64453111
3781F4453111J486942J291060J423035J234076J163418J298787J632532J403746
$$ 64453111 65940053 67231113 68654148 69888224 71051642 72350429 73982961 75386707
3773G5386707J382996J756107J301550J698277J432441J174657J284446J495061
$$ 75386707 76769703 78525810 79827360 81525637 82958078 84132735 85417181 86912242
3765H6912242J526902J508466J235254J295899J202879J038033J171936P73719
$$ 86912242 88439144 89947610 91182864 92478763 93681642 94719675 95891611 96665330
3757I6665330O99437O89385Q58852j65354j41499N36846J04840j36332J26674
$$ 96665330 97364767 98054152 98913004 98747650 98606151 99142997 99247837 99111505 99238179
3748I9238179n17946o92643l71036r66709j233280r42902o95051j364408j895352
$$ 99238179 98720233 98027590 97656554 96689845 95456565 94513663 93818612 92454204 90558852
3739I0558852j221382j475782j972557j704228k074332j897530k026757k199921
$$ 90558852 89337470 87861688 85889131 84184903 82110571 80213041 78186284 75986363
3731G5986363j884134k094162k408669k063146k219924k350644j809495k148292
$$ 75986363 74102229 72008067 69599398 67536252 65316328 62965684 61156189 59007897
3723E9007897j880737k151832j824610j666574j798437j983784j818843j334244
$$ 59007897 57127160 54975328 53150718 51484144 49685707 47701923 45883080 44548836
3715D4548836j676458j486016j148021j403494j228939r47139j266817p79323
$$ 44548836 42872378 41386362 40238341 38834847 37605908 36658769 35391952 34612629
3707C4612629j050504j006410m90367q45030q35514r76107q85255j032287p08636
$$ 34612629 33562125 32555715 32065348 31220318 30384804 29408697 28523442 27491155 26782519
3698B6782519m96543m18341m88670m56320k73403l22132J1641m35710k52325m74768
$$ 26782519 26285976 25867635 25378965 24922645 24649242 24327110 24338751 23903041 23650716 23175948
3688B3175948m39838l38531k87589j97198j03164k53155k29558k06072k19683
$$ 23175948 22736110 22397579 22109990 21912792 21809628 21556473 21326915 21120843 20901160
3679B0901160J53991m69279k16347R9672Q2983l88316j03040K05508p7591l57717
$$ 20901160 21055151 20585872 20369525 20469197 20552180 20163864 20060824 20266332 20188741 19831024
3669A9831024Q1963K21535L30465j52777m09998J57281O8882L29901Q8281N7508
$$ 19831024 19912987 20134522 20464987 20312210 19902212 20059493 20128375 20458276 20546557 20604065
3659B0604065J71876K06953K75193j14309M0685L75634J93427L33292L41697N33866
$$ 20604065 20775941 20982894 21258087 21143778 21184463 21560097 21753524 22086816 22428513 22962379
3649B2962379K56891N78J12200j67291J08571k2264q1804k31901l84361j24629
$$ 22962379 23219270 23219848 23332048 23164757 23273328 23251064 23169260 22937359 22552998 22428369
3639B2428369o4496l21211q1606j9187j25703L42152l9880J0118L18497n1182
$$ 22428369 22363873 22042662 21961056 21941869 21816166 22158318 22118438 22128556 22447053 22395871
3629B2395871J88817L53056L38259J26695L90686M53122M56865L50637M69865
$$ 22395871 22584688 22937744 23276003 23402698 23793384 24246506 24703371 25054008 25523873
3620B5523873M49207J25311j50472m67892j53262l71256m24949l84279k65058
$$ 25523873 25973080 26098391 25947919 25480027 25326765 24955509 24530560 24146281 23881223
3611B3881223k46625j05462k83081j61814m49821j91376n4921k48145R7687m9464
$$ 23881223 23634598 23529136 23246055 23084241 22634420 22443044 22388123 22139978 22237665 22188201
3601B2188201k69385j42615L1458m2537k38989k47338o7316M40816l71538N4710
$$ 22188201 21918816 21776201 21807659 21765122 21526133 21278795 21211479 21652295 21280757 21335467
3591B1335467N577j48434r0319l2092n4875j36449j83328n6339j99609l81589
$$ 21335467 21341044 21192610 21102291 21070199 21015324 20878875 20695547 20639208 20439599 20058010
3581B0058010N5737o827N9728l73454l56560K01538q918j16477q2546J94294m77943
$$ 20058010 20113747 20106920 20166648 19793194 19436634 19638172 19629254 19512777 19430231 19624525 19146582
3570A9146582l99518N921m9598K12848l60410J64889j7624p9403j08618k7037
$$ 19146582 18747064 18752985 18703387 18916235 18555825 18720714 18703090 18623687 18515069 18488032
3560A8488032J00157N2162J16288J20046L786m3552k3493N45550L24110J53125
$$ 18488032 18588189 18640351 18756639 18876685 18880471 18836919 18813426 19358976 19683086 19836211
3550A9836211O4372J55317N05938L28363P7824L89298L71576L28732K39925K68783
$$ 19836211 19900583 20055900 20561838 20890201 20968025 21357323 21728899 22057631 22297556 22566339
3540B2566339M16430M72090N11954L87459N07586N20055M88822M40627M40344
$$ 22566339 22982769 23454859 23966813 24354272 24861858 25381913 25870735 26311362 26751706
3531B6751706N70730P62795M83787K94379N48026O47597N92685O22575P29609
$$ 26751706 27322436 28085231 28569018 28863397 29411423 30059020 30651705 31274280 32003889
3522C2003889O65871O58048M21389O63695N27519P02602O53714Q02289Q66764
$$ 32003889 32669760 33327808 33749197 34412892 34940411 35643013 36296727 37099016 37965780
3513C7965780L57675M75198J048494P61895N77489R55124N47640N51163J112763
$$ 37965780 38323455 38798653 39847147 40609042 41186531 42141655 42689295 43240458 44353221
3504D4353221O53688O88677R44477Q85760M72318R77378P46251P01786P91643
$$ 44353221 45006909 45695586 46640063 47525823 47998141 48975519 49721770 50423556 51215199
3495E1215199O96367Q60707O05450P95209Q51503R52402J42852N30165R26760
$$ 51215199 51911566 52772273 53377723 54172932 55024435 55976837 56119689 56649854 57576614
3486E7576614O44382P03793R46095M66719R28128Q70735J009421R02055O84348
$$ 57576614 58220996 58924789 59870884 60337603 61265731 62136466 63145887 64047942 64732290
3477F4732290P87633J409213J152907Q18660J333175J609034J331398J882820
$$ 64732290 65519923 66929136 68082043 68900703 70233878 71842912 73174310 75057130
3469G5057130J820647J605616J782269K414944K491497K324103K956296K896387
$$ 75057130 76877777 78483393 80265662 82680606 85172103 87496206 90452502 93348889
3461I3348889K876717L044251L433259L273064L559650M351743L863252M251022
$$ 93348889 96225606 99269857 102703116 105976180 109535830 113887573 117750825 122001847
3453A22001847M389717M784183M795706M796425M798401M931208M838506N266190
$$ 122001847 126391564 131175747 135971453 140767878 145566279 150497487 155335993 160602183
3445A60602183N442661N249699N153882M989026N259890M945974M924464M437811
$$ 160602183 166044844 171294543 176448425 181437451 186697341 191643315 196567779 201005590
3437B01005590M074525L551934L309087L195695K781963K329602J731210J072208
$$ 201005590 205080115 208632049 211941136 215136831 217918794 220248396 221979606 223051814
3429B23051814P74961L30212J53731m68972m87265j069258j278882j491133j585641
$$ 223051814 223826775 224156987 224310718 223841746 223354481 222285223 221006341 219515208 217929567
3420B17929567j901010j573025k018728k009257k042362j647733j431765j507028
$$ 217929567 216028557 214455532 212436804 210427547 208385185 206737452 205305687 203798659
3412B03798659j606272j379405j255327j716654j166214j282244r72035j193851
$$ 203798659 202192387 200812982 199557655 197841001 196674787 195392543 194420508 193226657
3404A93226657j348302j188221j060594j109521j288639j509336j700418j682852
$$ 193226657 191878355 190690134 189629540 188520019 187231380 185722044 184021626 182338774
3396A82338774j472217j685658k157622k003560k229962j876831k356599k435414
$$ 182338774 180866557 179180899 177023277 175019717 172789755 170912924 168556325 166120911
3388A66120911k349906k159819k008185k103749j914121j656571j771331k224349
$$ 166120911 163771005 161611186 159603001 157499252 155585131 153928560 152157229 149932880
3380A49932880j892292j342111j093448j179050j150558j540513j408552q95031
$$ 149932880 148040588 146698477 145605029 144425979 143275421 141734908 140326356 139431325
3372A39431325j206589j322226r27599j161319o86056j247683j611138j315655
$$ 139431325 138224736 136902510 135974911 134813592 134127536 132879853 131268715 129953060
3364A29953060j410155j272966j695717j805531j644519k232271k095970k338164
$$ 129953060 128542905 127269939 125574222 123768691 122124172 119891901 117795931 115457767
3356A15457767k921840k422053k532079k558369k625285k452687k640728k476008
$$ 115457767 112535927 110113874 107581795 105023426 102398141 99945454 97304726 94828718
3348I4828718k479288k824680k645423k494617k752950k693264k429742k346265
$$ 94828718 92349430 89524750 86879327 84384710 81631760 78938496 76508754 74162489
3340G4162489k061680k055139k084318j572117j802896k050773j431106j150672
$$ 74162489 72100809 70045670 67961352 66389235 64586339 62535566 61104460 59953788
3332E9953788j125090j311377j002003j039059j018013q54861p92987m73130n96021
$$ 59953788 58828698 57517321 56515318 55476259 54458246 53603385 52810398 52337268 51741247
3323E1741247q89272m83926m00025o35581p00643o60907o57590o58585m85080
$$ 51741247 50851975 50368049 49968024 49332443 48631800 47970893 47313303 46654718 46169638
3314D6169638m82417p29124o76903q48536p37105j161337p29663o95828j040572
$$ 46169638 45687221 44958097 44281194 43432658 42695553 41534216 40804553 40108725 39068153
3305C9068153q71318r48403r09566r16236r54538q95466q27087r91737q04271
$$ 39068153 38196835 37248432 36338866 35422630 34468092 33572626 32745539 31753802 30949531
3296C0949531j161807q93895q84200r60829p69286o93292o03833j133001n38153
$$ 30949531 29787724 28893829 28009629 27048800 26279514 25586222 24982389 23849388 23311235
3287B3311235p25151p20882n78892q6061q09314p67707n43617m95125m04611l54709
$$ 23311235 22586084 21865202 21286310 21200249 20390935 19623228 19079611 18584486 18179875 17825166
3277A7825166l71574j93961m97276q61517n16662k80545k17898m41224k26667
$$ 17825166 17453592 17259631 16762355 15900838 15384176 15103631 14885733 14444509 14217842
3268A4217842l93169l40492l50816k75203k6044O8177k73071m11793j34924m93075
$$ 14217842 13824673 13484181 13133365 12858162 12832118 12900295 12627224 12215431 12080507 11587432
3258A1587432l26679K3556m1972m09104k0147q8919l93353j07103m12381l69019
$$ 11587432 11260753 11284309 11242337 10833233 10813086 10724167 10330814 10223711 9811330 9442311
3248I442311j01425K42001J53362l00664k71915J10178K1788l7940l62976k10334
$$ 9442311 9340886 9582887 9736249 9435585 9163670 9273848 9295636 9257696 8894720 8684386
3238H684386N0471j73331l06776p1791K06854J75565k20154l75260k22679k43189
$$ 8684386 8734857 8561526 8254750 8182959 8389813 8565378 8345224 7969964 7747285 7504096
3228G504096j69730j08921q1629O7197k04559M8587k77826J34401j54511J84367
$$ 7504096 7334366 7225445 7143816 7211013 7006454 7055041 6777215 6911616 6757105 6941472
3218F941472J12162k1871o9473m1380K5433K1030o02826j47091m361j453r9854
$$ 6941472 7053634 7031763 6962290 6920910 6946343 6967373 6364547 6217456 6213095 6211642 6111788
3207F111788J01892q8015M65717k06242o38413p54N3803o5289n4299J5981J56733
$$ 6111788 6213680 6125665 6591382 6385140 5746727 5745973 5799776 5734487 5680188 5696169 5852902
3196E852902k5229l63818p4616K11615K85316k33962K25861J0647j94333k26651
$$ 5852902 5827673 5463855 5389239 5600854 5886170 5652208 5878069 5888716 5694383 5467732
3186E467732J4151J50340r8109M1347j37322l4557J1286Q8641J30728P855M8809
$$ 5467732 5481883 5632223 5534114 5575461 5438139 5403582 5414868 5503509 5634237 5642092 5690901
3175E690901N1743N7359J0857j53409j79817N7300j87329K98418j09678L69369
$$ 5690901 5742644 5800003 5810860 5657451 5477634 5534934 5347605 5646023 5536345 5905714
3165E905714K20649j92586j40592R7395j08712o1707K14796m7340k61190O4872
$$ 5905714 6126363 5933777 5793185 5890580 5781868 5720161 5934957 5887617 5626427 5691299
3155E691299J29562j74812j46965L52233q302J23995l55138J17745J15778k86174
$$ 5691299 5820861 5646049 5499084 5851317 5843015 5967010 5611872 5729617 5845395 5559221
3145E559221k19481o1381J19259Q0883r1680j58769R1786j31518K23024J22821
$$ 5559221 5339740 5278359 5397618 5478501 5386821 5228052 5319838 5188320 5411344 5534165
3135E534165k83795M4470R0292o5408k3232K31078m5695K6097n1377O9834K16398
$$ 5534165 5250370 5294840 5385132 5319724 5296492 5527570 5481875 5507972 5456595 5526429 5742827
3124E742827K0186K93615k94400q8552N8550K15340J41993J15099j10123k4768
$$ 5742827 5763013 6056628 5762228 5673676 5732226 5947566 6089559 6204658 6094535 6069767
3114F069767J68619j5946q3372J79297P2558L51734L04377l23376k03278r3934
$$ 6069767 6238386 6222440 6139068 6318365 6390923 6742657 7047034 6723658 6520380 6426446
3104F426446K9140l81495R8317n5201m22117n82983k38881K48671m7391l07140
$$ 6426446 6455586 6074091 6172408 6117207 5695090 5112107 4873226 5121897 5074506 4767366
3094D767366k92125J53682j40719k05598j52768P424j77203L3790O4M1661k29229
$$ 4767366 4475241 4628923 4488204 4282606 4129838 4137262 3960059 3993849 3993913 4035574 3806345
3083C806345l20700Q3877L1576M5360K08626j58563l44516p9109L7840r3207N9957
$$ 3806345 3485645 3569522 3601098 3646458 3855084 3696521 3352005 3272896 3310736 3217529 3277486
3072C277486q8264n4552N6364o6297L09978j46626M1005m20113J54271j5983k90747
$$ 3277486 3189222 3134670 3191034 3124737 3434715 3288089 3329094 2908981 3063252 3047269 2756522
3061B756522M0826q6145l09771K05102O6873j32494n7621J46474K91527r1775
$$ 2756522 2797348 2711203 2401432 2606534 2673407 2540913 2483292 2629766 2921293 2829518
3051B829518j81564k35777j38229N1290K6141j80367j0871K75702J44233m11440
$$ 2829518 2647954 2412177 2273948 2325238 2351379 2171012 2160141 2435843 2580076 2168636
3041B168636J96289Q5959j26218j5664m1897j84544q2361m0488l0382O4677j06971
$$ 2168636 2364925 2450884 2324666 2309002 2267105 2082561 2000200 1959712 1929330 1994007 1887036
3030A887036M0481j11790K35216r2853k32382M1322L7394j63260J18728O2732
$$ 1887036 1927517 1815727 2050943 1958090 1725708 1767030 1804424 1641164 1759892 1822624
3020A822624n30958J00041K03607l14070j02733J97680J61809Q7313O039J50201
$$ 1822624 1291666 1391707 1595314 1281244 1178511 1376191 1538000 1625313 1631352 1781553
3010A781553j63394k73000p0286L72824n9502J56385m21547k9627J438L49890
$$ 1781553 1618159 1345159 1274873 1647697 1588195 1744580 1323033 1293406 1294844 1644734
3000A644734j96434J54678p099p5960j39770K31115J42329n098k82423k53900
$$ 1644734 1448300 1602978 1595879 1519919 1380149 1611264 1753593 1748495 1466072 1212172
2990A212172L40940k19834m8505k1186J68393j9633p8988l5861J86837l7312J28959
$$ 1212172 1553112 1333278 1284773 1263587 1431980 1412347 1333359 1297498 1484335 1447023 1575982
2979A575982R2571N8859k21987K9841K7540r0746K03219m13601n2506j61372L6547
$$ 1575982 1668553 1727412 1505425 1535266 1562806 1472060 1675279 1261678 1209172 1047800 1084347
2968A084347K97135j27163Q0633J05077k69202m5624p0855j31514K44135k06457
$$ 1084347 1381482 1254319 1334952 1440029 1170827 1125203 1054348 922834 1166969 960512
2958I60512O3589J37420L5316l17361P5742k53918J08047L86398r0931j85516
$$ 960512 1024101 1161521 1196837 879476 955218 701300 809347 1195745 1104814 919298
2948I19298j02107J63601j7433j4931l0111l9045J49428o6813n4847k31703K4912
$$ 919298 817191 980792 963359 948428 918317 879272 1028700 961887 907040 675337 700249
2937G00249q8426J67598Q4379k53830M3766P3495K8978q9090r8412R8065K03858
$$ 700249 611823 779421 863800 609970 653736 727231 756209 667119 568707 666772 870630
2926H70630M1607J18250J26134m08431j06919p5150K54926R8320k12385J06623
$$ 870630 912237 1030487 1156621 748190 641271 566121 821047 919367 706982 813605
2916H13605N9514l26612N2287K93949J31039p8818J1850j40912k53683Q7562K3244
$$ 813605 873119 546507 598794 892743 1023782 944964 956814 815902 562219 649781 673025
2905F73025l9277K03096k540J72130M6164j10013k78341p647K95062N8059K74963
$$ 673025 633748 836844 834304 1006434 1052598 942585 664244 656597 951659 1009718 1284681
2894A284681k74616r0711j2752J4985r2508L8416J43029j5364k41008r5049R5215
$$ 1284681 1010065 919354 906602 921587 829079 867495 1010524 995160 754152 659103 754318
2883G54318J58791K65649j45676N2154J11373j50852j55154M4491L8109r5609
$$ 754318 913109 1178758 1033082 1085236 1196609 1045757 890603 935094 973203 877594
2873H77594N0359J71570N7366k23897q3229M16492m110J07197J19308l28719j05571
$$ 877594 927953 1099523 1156889 932992 849763 1266255 1262145 1369342 1488650 1159931 1054360
2862A054360M7538J85983q3951M8519L4799L8491J01943l29466J54814N2347l59341
$$ 1054360 1101898 1287881 1203930 1252449 1287248 1325739 1427682 1098216 1253030 1305377 946036
2851I46036L53467r5455k39372N1817N1896l67633K39666K09191j1993K6163q9190
$$ 946036 1299503 1204048 964676 1016493 1068389 700756 940422 1149613 1137620 1163783 1074593
2840A074593p6731Q2945K5016q1719J99844J9421m3750j96052K28698J75581K50395
$$ 1074593 997862 1080807 1105823 1024104 1223948 1243369 1199619 1003567 1232265 1407846 1658241
2829A658241K5526k60922k89100J01370J07762r741J08302k78855J54156j3054
$$ 1658241 1683767 1422845 1133745 1235115 1342877 1333136 1441438 1162583 1316739 1303685
2819A303685o6527L68614q4893n17011L19874L17720k56725l71145N2276O2055
$$ 1303685 1237158 1605772 1520879 1003868 1323742 1641462 1384737 1013592 1065868 1127923
2809A127923J229J79845j77932J52218N7201j60241L81760K00334m61737j53770
$$ 1127923 1129152 1308997 1131065 1283283 1340484 1180243 1562003 1762337 1300600 1146830
2799A146830K9567K57699k77167q9191J72594j31818Q3484J53556L71684m61954
$$ 1146830 1176397 1434096 1156929 1067738 1240332 1108514 1191998 1345554 1717238 1255284
2789A255284k06827P0699n5586K93906J48770j80825K01599L3267J71040K6423
$$ 1255284 1048457 1119156 1063570 1357476 1506246 1325421 1527020 1560287 1731327 1757750
2779A757750J07635l47710N7383L99134K30770k77712j27834n099J10057K89405
$$ 1757750 1865385 1517675 1575058 1974192 2204962 1927250 1799416 1794317 1904374 2193779
2769B193779k1202m05900L66732J79387j73412j27234p2587M3139j98743J98233
$$ 2193779 2172577 1766677 2133409 2312796 2139384 2012150 1939563 1982702 1783959 1982192
2759A982192l056J83135m86483J95565k50003q3740J97368l54299k27913k6931
$$ 1982192 1979136 2162271 1675788 1871353 1621350 1537610 1734978 1380679 1152766 1125835
2749A125835j13362K0540J89375j5271j81643M9159J60690J02589k78048k33813
$$ 1125835 1012473 1033013 1222388 1207117 1025474 1074633 1235323 1337912 1059864 826051
2739H26051M2677L25005n2201o3605j97753j61313M14527j59418M4270j22531
$$ 826051 868728 1193733 1141532 1077927 880174 718861 1133388 973970 1018240 895709
2729H95709o8972K07080l89893N1766m4746j12049j4637K4759K3155N3542l1635
$$ 895709 826737 1033817 643924 695690 650944 538895 524258 549017 572172 625714 594079
2718E94079n3402q0505j53646L42790n3082N4731k35691m5399r4301j28716K49403
$$ 594079 540677 460172 306526 649316 596234 650965 415274 369875 275574 146858 396261
2707C96261r4j58350k3530J17364n7427J65230J63085o4307r3029m6186R542j51259
$$ 396261 396167 237817 214287 331651 274224 439454 602539 538232 445203 399017 408559 257300
2695B57300j6368K19385k93537L69927J691K2398q1557P7639j26532k897j24670
$$ 257300 240932 460317 166780 536707 538398 560796 479239 556878 430346 427449 302779
2684C02779M1585O676J767K32946k54189p447k5388q2980L7950j54217K24378
$$ 302779 344364 351040 352807 585753 331564 324117 298729 215749 253699 99482 323860
2673C23860K8152k05406J58766k65070J242L7338k24980L75206J54929k36947
$$ 323860 352012 146606 305372 40302 41544 78882 -146098 229108 384037 147090
2663A47090J30386J30807J2176k83751j2049j97818K19537Q7428q9492n1251K62024
$$ 147090 277476 408283 420459 136708 124659 -73159 146378 233806 144314 93063 355087
2652C55087J27760j28354j20656q7230l8629j67095N30010q3490k63484j48853
$$ 355087 482847 354493 233837 146607 107978 -59117 470893 387403 123919 -24934
2642b4934Q8383J60479k41526j68656M00477K9916j26980N5333k61235J65681
$$ -24934 63449 223928 -17598 -186254 214223 244139 117159 172492 -88743 76938
2632G6938j65175K07031Q6582k07949l50591Q0789j29460L0281L10030K44534
$$ 76938 -88237 118794 205376 -2573 -353164 -272375 -401835 -371554 -61524 183010
2622A83010j86544J20206J96393k60514k49023J05493K56410N2539M0356j72662
$$ 183010 -3534 116672 313065 52551 -196472 -90979 165431 217970 258326 85664
2612H5664M8053K2464k96398J97579J08940j77506J8531l6113J3475M2529k8696
$$ 85664 133717 156181 -140217 57362 166302 -11204 7327 -28786 -15311 27218 -1478
2601a478J08198j91591R068K08167k01353j16207Q6376Q8848l0126R9747J59209
$$ -1478 106720 -84871 -75803 132364 -68989 -185196 -98820 -9972 -40098 59649 218858
2590B18858j6313l878q1131J23052o8062K58405j71267M9215m7913k42636N6226
$$ 218858 202545 198667 117536 240588 172526 430931 259664 308879 260966 18330 74556
2579G4556j42878L13472l0709m0984l77117Q8293J29295N23105k13183j48932
$$ 74556 -68322 245150 214441 173457 -203660 -115367 13928 537033 323850 174918
2569A74918J20073p2297P2122N7650R7558k94062M5870k44981j09502L15940J17348
$$ 174918 294991 222694 294816 352466 450024 155962 201832 -43149 -152651 163289 280637
2558B80637N4946k42794k9965J11715q1760l4208M386J49989J37716K41759j64830
$$ 280637 335583 92789 62824 174539 92779 58571 62957 212946 350662 592421 427591
2547D27591k62626L1350P3704J5483m23906K20519M56675K911j09946n3468j11670
$$ 427591 164965 196315 270019 285502 -138404 82115 538790 541701 431755 378287 266617
2536B66617J45855j06653j05615n7221J58748K2052R5275K37995j31758j50644
$$ 266617 412472 305819 200204 142983 301731 323783 419058 657053 525295 374651
2526C74651q9067l2168l2889J51999l00021m8466j55449L09790J85337q1962K31578
$$ 374651 285584 253416 220527 372526 72505 24039 -131410 178380 363717 281755 513333
2515E13333j54450k8377r572J3867J96009k21240q7666J37406Q6294p3985K660
$$ 513333 358883 330506 320934 334801 530810 309570 221904 359310 445604 371619 374279
2504C74279l24313K80851J2721J46902k6371k40457k00158P690J23608m6514J24867
$$ 374279 49966 330817 343538 490440 464069 223612 23454 31144 154752 108238 233105
2493B33105q7971q8022J12886o8438k5695L91427R1958L64662m23916k23361J06609
$$ 233105 145134 57112 169998 101560 75865 467292 559250 923912 499996 276635 383244
2482C83244m6057N5952j40221m34685J53402j04995J54172n0470q1489J49111
$$ 383244 337187 393139 252918 -181767 -28365 -133360 20812 -29658 -111147 37964
2472C7964J41085l8383J02372P786j08426O6461J01023j69628R3202K09477j25366
$$ 37964 179049 140666 243038 250824 142398 208859 309882 140254 233456 442933 317567
2461C17567K4267p7199N5968l17425j42374o0478J21460K3872l5091k3629J43677
$$ 317567 341834 264635 320603 3178 -139196 -199674 -78214 -54342 -89433 -113062 30615
2450C0615J28683p4523J08013k30678J67193P4862k38619J23635J00051l88108
$$ 30615 159298 84775 192788 -37890 129303 204165 -34454 89181 189232 -198876
2440a98876J19445M7365k6534n2113J44219J2681o3551J19185k16979k50280M51695
$$ -198876 -79431 -32066 -58600 -110713 33506 46187 -17364 101821 -115158 -365438 86257
2429H6257P2623l11348K25373J72052k0434k41766J09911J30470Q6759l38456
$$ 86257 158880 -152468 72905 244957 224523 -17243 92668 223138 309897 -28559
2419b8559j4502K44866n9552N6536J03467M306l37776q9490j19442L2368k06987
$$ -28559 -43061 201805 142253 198789 302256 306562 -31214 -120704 -240146 -207778 -414765
2408d14765k6836M31166n4816o9447J35252k34261n5776L42335J74386L5969j26758
$$ -414765 -441601 -10435 -65251 -134698 554 -233707 -289483 52852 227238 263207 136449
2397A36449l3754j89693J80806k99030M8764K17543L25319k914j65189k60335
$$ 136449 102695 -86998 93808 -205222 -156458 61085 386404 383490 218301 -42034
2387d2034k71712k0361K27201J9170Q6062J47771Q6575k73080L91567j11595l97603
$$ -42034 -313746 -334107 -106906 -87736 -1674 146097 232672 -40408 351159 239564 -158039
2376a58039k28885M07396J27883Q969k8932o3169J96373m7142j86468k84979j1125
$$ -158039 -386924 20472 148355 157324 128392 65223 261596 214454 27986 -256993 -268118
2365b68118K39962j702K716l11253Q6307K13888K20005l3111P6550K92314k17941
$$ -268118 -28156 -29858 -27142 -338395 -252088 -38200 181805 148694 225244 517558 299617
2354B99617q7409j60441k2888J3749K38002p1596J8689j48664J88392k05544j42296
$$ 299617 212208 51767 28879 42628 280630 209034 227723 79059 267451 61907 -80389
2343h0389K5195M8954j0273J11301n4644l72838J89308K50739k37629L99754j5140
$$ -80389 -55194 -6240 -16513 94788 40144 -332694 -143386 107353 -130276 269478 254338
2332B54338m0180j76289m6440L28980N2469j13740J65779N0186J4386P722K34244
$$ 254338 214158 37869 -8571 320409 372878 259138 424917 475103 489489 497211 731455
2321G31455k53982J8335L5072R5274k33397l02890J65054Q0191m6097r5086q7062
$$ 731455 477473 495808 530880 626154 392757 89867 254921 335112 289015 193929 106867
2310A06867r0481K17509L96336P5593o45240J65716M8416l66032J59463p2664
$$ 106867 16386 233895 630231 705824 60584 226300 274716 -91316 68147 -4517
2300d517p5440R9680J88498P5250J1377j38451j69219P5101J06256j51361k60848
$$ -4517 -79957 19723 208221 283471 294848 156397 -12822 62279 168535 17174 -243674
2289b43674K19808N0713K6819k06773k90585L51797L88764j59037n540J09575
$$ -243674 -23866 26847 53666 -153107 -443692 -91895 296869 137832 132292 241867
2279B41867j89927j63019M7536M76343j34228O1789k97950r7305K98177p952J41455
$$ 241867 51940 -111079 -63543 412800 278572 340361 42411 -54894 243283 235331 376786
2268C76786m89450L2784J36076L69369j73816k72474J36557J20398K95997k32795
$$ 376786 -112664 -79880 56196 425565 251749 -20725 115832 236230 532227 299432
2258B99432j24966K18187J85328j30519l46241J73818N4553R898R2796k65155
$$ 299432 174466 392653 577981 447462 101221 275039 329592 339490 432286 167131
2248A67131j00528j86573l6919K9249M8714k07205M82383J26191k04595K50490
$$ 167131 66603 -119970 -156889 -127640 -78926 -286131 196252 322443 117848 368338
2238C68338m05840L0203K40746K27207j74156r1407l00184L16322R3829Q4479
$$ 368338 -37502 -7299 233447 460654 286498 195091 -105093 211229 305058 389537
2228C89537K32677j62590R0921p1952k6400j01717j81793j0115R957J0483J39564
$$ 389537 622214 459624 550545 478593 452193 350476 168683 158568 168525 179008 318572
2217C18572L0617J07069j50987r2688J83704k52500j68536J50006J79414n6429
$$ 318572 349189 456258 305271 212583 396287 143787 -24749 125257 304671 248242
2207B48242L05339j85759P6003J54427P394j72192q9629M20627Q8017R0812J45544
$$ 248242 553581 367822 443825 598252 605646 433454 343825 764452 852469 943281 1088825
2196A088825j79601k23849J3179J12591K50638m15857j43117q5791J7347L11883
$$ 1088825 909224 685375 698554 811145 1061783 645926 502809 417018 434365 746248
2186G46248K418j56291l5433p5828K56121K23907m1228k21441j21606K10991J17093
$$ 746248 748666 592375 556942 481114 737235 961142 919914 698473 576867 787858 904951
2175I04951J7128O8488q3131l3151j96573M9025o7824k7816K4865K5083L20171
$$ 904951 922079 990567 907436 874285 677712 726737 658913 631097 655962 681045 1001216
2164A001216m2183Q8818j02535k30708R7083J41369r8746J45377j96212j15270
$$ 1001216 959033 1047851 945316 714608 811691 953060 854314 999691 803479 688209
2154F88209J46079J36304J40863J58577K25775n0478j54249L8117L88217O9122
$$ 688209 834288 970592 1111455 1270032 1495807 1445329 1291080 1329197 1717414 1786536
2144A786536j11613M6226M1823J82458K59367j116j56453j1371L966N5126K38953
$$ 1786536 1674923 1721149 1762972 1945430 2204797 2203681 2047228 2035857 2039823 2094949 2333902
2133B333902L8020k20477l05388Q3770N91508J24650M1977L97593K6088j08934
$$ 2333902 2371922 2151445 1846057 1929827 2521335 2645985 2687962 3085555 3111643 3002709
2123C002709K07518L45320R413K3176K71730L8437K52667L8565R5294L37308M6489
$$ 3002709 3210227 3555547 3564960 3588136 3859866 3898303 4150970 4189535 4284829 4622137 4668626
2112D668626K44261L41733M01811N76043K89844o2038M10588L60658K38465O67940
$$ 4668626 4912887 5254620 5656431 6232474 6522318 6460280 6870868 7231526 7469991 8137931
2102H137931L02492N02654N04292R29729P37787R26869J133242J589228J993633
$$ 8137931 8440423 8943077 9447369 10377098 11114885 12041754 13174996 14764224 16757857
2093A6757857J715561J935000K156033K323181K660018L126854M095267N395171
$$ 16757857 18473418 20408418 22564451 24887632 27547650 30674504 34769771 40164942
2085D0164942O640476Q671832J0542164J1938103R422585P109573l097072j2138822
$$ 40164942 46805418 55477250 66019414 77957517 87380102 94489675 91392603 79253781
2077G9253781j2429587j2420091j0023561p153643n128980l690642l137460k034165
$$ 79253781 66824194 54404103 44380542 37226899 32097919 28407277 25269817 23235652
2069B3235652j964441j857345j322124j078401j167597j284605j237287j253780
$$ 23235652 21271211 19413866 18091742 17013341 15845744 14561139 13323852 12070072
2061A2070072r74926o35109p76927n92773l11158o46432m64240k81927k12631
$$ 12070072 11095146 10460037 9683110 9090337 8779179 8132747 7668507 7386580 7173949
2052G173949k63078m64132k78352J09688k41549j45929l00850k27760k76918k97876
$$ 7173949 6910871 6446739 6168387 6278075 6036526 5890597 5589747 5361987 5085069 4787193
2042D787193l04809P6118M6245o15405j11826k7395m77313K86193l2839m33987
$$ 4787193 4482384 4558502 4604747 3989342 3877516 3850121 3372808 3659001 3626162 3192175
2032C192175n2186Q7481l96485K779o7069K5620M7397k31227M711o3242r0430
$$ 3192175 3139989 3227470 2830985 2833764 2766695 2792315 2839712 2608485 2613196 2549954 2459524
2021B459524k68325k01134L86485r8837K2871n5181m03206k0965N7081K50219
$$ 2459524 2191199 1990065 2376550 2277713 2300584 2245403 1842197 1821232 1878313 2128532
2011B128532m1213l29786R029k6235K28615j79996k32529j19162r5315r7332j16115
$$ 2128532 2087319 1757533 1766562 1740327 1968942 1788946 1556417 1437255 1341940 1244608 1128493
2000A128493Q9979r5034J1160J78038j30094R6782l2686n3039l0280j36369k180
$$ 1128493 1218472 1123438 1134598 1312636 1182542 1279324 1246638 1193599 1163319 1026950 1024770
1989A024770L0963R738K01920L6658p32421o8143J42496L64614j14477Q7782J0626
$$ 1024770 1055733 1065471 1267391 1304049 571628 503485 645981 1010595 896118 983900 994526
1978I94526j91513m48071O3858M12929J35053l71197L5784J66418j35482p6158
$$ 994526 803013 354942 418800 831729 966782 595585 631369 797787 662305 586147
1968E86147N3478Q8293j36074j43042n3896J19865k87359J85330J83073J19807
$$ 586147 639625 727918 591844 448802 394906 514771 227412 412742 595815 715622
1958G15622q248m1867j39306M9749k3213j06649j15602o5606k5247o0317j10559
$$ 715622 707374 665507 526201 575950 552737 446088 330486 264880 239633 179316 68757
1947F8757o214L23710k02097J31287R7937N6850J0554k73644M60537N3470k69461
$$ 68757 62543 386253 184156 315443 413380 470230 480784 207140 667677 721147 451686
1936D51686j96659j18156j08875q6245K59762o88K1245L76715q4443l65793j49046
$$ 451686 255027 136871 27996 -58249 201513 200825 222070 598785 514342 148549 -497
1925d97l7934R2805p5948k06342L21758l0157J13730n6720j69623K21084j35915
$$ -497 -38431 54374 -21574 -227916 93842 63685 177415 120695 -48928 172156 36241
1914C6241K34477j98754O3026J63726k25282P9785L57707j89344j42147l90720
$$ 36241 270718 71964 134990 298716 73434 153219 510926 321582 179435 -211285
1904b11285J97735J54903j96166M1461Q0371j09737p1170K84888L6067j03651
$$ -211285 -13550 141353 -54813 -13352 67019 -42718 -113888 171000 207067 103416
1894A03416O2810k22421L00688J95524k43534j88990J4462P506k00214K45632
$$ 103416 166226 -56195 244493 440017 196483 7493 21955 29461 -170753 74879
1884G4879K70825k06028j05481o1023p0965L07018l26750J62044K42495k80614
$$ 74879 345704 139676 34195 -26828 -97793 209225 -117525 44519 287014 6400
1874F400j36843K2880m2080q1664K33130j01435p3298J14579j11987K79871j74583
$$ 6400 -130443 -107563 -149643 -231307 1823 -99612 -172910 -58331 -170318 109553 -65030
1863f5030p5269L71140k05848m9116J57505l49495J56627O6163k1721k45764k4200
$$ -65030 -140299 230841 24993 -24123 133382 -216113 -59486 6677 -15044 -260808 -285008
1852b85008J02767L06557j17282Q1945J07224j07228J39055R0381l08919j49235
$$ -285008 -182241 124316 7034 88979 196203 88975 228030 318411 9492 -139743
1842a39743K74144K99977j86966L8684K52388J01248r5055m24359J73375J5475
$$ -139743 134401 434378 247412 286096 538484 639732 544677 120318 293693 309168
1832C09168k613k01335k94495j74340L68116K00411j61796J12720J07069Q2837
$$ 309168 306555 105220 -189275 -363615 4501 204912 43116 155836 262905 345742
1822C45742j63954k07217L58544j76407K25178j88141p2466K50038k12201O371
$$ 345742 181788 -25429 333115 156708 381886 193745 121279 371317 159116 165487
1812A65487K4290j86790M6048K19857n01744j47316L83647p0203q5060M4477J0961
$$ 165487 189777 2987 49035 268892 -232852 -380168 3479 -66724 -151784 -107307 -96346
1801i6346K86837J9167k51889N6330Q0571m75829K20503J20516j49918M9342j71400
$$ -96346 190491 209658 -42231 14099 94670 -381159 -160656 -40140 -190058 -140716 -312116
1790c12116M45425M4565j40675J17519j19283L0087j97205J15389K97012O4126
$$ -312116 133309 177874 37199 154718 35435 65522 -131683 -16294 280718 344844
1780C44844l31940p0239k46022j14662N10111L11091j12963k21582M9058k04960
$$ 344844 12904 -57335 -303357 -418019 92092 403183 290220 68638 117696 -87264
1770h7264J17p4654J54604r4772j45817J16506L7850J18792j20996k58328L68045
$$ -87264 -87147 -161801 -7197 -101969 -247786 -131280 -93430 25362 -95634 -353962 14083
1759A4083J98985p1974K11741j72365k25424J14412J27523k78800j82399k37923
$$ 14083 213068 141094 352835 180470 -44954 69458 196981 -81819 -264218 -502141
1749e02141L24676K51034k20413j53340L16437K39735k37220J50797m26458o7903
$$ -502141 -177465 73569 -146844 -300184 16253 255988 18768 169565 -256893 -324796
1739c24796m8814j40907M16493K67930q4207p0181o990k80997J83194K18556J09834
$$ -324796 -373610 -514517 -98024 169906 85699 15518 8528 -272469 -89275 129281 239115
1728B39115k5399m21335J83006K63765k24634k18606M562J19690O1269J00056
$$ 239115 213716 -207619 -24613 239152 14518 -204088 -199526 -79836 -18567 81489
1718H1489j68678j6805J43837J07199k20723k6553L18333P4222p1804k79531O4019
$$ 81489 -87189 -103994 39843 147042 -73681 -100234 218099 292321 220517 -59014 5005
1707E005j28942J83802n5028p141J94756j26740N8873p4981l7333j14917N0598
$$ 5005 -123937 59865 4837 -2304 192452 65712 124585 49604 12271 -102646 -52048
1696e2048l66328O239K54787J43623j22605n1034K08497k43141L30922J53918
$$ -52048 -418376 -412137 -157350 -13727 -136332 -187366 21131 -222010 108912 262830
1686B62830k52678P1394k06747l4841J42040J85818K48556p9848o8402j15998
$$ 262830 10152 81546 -125201 -160042 -18002 167816 416372 336524 268122 152124
1676A52124k73159r1272K02395L3197J18157q6534r3264l2311r6825P0687J19114
$$ 152124 -121035 -212307 -9912 23285 141442 54908 -38356 -70667 -167492 -96805 22309
1665B2309j35212j87900L7899L06969r6836k63839J19903J90326R238p9124q1948
$$ 22309 -112903 -300803 -262904 44065 -52771 -316610 -196707 -6381 2857 -76267 -158215
1654a58215p2375J81429l9681j22008n833l6371J94702J50816j85598M1254n7755
$$ -158215 -230590 -49161 -88842 -210850 -216683 -253054 -58352 92464 -93134 -51880 -109635
1643a09635K5027q7515q0410J23550K58513r6247o8449J57312j51953k51129j6329
$$ -109635 -84608 -172123 -252533 -128983 129530 33283 -35166 122146 -29807 -280936 -297265
1632b97265J05609k88129L24446l01432J29135M6311o0542L16079j6884J35318
$$ -297265 -191656 -479785 -155339 -456771 -327636 -281325 -341867 -25788 -42672 92646
1622I2646j32638M0342N1867r0175j83798J5580P8347P6686j32862j32987K69591
$$ 92646 -39992 350 52217 -37958 -221756 -206176 -127829 -51143 -184005 -316992 -47401
1611d7401Q3182l15096J80122j12031O6929j0495J9589O7468J96659k85284N3018
$$ -47401 35781 -279315 -99193 -211224 -144295 -154790 -135201 -67733 128926 -156358 -103340
1600a03340L16480l18395Q6178j95126k00636J08737J5052J73509j3052L0446
$$ -103340 213140 -105255 -19077 -214203 -414839 -306102 -291050 -117541 -130593 -100147
1590a00147k8242l7195K38094o0023j02910l3242K48460j9007k5099K0465j87802
$$ -100147 -128389 -165584 72510 12487 -90423 -123665 124795 105788 80689 101154 -86648
1579h6648J03479k78728P4550N3792K15283l5582J72632O4129m12738j43962K40806
$$ -86648 16831 -261897 -187347 -133555 81728 46146 218778 282907 -129831 -273793 -32987
1568c2987k46700l9778J11843P8299k7602N9362r8299j6481O7452K86849L04419
$$ -32987 -279687 -319465 -207622 -129323 -156925 -97563 -195862 -212343 -144891 141958 446377
1557D46377l03256J65756j41255l38647k30134M39680J9471o5644r8920K46023
$$ 446377 143121 308877 167622 -171025 -401159 38521 57992 -7652 -106572 139451
1547A39451J5849l44742j29031M60923j63580n6405J40839k3658N43j32255k2932
$$ 139451 155300 -189442 -318473 142450 -21130 -77535 63304 39646 40189 -92066 -114998
1536a14998K37534m63080K61874J22343o707k52469J46450k0124J91845J08225
$$ -114998 122536 -340544 -78670 43673 36966 -215503 -69053 -89177 102668 210893
1526B10893k1012k31474k35135K7155k0739K18147p6876J1476L39234j39637k25031
$$ 210893 189881 -41593 -276728 -249573 -270312 -52165 -129041 -117565 221669 82032 -142999
1515a42999j2654L3970L91469j40962k65347J0825J69559O6986O5122p9117K23523
$$ -142999 -155653 -121683 269786 128824 -136523 -125698 43861 110847 175969 96852 320375
1504C20375k12387K30885k0220k36244J27809j40458M3753J43105k46766j79273
$$ 320375 107988 338873 318653 82409 210218 69760 113513 256618 9852 -169421
1494a69421O1018l172r618M7659j16197K011P5458O5180k16539J83868J39890
$$ -169421 -108403 -111575 -121193 -73534 -189731 -187720 -112262 -47082 -263621 -79753 60137
1483F0137K96639o5457P5971j35797k16033j86625J06520J35976J16205k71172
$$ 60137 356776 291319 367290 231493 15460 -171165 -64645 71331 187536 -83636
1473h3636o1682K08908K31326o0256l57676l21659P9760J70084J65800J84836
$$ -83636 -145318 63590 294916 234660 -123016 -444675 -364915 -194831 -29031 155805
1463A55805J4919j09199l8639o6399p017P7728J25411m45603J93014j6576j39983
$$ 155805 170724 61525 22886 -43513 -50530 27198 152609 -292994 -99980 -116556 -256539
1452b56539M23437q1169J13598k10766n6324K30765j07253j05384j03920J21549
$$ -256539 166898 85729 199327 -11439 -67763 163002 55749 -49635 -153555 -32006
1442c2006J29680k68577L39136p3474n0738J32293k34906j08349K15874n6069
$$ -32006 97674 -170903 168233 94759 44021 176314 -58592 -166941 48933 -7136
1432g136J6381J02557J377J4425M9885j57286N2007l00017j04826P2647K26946
$$ -7136 9245 111802 113179 127604 177489 20203 72210 -227807 -332633 -259986 -33040
1421c3040J21389n8519k02737K065K73319l53096j23623J24149J26845k4268Q1992
$$ -33040 88349 29830 -172907 -170842 102477 -250619 -374242 -250093 -123248 -147516 -65524
1410f5524q7704j92064L462j43437R7156J72907K04415J95176L6183O1794R138
$$ -65524 -153228 -345292 -341830 -485267 -388111 -215204 -10789 184387 220570 282364 291502
1399B91502j04736j69802j79040j2185K3020L17888J31599j91057j55403Q0056
$$ 291502 186766 16964 -162076 -174261 -151241 166647 298246 107189 -48214 31842
1389C1842l10089L78047J46100k07991J8594j67913K3807J02652k09740J76367
$$ 31842 -278247 99800 245900 37909 56503 -111410 -87603 15049 -194691 -18324
1379a8324R1930j40108J77903J10051k27144j13124n0407Q2522J05953K4316o607
$$ -18324 73606 -66502 111401 221452 -5692 -118816 -169223 -86701 19252 43568 36961
1368C6961j58023p4839J75260L43030l23649J02360m8892j01454m2486L5335L51533
$$ 36961 -121062 -195901 -20641 322389 -1260 101100 52208 -49246 -91732 -56397 295136
1357B95136l45559J81241o6945k39482k32107R4707K03231K9070l88651k9414
$$ 295136 -50423 130818 63873 -175609 -407716 -313009 -109778 -80708 -469359 -498773
1347d98773J03646p9171O59703k34010k31773n9988J53979Q6866K2858J8314O5268
$$ -498773 -395127 -474298 185405 -48605 -280378 -340366 -186387 -99521 -76663 -58349 6919
1336F919L455k05757p1986J60967p8914j061Q9442K58280p4615m5529j65178j712
$$ 6919 10374 -195383 -267369 -106402 -185316 -186377 -96935 161345 86730 41201 -123977 -125689
1324a25689J42904J59270l75006k31388N2360L78796k66687P5465R5487o1271
$$ -125689 17215 176485 -198521 -429909 -377549 1247 -265440 -189975 -94488 -155759
1314a55759R5744k18111M28711j64414k8697K31468r7729N6423k18731L8395j98040
$$ -155759 -60015 -278126 150585 -13829 -42526 188942 91213 147636 -71095 -32700 -230740
1303b30740l14721J26552K96525L78165k06083q92m65623K57374j35863J3322
$$ -230740 -545461 -418909 -122384 255781 49698 48806 -416817 -159443 -295306 -281984
1293b81984J52986M23315O2879l49448r8944J5834o880j06554R7849Q2519p5786
$$ -281984 -128998 294317 357196 7748 -91196 -75362 -82242 -188796 -90947 -8428 -84214
1282h4214j73568l2613k8405j56921L13344L40357q9480Q6268k62005l5346J17274
$$ -84214 -257782 -290395 -318800 -475721 -162377 177980 88500 174768 -87237 -122583 -5309
1271e309J88813k52094j1051J49409K29413l07544j06548J6835j48264k24735
$$ -5309 183504 -68590 -79641 69768 299181 -8363 -114911 -98076 -246340 -471075
1261d71075L68266J83714k11582l24427L1666M04154K55306k14831j82497J64673
$$ -471075 -102809 80905 -130677 -455104 -423438 -19284 236022 21191 -161306 3367
1251C367p0770j25161o4227L88774q0354q9464j69620k0889J05207K96690K55749
$$ 3367 -67403 -192564 -256791 131983 51629 -37835 -207455 -228344 -123137 173553 429302
1240D29302j60559m45375k44892L99955R4172k86638p2191P7998Q7752j39040
$$ 429302 268743 -176632 -421524 -21569 72603 -214035 -286226 -208228 -120476 -259516
1230b59516J90515J45269j26781J18427o1035O0005J64968k0900j75076k11798
$$ -259516 -69001 76268 -50513 67914 6879 66884 231852 210952 35876 -175922
1220a75922J54436r2507K9902k28573O9616p3686O2250j3713j06526L1455O6307
$$ -175922 -21486 -113993 -84091 -312664 -243048 -316734 -254484 -268197 -374723 -343268 -276961
1209b76961N5849j2518K65239j1125K51541k6112k74793M6908k65437J42186r7930
$$ -276961 -221112 -233630 31609 20484 272025 245913 -28880 18028 -247409 -105223 -203153
1198b03153k31882P4084K15646j4141m7781K87562J13680k27814j98691J94834
$$ -203153 -435035 -360951 -145305 -159446 -207227 80335 194015 -33799 -232490 -37656
1188c7656j22492J55194K01605l20250J47334m2414N0944J71125l14402K19781
$$ -37656 -160148 -4954 196651 -123599 23735 -18679 32265 203390 -111012 108769
1178A08769r7478j80108j01385L03802J17186k28267K3179K64302l02395J67729
$$ 108769 11291 -168817 -270202 33600 150786 -77481 -54302 210000 -92395 75334
1168G5334j92008J45488K80655P5080l6495k01155k42433n5234N2262K67091M5980
$$ 75334 -116674 28814 309469 384549 348054 146899 -95534 -150768 -98506 168585 214565
1157B14565n37898O8198J43493J88248M8043j14107J10905k68088J09579j6410
$$ 214565 -323333 -255135 -111642 76606 124649 10542 121447 -146641 -37062 -53472
1147e3472k24523K77995J25041K75291k02575Q4811l65550m0377n231j16244J33465
$$ -53472 -277995 0 125041 400332 197757 282568 -82982 -123359 -128590 -244834 -111369
$$ [...]
##END NTUPLES=NMR SPECTRUM
##END=
