##TITLE=1H_CA-8889-1
 CDCl3, 8 sc, 
 1.07.2021
##JCAMPDX= 6.0         $$ Bruker NMR JCAMP-DX V2.0
##DATA TYPE= NMR SPECTRUM
##DATA CLASS= NTUPLES
##ORIGIN= UXNMR, Bruker Analytische Messtechnik GmbH
##OWNER= root
$$ XWIN-NMR		Version 3.5
$$ Thu Jul  1 11:46:08 2021 Russian Standard Time (UT+4h)  she@DPX200
##.OBSERVE FREQUENCY= 200.131506
##.OBSERVE NUCLEUS= ^1H
##.ACQUISITION MODE= SIMULTANEOUS
##.ACQUISITION SCHEME= undefined
##.AVERAGES= 8
##.DIGITISER RES= 18
##SPECTROMETER/DATA SYSTEM= spect
##.PULSE SEQUENCE= zg30
##.SOLVENT NAME= CDCl3
##.SHIFT REFERENCE= (INTERNAL, CDCl3, 0, 17.5142)
##AUDIT TRAIL= $$ (NUMBER, WHEN, WHO, WHERE, WHAT)
$$ ##TITLE= Audit trail, XWIN-NMR		Version 3.5
$$ ##JCAMPDX= 5.01
$$ ##ORIGIN= Bruker BioSpin GmbH
$$ ##OWNER= she
$$ F:/spectra/data/she/nmr/H-F/1/pdata/1/auditp.txt
$$ ##AUDIT TRAIL=  $$ (NUMBER, WHEN, WHO, WHERE, WHAT)
(   1,<2021-07-01 11:43:21.00 +0400>,<she>,<DPX200>,
      <created by zg, POWCHK disabled, PULCHK disabled
       configuration hash MD5:
       00 E9 B6 7A A2 85 ED C7 34 08 36 98 17 FE 4E 26
       data hash MD5: 16K
       78 AB 5D 2C EA DF CC DC F3 40 67 C2 F2 15 1F DA>)
(   2,<2021-07-01 11:43:25.14 +0400>,<she>,<DPX200>,
      <Start of raw data processing
       efp BC_mod = 2 LB = 0.24 FT_mod = 6 PKNL = 1 PHC0 = -11915.46 PHC1 = 13.80099 SI = 16K 
       data hash MD5: 16K
       CB 38 45 97 24 E9 40 78 D5 20 21 17 64 D8 02 36>)
(   3,<2021-07-01 11:43:55.15 +0400>,<she>,<DPX200>,
      <abs ABSG = 5 
       data hash MD5: 16K
       60 AD F4 E2 53 38 F2 79 22 6B 30 80 E1 B8 11 DD>)
(   4,<2021-07-01 11:44:35.35 +0400>,<she>,<DPX200>,
      <pk PHC0 = 29.21804 PHC1 = 0 
       data hash MD5: 16K
       7D A9 03 65 A3 86 92 CF DE DC 96 66 C1 1F 74 C9>)
(   5,<2021-07-01 11:44:59.26 +0400>,<she>,<DPX200>,
      <pk PHC0 = -30.76802 PHC1 = 2.6 
       data hash MD5: 16K
       F0 58 69 2C 3E 13 2A BA 09 B5 0F 18 C3 C2 4C 9C>)
(   6,<2021-07-01 11:45:02.84 +0400>,<she>,<DPX200>,
      <abs ABSG = 5 
       data hash MD5: 16K
       AA 8F 95 5B 4E 0C 9A 5A AF 8D 07 17 CE 22 D9 1B>)
(   7,<2021-07-01 11:45:40.48 +0400>,<she>,<DPX200>,
      <abs ABSG = 5 
       data hash MD5: 16K
       12 AA BE BA BE FD 35 9F 08 BF 47 B5 8A 33 6A 37>)
$$ ##END=
$$ 
$$ hash MD5
$$ A5 D9 DA CE FC B0 83 10 3A 72 E9 4C D2 5E C7 EC
##$RELAX= 
##$RELAX= 
##$RELAX= 
##$RELAX= 
##$RELAX= 
##$RELAX= 
$$ Bruker specific parameters
$$ --------------------------
##$DU= <F:/spectra>
##$EXPNO= 1
##$NAME= <H-F>
##$PROCNO= 1
##$TYPE= <nmr>
##$USER= <she>
##$AMP= (0..31)
100 100 100 100 100 100 100 100 100 100 100 100 100 100 100 100 100 100 
100 100 100 100 100 100 100 100 100 100 100 100 100 100 
##$AQSEQ= 0
##$AQ_mod= 1
##$AUNM= <au_zg>
##$AUTOPOS= <>
##$BF1= 200.13
##$BF2= 200.13
##$BF3= 200.13
##$BF4= 200.13
##$BF5= 200.13
##$BF6= 200.13
##$BF7= 200.13
##$BF8= 200.13
##$BYTORDA= 1
##$CFDGTYP= 0
##$CFRGTYP= 5
##$CHEMSTR= <none>
##$CNST= (0..31)
1 1 145 1 1 1 1 1 1 1 1 1 1 1 1 1 1 1 1 1 1 1 1 1 1 1 1 1 1 1 1 1 
$$ [...]
##$SUBNAM3= <"">
##$SUBNAM4= <"">
##$SUBNAM5= <"">
##$SUBNAM6= <"">
##$SUBNAM7= <"">
##$SUBNAM8= <"">
##$SUBNAM9= <"">
##$SW= 20.0188882624521
##$SWIBOX= (0..15)
0 0 2 0 0 0 0 0 0 0 0 0 0 0 0 0 
##$SW_h= 4006.41025641026
##$TD= 16384
##$TD0= 1
##$TE= 0
##$TE2= 300
##$TE3= 300
##$TEG= 300
##$TL= (0..7)
0 120 120 120 120 120 120 120 
##$TP= (0..7)
150 150 150 150 150 150 150 150 
##$TP07= 0
##$TPNAME0= <>
##$TPNAME1= <>
##$TPNAME2= <>
##$TPNAME3= <>
##$TPNAME4= <>
##$TPNAME5= <>
##$TPNAME6= <>
##$TPNAME7= <>
##$TPOAL= (0..7)
0.5 0.5 0.5 0.5 0.5 0.5 0.5 0.5 
##$TPOFFS= (0..7)
0 0 0 0 0 0 0 0 
##$TUNHIN= 0
##$TUNHOUT= 0
##$TUNXOUT= 0
##$USERA1= <user>
##$USERA2= <user>
##$USERA3= <user>
##$USERA4= <user>
##$USERA5= <user>
##$V9= 5
##$VALIST= <valist>
##$VCLIST= <CCCCCCCCCCCCCCC>
##$VD= 0
##$VDLIST= <DDDDDDDDDDDDDDD>
##$VPLIST= <PPPPPPPPPPPPPPP>
##$VTLIST= <TTTTTTTTTTTTTTT>
##$WBST= 1024
##$WBSW= 4
##$XGAIN= (0..3)
0 0 0 0 
##$XL= 0
##$YL= 0
##$YMAX_a= 679785
##$YMIN_a= -1002489
##$ZGOPTNS= <>
##$ZL1= 120
##$ZL2= 120
##$ZL3= 120
##$ZL4= 120
##$ABSF1= 17.51422
##$ABSF2= -2.50482
##$ABSG= 5
##$ABSL= 3
##$ALPHA= 0
##$AQORDER= 0
##$ASSFAC= 0
##$ASSFACI= 0
##$ASSFACX= 0
##$ASSWID= 0
##$AUNMP= <proc_1d>
##$AZFE= 0.1
##$AZFW= 0.1
##$BCFW= 0
##$BC_mod= 2
##$BYTORDP= 0
##$COROFFS= 0
##$CY= -3
##$DATMOD= 1
##$DC= 0
##$DFILT= <>
##$DTYPP= 0
##$F1P= 0
##$F2P= 0
##$FCOR= 1
##$FTSIZE= 16384
##$FT_mod= 6
##$GAMMA= 0
##$GB= 0
##$INTBC= 1
##$INTSCL= 1.334414e-10
##$ISEN= 128
##$LB= 0.24
##$LEV0= 0
##$LPBIN= 0
##$MAXI= 10000
##$MC2= 0
##$MEAN= 0
##$ME_mod= 0
##$MI= 1.114404
##$NCOEF= 0
##$NC_proc= -6
##$NLEV= 6
##$NOISF1= 3.799351
##$NOISF2= 2.8
##$NSP= 0
##$NTH_PI= 0
##$NZP= 0
##$OFFSET= 17.51422
##$PC= 1
##$PHC0= -11917.01
##$PHC1= 16.40099
##$PH_mod= 1
##$PKNL= yes
##$PPARMOD= 0
##$PSCAL= 0
##$PSIGN= 0
##$REVERSE= no
##$SF= 200.130004085991
##$SI= 16384
##$SIGF1= 3
##$SIGF2= 2
##$SINO= 5.538805
##$SIOLD= 16384
##$SREGLST= <1H.CDCl3>
##$SSB= 0
##$STSI= 16384
##$STSR= 0
##$SW_p= 4006.41025641026
##$SYMM= 0
##$S_DEV= 0
##$TDeff= 16384
##$TDoff= 0
##$TI= <>
##$TILT= no
##$TM1= 0
##$TM2= 0
##$TOPLEV= 0
##$USERP1= <user>
##$USERP2= <user>
##$USERP3= <user>
##$USERP4= <user>
##$USERP5= <user>
##$WDW= 1
##$XDIM= 16384
##$YMAX_p= 439842494
##$YMIN_p= -259467
$$ End of Bruker specific parameters
$$ ---------------------------------
##NTUPLES= NMR SPECTRUM
##VAR_NAME=  FREQUENCY,     SPECTRUM/REAL,   SPECTRUM/IMAG
##SYMBOL=    X,             R,               I
##VAR_TYPE=  INDEPENDENT,   DEPENDENT,       DEPENDENT
##VAR_FORM=  AFFN,          ASDF,            ASDF
##VAR_DIM=   16384,         16384,           16384
##UNITS=     HZ,            ARBITRARY UNITS, ARBITRARY UNITS
##FACTOR=    0.24454680195387, 1,            1
##FIRST=     3505.12077688139, 0,            0
##LAST=      -501.289479528867, 0,           0
##MIN=       -501.289479528867, -259467,     0
##MAX=       3505.12077688139, 439842494,    0
$$ Real data points
##PAGE= N=1
##DATA TABLE= (X++(R..R)), XYDATA
$$ [...]
6135D73753Q9888L5419J7327m6544P719r2647K9890M2794K9792l1333K8459O4875
$$ 473753 563641 599060 616387 569843 577562 484915 514805 557599 587391 556058 584517 649392
6123F49392J20652N2962q6211P2638j06482r1399P101Q1320M234J7057l3059j20165
$$ 649392 770044 823006 736795 809433 702951 611552 618653 699973 704207 721264 688205 568040
6111E68040n6158O9920m490k1829K1502J54048k1954j21452l2487P5410P9913
$$ 568040 511882 581802 577312 555483 576985 731033 709079 587627 555140 630550 710463
6100G10463n851k4300J2782Q2845O8118K9557j20846l4372n1868L0356j07901
$$ 710463 704612 680312 693094 775939 844057 873614 752768 718396 666528 696884 588983
6089E88983j7001P0862L8722j47676n5169l0367R5527m8331K1272R1670j1955
$$ 588983 571982 642844 681566 533890 478721 448354 543881 495550 516822 608492 596537
6078E96537N742K9793M9953M164n278m2842L5207o9453L0162q4966r2301R8678
$$ 596537 602279 632072 682025 686189 680911 638069 673276 603823 633985 549019 456718 555396
6066E55396K6368m9211n7936o327k6654L6729J60950j09003o6245M7205o6408
$$ 555396 581764 532553 474617 468290 441636 478365 639315 530312 464067 511272 444864
6055D44864N220K5747l0474L1552J17829L637j15353M1118m7458k1945O4946P7098
$$ 444864 450084 475831 445357 476909 594738 598375 483022 524140 476682 454737 519683 596781
6043E96781l3743K1713q0972L8552J36506j09861q367J22962J11839j23529L3182
$$ 596781 563038 584751 503779 542331 678837 568976 560609 683571 795410 671881 705063
6032G05063J19467l1200p8987M7043r7360o5594Q522l1550Q7089N9535k844J48979
$$ 705063 824530 793330 714343 761386 664026 598432 606954 575404 662493 722028 719184 868163
6020H68163k2842o6150K3625L6036o8997K8623L6055k0011P132J0424j178j09425
$$ 868163 845321 779171 802796 838832 769835 798458 834513 814502 821634 832058 830880 721455
6008G21455R3528K0749J6276j35496j2340o5938l5214K38843j00817Q3256J42095
$$ 721455 814983 835732 852008 716512 704172 638234 603020 841863 741046 824302 966397
5997I66397q9328r17o0194j02170J33856q5840M7860L7939j37217m1798j3560
$$ 966397 877069 876152 815958 713788 847644 761804 809664 847603 710386 668588 655028
5986F55028R3778L1713l4237k7541P5684o852O9769l3592K643q8323M0263K29007
$$ 655028 748806 780519 746282 718741 794425 787573 857342 823750 826393 738070 778333 1007340
5974A007340n5885r3726N0488j12695J03669P9690q8377k8504J6115O9435J4095
$$ 1007340 951455 857729 908217 795522 899191 978881 890504 862000 878115 947550 961645
5963I61645P1783l010j32893J5986M3163J0094N4821p46l2538k2070p1965P1079
$$ 961645 1033428 1030418 897525 913511 956674 966768 1021589 1020843 988305 966235 894270 965349
5951I65349O9696j7702k5005J53066m1723j16884J13759N3901o2730k2919J7959
$$ 965349 1035045 1017343 992338 1145404 1103681 986797 1100556 1154457 1091727 1068808 1086767
5940A086767k2128O9735l05l628M951R1549J6608n4751j4711J2267m3895J49715
$$ 1086767 1064639 1134374 1134069 1130441 1135392 1226941 1243549 1188798 1174087 1186354 1142459 1292174
5928A292174J49573m1331k4417o1163P6906K9433j27971j7214J83029N0619j65214
$$ 1292174 1441747 1400416 1375999 1314836 1391742 1421175 1293204 1275990 1459019 1509638 1344424
5917A344424R06j0204j17741P1427N002p2028o7877J04108P0079N5726r1567l5217
$$ 1344424 1345330 1335126 1217385 1288812 1293814 1221786 1153909 1258017 1328096 1383822 1292255 1257038
5905A257038L1405r0983Q9694J26002J08277K4308m1175k8327P5538l411L2339
$$ 1257038 1288443 1197460 1287154 1413156 1521433 1545741 1504566 1476239 1551777 1548366 1580705
5894A580705j3823p3266M034r7747J03748Q8531j06814K3379O1885M0355k7826
$$ 1580705 1566882 1493616 1497650 1399903 1503651 1592182 1485368 1508747 1570632 1610987 1583161
5883A583161l3968p2713K0617j03523k9437m6059j7684P3958J5278p8831j17636
$$ 1583161 1549193 1476480 1497097 1393574 1364137 1318078 1300394 1374352 1389630 1310799 1193163
5872A193163j3655J63759j13144l0090Q6646m5221J59187J7953k5004J9106j35518
$$ 1193163 1179508 1343267 1230123 1200033 1286679 1241458 1400645 1418598 1393594 1412700 1277182
5861A277182J3558M2562n7337o2458R747O7737n8633O4372N4687j62137k1696
$$ 1277182 1290740 1333302 1275965 1213507 1223254 1290991 1232358 1296730 1351417 1189280 1167584
5850A167584J30864o8004j20193L6525J7282P2682J33473j5670q7611N9091l6418
$$ 1167584 1298448 1230444 1110251 1146776 1164058 1236740 1370213 1354543 1266932 1326023 1289605
5839A289605o7666M5989L1202M2453Q9051R861l5416j34553M0523L5217O6015
$$ 1289605 1221939 1267928 1299130 1341583 1430634 1440495 1405079 1270526 1311049 1346266 1412281
5828A412281j9059R0231k0099m0271L1931k6187l7511J478Q751M1035N444M8917
$$ 1412281 1393222 1483453 1463354 1423083 1455014 1428827 1391316 1392794 1401545 1442580 1448024 1496941
5816A496941L5412p3873j3580j21635M7886P290J22936j00199j2904J61608O8646
$$ 1496941 1532353 1458480 1444900 1323265 1371151 1378441 1501377 1401178 1388274 1549882 1618528
5805A618528j21304R2571j03236J11141L8722r0036J02214j9715L3981K6527j01850
$$ 1618528 1497224 1589795 1486559 1597700 1636422 1546386 1648600 1628885 1662866 1689393 1587543
5794A587543J2293j16972l8089P0891L6755j13598N7099N8076r1940N3848J3618
$$ 1587543 1599836 1482864 1444775 1515666 1552421 1438823 1495922 1553998 1462058 1515906 1529524
5783A529524j25882R7145O4214l2156M0152J8760R3157N5651n8386m3137q8318
$$ 1529524 1403642 1500787 1565001 1532845 1572997 1591757 1684914 1740565 1682179 1639042 1550724
5772A550724j8052l8876m8112q046N8981R6748r3423Q2834J4551P0122O5460K1173
$$ 1550724 1532672 1493796 1445684 1437638 1496619 1593367 1499944 1582778 1597329 1667451 1732911 1754084
5760A754084r3931O7466l1301P1858R7818r659J57199O6655J2632m8531r9752
$$ 1754084 1660153 1727619 1696318 1768176 1865994 1856335 2013534 2080189 2092821 2044290 1944538
5749A944538j2682J51088P0685K2410N9948p88j28346o1000j6195j7980L1198
$$ 1944538 1931856 2082944 2153629 2176039 2235987 2235199 2106853 2045853 2029658 2011678 2042876
5738B042876p9870r7897j12710Q5530J22399j64542l0095N1507R429L9516q2095
$$ 2042876 1963006 1865109 1752399 1837929 1960328 1795786 1765691 1817198 1826627 1866143 1784048
5727A784048j5571J39140n5312j44472J21542k8631M3123P6491j68826j7808Q5459
$$ 1784048 1768477 1907617 1852305 1707833 1829375 1800744 1843867 1920358 1751532 1733724 1819183
5716A819183k0429J07150p5854P9646m5104L9438q465j6676J6883P2167K0309
$$ 1819183 1798754 1905904 1830050 1909696 1864592 1904030 1895565 1878889 1895772 1967939 1988248
5705A988248q4237M8897M1146j7538L6875L6086L7572j1588p8210j0068J63792
$$ 1988248 1904011 1952908 1994054 1976516 2013391 2049477 2087049 2075461 1997251 1987183 2150975
5694B150975P1850l8293k3419J9449O791o6236n9230M0995J06475L0718p7340
$$ 2150975 2222825 2184532 2161113 2180562 2187353 2121117 2061887 2102882 2209357 2240075 2162735
5683B162735K8159R6594j2756O9098K0732L8348l0156J30204j5776p2211R3780
$$ 2162735 2190894 2287488 2274732 2343830 2364562 2402910 2372754 2502958 2487182 2414971 2508751
5672B508751L3749O2483J5668l2956l8898n153M2402P1916n550Q0120J1350m1144
$$ 2508751 2542500 2604983 2620651 2587695 2548797 2543644 2586046 2657962 2652412 2732532 2743882 2702738
5660B702738O6035O3943J22622j14808k8934K6309R6959n9779J43351l0319j06556
$$ 2702738 2768773 2832716 2955338 2840530 2811596 2837905 2934864 2875085 3018436 2988117 2881561
5649B881561j19597m644m3045J56515P6969Q0457j58834P646n7461l850J45941
$$ 2881561 2761964 2757320 2714275 2870790 2947759 3028216 2869382 2877028 2819567 2815717 2961658
5638B961658j6771K2991j171K0384k5295o8627m6243N4489r2804o9095J8462k9108
$$ 2961658 2944887 2967878 2966707 2987091 2961796 2893169 2846926 2901415 2808611 2739516 2757978 2728870
5626B728870O7844J8789n7122P4951j09039R606m6074Q0701l868M2319J11992
$$ 2728870 2796714 2815503 2758381 2833332 2724293 2733899 2687825 2768526 2764658 2806977 2918969
5615B918969L9940j52715K7654k6595J21830J7192p0343J13610N9989L3112n8770
$$ 2918969 2958909 2806194 2833848 2807253 2929083 2946275 2875932 2989542 3049531 3082643 3023873
5604C023873j5045r276p1675J2938K5550R503N2168q697p4521L4899j05746Q7467
$$ 3023873 3008828 2999552 2927877 2940815 2966365 2975868 3028036 3019339 2944818 2979717 2873971 2961438
5592B961438J33850m2806o4063R4119j4975P0893O0751m9376k9410j33140J73794
$$ 2961438 3095288 3052482 2988419 3082538 3067563 3138456 3199207 3149831 3120421 2987281 3161075
5581C161075k8467J71360K3012r4625k313J8031n904J8604j03356J03207R7163
$$ 3161075 3132608 3303968 3326980 3232355 3230042 3248073 3242169 3260773 3157417 3260624 3357787
5570C357787k8529m4727K8081N9334r2129J29876J921J748P6081J7844j0590Q823
$$ 3357787 3329258 3284531 3312612 3371946 3279817 3409693 3411614 3413362 3489443 3507287 3496697 3505520
5558C505520M7582J7699L4066m1837m3605J14806l8878J91430L926m5698j9967
$$ 3505520 3553102 3570801 3604867 3563030 3519425 3634231 3595353 3786783 3790709 3745011 3725044
5547C725044R461L1761N9406L7147J00370k0204O8547j7906M8990P8654l5803
$$ 3725044 3734505 3766266 3825672 3862819 3963189 3942985 4011532 3993626 4042616 4121270 4085467
5536D085467M3738J23872J59767j7121K0430L8523p535m5140K20786K35211N9978
$$ 4085467 4129205 4253077 4412844 4395723 4416153 4454676 4447141 4402001 4622787 4857998 4917976
5525D917976P4717m7603l787K00926J77812j14796J8708J24814o2930L5338J2309
$$ 4917976 4992693 4945090 4941303 5142229 5320041 5205245 5223953 5348767 5285837 5321175 5333484
5514E333484q0795L776J61675J15774K0551J2459J01904j6339O9923q7150P6251
$$ 5333484 5252689 5256465 5418140 5533914 5554465 5566924 5668828 5652489 5722412 5635262 5711513
5503E711513J04789J40347l2048M3942J66497l2069O6207J52474R5944J55694
$$ 5711513 5816302 5956649 5924601 5968543 6135040 6102971 6169178 6321652 6417596 6573290
5493F573290P3553J45306K06918L8369K31179J40643Q8425j4130J97888N0463
$$ 6573290 6646843 6792149 6999067 7037436 7268615 7409258 7497683 7483553 7681441 7731904
5483G731904O556K24176K7005P9969P9272L1537R3672Q2534k3812J04329O1569
$$ 7731904 7738460 7962636 7989641 8069610 8148882 8180419 8274091 8356625 8332813 8437142 8498711
5472H498711J27521O6772K942m3571O7587P7226K4662J7928P7809L3447J26929
$$ 8498711 8626232 8693004 8695946 8652375 8719962 8797188 8821850 8839778 8917587 8951034 9077963
5461I077963N8099Q74K09997M1388J15305J32239J53202J18575m6728J70903J97260
$$ 9077963 9136062 9136936 9346933 9388321 9503626 9635865 9789067 9907642 9860914 10031817 10229077
5450A0229077J81512R3637J26945J29039N3090p0827j1932k2842P3933J51724
$$ 10229077 10410589 10504226 10631171 10760210 10813300 10742473 10730541 10707699 10781632 10933356
5440A0933356p1953Q3025L7393J91057J83947J97016L19750K56869K70610J97694
$$ 10933356 10861403 10944428 10981821 11172878 11356825 11553841 11873591 12130460 12401070 12598764
5430A2598764J59966J31522R4124N7059P4212J04909k0646J60508J42199J31508
$$ 12598764 12758730 12890252 12984376 13041435 13115647 13220556 13199910 13360418 13502617 13634125
5420A3634125J56055R9137J43056K36666J17519K2656K24241k641J7387K29172
$$ 13634125 13790180 13889317 14032373 14269039 14386558 14409214 14633455 14630814 14648201 14877373
5410A4877373O9742J60392K67837L43122K87373K49595M25242L36547L03701L41742
$$ 14877373 14947115 15107507 15375344 15718466 16005839 16255434 16680676 17017223 17320924 17662666
5400A7662666L95649K61054K65177L45889L98260M30839K72116L11827N02087
$$ 17662666 18058315 18319369 18584546 18930435 19328695 19759534 20031650 20343477 20845564
5391B0845564M30502L50405N48452M43505O07398P14333P77884P50440Q11682
$$ 20845564 21276066 21626471 22174923 22618428 23225826 23940159 24718043 25468483 26280165
5382B6280165J061841J194716J343841J464751J673864J873971J995477K385177
$$ 26280165 27342006 28536722 29880563 31345314 33019178 34893149 36888626 39273803
5374C9273803K586462K815689L147889L312886L517562L926224M281971M578836
$$ 39273803 41860265 44675954 47823843 51136729 54654291 58580515 62862486 67441322
5366F7441322M437902L594847K589539J202489k39216j324373k013700k251975
$$ 67441322 71879224 75474071 78063610 79266099 79026883 77702510 75688810 73436835
5358G3436835k033428j636085q88261k12852L50609R29017J163252J962015K610322
$$ 73436835 71403407 69767322 68879061 68666209 69016818 69945835 71109087 73071102 75681424
5349G5681424L096060L695827M212290M561177M385927K812818N93474k215809
$$ 75681424 78777484 82473311 86685601 91246778 95632705 98445523 99038997 96823188
5341I6823188m459364n785351o336929o479022o109489n451938m782950m023135
$$ 96823188 92363824 86578473 80241544 73762522 67653033 62201095 57418145 53395010
5333E3395010l515592k985280k691156k548193k037662j704761j536127j340314
$$ 53395010 49879418 46894138 44202982 41654789 39617127 37912366 36376239 35035925
5325C5035925j218515j075823r76674q63294q32620o63272o88311l56443m22513
$$ 35035925 33817410 32741587 31764913 30901619 30068999 29405727 28717416 28360973 27938460
5316B7938460m60611m69993k67953k48481l53225l82230l20672k38858j70031
$$ 27938460 27477849 27007856 26739903 26491422 26138197 25755967 25435295 25196437 25026406
5307B5026406l91197j42686l3736j14041j55165m2263M156n0992m1251l1625n7122
$$ 25026406 24635209 24492523 24458787 24344746 24189581 24147318 24151474 24100482 24059231 24027606 23970484
5296B3970484j5577J94840J95222R9364J80234J08948K45335L79474K25428L53529
$$ 23970484 23954907 24149747 24344969 24444333 24624567 24733515 24978850 25358324 25583752 25937281
5286B5937281L41369L87580N79895O39197O41190N44219M72793L65384K16957
$$ 25937281 26278650 26666230 27246125 27885322 28526512 29070731 29543524 29908908 30125865
5277C0125865J62658J52557J60983K01513J31761L05068M68727M86929N63225
$$ 30125865 30288523 30441080 30602063 30803576 30935337 31240405 31709132 32196061 32759286
5268C2759286P04985R14252P33598P84854R89442N72838M26262L50600J30434
$$ 32759286 33464271 34378523 35112121 35896975 36886417 37459255 37885517 38236117 38366551
5259C8366551K6464R5186k8665j4960m4992J21914K90840L62543K85048M23892
$$ 38366551 38393015 38488201 38459536 38444576 38399584 38521498 38812338 39174881 39459929 39883821
5249C9883821L53319K66547K42312Q9659J7248j84404j76367k17827j54686k04920
$$ 39883821 40237140 40503687 40745999 40835658 40852906 40668502 40492135 40274308 40119622 39914702
5239C9914702l03393j55827p3025r3184J60204N5252J72796J98239J34912q3536
$$ 39914702 39611309 39455482 39382457 39289273 39449477 39504729 39677525 39875764 40010676 39927140
5229C9927140l25117n55273p22998p08011o74796r56981p86906q78328p31717
$$ 39927140 39602023 39046750 38323752 37615741 36940945 35983964 35197058 34318730 33587013
5220C3587013o45744l43805m19645k68766k00961m8369q2128o2861j94267l35601
$$ 33587013 32941269 32597464 32177819 31909053 31708092 31659723 31577595 31514734 31320467 30984866
5210C0984866n39566o77017p21010q42586n54331q44538p15714p08595p28424
$$ 30984866 30445300 29768283 29047273 28204687 27650356 26805818 26090104 25381509 24653085
5201B4653085o26916n78808o08649l84150l05867j63660k59598l26890j50706
$$ 24653085 24026169 23447361 22838712 22454562 22148695 21985035 21725437 21398547 21247841
5192B1247841r9527k05266k13827l72524k43121k83390m52066k51846k08526k69392
$$ 21247841 21148314 20943048 20729221 20356697 20113576 19830186 19378120 19126274 18917748 18648356
5182A8648356k00071k18959k10568j72201k03624j7164j57303l1745j32015J8034
$$ 18648356 18448285 18229326 18018758 17846557 17642933 17625769 17468466 17436721 17304706 17322740
5172A7322740J45030P3283J6168P2501k6706j25287j4288k7247j11712j87782
$$ 17322740 17467770 17541053 17557221 17629722 17603016 17477729 17463441 17436194 17324482 17136700
5162A7136700P3002m5911p4160j3941J11319O2654J48690M1070J9356J60968L0627
$$ 17136700 17209702 17163791 17089631 17075690 17187009 17249663 17398353 17439423 17458779 17619747 17650374
5151A7650374L0863J73774R4706J02382J56968N3520J06921K36997J41581K31176
$$ 17650374 17681237 17855011 17949717 18052099 18209067 18262587 18369508 18606505 18748086 18979262
5141A8979262J58482K07384J11673J84256M50956K85020K10017N45960N60206
$$ 18979262 19137744 19345128 19456801 19641057 20092013 20377033 20587050 21133010 21693216
5132B1693216M52479N79808M96458J94391J75704K60689Q7772O0798P1709J93111
$$ 21693216 22145695 22725503 23221961 23416352 23592056 23852745 23940517 24001315 24073024 24266135
5122B4266135K81105L85251K21994J45289K95660M19279L37364L38231L73557
$$ 24266135 24547240 24932491 25154485 25299774 25595434 26014713 26352077 26690308 27063865
5113B7063865K07626K54097K99995L80250M32318M46984M96335O73469R22699
$$ 27063865 27271491 27525588 27825583 28205833 28638151 29085135 29581470 30254939 31177638
5104C1177638Q34389L23549k96164k57669k65459k81743m52972l79006k61877
$$ 31177638 32012027 32335576 32039412 31781743 31516284 31234541 30781569 30402563 30140686
5095C0140686j95346J19668j95022j60872j38125k43594l48842m17359k96736
$$ 30140686 29945340 30065008 29869986 29709114 29570989 29327395 28978553 28561194 28264458
5086B8264458k67509k84030k24940k0443J36249J09087N8892O0988k7700K38861
$$ 28264458 27996949 27712919 27487979 27467536 27603785 27712872 27771764 27832752 27805052 28043913
5076B8043913M5609k84573l84535k48493k05214k75488k96232l10894j87779k70582
$$ 28043913 28089522 27804949 27420414 27171921 26966707 26691219 26394987 26084093 25896314 25625732
5066B5625732j45123j31174j60386j62080k2586l2086j38204L6516J25153l8793
$$ 25625732 25480609 25349435 25189049 25026969 25004383 24972297 24834093 24870609 24995762 24956969
5056B4956969m0134J26758R8603R3322J92275O9383J55060K34324J74582Q9921
$$ 24956969 24916835 25043593 25142196 25235518 25427793 25497176 25652236 25886560 26061142 26151063
5046B6151063K20048J25195J15800J40290M0078O6708J17174L5983r076j1981
$$ 26151063 26371111 26496306 26612106 26752396 26792474 26859182 26976356 27012339 27003263 26991282
5036B6991282N2181N0002J83154J14124O261J67245R4098M7121k9472J27540P6650
$$ 26991282 27043463 27093465 27276619 27390743 27397004 27564249 27658347 27705468 27675996 27803536 27880186
5025B7880186K79081J15719K52266J83853J04108R8012K65472L50055J47581L03137
$$ 27880186 28159267 28274986 28527252 28711105 28815213 28913225 29178697 29528752 29676333 29979470
5015B9979470K92464L56933L28774K50329K07481K34409L53369K60411L56126
$$ 29979470 30271934 30628867 30957641 31207970 31415451 31649860 32003229 32263640 32619766
5006C2619766M22980M81665N36798N90277O84243P33334Q53862P80881R53566
$$ 32619766 33042746 33524411 34061209 34651486 35335729 36069063 36922925 37703806 38657372
4997C8657372J137950J224020J266343J248636J248427J152058Q60151L76000
$$ 38657372 39795322 41019342 42285685 43534321 44782748 45934806 46794957 47170957
4989D7170957K41356K87832J83620K95084N03943N11763N59834P14080R48495
$$ 47170957 47412313 47700145 47883765 48178849 48682792 49194555 49754389 50468469 51416964
4980E1416964R90649R28677J038998R21720Q25785J122491J060747J176190J500415
$$ 51416964 52407613 53336290 54375288 55297008 56122793 57245284 58306031 59482221 60982636
4971F0982636J582995J558507J375474O03355m87661j191538j765851j919247
$$ 60982636 62565631 64124138 65499612 66102967 65615306 64423768 62657917 60738670
4963F0738670j936457j896750j554155j288142j112971r99110r46642q03542r48569
$$ 60738670 58802213 56905463 55351308 54063166 52950195 51951085 51004443 50200901 49252332
4954D9252332o42296o49642o59495o80718m52252l24599l12338k83160l17124
$$ 49252332 48610036 47960394 47300899 46620181 46167929 45843330 45530992 45247832 44930708
4945D4930708m41515p65629j058879j256767j317327j452370j380949j272508
$$ 44930708 44489193 43723564 42664685 41407918 40090591 38638221 37257272 35984764
4937C5984764j133220q62000q54661p99084o70603o52632l82099m40807n76872
$$ 35984764 34851544 33989544 33134883 32335799 31665196 31012564 30630465 30189658 29612786
4928B9612786n31106m71655l63553l80186k42996k48517k82586j79630k34632
$$ 29612786 29081680 28610025 28246472 27866286 27623290 27374773 27092187 26912557 26677925
4919B6677925l37847k21327k84473l20734l27997l58216q3512j47789j91317k80086
$$ 26677925 26340078 26118751 25834278 25513544 25185547 24827331 24743819 24596030 24404713 24124627
4909B4124627k03499j75664j19543j05619p0280k59240j54438j87973j75535k00423
$$ 24124627 23921128 23745464 23625921 23520302 23450022 23190782 23036344 22848371 22672836 22472413
4899B2472413j75719r5638r1396J3109K4777j46089j75290q9631L515k0487j30583
$$ 22472413 22296694 22201056 22109660 22122769 22147546 22001457 21826167 21736536 21740051 21719564 21588981
4888B1588981j58154j35791k13594n2223O2755r2613p9588j01985m8911K9938
$$ 21588981 21430827 21295036 21081442 21029219 21091974 20999361 20919773 20817788 20768877 20798815
4878B0798815k7609o6736k6288q1986o4525o5502l7184q9787j3846m1722j06816
$$ 20798815 20771206 20704470 20678182 20596196 20531671 20466169 20428985 20339198 20325352 20283630 20176814
4867B0176814J2829j77230j5242N3833J05058M1770j1468l7228j70433j81677
$$ 20176814 20189643 20012413 19997171 20051004 20156062 20197832 20186364 20149136 19978703 19797026
4857A9797026k2999j4789o3485J46984j26862j5473j4001J14974m8671J3878N0117
$$ 19797026 19774027 19759238 19695753 19842737 19715875 19700402 19686401 19801375 19752704 19766582 19816699
4846A9816699N7045n5507K6760K8375J27383J6814J54909M8613k958J24092n3414
$$ 19816699 19873744 19818237 19844997 19873372 20000755 20017569 20172478 20221091 20218133 20342225 20288811
4835B0288811N637J7451r6615K7744o4569q2006M0188j06079p0645q8121K707
$$ 20288811 20294448 20311899 20215284 20243028 20178459 20096453 20136641 20030562 19959917 19871796 19874503
4824A9874503J20436k5202R3825j7581j67825J10368J38548M3J04173j5417r200
$$ 19874503 19994939 19969737 20063562 20045981 19878156 19988524 20127072 20127115 20231288 20215871 20206671
4813B0206671Q2881P1207o4441k29187q336k03535j4743L0461q7297k41622M0403
$$ 20206671 20289552 20360759 20296318 20067131 20058795 19855260 19840517 19870978 19783681 19542059 19582462
4802A9582462J1432r5033O2314R3389n3701R6405k4263j00310j22307j04406m8640
$$ 19582462 19593894 19498861 19561175 19654564 19600863 19697268 19673005 19572695 19450388 19345982 19297342
4791A9297342n2729m0913Q0262p4042m9531n3434j20961o0450l3605r2585l2783
$$ 19297342 19244613 19203700 19283962 19209920 19160389 19106955 18985994 18925544 18891939 18799354 18766571
4780A8766571j1472N4538j5549q2573j47969L3923R9716Q8585L5346J13957J18218
$$ 18766571 18755099 18809637 18794088 18711515 18563546 18597469 18697185 18785770 18821116 18935073 19053291
4769A9053291o5968J48213K2599O0569R5799M772R0580J55052J4554K31712L00946
$$ 19053291 18987323 19135536 19158135 19218704 19314503 19319275 19409855 19564907 19579461 19811173 20112119
4758B0112119n3456k22651k68936l43457l69597l49326j22766p4897k53487l30310
$$ 20112119 20058663 19836012 19567076 19223619 18854022 18504696 18381930 18307033 18053546 17723236
4748A7723236J4180p8504j23262o1085L2601j97477p8603j55455m5105l5655j9139
$$ 17723236 17737416 17658912 17535650 17474565 17507166 17309689 17231086 17075631 17030526 16994871 16975732
4737A6975732j27277j57271j2843j54203l4418k7525N2381j14388m7220j6159
$$ 16975732 16848455 16691184 16678341 16524138 16489720 16462195 16514576 16400188 16352968 16336809
4727A6336809Q9597o3607r9329k0034o755q7158k5298l9620l4018q4809o1746
$$ 16336809 16426406 16362799 16263470 16243436 16236681 16149523 16124225 16084605 16050587 15965778 15904032
4716A5904032q6616j05606P4051L6631L5592L1275r0895j07967P009l8294j2710
$$ 15904032 15817416 15711810 15785861 15822492 15858084 15889359 15798464 15690497 15697506 15659212 15646502
4705A5646502P8933R3631J19505J0564j17644M2081J3850j98J1579N13N15O1212
$$ 15646502 15725435 15819066 15938571 15949135 15831491 15873572 15887422 15887224 15898803 15899316 15899831 15961043
4693A5961043P4117j3066J1413Q2000Q2499M5716L9407J04350n8687r1981j1862
$$ 15961043 16035160 16022094 16033507 16115507 16198006 16243722 16283129 16387479 16328792 16236811 16224949
4682A6224949J98151J24695J968o6274j00013k0349Q821R3402j69139j91262M6817
$$ 16224949 16423100 16547795 16549763 16483489 16383476 16363127 16371948 16465350 16296211 16104949 16151766
4671A6151766j38975j26338r7408j02012j01390j455K762l36707J9279N481j10958
$$ 16151766 16012791 15886453 15789045 15687033 15585643 15584188 15586950 15250243 15269522 15275003 15164045
4660A5164045l8816j3812p0260j07078j24112j15995L960p4281m9995j41510j45225
$$ 15164045 15125229 15111417 15041157 14934079 14809967 14693972 14697932 14623651 14573656 14432146 14286921
4649A4286921P8153J61786j03224j49770J9968J42878J21356O1546k4390k8790
$$ 14286921 14365074 14526860 14423636 14273866 14293834 14436712 14558068 14619614 14595224 14566434
4639A4566434K565K5036N5936N3870K6941J3626J17656n4143J58561J46845J4912
$$ 14566434 14568999 14594035 14649971 14703841 14730782 14744408 14862064 14807921 14966482 15113327 15128239
4628A5128239J1126j24276j02651J5771M6250p7460l6990O162K4120m4478P1579
$$ 15128239 15139365 15015089 14912438 14928209 14974459 14896999 14860009 14866171 14890291 14845813 14917392
4617A4917392p1918o5861L0897J1390K3896r8365k24430k38476j15443j24506
$$ 14917392 14845474 14779613 14810510 14821900 14845796 14747431 14523001 14284525 14169082 14044576
4607A4044576j64608r2838m8815q0433q6663j16932r5733j40938m0077j29127
$$ 14044576 13879968 13787130 13738315 13657882 13571219 13454287 13358554 13217616 13177539 13048412
4597A3048412l4276M616l3641r2838m1745m6767L2579r0630q0141j14584j04657
$$ 13048412 13014136 13018752 12985111 12892273 12850528 12803761 12836340 12745710 12665569 12550985 12446328
4586A2446328L8562L9513P8212l9234j15921K7003J05247n2244j07442j37928
$$ 12446328 12484890 12524403 12602615 12563381 12447460 12474463 12579710 12527466 12420024 12282096
4576A2282096N0772n1564k4087N9866l0918o3323O761J0502m1620j508n3258r0709
$$ 12282096 12332868 12281304 12257217 12317083 12286165 12222842 12229603 12240105 12198485 12196977 12143719 12053010
4564A2053010M5422j50421j53013q0282p4537m0982n0017P552l8425L2415j24134
$$ 12053010 12098432 11948011 11794998 11714716 11640179 11599197 11549180 11556732 11518307 11550722 11426588
4553A1426588J0790m0352l4186R0155L9035j72103p5163J35849J04816J3800j4589
$$ 11426588 11437378 11397026 11362840 11452995 11492030 11319927 11244764 11380613 11485429 11499229 11484640
4542A1484640M3042r1366k5281l9972J38782M7073P5225j3213J19978J21816N2969
$$ 11484640 11527682 11436316 11411035 11371063 11509845 11556918 11632143 11618930 11738908 11860724 11913693
4531A1913693J80804O0068N6014J04584J61998K1770j13980n0800j46320m09644
$$ 11913693 12094497 12154565 12210579 12315163 12477161 12498931 12384951 12334151 12187831 11778187
4521A1778187l27621j15425j8835r0287o0098j40471O1217n2990q5133M7795j5112
$$ 11778187 11450566 11335141 11316306 11226019 11165921 11025450 11086667 11033677 10948544 10996339 10981227
4510A0981227o1799L866M8146n3546L1198N9054L4323n6273N1388l1569j1257
$$ 10981227 10919428 10923294 10971440 10917894 10949092 11008146 11042469 10986196 11037584 11006015 10994758
4499A0994758j3123J6377J0054J04556n4764R4527n6911m0036Q5155j760q3162
$$ 10994758 10981635 10998012 11008066 11112622 11057858 11152385 11095474 11055438 11140593 11138833 11055671
4488A1055671O0017N8273r388k4507q7406Q533J10207J63270J36448O0031j27150
$$ 11055671 11115688 11173961 11164573 11140066 11052660 11061193 11171400 11334670 11471118 11531149 11403999
4477A1403999k9656K9078R6885r7464P2944L1614j815l6970J25279m0963P075
$$ 11403999 11374343 11403421 11500306 11402842 11475786 11507400 11505585 11468615 11593894 11552931 11560006
4466A1560006l8626j41982o7935n876j75515j36711n2147M9522J06018l6374J66394
$$ 11560006 11521380 11379398 11311463 11305587 11130072 10993361 10941214 10990736 11096754 11060380 11226774
4455A1226774J3047l9926o1261O6071J75955P3306k6093J5919L1168j0182P0171
$$ 11226774 11239821 11199895 11138634 11204705 11380660 11453966 11427873 11443792 11474960 11464778 11534949
4444A1534949O5854L189J12696Q953J08832L684J42574J44898j1764J4207K6251
$$ 11534949 11600803 11603992 11716688 11725641 11834473 11838157 11980731 12125629 12113865 12128072 12154323
4433A2154323Q2941L3299P4164P6842Q2219O3176l7650R4825M3772k4387R5774
$$ 12154323 12237264 12270563 12344727 12421569 12503788 12566964 12529314 12624139 12667911 12643524 12739298
4422A2739298J37511k615l6358K48598J01303m570K6178J86849Q0721Q4239J11221
$$ 12739298 12876809 12874194 12837836 13086434 13187737 13183167 13209345 13396194 13476915 13561154 13672375
4411A3672375J58313R9056J27613R1602J69566J38182K00339J80795J60872J77583
$$ 13672375 13830688 13929744 14057357 14148959 14318525 14456707 14657046 14837841 14998713 15176296
4401A5176296J92469M1708J15908J06873M5734J53292P5502q2663k5936M7456
$$ 15176296 15368765 15410473 15526381 15633254 15678988 15832280 15907782 15825119 15799183 15846639
4391A5846639m713l0037L6719J47644r6643J50908J17591K60345L7155M0796K77254
$$ 15846639 15841926 15811889 15848608 15996252 15899609 16050517 16168108 16428453 16465608 16506404 16783658
4380A6783658K6117L35053M12495K02529K08859L50946M73868K99592N38716O62470
$$ 16783658 16809775 17144828 17557323 17759852 17968711 18319657 18793525 19093117 19631833 20294303
4370B0294303N66229N94636O73617P73459P24003Q15649J041998J038159J078893
$$ 20294303 20860532 21455168 22128785 22902244 23626247 24441896 25483894 26522053 27600946
4361B7600946R31795Q10304L91278J45007j90761l02071l74173m21567p5147j83091
$$ 27600946 28532741 29343045 29734323 29879330 29688569 29386498 29012325 28590758 28515611 28332520
4351B8332520j2474K97562L34665M76272N29080M88439P62882N11126J20668j78050
$$ 28332520 28320046 28617608 28952273 29428545 29957625 30446064 31208946 31720072 31840740 31662690
4341C1662690o88163q65190q58208r23409r39736p08427o17189m55056l40589
$$ 31662690 30974527 30109337 29251129 28327720 27387984 26679557 26062368 25607312 25266723
4332B5266723k70527j09009k3247r2690p3796K10558K66577J98649M20357O50536
$$ 25266723 24996196 24887187 24863940 24771250 24697454 24908012 25174589 25373238 25793595 26444131
4322B6444131N44983R10989R77872R44482J169001J408641J536354J526554J805733
$$ 26444131 26989114 27900103 28877975 29822457 30991458 32400099 33936453 35463007 37268740
4313C7268740J872812J768375J382777Q23558M5953n84489r50582q25712j026415
$$ 37268740 39141552 40909927 42292704 43116262 43162215 42577726 41627144 40801432 39775017
4304C9775017p77651n45167l41124M5360J48324L80628O49163Q31943O43414L17605
$$ 39775017 38997366 38452199 38111075 38156435 38304759 38685387 39334550 40166493 40809907 41127512
4294D1127512j62044n72730j269609j694833j710867j662477j716949j619770
$$ 41127512 40965468 40392738 39123129 37428296 35717429 34054952 32338003 30718233
4286C0718233j327118j059140q55240q03346o33239n10646n23699l47475l22388
$$ 30718233 29391115 28331975 27476735 26673389 26040150 25529504 25005805 24658330 24335942
4277B4335942l20113k71502o9611n16m2452k1623L0236r315J9948L4602j3376
$$ 24335942 24015829 23744327 23674716 23674200 23631748 23610125 23640361 23631046 23650994 23685596 23672220
4266B3672220K8343J1473j46840N6160J05797J51218P1551J58497R0994J58384
$$ 23672220 23700563 23712036 23565196 23621356 23727153 23878371 23949922 24108419 24199413 24357797
4256B4357797Q4513J94624K07695J56760K42142L47050K86304K50100M86891L11967
$$ 24357797 24442310 24636934 24844629 25001389 25243531 25590581 25876885 26126985 26613876 26925843
4246B6925843M74494N19065M91080O28385N95452N57059Q25952R79534J087134
$$ 26925843 27400337 27919402 28410482 29038867 29634319 30191378 31017330 31996864 33083998
4237C3083998J116340J239416J462394J464127J566488J328132Q31681J32123
$$ 33083998 34200338 35439754 36902148 38366275 39932763 41260895 42092576 42224699
4229D2224699n38243r16225j463707j589289j400117j368902j179159r44598q05316
$$ 42224699 41686456 40770231 39306524 37717235 36317118 34948216 33769057 32824459 32019143
4220C2019143n99368n46468l14721j20907k00845Q2524P2037K59100M74371N12801
$$ 32019143 31419775 30873307 30558586 30437679 30236834 30319358 30391395 30650495 31124866 31637667
4210C1637667N00689O22311P62527Q57829P71462R77765J292774J269727J444964
$$ 31637667 32138356 32760667 33523194 34381023 35152485 36130250 37423024 38692751 40137715
4201D0137715J397089J228608J000730L26941p48730r52386j256177j227041j386854
$$ 40137715 41534804 42763412 43764142 44091083 43342353 42389967 41133790 39906749 38519895
4192C8519895j262319q90838p63424o09822k65467o8402N5257J27093L12116K71676
$$ 38519895 37257576 36366738 35603314 34993492 34728025 34659623 34714880 34841973 35154089 35425765
4182C5425765J18044J6611n79393q19322r94646r94550r99614r12405p62834p50139
$$ 35425765 35543809 35560420 34981027 34161705 33167059 32172509 31172895 30260490 29497656 28747517
4172B8747517n39252l59089k80313m29246k38149j82912k6202m8695L17J68630
$$ 28747517 28208265 27849176 27568863 27139617 26901468 26718556 26692354 26643659 26643976 26812606
4162B6812606M4084K06738K52983K70017K75535J52659L03164M09402L76409L12570
$$ 26812606 26856690 27063428 27316411 27586428 27861963 28014622 28317786 28727188 29103597 29416167
4152B9416167L68785L19075O5603k13073n23989p74461p81640q43330q29125r36671
$$ 29416167 29784952 30104027 30169630 29956557 29432568 28658107 27876467 27033137 26204012 25267341
4142B5267341o56485m36835m55953l49075l98784m03407k90794k52784k65892
$$ 25267341 24610856 24174021 23718068 23368993 22970209 22566802 22276008 22023224 21757332
4133B1757332l44177j57478k6432k33973l25141p7346j10149k85232k73964k91585
$$ 21757332 21413155 21255677 21229245 20995272 20670131 20592785 20482636 20197404 19923440 19631855
4123A9631855j57830l23552j81615j45160k01636j78076n4296j60666j62060K3114
$$ 19631855 19474025 19150473 18968858 18823698 18622062 18443986 18389690 18229024 18066964 18090078
4113A8090078k639p6631j0294j58192M3614l9696O8133P7671j5063k4428J92578
$$ 18090078 18087439 18010808 18000514 17842322 17885936 17846240 17914373 17992044 17976981 17952553 18145131
4102A8145131M6530j9582J29528O4794J50517L4576k0054R6088R7037J87722O3077
$$ 18145131 18191661 18172079 18301607 18366401 18516918 18551494 18531440 18627528 18724565 18912287 18975364
4091A8975364M4221r4866R005O7315L8758j21822k1228j46640j58244j71879o2373
$$ 18975364 19019585 18924719 18933724 19001039 19039797 18917975 18896747 18750107 18591863 18419984 18357611
4080A8357611j49137j45685J0998o9426j06974j62121m4345o3022L0029o8406
$$ 18357611 18208474 18062789 18073787 18004361 17897387 17735266 17690921 17627899 17657928 17589522
4070A7589522k024r1760L9624K3678o1107n9578J61028P1987Q3551O4231O4852
$$ 17589522 17587498 17495738 17535362 17559040 17497933 17438355 17599383 17671370 17754921 17819152 17884004
4059A7884004J17785J67797M0980K5582J24693J71298J24288J72627K3542J29940
$$ 17884004 18001789 18169586 18210566 18236148 18360841 18532139 18656427 18829054 18852596 18982536
4049A8982536O4428J91908O9496R1209P8563R5607J73865r593K47260L1822M6601
$$ 18982536 19046964 19238872 19308368 19399577 19478140 19573747 19747612 19738019 19985279 20017101 20063702
4038B0063702J60456K416P5494K24859J21419L6799l3696K86771K37041K9550
$$ 20063702 20224158 20226574 20302068 20526927 20648346 20685145 20651449 20938220 21175261 21204811
4028B1204811N5783M38465M38221M57899M22275K6541j49723j63388J7625j23683
$$ 21204811 21260594 21699059 22137280 22595179 23017454 23043995 22894272 22730884 22748509 22624826
4018B2624826J8147N3027J57692K86174M11865L04930K60483J51035M5150j19044
$$ 22624826 22642973 22696000 22853692 23139866 23551731 23856661 24117144 24268179 24313329 24194285
4008B4194285j58339l8459j28087q3291P822J55023J42840K25059J54332N00284
$$ 24194285 24035946 23997487 23869400 23786109 23793931 23948954 24091794 24316853 24471185 24971469
3998B4971469N48116N66501N38191N73409P37126R49478Q74623O91228Q97646
$$ 24971469 25519585 26086086 26624277 27197686 27934812 28884290 29758913 30450141 31347787
3989C1347787N19058k17028o87204q01042r67097q54124p23157m64215k69323
$$ 31347787 31866845 31649817 30962613 30161571 29194474 28340350 27617193 27152978 26883655
3980B6883655k23352k50800j13282j88308P5725j00991j35250N2145N3584J1066
$$ 26883655 26660303 26409503 26296221 26107913 26183638 26082647 25947397 25999542 26053126 26064192
3970B6064192J40631J38513J27155K8219J64350L26514J84837K33341J89533K95533
$$ 26064192 26204823 26343336 26470491 26498710 26663060 26989574 27174411 27407752 27597285 27892818
3960B7892818L74348M41665M29176N69580L96474M79832M81979O06332M57323
$$ 27892818 28267166 28708831 29138007 29707587 30104061 30583893 31065872 31672204 32129527
3951C2129527M39757L64364M00822K84234K26716L21287L00466K20578K72645
$$ 32129527 32569284 32933648 33334470 33618704 33845420 34166707 34467173 34687751 34960396
3942C4960396M22833M14662L43784L76368N31758M23350N15681P08937P65553
$$ 34960396 35383229 35797891 36141675 36518043 37049801 37473151 37988832 38697769 39463322
3933C9463322Q85246J102143J190217J286467J313087J544605J761778J921176
$$ 39463322 40348568 41450711 42640928 43927395 45240482 46785087 48546865 50468041
3925E0468041J802965J893401J999297K015679K168862K312422K666058K977060
$$ 50468041 52271006 54164407 56163704 58179383 60348245 62660667 65326725 68303785
3917F8303785L156680L652961M083383M764421N499969O101711O933356P708609
$$ 68303785 71460465 75113426 79196809 83961230 89461199 95562910 102496266 110204875
3909A10204875Q607274R611190J0900965J1977166J3822081J6185173J8194628
$$ 110204875 118812149 128423339 139324304 151301470 165123551 181308724 199503352
3902A99503352J9993839K1957743K4621357K5894968J9968673N529047j0918243
$$ 199503352 219497191 241454934 266076291 291971259 311939932 317468979 306550736
3895C06550736k1139942k5361543k7036531k6853696k4255072k0029816j6186164
$$ 306550736 285410794 260049251 233012720 206159024 181903952 161874136 145687972
3888A45687972j3071405j0853205r057513p714971o353659n318112m418105l798122
$$ 145687972 132616567 121763362 112705849 104990878 98637219 93319107 88901002 85102880
3880H5102880l431062k995744k672874k200539j795533j230263q71448p24881
$$ 85102880 81671818 78676074 76003200 73802661 72007128 70776865 69905417 69180536
3872F9180536o16527q39733j184526j724669j947046k091879k132427k006882
$$ 69180536 68564009 67724276 66539750 64815081 62868035 60776156 58643729 56636847
3864E6636847j727262j637804j392895j041510j097802r98917r91308r96111q03921
$$ 56636847 54909585 53271781 51878886 50837376 49739574 48740657 47749349 46753238 45949317
3855D5949317j007175q88194p96148p47681q56883r38315p07217r22794o52615
$$ 45949317 44942142 44053948 43257800 42510119 41653236 40714921 40007704 39084910 38432295
3846C8432295o62939o35373n20668m42666l42249k69697j55888k0866n6865k76329
$$ 38432295 37769356 37133983 36613315 36170649 35828400 35558703 35402815 35381949 35325084 35048755
3836C5048755m56926n60533n52875n99648n06745m27071l92967m06719k73831
$$ 35048755 34591829 34031296 33478421 32878773 32372028 31944957 31551990 31145271 30871440
3827C0871440k58227j82688k06292k96036l27760l76071l56462m75949k81753
$$ 30871440 30613213 30430525 30224233 29928197 29600437 29224366 28867904 28391955 28110202
3818B8110202k22310k90255l01648j78358o0697j21198j22940m2551N4401L2460
$$ 28110202 27887892 27597637 27295989 27117631 27056934 26935736 26812796 26770245 26824646 26857106
3808B6857106j20199J24371J29208n8531K7051P2146K08044J42619J25104L41340
$$ 26857106 26736907 26861278 26990486 26931955 26959006 27031152 27239196 27381815 27506919 27848259
3798B7848259L54770K08353L97733K56695K20497M22545N42769M10164L72818
$$ 27848259 28203029 28411382 28809115 29065810 29286307 29708852 30251621 30661785 31034603
3789C1034603N65771M24018M31110N55309O43597N13185O24924O64284O61522
$$ 31034603 31600374 32024392 32455502 33010811 33654408 34167593 34792517 35456801 36118323
3780C6118323P16466Q42383R21607P38350Q64779R97905R08589J018876J190392
$$ 36118323 36834789 37677172 38598779 39337129 40201908 41199813 42108402 43127278 44317670
3771D4317670J237525J396363J405576J266451J555543J762452J715950J854430
$$ 44317670 45555195 46951558 48357134 49623585 51179128 52941580 54657530 56511960
3763E6511960J817354K052120K182263K342905K321546K542010K592969K772802
$$ 56511960 58329314 60381434 62563697 64906602 67228148 69770158 72363127 75135929
3755G5135929K842771L011331L194031L277688L471747L720233L862448L750431
$$ 75135929 77978700 80990031 84184062 87461750 90933497 94653730 98516178 102266609
3747A02266609M085784M264992M329150M274997M253696M391256M344778M517683
$$ 102266609 106352393 110617385 114946535 119221532 123475228 127866484 132211262 136728945
3739A36728945M557660M591686M557111M685962M451849M357386M285487L870262
$$ 136728945 141286605 145878291 150435402 155121364 159573213 163930599 168216086 172086348
3731A72086348L794988L528345L286291L188616K766911K602220K404320K295920
$$ 172086348 175881336 179409681 182695972 185884588 188651499 191253719 193658039 195953959
3723A95953959J938344J530448J364458R76306O22368L05152L3970l75326r34526
$$ 195953959 197892303 199422751 200787209 201763515 202385883 202691035 202725005 202349679 201415153
3714B01415153j547323j923482k309849k799653l061732l280279l725586l577172
$$ 201415153 199867830 197944348 195634499 192834846 189773114 186492835 182767249 179190077
3706A79190077l924887m010625m197501m250443m499046m481119m562361m500930
$$ 179190077 175265190 171254565 167057064 162806621 158307575 153826456 149264095 144763165
3698A44763165m214859m330177m354335m070927m100075m053928l915132m019275
$$ 144763165 140548306 136218129 131863794 127792867 123692792 119638864 115723732 111704457
3690A11704457m151649m061909l926777l865732l661614l484510l542013l190947
$$ 111704457 107552808 103490899 99564122 95698390 92036776 88552266 85010253 81819306
3682H1819306k906637k820056k670642k454619k242550k220116k132412j889444
$$ 81819306 78912669 76092613 73421971 70967352 68724802 66504686 64372274 62482830
3674F2482830j983954j784576j576732j658725j494539j511506j381285j279307
$$ 62482830 60498876 58714300 57137568 55478843 53984304 52472798 51091513 49812206
3666D9812206j227240j100894j045711r99249q99436r80022q10922q28865q78163
$$ 49812206 48584966 47484072 46438361 45439112 44539676 43559654 42748732 41919867 41041704
3657D1041704j056526r32886q51581q81258o95331p10669o78589o49967o75594
$$ 41041704 39985178 39052292 38200711 37319453 36624122 35913453 35234864 34584897 33909303
3648C3909303m65767m79685m78118l41961l38925l33444k78908k43338l02828
$$ 33909303 33443536 32963851 32485733 32143772 31804847 31471403 31192495 30949157 30646329
3639C0646329l71149j85540l21145m06599l88113n07203n68645n72774n13394
$$ 30646329 30275180 30089640 29768495 29361896 28973783 28466580 27897935 27325161 26811767
3630B6811767m80406m97112m25463l63672m42620k65348l29288l66421j17741
$$ 26811767 26331361 25834249 25408786 25045114 24602494 24337146 24007858 23641437 23523696
3621B3523696k78524j68376r9198j71953j18694j08395j17479o4778L9699k37711
$$ 23523696 23245172 23076796 22977598 22805645 22686951 22578556 22461077 22396299 22435998 22198287
3611B2198287n4705k6662k86837o0065k27959n6980j31047k65697k11855m7691
$$ 22198287 22143582 22116920 21830083 21770018 21542059 21485079 21354032 21088335 20876480 20828789
3601B0828789j9112j01853j21369p9149k2380J4902M7793L7435p728K997q459
$$ 20828789 20809677 20707824 20586455 20507306 20484926 20499828 20547621 20585056 20577328 20580325 20571866
3590B0571866Q6093J61577J11525K27821K26366P0424J81597L64322L09233M07720
$$ 20571866 20657959 20819536 20931061 21158882 21385248 21455672 21637269 22001591 22310824 22718544
3580B2718544L63395J25919R7162k6757P6074j20290j15038j61966N3134J73294
$$ 22718544 23081939 23207858 23305020 23278263 23354337 23234047 23119009 22957043 23010177 23183471
3570B3183471K02636K47632K99250K25289K43914K24784J35674L0015j3431p1769
$$ 23183471 23386107 23633739 23932989 24158278 24402192 24626976 24762650 24792665 24779234 24707465
3560B4707465J58244J98768P995M28155M74360O66124O70945Q48428L59109k41463
$$ 24707465 24865709 25064477 25072472 25500627 25974987 26641111 27312056 28160484 28519593 28278130
3550B8278130p08379n69686r00441p87716n07410j58818j43062j68975j6353q3961
$$ 28278130 27569751 27000065 26099624 25311908 24804498 24645680 24502618 24333643 24317290 24233329
3540B4233329q2715K7541j7954j15462j52216k72041l64635k57725k75251j64339
$$ 24233329 24150614 24178155 24160201 24044739 23892523 23620482 23255847 22998122 22722871 22558532
3530B2558532R016N2247J01511J09113J45793J35517o5039k60540k04839k51715
$$ 22558532 22567548 22619795 22721306 22830419 22976212 23111729 23046690 22786150 22581311 22329596
3520B2329596j64125j11210m3608n6307n1648M0191O7582J37450J84019J46434
$$ 22329596 22165471 22054261 22010653 21954346 21902698 21942889 22010471 22147921 22331940 22478374
3510B2478374k5870K86636K91654N8430K27121L13510L86348L25257K85095K53374
$$ 22478374 22452504 22739140 23030794 23089224 23316345 23629855 24016203 24341460 24626555 24879929
3500B4879929M00292L98906M26275L05374L70620N48191L08603L92804M62915
$$ 24879929 25280221 25679127 26105402 26410776 26781396 27329587 27638190 28030994 28493909
3491B8493909M50267M90199M03323M65117N60162N57344P23575P30132N33904
$$ 28493909 28944176 29434375 29837698 30302815 30862977 31420321 32143896 32874028 33407932
3482C3407932O64288Q14221P10711O94432Q28636Q27382Q46908R84994R90825
$$ 33407932 34072220 34886441 35597152 36291584 37120220 37947602 38794510 39779504 40770329
3473D0770329J036908J082287J169303J107633J133394J311414J235222J354304
$$ 40770329 41807237 42889524 44058827 45166460 46299854 47611268 48846490 50200794
3465E0200794J463897J339618J257225J468995J474466J589841J589703J706711
$$ 50200794 51664691 53004309 54261534 55730529 57204995 58794836 60384539 62091250
3457F2091250J736055J685119J889889J984031J933963J935495J873577K089774
$$ 62091250 63827305 65512424 67402313 69386344 71320307 73255802 75129379 77219153
3449G7219153K122726K292862K395114K284630K344156K531257K443577K362835
$$ 77219153 79341879 81634741 84029855 86314485 88658641 91189898 93633475 95996310
3441I5996310K380496K277143K448076K463480K241472K255391K506456K349848
$$ 95996310 98376806 100653949 103102025 105565505 107806977 110062368 112568824 114918672
3433A14918672K201955K197570J956737J860004J604254J563691J502318J540770
$$ 114918672 117120627 119318197 121274934 123134938 124739192 126302883 127805201 129345971
3425A29345971J611267J593766J778901J792477J689259J837333J859292J858970
$$ 129345971 130957238 132551004 134329905 136122382 137811641 139648974 141508266 143367236
3417A43367236K005300K093659J847051K067389K311866K439462K629270K911957
$$ 143367236 145372536 147466195 149313246 151380635 153692501 156131963 158761233 161673190
3409A61673190L023637L456498L792325L928590M080080M467105M719891M829138
$$ 161673190 164696827 168153325 171945650 175874240 179954320 184421425 189141316 193970454
3401A93970454N272323N464375N840976O019306O241003O557514O732602O773516
$$ 193970454 199242777 204707152 210548128 216567434 222808437 229365951 236098553 242872069
3393B42872069O717506O697570O977413P003294O861594O685870O835020O733972
$$ 242872069 249589575 256287145 263264558 270267852 277129446 283815316 290650336 297384308
3385B97384308O710010O544501O243293N874686N338955N092977M879614M313553
$$ 297384308 304094318 310638819 316882112 322756798 328095753 333188730 338068344 342381897
3377C42381897L934294L420154K892332L015687L082665K986403L048223L199662
$$ 342381897 346316191 349736345 352628677 355644364 358727029 361713432 364761655 367961317
3369C67961317L614189L514707L399965L499870L549781L546317L738929L956139
$$ 367961317 371575506 375090213 378490178 381990048 385539829 389086146 392825075 396781214
3361C96781214M098067M389429M841572M994352N178794N101698M819891M094655
$$ 396781214 400879281 405268710 410110282 415104634 420283428 425385126 430205017 434299672
3353D34299672K839258J738419P53619K11526k62651p00514r47688j039395j426740
$$ 434299672 437138930 438877349 439630968 439842494 439579843 438879329 437931641 436892246 435465506
3344D35465506j830768k055523k614030l151718l670538m075141m477285m340418
$$ 435465506 433634738 431579215 428965185 425813467 422142929 418067788 413590503 409250085
3336D09250085m289692m082385l348760k655121k156591j333990p34225j87188
$$ 409250085 404960393 400878008 397529248 394874127 392717536 391383546 390649321 390462133
3328C90462133N09136J332920K316084L287958M167603M817331N215233N063273
$$ 390462133 390971269 392304189 394620273 397908231 402075834 406893165 412108398 417171671
3320D17171671M582026L729181K455475J168227J0645j094906k266816k877994
$$ 417171671 421753697 425482878 427938353 429106580 429117225 428022319 425755503 422877509
3312D22877509l367254l877285m212357m860592n766141o819324q068199r451069
$$ 422877509 419510255 415632970 411420613 406560021 400793880 393974556 385906357 376455288
3304C76455288j0836900j2000234j2966798j3412192j3623493j3245508j2612238
$$ 376455288 365618388 353618154 340651356 327239164 313615671 300370163 287757925
3297B87757925j1989075j1241169j0439837r458668q793789q167973p656701o853376
$$ 287757925 275768850 264527681 254087844 244629176 235835387 227667414 220010713 213157337
3289B13157337o568166o112111n882930n398574n149030m785072m744960m587482
$$ 213157337 206589171 200477060 194594130 189195556 184046526 179261454 174516494 169929012
3281A69929012m352619m215340m145066m088395m032068l848984l768846l639491
$$ 169929012 165576393 161361053 157215987 153127592 149095524 145246540 141477694 137838203
3273A37838203l549670l519956l348468l189521l403449l141685l048249l146222
$$ 137838203 134288533 130768577 127420109 124230588 120827139 117685454 114637205 111490983
3265A11490983k845225k838828k786192k636297k456822k279788k345344k163513
$$ 111490983 108645758 105806930 103020738 100384441 97927619 95647831 93302487 91138974
3257I1138974k012075k066478k004025j836101j882401j822539j831671j622731
$$ 91138974 89126899 87060421 85056396 83220295 81337894 79515355 77683684 76060953
3249G6060953j690013j625232j417400j379112j336891j212809j131581j283182
$$ 76060953 74370940 72745708 71328308 69949196 68612305 67399496 66267915 64984733
3241F4984733j057876j047810r87900r19465r48962p94026q98072p98863q01418
$$ 64984733 63926857 62879047 61891147 60971682 60022720 59228694 58330622 57531759 56730341
3232E6730341q27597o21576p81533n93435o36754o46377p54228o44485o30015
$$ 56730341 55902744 55281168 54499635 53906200 53269446 52623069 51868841 51224356 50594341
3223E0594341o34143p30550o11078o90799p25214p51950o59800o50356p14376
$$ 50594341 49960198 49229648 48618570 47927771 47202557 46450607 45790807 45140451 44426075
3214D4426075p61302o40386n69437n68985n51484n42022n14874n80831o32268
$$ 44426075 43664773 43024387 42454950 41885965 41334481 40792459 40277585 39696754 39064486
3205C9064486o30084o62699o69982o46009n68372o65151o13943m64972l83287
$$ 39064486 38434402 37771703 37101721 36455712 35887340 35222189 34608246 34143274 33759987
3196C3759987m95262k75545l38662m32898m41557l52538n02880m98115m89798
$$ 33759987 33264725 32989180 32650518 32217620 31776063 31423525 30920645 30422530 29932732
3187B9932732m04658m10812k83499m14035m19100k84533m44652m41693m12383
$$ 29932732 29528074 29117262 28833763 28419728 28000628 27716095 27271443 26829750 26417367
3178B6417367m63657k88508k19986k49109m07210k68638j16408k77306l31602
$$ 26417367 25953710 25665202 25445216 25196107 24788897 24520259 24403851 24126545 23794943
3169B3794943l53084j13408k26900q5956k37376m1827j92650k30344k43727j85876
$$ 23794943 23441859 23328451 23101551 23015595 22778219 22736392 22543742 22313398 22069671 21883795
3159B1883795j67989o2105q6584j57205j56046j64592k22751k24361k31828j60429
$$ 21883795 21715806 21653701 21567117 21409912 21253866 21089274 20866523 20642162 20410334 20249905
3149B0249905k03885p5183j51424j39403o7478j16677m4557o9898r3164j5638
$$ 20249905 20046020 19970837 19819413 19680010 19612532 19495855 19451298 19381400 19288236 19272598
3139A9272598P67n8851n9360J49551K15574J22849P3289L5403P3177Q7534n0485
$$ 19272598 19273365 19214514 19155154 19304705 19520279 19643128 19716417 19751820 19824997 19912531 19862046
3128A9862046j35401l27503j53757j85082l29459j15102j14562o9468j80064n1530
$$ 19862046 19726645 19399142 19245385 19060303 18730844 18615742 18501180 18431712 18251648 18200118
3118A8200118p14j25018J7409J09159O3651J18189N8213O1665j3701Q1311r120
$$ 18200118 18199404 18074386 18091795 18200954 18264605 18382794 18441007 18502672 18488971 18570282 18561162
3107A8561162J18671K6992q5272j24827j18979l1004n4752L5567p7027j86404
$$ 18561162 18679833 18706825 18621553 18496726 18377747 18346743 18291991 18327558 18250531 18064127
3097A8064127J25868N942j5756O5510K12062J56761J48814K17847J10627J44407
$$ 18064127 18189995 18195937 18180181 18245691 18457753 18614514 18763328 18981175 19091802 19236209
3087A9236209J83400J93548J06602L10116J85953K10344K14885L09533K99679
$$ 19236209 19419609 19613157 19719759 20029875 20215828 20426172 20641057 20950590 21250269
3078B1250269N8470n3351m394k13912k50347q3668k28342l18489l02011k05627
$$ 21250269 21308739 21255388 21250994 21037082 20786735 20703067 20474725 20156236 19854225 19648598
3068A9648598j85874j90162j44880q9996n6096o0603J5863o2985j3100k05890
$$ 19648598 19462724 19272562 19127682 19037686 18981590 18920987 18936850 18873865 18860765 18654875
3058A8654875j32273j33525j44705q4101k11042j76084j64128j55950j28298j94743
$$ 18654875 18522602 18389077 18244372 18160271 17949229 17773145 17609017 17453067 17324769 17130026
3048A7130026N9580l0626k76655k03848k3451j49316q2847j2686j25449o6159
$$ 17130026 17189606 17158980 16882325 16678477 16655026 16505710 16422863 16410177 16284728 16218569
3038A6218569r7240j42742j21442N8223L0836O4622r2470L1413n3102l2401j10056
$$ 16218569 16121329 15978587 15857145 15915368 15946204 16010826 15918356 15949769 15896667 15864266 15754210
3027A5754210k65861r4545j04924j37060P01K749O0923P5324J96456K23177K80021
$$ 15754210 15488349 15393804 15288880 15151820 15152521 15155270 15216193 15291517 15487973 15711150 15991171
3016A5991171l1200n8134P618N1782R1850M2529k2205j19191m1646K2971N4361
$$ 15991171 15959971 15901837 15909455 15961237 16053087 16095616 16073411 15954220 15912574 15935545 15989906
3005A5989906K1927J34875L7189J7222K13281Q140J12431K84329K34069m4594
$$ 15989906 16011833 16146708 16183897 16201119 16414400 16422540 16534971 16819300 17053369 17008775
2995A7008775K458M7904P120J20947K79499K89876L12991K66033J92025L93814
$$ 17008775 17011233 17059137 17066257 17187204 17466703 17756579 18069570 18335603 18527628 18921442
2985A8921442L71050M42607N95011N27870O43472O93228M01722k2132j79808l12599
$$ 18921442 19292492 19735099 20330110 20857980 21501452 22194680 22596402 22574270 22394462 22081863
2975B2081863n03027k22493m86646l99579l08260k07390l15821j87222j87370
$$ 22081863 21578836 21356343 20869697 20470118 20161858 19954468 19638647 19451425 19264055
2966A9264055j82876j79482N0968j3905R6121l378L83011M19181K80079N24200
$$ 19264055 19081179 18901697 18952665 18938760 19034881 19031503 19414514 19833695 20113774 20637974
2956B0637974O61320P76495M29821J65481k86407m32117k12609l12678l79705
$$ 20637974 21299294 22075789 22505610 22671091 22384684 21952567 21739958 21427280 21047575
2947B1047575j81582l16171l32099m64612o12567m99802l48284o12579l62096
$$ 21047575 20865993 20549822 20217723 19753111 19140544 18640742 18292458 17679879 17317783
2938A7317783k35619k26286k25114k86704k10128j69912j38238q70m2969j21230
$$ 17317783 17082164 16855878 16630764 16344060 16133932 15964020 15825782 15824912 15781943 15660713
2928A5660713R107J1020j9499L8910k9179j3923K16346J87927M9651J3338k27959
$$ 15660713 15669820 15680840 15661341 15700251 15671072 15657149 15873495 16061422 16111073 16124411 15896452
2917A5896452l21998l30818k51596j88102k76589k20393j73082k01540j67632
$$ 15896452 15574454 15243636 14992040 14803938 14527349 14306956 14133874 13932334 13764702
2908A3764702j92654j55672k11446q5145r9471l9690l8821j22942j10511j85353
$$ 13764702 13572048 13416376 13204930 13119785 13020314 12980624 12941803 12818861 12708350 12522997
2898A2522997l8993P0331L2814K8129K5569k7673M1640N297m4611p4485n6058
$$ 12522997 12484004 12554335 12587149 12615278 12640847 12613174 12654814 12660111 12615500 12541015 12484957
2887A2484957l9O6j02241r289j02519m460J7123M3900L0812o6940O4229J61300
$$ 12484957 12484918 12484984 12382743 12373454 12270935 12266475 12283598 12327498 12358310 12291370 12355599 12516899
2875A2516899K2460p5835K0787k9802J11608J24844L0401q7925Q262J18123J14346
$$ 12516899 12539359 12463524 12484311 12454509 12566117 12690961 12721362 12633437 12641699 12759822 12874168
2864A2874168j51697j53561j30951r0411k0361N9744j62420n511J6307k03033
$$ 12874168 12722471 12568910 12437959 12347548 12327187 12386931 12224511 12219000 12235307 12032274
2854A2032274O7443j25116j49103O5673j31479j89527j50668p2666o4022j65890
$$ 12032274 12099717 11974601 11825498 11891171 11759692 11570165 11419497 11346831 11282809 11116919
2844A1116919n4708K6156j28337k07324P5770n012l0083j21529r7829l3532o3229
$$ 11116919 11062211 11088367 10960030 10752706 10828476 10823464 10793381 10671852 10574023 10540491 10477262
2833A0477262j911J7573q6303Q015j47430k60621j62457k11616n1960j88703k95827
$$ 10477262 10475351 10492924 10406621 10414636 10267206 10006585 9844128 9632512 9580552 9391849 9096022
2822I096022k27808j22913j94982j98600k53380j49803j61992j03546j44401j17675
$$ 9096022 8868214 8745301 8550319 8351719 8098339 7948536 7786544 7682998 7538597 7420922
2812G420922j59525l7669j20509o6812P4382k00776j00545l1055J21428r1324
$$ 7420922 7261397 7223728 7103219 7036407 7110789 6910013 6809468 6778413 6899841 6808517
2802F808517j2528l5942r061m9184M0272Q7869k3344j56273o7463j36814m1743
$$ 6808517 6795989 6760047 6750986 6701802 6742074 6829943 6806599 6650326 6582863 6446049 6404306
2791F404306K39r2952n8249q1610j14660j43063p5135O8921o7457j5791l3517
$$ 6404306 6404545 6311593 6253344 6171734 6057074 5914011 5838876 5907797 5840340 5824549 5791032
2780E791032j12801j03689j02442j2272r38m1340m2961J00333n1822j08946J1393
$$ 5791032 5678231 5574542 5472100 5459828 5458890 5417550 5374589 5474922 5423100 5314154 5325547
2769E325547j9058k0454j03933j1290O9331n6143j89311M6758J9549r2931o5651
$$ 5325547 5306489 5286035 5182102 5170812 5240143 5184000 4994689 5041447 5060996 4968065 4902414
2758D902414O8810N4371l7901J7196j4418M0492m9912M0808K3620O0346p4888
$$ 4902414 4971224 5025595 4987694 5004890 4990472 5030964 4981052 5021860 5045480 5105826 5030938
2747E030938L5436P3035p5322p5587J17579J29087o6003J1979k4838l0933P0230
$$ 5030938 5066374 5139409 5064087 4988500 5106079 5235166 5169163 5181142 5156304 5125371 5195601
2736E195601J08383j33743p9826K29435O4608J8880J43380M0704M9636J33166
$$ 5195601 5303984 5170241 5090415 5319850 5384458 5403338 5546718 5587422 5637058 5770224
2726E770224k0371O4554L2064L7437M4397K6410q9936j2236l0801j34328p4493
$$ 5770224 5749853 5814407 5846471 5883908 5928305 5954715 5864779 5852543 5821742 5687414 5612921
2715E612921j14478J7655j1604m2549l1386j1459O9973m3071O8307M4536Q1382
$$ 5612921 5498443 5516098 5504494 5461945 5430559 5419100 5489073 5446002 5514309 5558845 5640227
2704E640227P2830J00017n769J5189m7582P3232j72447j20947p6095j26377j13037
$$ 5640227 5713057 5813074 5807305 5822494 5774912 5848144 5675697 5554750 5478655 5352278 5239241
2693E239241k58174L8054P9989O7474J06021k0616k7825J92250J82985n4248o6087
$$ 5239241 4981067 5019121 5099110 5166584 5272605 5251989 5224164 5416414 5599399 5545151 5479064
2682E479064j49162j95478j51953j85928j84417k52315j33098j39210j31309m3239
$$ 5479064 5329902 5134424 4982471 4796543 4612126 4359811 4226713 4087503 3956194 3912955
2672C912955j93203j74324m8775r0120K5468l0932j85483j07896k7384k0523l2307
$$ 3912955 3719752 3545428 3496653 3406533 3432001 3401069 3215586 3107690 3080306 3059783 3027476
2661C027476j35310k9151j13458M0065q1405m0312j0308o4912l8938r843n7829
$$ 3027476 2892166 2863015 2749557 2789622 2708217 2667905 2657597 2592685 2553747 2543904 2486075
2650B486075l5212L1129M6815p4556j31115o1683m5143n6464M1576l9068o8552
$$ 2486075 2450863 2481992 2528807 2454251 2323136 2261453 2216310 2159846 2201422 2162354 2093802
2639B093802M6415n5253j4616L5171j7485n0454Q018J6908K2792k6847m7757j1536
$$ 2093802 2140217 2084964 2070348 2105519 2088034 2037580 2045598 2062506 2085298 2058451 2010694 1999158
2627A999158M6026L917j35863j70261J66819L6878j60472o8061L9196P3884q5183
$$ 1999158 2045184 2049101 1913238 1742977 1909796 1946674 1786202 1718141 1757337 1831221 1746038
2616A746038m6342J64074k6296q0363j8637j09009P4567R3151p8072j32197J519
$$ 1746038 1699696 1863770 1837474 1757111 1738474 1629465 1704032 1797183 1719111 1586914 1588433
2605A588433P3219Q1691m2804n407M9626r7896R893n8631r2613l9770N5362J26054
$$ 1588433 1661652 1743343 1700539 1695132 1744758 1646862 1656755 1598124 1505511 1465741 1521103 1647157
2593A647157j76633p7757j6066J95551K8652j09250K3701L546j1986J25153m8773
$$ 1647157 1470524 1392767 1376701 1572252 1600904 1491654 1515355 1518901 1506915 1632068 1583295
2582A583295j29604L4343r4604m7077j08096J25909R7128J7977n628m6354M8221
$$ 1583295 1453691 1488034 1393430 1346353 1238257 1364166 1461294 1479271 1473643 1427289 1475510
2571A475510l2813M7014j54938Q0154Q1718n9808l6004L7843r4602k5065J86607
$$ 1475510 1442697 1489711 1334773 1414927 1496645 1436837 1400833 1438676 1344074 1319009 1505616
2560A505616p4476m9546l4908J27418p5350q3704N8327O1808r1962r8610N652
$$ 1505616 1431140 1381594 1346686 1474104 1398754 1315050 1373377 1435185 1343223 1244613 1250265
2549A250265L9597K7159P3382O866J9561p2503Q4819J5170R112Q8395k8564N4093
$$ 1250265 1289862 1317021 1390403 1397269 1416830 1344327 1429146 1444316 1453428 1541823 1513259 1567352
2537A567352j18827l1041o2078P8091N2892k6502p7885Q3202j2491Q0371R8150
$$ 1567352 1448525 1417484 1355406 1433497 1486389 1459887 1382002 1465204 1452713 1533084 1631234
2526A631234j32082N8027k3248p0712P6409L7069n9612n5141N8013Q7634M8762
$$ 1631234 1499152 1557179 1533931 1463219 1539628 1576697 1517085 1461944 1519957 1607591 1656353
2515A656353q3827m6342J09541L2513q4781L1970K24900r7285p1612J0791J5716
$$ 1656353 1572526 1526184 1635725 1668238 1583457 1615427 1840327 1743042 1671430 1682221 1697937
2504A697937O6686l7708o2262j58893Q6881J32593J2259k9531k414l1774l206
$$ 1697937 1764623 1726915 1664653 1505760 1592641 1725234 1737493 1707962 1705548 1673774 1670568
2493A670568l0418l7127J45242K2426n3175j14063P5825P8866n4558r1634R4924
$$ 1670568 1640150 1603023 1748265 1770691 1717516 1603453 1679278 1758144 1703586 1611952 1706876
2482A706876p0075O488j33686j02765J01048J29809o7477m6450K1427L6368m4179
$$ 1706876 1636801 1643289 1509603 1406838 1507886 1637695 1570218 1523768 1545195 1581563 1537384
2471A537384M346r8306L9687Q7970p2441o609p8649R7375m6743l1667N7033j8891
$$ 1537384 1541730 1443424 1483111 1571081 1498640 1492031 1413382 1510757 1464014 1432347 1489380 1470489
2459A470489J9268R6661j09191p9026p8749M5385P2292l8633j60149p411q049
$$ 1470489 1489757 1586418 1477227 1398201 1319452 1364837 1437129 1398496 1238347 1230936 1222887
2448A222887q3198m3913N1284M2527j03031l895K03847P6922j23748j3375n7130
$$ 1222887 1139689 1095776 1147060 1189587 1086556 1082661 1286508 1363430 1239682 1226307 1169177
2437A169177O644j26326R0843R5834l64706O7014Q0827L9096O9589j5069j20445
$$ 1169177 1175821 1049495 1140338 1236172 871466 938480 1019307 1058403 1127992 1112923 992478
2426I92478r8594O6858l4460J14051N0585r4260l2351l2824o4373J1507l6974
$$ 992478 893884 960742 926282 1040333 1090918 996658 964307 931483 867110 878617 841643
2415H41643O2877r6808N7668M1615j27626j3874N7363N9373r3899j5143l7338
$$ 841643 904520 807712 865380 906995 779369 765495 822858 882231 788332 773189 735851
2404G35851L9552J04557N3082k6294j3202j09183j2871R1818n2392m7170J10089
$$ 735851 775403 879960 933042 906748 893546 784363 771492 863310 810918 763748 873837
2393H73837M2374j03796j47629M6624o4741N5611n0218o3698J72755L1294L198
$$ 873837 916211 812415 664786 711410 646669 702280 652062 588364 761119 792413 795611
2382G95611M5026p2813q9610Q8153o2868J4793j9922L121J1003l4686K6054j3770
$$ 795611 840637 767824 678214 766367 703499 718292 698370 701491 712494 677808 703862 690092
2370F90092R5987O9297m626j06132r8322M4134J10833k0751j26565R1158K8705
$$ 690092 786079 855376 850750 744618 646296 690430 801263 780512 653947 745105 773810
2359G73810j51176k6291n2811j5739J28383R7241j01195O2790o8056Q0964L3286
$$ 773810 622634 596343 543532 527793 656176 753417 652222 715012 646956 727920 761206
2348G61206m9522q3471n4514K8700j8296K5889L8722M7534n3746j899n2964p774
$$ 761206 711684 628213 573699 602399 584103 609992 648714 696248 642502 640603 587639 579865
2336E79865j1890M5201j45696J8641K10628l1249k583j54392l980r830j0564N7300
$$ 579865 567975 613176 467480 486121 696749 665500 662917 508525 504545 494715 484151 541451
2324E41451J9484m566j08542J15769l871k1535J9940p1171L8962M5639K9447j6253
$$ 541451 560935 556369 447827 563596 559725 538190 558130 486959 525921 571560 601007 584754
2312E84754L585k8343L769M6891n3158o528J4498J4259j3833K0j9566Q5931J6261
$$ 584754 588339 559996 563765 610656 557498 550970 565468 579727 565894 565914 546348 632279 648540
2299F48540o263q8175L3689L730N401j00413P5384M0561J4263K4202K0895L4454
$$ 648540 642277 554102 587791 591521 596922 496509 571893 612454 626717 650919 671814 706268
2287G06268m1813J6481j50551p090m6142J10629K6509q7947L5454j7764N9576
$$ 706268 664455 680936 530385 523295 477153 587782 614291 526344 561798 544034 603610
2276F03610l5493N6183K3964o4193q3135k2594P2061J39740j4784k1467K1382
$$ 603610 568117 624300 648264 584071 500936 478342 550403 690143 675359 653892 675274
2265F75274q500j55797J11054j14934K3504M1311l8736q8062p8691J22977K0563
$$ 675274 666774 510977 622031 507097 530601 571912 533176 445114 366423 489400 509963
2254E09963J48537n3225o4048r882j4295k6736j16768L3092Q7588L2946N4447
$$ 509963 658500 605275 541227 531345 517050 490314 373546 406638 494226 527172 581619
2243E81619j02819J10767m9160r0597n483j5565N1228N728J08272J2418r61j4975
$$ 581619 478800 589567 540407 449810 444327 428762 479990 485718 593990 606408 605447 590472
2231E90472l9464K5136J9044P822p7467M0684L9710K5606j37105L3058N3894n4509
$$ 590472 551008 576144 595188 603010 525543 566227 605937 631543 494438 527496 581390 526881
2219E26881j10345p6341K2791R8365M325K743r352J4456O0675p768j1374p9155
$$ 526881 416536 340195 362986 461351 465676 468419 459067 473523 534198 526430 515056 435901
2207D35901O1353R7511j18157p5400J35034J049j07421M5265J4978o8258J0734
$$ 435901 497254 594765 476608 401208 536242 537291 429870 475135 490113 421855 432589
2196D32589L9005k9454K5210l6513J12337M3833k8401o8077L0057J2903j1789
$$ 432589 471594 442140 467350 430837 543174 587007 558606 490529 520586 533489 521700
2185E21700l888k2728n3042m7221L5735P1402k8940M5048k1269o9802J53351k625
$$ 521700 517812 495084 442042 394821 430556 501958 473018 518066 496797 426995 580346 577721
2173E77721r8604J7803K6245J42364q2932q1347J01268j5564L5042p0669l7078
$$ 577721 479117 496920 523165 665529 582597 501250 602518 586954 621996 551327 514249
2162E14249L6779P6395n812j44533l1061J46769l5702k5159m930k4282J64323
$$ 514249 551028 627423 621611 477078 446017 592786 557084 531925 526995 502713 667036
2151F67036n1363k1370N2517k1167Q522M9484k5043p7095N5756L662j12813l1188
$$ 667036 615673 594303 646820 625653 634175 683659 658616 581521 637277 640939 528126 496938
2139D96938J43800j9380J22018J8091j44986P6589M3026J24431l412j50768k0535
$$ 496938 640738 621358 743376 761467 616481 693070 736096 860527 857115 706347 685812
2128F85812L596K9759J27885p7100K2025J08166r4378J6044k8491L2495R3983
$$ 685812 689408 719167 847052 769952 791977 900143 805765 821809 793318 825813 919796
2117I19796K4369j55943J13027m0667n6209P1686O7645M1069Q6962K5580P6758
$$ 919796 944165 788222 901249 860582 804373 876059 943704 984773 1071735 1097315 1174073
2106A174073O5041j13141k7031N8544n4760Q2627J36952j27469K5535k8371N7292
$$ 1174073 1239114 1125973 1098942 1157486 1102726 1185353 1322305 1194836 1220371 1192000 1249292
2095A249292K4064L809N7349q1180l0974L1102K1468K9556R5411R6056Q7609n78
$$ 1249292 1273356 1277165 1334514 1253334 1222360 1253462 1274930 1304486 1399897 1495953 1583562 1582984
2083A582984R1280j027J1915J6525N8753L08358J20495L3990J46746R7785J48079
$$ 1582984 1674264 1673237 1685152 1701677 1760430 2068788 2189283 2223273 2370019 2467804 2615883
2072B615883K17841L09441R4275J28735J98875M13771J53864M31255M44693N72065
$$ 2615883 2833724 3143165 3237440 3366175 3565050 3978821 4132685 4563940 5008633 5580698
2062E580698M65376M61611O51386N82817P30404Q21903J231823J505494J545058
$$ 5580698 6046074 6507685 7159071 7741888 8472292 9294195 10526018 12031512 13576570
2053A3576570J976864K860554L509447J919685j685891k664229k194197k175010
$$ 13576570 15553434 18413988 21923435 23843120 22157229 19493000 17298803 15123793
2045A5123793k733899k113019j422491j124396p08628n28895o72896m64761l74440
$$ 15123793 12389894 10276875 8854384 7729988 7021360 6492465 5819569 5354808 4980368
2036D980368k18809l77274k75713k15452k18989k74127l87627j98081j41433p8161
$$ 4980368 4761559 4384285 4108572 3893120 3674131 3400004 3012377 2814296 2672863 2594702
2026B594702q7897j11760r7833r9364r5686j8661j12544L4534j4839j52839o3184
$$ 2594702 2506805 2395045 2297212 2197848 2102162 2083501 1970957 2005491 1990652 1837813 1774629
2015A774629q3506l9095j39240J8440J2099m5103j67560m5863R0232q4431k4027
$$ 1774629 1691123 1652028 1512788 1531228 1543327 1498224 1330664 1284801 1375033 1290602 1266575
2004A266575p3365K198r161j27122m2858l2126K5385Q8659l3063l0745M5k9890
$$ 1266575 1193210 1195408 1186247 1059125 1016267 984141 1009526 1098185 1065122 1034377 1034422 1004532
1992A004532j31044k728j5215J4837O8766j18481j10214J16039l6802N3268p9779
$$ 1004532 873488 870760 855545 870382 939148 820667 710453 826492 789690 842958 763179
1981G63179j03413J06411l9291l700R9449n4817j41261j2660l6249J00010j2070
$$ 763179 659766 766177 726886 723186 822635 767818 626557 613897 577648 677658 665588
1970F65588l3618k412j7142J15178j28099N5851n958q927j6083j01796j797K2054
$$ 665588 631970 629558 612416 727594 599495 655346 649388 640461 624378 522582 520785 542839
1958E42839q4400j8311O8304m4562k1280j0388j3638L4475k2712l972L3098L6626
$$ 542839 458439 440128 508432 463870 442590 432202 418564 453039 430327 426355 459453 496079
1946D96079K5832p8315P0506q3604J6322M8560o3613l8556J00527R0264K0999
$$ 496079 521911 443596 514102 430498 446820 495380 431767 393211 493738 584002 605001
1935F05001p2464j01290J02285l8520J9702k7798L441r446o1393o6454J33234
$$ 605001 532537 431247 533532 495012 514714 486916 490357 480911 419518 353064 486298
1924D86298L1920n998r1506m1433M318k9225K0170M1182r3439j04469R8173M8665
$$ 486298 518218 512220 420714 379281 383599 354374 374544 415726 322287 217818 315991 364656
1912C64656O4194R0971j7616j45521k6682k1421o248R0425N2983j02482P0546
$$ 364656 428850 519821 502205 356684 330002 308581 302333 392758 445741 343259 413805
1901D13805L1602N1247n5289R0806q7204k36468O0142J038P5696J75182n1345
$$ 413805 445407 496654 441365 532171 444967 208499 268641 269679 345375 520557 469212
1890D69212m2234j1131k019j02137n2650J25347l6564L5131l8551q2058O7444
$$ 469212 426978 415847 413828 311691 259041 384388 347824 382955 344404 262346 329790
1879C29790L136q1572j022J6155J0285k7968J00517m8129j43244K00578J52714
$$ 329790 332926 251354 250332 266487 276772 248804 349321 301192 157948 358526 511240
1868E11240k15996N900K331M3509Q9291j75389P2721l6359q7406m9317N9981j5235
$$ 511240 295244 301144 303475 346984 436275 260886 333607 297248 209842 160525 220506 205271
1856B05271P6494J4313M2364Q6447p6210o2140R4160N7351j53434l7500o0592
$$ 205271 281765 296078 338442 424889 348679 286539 380699 438050 284616 247116 186524
1845A86524j05K4975M0002N2731N6351j36833K8149K7785N488Q8830k2960l2576
$$ 186524 186419 211394 251396 304127 360478 223645 251794 279579 285067 373897 350937 318361
1833C18361p2648O2380J0029m1733l491r1928j1965Q8448O4513L053p3355r3734
$$ 318361 245713 308093 318122 276389 272898 180970 169005 257453 321966 325019 251664 157930
1821A57930J1464n5344J2402N1513k1792J29080N3217o747j01425O0543M0348
$$ 157930 169394 114050 126452 177965 156173 285253 338470 331723 230298 290841 331189
1810C31189n5629Q1706P2938n4878j01376p388K0644L4891J43223l4254j22051
$$ 331189 275560 357266 430204 375326 273950 266562 287206 322097 465320 431066 309015
1799C09015j7238r2949r419q1570M0060N7165M8326j837n0041J1295J36959p7991
$$ 309015 291777 198828 189409 107839 147899 205064 253390 251553 201512 212807 349766 271775
1787B71775q0515J9331l3551L0729L5917J3242l2123j03763Q809J34077N6386
$$ 271775 191260 210591 177040 207769 243686 256928 224805 121042 129851 263928 320314
1776C20314j42240j05833J007m9112J46697o3062m9673P2181N6958K2241r2084
$$ 320314 178074 72241 73248 24136 170833 107771 58098 130279 187237 209478 117394
1765A17394K3088k3427p9452O0664J22689J33892o1112M064n6637m5649J6845
$$ 117394 140482 117055 37603 98267 220956 354848 293736 297800 241163 195514 212359
1754B12359L9780j11687j40093J27482J29173J5713q4395j06323j1141J33717
$$ 212359 252139 140452 359 127841 257014 272727 188332 82009 70868 204585
1744B04585j05861N4338P3478K6101j46160k3999J22870m3358o6636k560k0924
$$ 204585 98724 153062 226540 252641 106481 82482 205352 161994 95358 92798 71874
1733G1874J9936P6611k2275L9197k8146k8883J9766J0089q2546k1003L949J08539
$$ 71874 91810 168421 146146 185343 157197 128314 148080 158169 75623 54620 58569 167108
1721A67108Q374n2510r2686J3440J36609N7912L0681k7433o2213L7641q6558m6639
$$ 167108 175482 122972 30286 43726 180335 238247 268928 241495 179282 216923 130365 83726
1709H3726K5524j22973P4755n9554P4172Q1219j8940J2044m9188P5803m9916L135
$$ 83726 109250 -13723 61032 1478 75650 156869 137929 149973 100785 176588 126672 129807
1697A29807o288R2911O2817l7480j26165n8283P2781M0721n1271R622k1787O193
$$ 129807 123519 216430 279247 241767 115602 57319 130100 170821 119550 129172 107385 113578
1685A13578L0042L012K4838J26005j25580q172k097P0186n3671k9639N1641K5744
$$ 113578 143620 146632 171470 297475 171895 163723 161626 231812 178141 148502 200143 225887
1673B25887J02793j24423K6764j37832n2167O8020J09960k1352J3118p2315j8016
$$ 225887 328680 204257 231021 93189 41022 109042 219002 197650 210768 138453 120437
1662A20437m2324L2029Q7269o6508j9923N0526l2323J46685J9359j69511j20125
$$ 120437 78113 110142 197411 130903 110980 161506 129183 275868 295227 125716 5591
1651E591j922l1274J15652J7916m2336M3108l988j403K4799J3778m2055m7355
$$ 5591 3669 -27605 88047 105963 63627 106735 102747 101344 126143 139921 97866 50511
1639E0511R1701q683m7009J05456L7300j05440N3477L2319j21351M5502J18733
$$ 50511 142212 133529 86520 191976 229276 123836 177313 209632 88281 133783 252516
1628B52516j15487j5768M8246N255J1889j213J6955K092k8777n4693j4323o1653
$$ 252516 137029 121261 169507 174762 186651 185438 202393 204485 175708 121015 106692 45039
1616D5039N0163m214R09P299J11768K8545l7010n2274m7320q9110M0258j3835
$$ 45039 95202 90988 91897 99196 210964 239509 202499 150225 102905 13795 54053 40218
1604D0218N6020m1486p5933M7590K3042J63502R7850r9638p5353j8773L2401N464
$$ 40218 96238 54752 -21181 26409 49451 212953 310803 211165 135812 117039 149440 154904
1592A54904K7871q1935l3769P7480l3341k0086O9636m1332n7366M2895N8659n2191
$$ 154904 182775 100840 67071 144551 111210 91124 160760 119428 62062 104957 163616 111425
1580A11425j00824l4148P5000l5824m345R0765J2689m1926j01612J52175L1025
$$ 111425 10601 -23547 51453 15629 11284 102049 114738 72812 -28800 123375 154400
1569A54400m2404j655k0032K3719k0800M4767o784K6060M473j12697K2468O7058
$$ 154400 111996 110341 90309 114028 93228 137995 131211 157271 161744 49047 71515 138573
1557A38573R640n4005j3923J7746J25239j8869j4034J1380q9004J15711L5876
$$ 138573 148213 94208 80285 98031 223270 204401 190367 201747 112743 228454 264330
1546B64330l0651j98455n1729L1206L2924O5996O3011j37240Q3819J00981j13937
$$ 264330 233679 35224 -16505 14701 47625 113621 176632 39392 123211 224192 110255
1535A10255K184J0230M6378j25324R359N9101j7549q084M6133R4574j3097j05505
$$ 110255 112439 122669 169047 43723 53082 112183 94634 86550 132683 227257 214160 108655
1523A08655q803L2463q4436J2661j2211L9058K3970p2983L1038q6379J12290N4120
$$ 108655 99852 132315 47879 60540 48329 87387 111357 38374 69412 -16967 95323 149443
1511A49443l2499k7372j6052M3895k7540Q9692J9658o2057M6970p6362m7267J23746
$$ 149443 116944 89572 73520 117415 89875 179567 199225 137168 184138 107776 60509 184255
1499A84255j2582j08203L4989p0554P856N665k7509J3527J57661q2865r4259P0689
$$ 184255 171673 63470 98459 27905 35761 41426 13917 27444 185105 102240 7981 78670
1487G8670K8980Q5448j4965p4590m3305m7199J33795J40630k3895q0019k05007
$$ 78670 107650 193098 178133 103543 60238 13039 146834 287464 263569 183550 -21457
1476b1457P0105P8408n6750o6269j27303J35959M4994J02613o7603j4537J11011
$$ -21457 48648 127056 70306 4037 -123266 12693 57687 160300 92697 78160 189171
1465A89171K6849p7059k2958L1070J0997l4888J7999j31836K8795J25398R391
$$ 189171 216020 138961 116003 147073 158070 123182 141181 9345 38140 163538 172929
1454A72929r402K2237k9802r3205J0369M2787N8040o1720m5837o3654Q4185K0659
$$ 172929 163527 185764 155962 62757 73126 115913 173953 112233 66396 2742 86927 107586
1442A07586J11409j06933q0211M655M2189K9263n5600j40925J11904R7078J28330
$$ 107586 218995 112062 31851 36506 78695 107958 52358 -88567 23337 120415 248745
1431B48745k00553p3943N2227J08200j15215J06394k7514K1009K7106j49125N4215
$$ 248745 48192 -25751 26476 134676 19461 125855 98341 119350 146456 -2669 51546
1420E1546p0456J17361p748L7048l3146O0011j46914o7842J13133Q3757J7122
$$ 51546 -18910 98451 90703 127751 94605 154616 7702 -60140 52993 136750 153872
1409A53872n0227O905p0063M3835K5280l4062k0438L0321J4704J0049j081M9256
$$ 153872 103645 110550 40487 84322 109602 75540 55102 85423 100127 110176 109095 158351
1397A58351o839J07713j10457j51022N0005P6210o8240q6714O3628j3078P1423
$$ 158351 151512 259225 148768 -2254 47751 123961 55721 -30993 32635 19557 90980
1386I0980k0667N5694k9N4946q6739r4606M3643N2938j03849o5414R2503N6275
$$ 90980 70313 126007 125978 180924 94185 -421 43222 96160 -7689 -73103 19400 75675
1374G5675j93682N3280J21433q6094M3450R278Q0734L5006m713j5432n1220p9228
$$ 75675 -118007 -64727 56706 -29388 14062 23340 104074 139080 134367 118935 67715 -11513
1362a1513p3652N7093J2948l5721M3079J87413l139Q979M726K7522n1484j03236
$$ -11513 -85165 -28072 -15124 -50845 -7766 179647 176508 185487 190213 217735 166251 63015
1350F3015q0695O3066J00425R4704j51050q0015k2782Q1259J42338k08527j28355
$$ 63015 -17680 45386 145811 240515 89465 9450 -13332 67927 210265 1738 -126617
1339a26617J07718n7699L5475J48196n9690J1170l5875l0257k4797O4042N1314
$$ -126617 -18899 -76598 -41123 107073 47383 58553 22678 -7579 -32376 31666 82980
1328H2980L4995L8561j5698p2342p7487q6373J07002J0944M2670o0555N8750K6006
$$ 82980 117975 156536 140838 68496 -8991 -95364 11638 22582 65252 4697 63447 89453
1316H9453M5519M0294q5525L4160j02191R3924K3769k3463J08281o9542o0964
$$ 89453 134972 175266 89741 123901 21710 115634 139403 115940 224221 154679 93715
1305I3715m814n9517P4336O1533m5568q6835M3498k2713q9105m6632M6322J55048
$$ 93715 88901 29384 103720 165253 119685 32850 76348 53635 -35470 -82102 -35780 119268
1293A19268l0225k6513R201K3430p2979m4150R4137j6972m577J4131P1625r3176
$$ 119268 89043 62530 71731 95161 22182 -21968 72169 55197 50620 64751 136376 43200
1281D3200r981m7463l9836o251o9597J12167J42132n9830P265r2995J3232R7920
$$ 43200 33219 -14244 -54080 -60331 -129928 -17761 124371 64541 71806 -21189 -7957 89963
1269H9963j25408n1750m7794J72680R9836l4346q9376j05712P6999J82233R0363
$$ 89963 -35445 -87195 -134989 37691 137527 103181 13805 -91907 -14908 167325 257688
1258B57688m7503j70993j7569J9178O7318r5826O9873n2943k267Q006J8337l9826
$$ 257688 210185 39192 21623 40801 108119 12293 82166 29223 26956 34962 53299 13473
1246A3473m9830j6345k0703j5358k8556J02447l6958L7315o4270J00163Q0783
$$ 13473 -36357 -52702 -73405 -88763 -117319 -14872 -51830 -14515 -78785 21378 102161
1235A02161L1578j3236k5393k9763k1031R970K646O9848j03478L4017O3680n7296
$$ 102161 133739 120503 95110 65347 44316 54286 56932 126780 23302 57319 120999 63703
1223F3703p6265M9485J269K7060j21446O0734M9893o1683K1472K1412R7693k1394
$$ 63703 -12562 36923 38192 65252 -56194 4540 54433 -7250 14222 35634 133327 111933
1211A11933K524r535j61269k4957N6340O6793Q1254j31850R3577n81K6655Q9598
$$ 111933 114457 104922 -56347 -81304 -24964 41829 123083 -8767 84810 84229 110884 200482
1199B00482j04687j46462J4412p3060J23708N3411n0743o0240O3018k1682m0965
$$ 200482 95795 -50667 -36255 -109315 14393 67804 17061 -43179 19839 -1843 -42808
1188d2808M1720M2640j18248J6739O5656l2482K9263N1338o224J9689q3542K080
$$ -42808 -1088 41552 -76696 -59957 5699 -26783 2480 53818 47594 67283 -16259 -14179
1176a4179j14286P0946J52141n6337O6693O248j50111r2247Q9746l5726O6743
$$ -14179 -128465 -57519 94622 38285 104978 111226 -38885 -131132 -41386 -77112 -10369
1165a0369L6346o901o4924N120l1921J04112n8873n3011n1170R0230J6559k8383
$$ -10369 25977 19076 -45848 -40728 -72649 31463 -27410 -80421 -131591 -41361 -24802 -53185
1153e3185P6379l4048r6317j3419M1364R5929n7056J5489J21388p522r9861r546
$$ -53185 23194 -10854 -107171 -120590 -79226 16703 -40353 -24864 96524 89002 -10859 -20405
1141b0405k4702K453J41284n124k9061m9511k2118j7439j5530J02110Q9659j07292
$$ -20405 -45107 -42654 98630 93506 64445 14934 -7184 -24623 -40153 61957 151616 44324
1129D4324j6942n889l8336J436R792o0114O39j8500k0454L1533O9305j6019L3170
$$ 44324 27382 21493 -16843 -15407 -5615 -65729 -65090 -83590 -104044 -72511 -3206 -19225 13945
1116A3945O5301j42939J6745M3000J3834j3088L3924O0031q0266o033j09882P4931
$$ 13945 79246 -63693 -46948 -3948 9886 -3202 30722 90753 10487 4454 -105428 -30497
1104c0497P3633L5777j26155j27273N3570M1776R2867p8979O4393m8262j710Q3318
$$ -30497 43136 78913 -47242 -174515 -120945 -79169 13698 -65281 -888 -49150 -50860 32458
1092C2458O2299r9215L9357j7742J6299q353K1188J7778m9376j45469P3971J28056
$$ 32458 94757 -4458 34899 17157 33456 25103 46291 64069 14693 -130776 -56805 71251
1080G1251l2332Q8495n5883n1685j06548l9013M5186J15865l608n830l2345K1188
$$ 71251 38919 127414 71531 19846 -86702 -125715 -80529 35336 31728 25898 -6447 14741
1068A4741m8996r3137J03626O1486M192K6667m0538o059o3792n4302P8677M2260
$$ 14741 -34255 -127392 -23766 37720 41912 68579 28041 21982 -41810 -96112 -17435 24825
1056B4825K5025k957j09415P7528P112K431n0340l9455K287o2262J8191K9778
$$ 24825 49850 46893 -62522 15006 22118 24549 -25791 -65246 -62959 -125221 -107030 -77252
1044g7252n5248n2302R7946K13818o0635j05176K961K28752j49621j28469l2436
$$ -77252 -132500 -184802 -86856 126962 66327 -38849 -35888 192864 43243 -85226 -117662
1033a17662M4268J70558j1701q7947P0977l4888L993o9699o4023o3143M1376O9700
$$ -117662 -73394 97164 85463 -2484 68493 33605 37598 -32101 -96124 -159267 -117891 -48191
1021d8191J16366J01767j20576p5455o4896k3473J36792L8643m0268J4489o2208
$$ -48191 68175 169942 49366 -26089 -90985 -114458 22334 60977 20709 35198 -27010
1010b7010P6128j09712K8093o174Q8290p6924N5959l7755J00650j0678n34r5248
$$ -27010 49118 -60594 -32501 -38675 49615 -27309 28650 -9105 91545 80867 80333 -14915
998a4915l5637O4287K8818n2773K1079q966N5475l0949J0386O1528K5345n7986
$$ -14915 -50552 13735 42553 -10220 10859 1893 57368 26419 36805 98333 123678 65692
986F5692j61083J11455K0948m5421O961j23466L325R0716M5463j1446k8615P8201
$$ 65692 -95391 16064 37012 -8409 -1448 -124914 -121589 -30873 14590 3144 -25471 52730
974E2730m5683j5195j7947J3663p8934m5004N4641L3417J26489N760O3282j07519
$$ 52730 7047 -8148 -26095 -12432 -91366 -136370 -81729 -48312 78177 83937 147219 39700
962C9700q5240P050p5584J28562j51765N1360K1065j7334R5369n3114Q3393l442
$$ 39700 -45540 -38490 -114074 14488 -137277 -85917 -64852 -82186 13183 -39931 43462 40020
950D0020m6393K1272n751m7222P4315l5522j807j5597r9839P9261k835K7409N0424
$$ 40020 -6373 14899 9148 -38074 36241 719 -1088 -16685 -116524 -37263 -40098 -12689 37735
937C7735P916l1936n8922P6453n6939J02317l9911j41082J00311m1625J03324
$$ 37735 45651 13715 -45207 31246 -25693 76624 36713 -104369 -4058 -45683 57641
926E7641o8343j26512J9285J49801j03486n4492L0990P903J5673r921l2510J3530
$$ 57641 -10702 -137214 -117929 31872 -71614 -126106 -95116 -87213 -71540 -81461 -113971 -100441
914a00441k3644O5571q523N0012q3129P2915m492K282R1037o6296j9644Q3583
$$ -100441 -124085 -58514 -67037 -17025 -100154 -27239 -31731 -29449 61588 -4708 -24352 59231
902E9231j7526L9099K0762j22804N5989m5316m9134N9364N0445r2645n1466l8722
$$ 59231 41705 80804 101566 -21238 34751 -10565 -59699 -335 50110 -42535 -94001 -132723
890a32723k3534K7222R0078P3175O4908n0607j28394m5539L4158j6618J75211
$$ -132723 -156257 -129035 -38957 34218 99126 48519 -79875 -125414 -91256 -107874 67337
879F7337r8337p2195N1166L6136m831q7038J12277L809j7022N7917j70826O3776
$$ 67337 -31000 -103195 -52029 -15893 -20724 -107762 4515 8324 -8698 49219 -121607 -57831
867e7831J1057j31423Q5718O90K3098J3961m1416m2117K9507R1894K0430m347
$$ -57831 -46774 -178197 -92479 -91789 -68691 -54730 -96146 -138263 -108756 -16862 3568 -779
855g79k1019j34449O3834K4964R6415J07372j09738o1851R5138k1589o9984l0808
$$ -779 -21798 -156247 -92413 -67449 28966 136338 26600 -35251 59887 38298 -31686 -62494
843f2494P098L2935p8819P0047R6368q4388J12677K5586p0185k0390j50108k0690
$$ -62494 -55396 -22461 -101280 -31233 65135 -19253 93424 119010 48825 28435 -121673 -142363
831a42363J04528j3656n564L1063N4260m7739j4280R5602R8144n8515m9643j8843
$$ -142363 -37835 -51491 -57055 -25992 28268 -19471 -33751 61851 159995 101480 51837 32994
819C2994K8645n1776j14639M3100J9615m6074L5940P5123r9937j724m4416M5970
$$ 32994 61639 9863 -104776 -61676 -42061 -88135 -52195 22928 -77009 -78733 -123149 -77179
807g7179l3352J02858k6094r2089P6661J0935Q1900Q053p9823l548o6740j4098
$$ -77179 -110531 -7673 -33767 -125856 -49195 -38260 43640 51693 -28130 -31678 -98418 -112516
795a12516K6724K4393j02880J02966L7593M7541j05463L1101O3090R1753p6802
$$ -112516 -85792 -61399 -164279 -61313 -23720 23821 -81642 -50541 12549 104302 27500
784B7500j46648K3066q727k5287K4857n4615P1074K3351l8349J7620J09000J3207
$$ 27500 -119148 -96082 -104809 -130096 -105239 -159854 -88780 -65429 -103778 -86158 22842 36049
772C6049j8409O176j43326J61548j3687l0618j4984n8217l2970o3975J59452K3587
$$ 36049 17640 23816 -119510 42038 28351 -2267 -17251 -75468 -108438 -172413 -12961 10626
760A0626k13363k0873J03400J30122o7277k4422O878k378J13049l707j4969K4160
$$ 10626 -202737 -223610 -120210 9912 -57365 -81787 -74909 -77287 35762 32055 17086 41246
748D1246n2367L0534l6869M9325p7366L0979q8492N5142J6537p4510M9724q0029
$$ 41246 -11121 19413 -17456 31869 -45497 -14518 -103010 -47868 -31331 -105841 -56117 -136146
736a36146j7798J75680M5211q3496K7690J873q6856Q3804M7246j43144J1996P1875
$$ -136146 -153944 21736 66947 -16549 11141 13014 -73842 9962 57208 -85936 -73940 -2065
724b065J8730O996m9138R955K5785L573k3417m395k3709q591R974l699r2592P9689
$$ -2065 16665 23661 -25477 -15522 10263 13836 -9581 -13976 -37685 -46276 -36302 -40001 -132593 -52904
710e2904M5028k4327p0151J0264q7606J63195M5132M6785n6785n9820J20010L3263
$$ -52904 -7876 -32203 -102354 -92090 -179696 -16501 28631 75416 18631 -41189 78821 112084
698A12084k077j10114L0258p04p091q8472N4008L3963J04264Q847j07822q350
$$ 112084 110007 -107 30151 29447 22356 -66116 -12108 21855 126119 134966 27144 18794
686A8794N1139P695n236j0393j0997p0342l8305J34957J01874l3915r9295M5746
$$ 18794 69933 77628 72392 61999 51002 -19340 -57645 77312 179186 145271 45976 91722
674I1722j9035L2470r3644j9845Q6364p1153K4163l9917K4255l9911k7158K7211
$$ 91722 72687 105157 11513 -8332 78032 6879 31042 -8875 15380 -24531 -51689 -24478
662b4478J867m8671n26K7707M9062J9970j4736j9070O2108p1338K9637r3273N7831
$$ -24478 -22611 -71282 -71808 -44101 4961 24931 10195 -8875 53233 -18105 11532 -81741 -23910
649b3910l2221L8235o841K9451j0384J2262M6526j16203n5235J00331M4723j3135
$$ -23910 -56131 -17896 -24737 4714 -5670 6592 53118 -63085 -118320 -17989 26734 13599
637A3599k5768n3249J8036L1544K5183k3306m5550K2516L3436R9755j32550j8232
$$ 13599 -12169 -65418 -47382 -15838 9345 -13961 -59511 -36995 -3559 96196 -36354 -54586
625e4586J0694J7312j004P1736N0787q5453L098N8314l462j28943O511j0042n3241
$$ -54586 -43892 -26580 -27584 44152 94939 9486 12584 70898 67436 -61507 -54996 -65038 -118279
612a18279j2239N4269k8629m984n6983O3021P272M1742j1202K9695n9802Q9047
$$ -118279 -130518 -76249 -104878 -109862 -166845 -103824 -96552 -54810 -66012 -36317 -96119 -7072
600g072n2813M9806O3788q7943j3559M8759R732j727M7982L6977j08578k6l0518
$$ -7072 -59885 -10079 53709 -34234 -47793 966 10698 8971 56953 93930 -14648 -14674 -45192
587d5192k6145k2046J14851k0922n941l2825L3532K1257m5685k0191L7731P2704
$$ -45192 -71337 -93383 21468 546 -5395 -38220 -4688 16569 -29116 -49307 -11576 61128
575F1128m5230j09342k0548J06472j22053P9272m9909k0895j4989J43233q3060
$$ 61128 15898 -93444 -113992 -7520 -129573 -50301 -100210 -121105 -136094 7139 -75921
564g5921p3886M2814Q8194L0799j22990j01947M5756K5338J10350R9044r4702
$$ -75921 -149807 -106993 -18799 12000 -110990 -212937 -167181 -141843 -31493 67551 -27151
553b7151M5677q0650O1099L1412q810r9874O9617Q0632j05515o1766Q3337M6814
$$ -27151 18526 -62124 -1025 30387 21577 -78297 -8680 71952 -33563 -95329 -11992 34822
541C4822j86534O7873R1652l8475L3301m7269o4321P8173Q5927J13226j73202
$$ 34822 -151712 -83839 7813 -30662 2639 -44630 -108951 -30778 55149 168375 -4827
530d827o0932N552R0044M8297k9272p4265k9397O5386j07673J70422k8764j0751
$$ -4827 -65759 -60207 29837 78134 48862 -25403 -54800 10586 -97087 73335 44571 33820
518C3820n248L610j37873K7352N8213m1743J23014K2853q6703M4539J9383j0613
$$ 33820 28572 32182 -105691 -78339 -20126 -61869 61145 83998 -2705 41834 61217 50604
506E0604j33472m709Q1590j6752J32238o6953r0852K3364k5239m7031R8042J04722
$$ 50604 -82868 -87577 -5987 -22739 109499 42546 -48306 -24942 -50181 -97212 830 105552
494A05552r1821n5922J0646l6541M807j21653J52501K2513K5030m4360n7121P5023
$$ 105552 13731 -42191 -31545 -68086 -63279 -184932 -32431 -9918 15112 -29248 -86369 -11346
482a1346K0951K4008K4099k0012r6051L5448n886o9473K7539R6565m2949r7584
$$ -11346 9605 33613 57712 37700 -58351 -22903 -28789 -98262 -70723 25842 -17107 -114691
470a14691J14858r4077J7037J32209l0737r1603m7566M0758Q2721m4701j58N5573
$$ -114691 167 -93910 -76873 55336 24599 -67004 -114570 -73812 8909 -35792 -35950 19623
458A9623r4234l7641n680L7289n2876m5196K8808l0563J70686L984q8594O4560
$$ 19623 -74611 -112252 -117932 -80643 -133519 -178715 -149907 -180470 -9784 -5800 -94394 -29834
446b9834O5685r3465M3301o5074p2936J47244k011N117l4862N6397K4300q2850
$$ -29834 35851 -57614 -14313 -79387 -152323 -5079 -7090 -1973 -36835 19562 43862 -38988
434c8988p7925J82211q0531q4048j5134N4453N300n6846J796J21782O8850l0235
$$ -38988 -116913 65298 -15233 -99281 -114415 -59962 -54662 -111508 -109712 12070 80920 50685
422E0685l5968j00886l0313P2243Q3106N2781j35125R512j04919J9106J02215
$$ 50685 14717 -86169 -116482 -44239 38867 91648 -43477 -33965 -138884 -119778 -17563
411a7563j09629J07252R947m2879K1408j22975N0809K63893J3068m1652j93900
$$ -17563 -127192 -19940 -9993 -52872 -31464 -154439 -103630 160263 173331 131679 -62221
400f2221l6825R4963l5303r7141k6499Q063J5854J93708J9678p3681M306m8801
$$ -62221 -99046 -4083 -39386 -136527 -163026 -154963 -139109 54599 74277 596 4902 -43899
388d3899r7791J78517O1470j28827L1781R8398O734k361j16870k3771L3302j41845
$$ -43899 -141690 36827 98297 -30530 1251 99649 106383 104022 -12848 -36619 -3317 -145162
376a45162R6575o8854q568J67378M2704j1909j2863o2603K6273o8907O6010r6402
$$ -145162 -48587 -117441 -126009 41369 84073 72164 59301 -3302 22971 -45936 20074 -76328
364g6328J0803l3788q0040J52687q375j313Q8952j25341L7395N3936j1539n0616
$$ -76328 -65525 -99313 -179353 -26666 -35041 -36354 52598 -72743 -35348 18588 7049 -43567
352d3567O0050O7540q3732p5818O7322O3354l3384m6461m8813L6201Q6328r5694
$$ -43567 16483 84023 291 -75527 -8205 55149 21765 -24696 -73509 -37308 49020 -46674
340d6674o2835l3496k2064l063L1712J82914p6277J33m3613M5641P6842j04621
$$ -46674 -109509 -143005 -165069 -168132 -136420 46494 -29783 -29650 -73263 -27622 49220 -55401
328e5401Q0778O6025j78916J50995o4648p2068K9179J5994j3381K440l6572N9883
$$ -55401 25377 91402 -87514 63481 -1167 -73235 -44056 -28062 -41443 -39003 -75575 -15692
316a5692O787M4671J177l6187r929j27744J7482J67769j6407l9795k547p3934
$$ -15692 -8905 35766 36943 756 -9173 -136917 -119435 48334 31927 -7868 -10415 -84349
304h4349M5442R5543N4123r0797r6756N9279R7203j58743J11281M7880j5226K6521
$$ -84349 -38907 56636 110759 19962 -76794 -17515 79688 -79055 32226 80106 64880 91401
292I1401j55754P1826p6678k5280n6998M7509L9404L89l3493P2044R1548l3899
$$ 91401 -64353 7473 -69205 -94485 -151483 -103974 -64570 -64181 -97674 -25630 65918 32019
280C2019j8357p5142O8209O0812j1141p5671l7623M4401o479j3389L970j18093
$$ 32019 13662 -61480 6729 67541 56400 -19271 -56894 -12493 -18972 -32361 -28391 -146484
268a46484j4840N040L2100J40887r0352r2256J9614N0697N1037j26696J38072
$$ -146484 -161324 -156284 -124184 16703 -73649 -165905 -146291 -95594 -44557 -171253 -33181
257c3181k9994P3570m0480N5454M507j15438L2616Q7743K1079j15225K9005J09913
$$ -33181 -63175 10395 -30085 25369 29876 -85562 -52946 34797 55876 -59349 -30344 79569
245G9569J282j7585m6838n4091M6000J16788n8246k7906k0934q1007j6842k9308
$$ 79569 80851 63266 16428 -37663 8337 125125 66879 38973 18039 -62968 -79810 -109118
233a09118k440J4437k279n3393J57730Q547K5226r916j8343L8178l185K3021M5975
$$ -109118 -111558 -97121 -99400 -152793 4937 13484 38710 28794 10451 48629 45444 68465 114440
220A14440l5403m0854J2256j9028n2293j0074L9747J5332j22511P5630m5054l1346
$$ 114440 79037 38183 50439 31411 -20882 -30956 8791 24123 -98388 -22758 -67812 -99158
208i9158J01298L3097k5101j0513l0958J5066N2656j15977n8423k6760O0677m2339
$$ -99158 2140 35237 10136 -377 -31335 -16269 36387 -79590 -138013 -164773 -104096 -146435
196a46435j7902Q5857j6701j8063N4158N7059m6250o7056P0700L7669L8093K2524
$$ -146435 -164337 -78480 -95181 -113244 -59086 -2027 -48277 -115333 -44633 -6964 31129 53653
$$ [...]
##END NTUPLES=NMR SPECTRUM
##END=
