##TITLE=1H_CA-8888-met
 CDCl3, 8 sc, 
 5.07.2021
##JCAMPDX= 6.0         $$ Bruker NMR JCAMP-DX V2.0
##DATA TYPE= NMR SPECTRUM
##DATA CLASS= NTUPLES
##ORIGIN= UXNMR, Bruker Analytische Messtechnik GmbH
##OWNER= root
$$ XWIN-NMR		Version 3.5
$$ Mon Jul  5 10:50:45 2021 Russian Standard Time (UT+4h)  she@DPX200
##.OBSERVE FREQUENCY= 200.131506
##.OBSERVE NUCLEUS= ^1H
##.ACQUISITION MODE= SIMULTANEOUS
##.ACQUISITION SCHEME= undefined
##.AVERAGES= 8
##.DIGITISER RES= 18
##SPECTROMETER/DATA SYSTEM= spect
##.PULSE SEQUENCE= zg30
##.SOLVENT NAME= CDCl3
##.SHIFT REFERENCE= (INTERNAL, CDCl3, 0, 17.6474)
##AUDIT TRAIL= $$ (NUMBER, WHEN, WHO, WHERE, WHAT)
$$ ##TITLE= Audit trail, XWIN-NMR		Version 3.5
$$ ##JCAMPDX= 5.01
$$ ##ORIGIN= Bruker BioSpin GmbH
$$ ##OWNER= she
$$ F:/spectra/data/she/nmr/H-F/1/pdata/1/auditp.txt
$$ ##AUDIT TRAIL=  $$ (NUMBER, WHEN, WHO, WHERE, WHAT)
(   1,<2021-07-05 10:49:17.84 +0400>,<she>,<DPX200>,
      <created by zg, POWCHK disabled, PULCHK disabled
       configuration hash MD5:
       00 E9 B6 7A A2 85 ED C7 34 08 36 98 17 FE 4E 26
       data hash MD5: 16K
       81 3B 14 37 D1 03 D9 03 1F EE 4C C5 BC 52 3E F1>)
(   2,<2021-07-05 10:49:20.46 +0400>,<she>,<DPX200>,
      <Start of raw data processing
       efp BC_mod = 2 LB = 0.24 FT_mod = 6 PKNL = 1 PHC0 = -11914.16 PHC1 = 10.60099 SI = 16K 
       data hash MD5: 16K
       7A A8 A7 C3 9F AB 37 EE 9A 63 05 BB 58 BF 4D 8A>)
(   3,<2021-07-05 10:49:39.12 +0400>,<she>,<DPX200>,
      <pk PHC0 = -156.1021 PHC1 = -2.6 
       data hash MD5: 16K
       26 02 95 58 DA 88 6A 78 70 03 25 78 CD D9 1D 67>)
(   4,<2021-07-05 10:49:42.78 +0400>,<she>,<DPX200>,
      <abs ABSG = 5 
       data hash MD5: 16K
       E1 1D 6A B5 BD B7 55 87 9F 11 8B C4 DA 2E BF 6A>)
(   5,<2021-07-05 10:50:04.01 +0400>,<she>,<DPX200>,
      <abs ABSG = 5 
       data hash MD5: 16K
       C3 3D 3D BD 31 AD 5B BA 5F 80 19 B9 77 B6 A9 1A>)
$$ ##END=
$$ 
$$ hash MD5
$$ B9 31 8D BF 45 FA 23 B5 F9 55 E9 7A D9 CF 04 93
##$RELAX= 
##$RELAX= 
##$RELAX= 
##$RELAX= 
##$RELAX= 
##$RELAX= 
$$ Bruker specific parameters
$$ --------------------------
##$DU= <F:/spectra>
##$EXPNO= 1
##$NAME= <H-F>
##$PROCNO= 1
##$TYPE= <nmr>
##$USER= <she>
##$AMP= (0..31)
100 100 100 100 100 100 100 100 100 100 100 100 100 100 100 100 100 100 
100 100 100 100 100 100 100 100 100 100 100 100 100 100 
##$AQSEQ= 0
##$AQ_mod= 1
##$AUNM= <au_zg>
##$AUTOPOS= <>
##$BF1= 200.13
##$BF2= 200.13
##$BF3= 200.13
##$BF4= 200.13
##$BF5= 200.13
##$BF6= 200.13
##$BF7= 200.13
##$BF8= 200.13
##$BYTORDA= 1
##$CFDGTYP= 0
##$CFRGTYP= 5
##$CHEMSTR= <none>
##$CNST= (0..31)
1 1 145 1 1 1 1 1 1 1 1 1 1 1 1 1 1 1 1 1 1 1 1 1 1 1 1 1 1 1 1 1 
##$CPDPRG= <>
##$CPDPRG1= <>
##$CPDPRG2= <>
##$CPDPRG3= <>
##$CPDPRG4= <mlev>
##$CPDPRG5= <mlev>
##$CPDPRG6= <mlev>
##$CPDPRG7= <mlev>
##$CPDPRG8= <mlev>
##$CPDPRGB= <>
##$CPDPRGT= <>
##$D= (0..31)
0 1.2 0 0 0 0 0 0 0 0.06 0 0.03 0 0 0 0 0.0002 0 0 0 0 0 0 0 0 0 0 0 0 
0 0 0 
##$DATE= 1625467757
##$DBL= (0..7)
$$ [...]
##$SUBNAM3= <"">
##$SUBNAM4= <"">
##$SUBNAM5= <"">
##$SUBNAM6= <"">
##$SUBNAM7= <"">
##$SUBNAM8= <"">
##$SUBNAM9= <"">
##$SW= 20.0188882624521
##$SWIBOX= (0..15)
0 0 2 0 0 0 0 0 0 0 0 0 0 0 0 0 
##$SW_h= 4006.41025641026
##$TD= 16384
##$TD0= 1
##$TE= 0
##$TE2= 300
##$TE3= 300
##$TEG= 300
##$TL= (0..7)
0 120 120 120 120 120 120 120 
##$TP= (0..7)
150 150 150 150 150 150 150 150 
##$TP07= 0
##$TPNAME0= <>
##$TPNAME1= <>
##$TPNAME2= <>
##$TPNAME3= <>
##$TPNAME4= <>
##$TPNAME5= <>
##$TPNAME6= <>
##$TPNAME7= <>
##$TPOAL= (0..7)
0.5 0.5 0.5 0.5 0.5 0.5 0.5 0.5 
##$TPOFFS= (0..7)
0 0 0 0 0 0 0 0 
##$TUNHIN= 0
##$TUNHOUT= 0
##$TUNXOUT= 0
##$USERA1= <user>
##$USERA2= <user>
##$USERA3= <user>
##$USERA4= <user>
##$USERA5= <user>
##$V9= 5
##$VALIST= <valist>
##$VCLIST= <CCCCCCCCCCCCCCC>
##$VD= 0
##$VDLIST= <DDDDDDDDDDDDDDD>
##$VPLIST= <PPPPPPPPPPPPPPP>
##$VTLIST= <TTTTTTTTTTTTTTT>
##$WBST= 1024
##$WBSW= 4
##$XGAIN= (0..3)
0 0 0 0 
##$XL= 0
##$YL= 0
##$YMAX_a= 662911
##$YMIN_a= -572118
##$ZGOPTNS= <>
##$ZL1= 120
##$ZL2= 120
##$ZL3= 120
##$ZL4= 120
##$ABSF1= 17.6474
##$ABSF2= -2.371641
##$ABSG= 5
##$ABSL= 3
##$ALPHA= 0
##$AQORDER= 0
##$ASSFAC= 0
##$ASSFACI= 0
##$ASSFACX= 0
##$ASSWID= 0
##$AUNMP= <proc_1d>
##$AZFE= 0.1
##$AZFW= 0.1
##$BCFW= 0
##$BC_mod= 2
##$BYTORDP= 0
##$COROFFS= 0
##$CY= -3
##$DATMOD= 1
##$DC= 0
##$DFILT= <>
##$DTYPP= 0
##$F1P= 0
##$F2P= 0
##$FCOR= 1
##$FTSIZE= 16384
##$FT_mod= 6
##$GAMMA= 0
##$GB= 0
##$INTBC= 1
##$INTSCL= 1.334414e-10
##$ISEN= 128
##$LB= 0.24
##$LEV0= 0
##$LPBIN= 0
##$MAXI= 10000
##$MC2= 0
##$MEAN= 0
##$ME_mod= 0
##$MI= 1.114404
##$NCOEF= 0
##$NC_proc= -3
##$NLEV= 6
##$NOISF1= 3.799351
##$NOISF2= 2.8
##$NSP= 0
##$NTH_PI= 0
##$NZP= 0
##$OFFSET= 17.6474
##$PC= 1
##$PHC0= -12070.26
##$PHC1= 8.00099
##$PH_mod= 1
##$PKNL= yes
##$PPARMOD= 0
##$PSCAL= 0
##$PSIGN= 0
##$REVERSE= no
##$SF= 200.129977432177
##$SI= 16384
##$SIGF1= 3
##$SIGF2= 2
##$SINO= 5.538805
##$SIOLD= 16384
##$SREGLST= <1H.CDCl3>
##$SSB= 0
##$STSI= 16384
##$STSR= 0
##$SW_p= 4006.41025641026
##$SYMM= 0
##$S_DEV= 0
##$TDeff= 16384
##$TDoff= 0
##$TI= <>
##$TILT= no
##$TM1= 0
##$TM2= 0
##$TOPLEV= 0
##$USERP1= <user>
##$USERP2= <user>
##$USERP3= <user>
##$USERP4= <user>
##$USERP5= <user>
##$WDW= 1
##$XDIM= 16384
##$YMAX_p= 329312616
##$YMIN_p= -79654
$$ End of Bruker specific parameters
$$ ---------------------------------
##NTUPLES= NMR SPECTRUM
##VAR_NAME=  FREQUENCY,     SPECTRUM/REAL,   SPECTRUM/IMAG
##SYMBOL=    X,             R,               I
##VAR_TYPE=  INDEPENDENT,   DEPENDENT,       DEPENDENT
##VAR_FORM=  AFFN,          ASDF,            ASDF
##VAR_DIM=   16384,         16384,           16384
##UNITS=     HZ,            ARBITRARY UNITS, ARBITRARY UNITS
##FACTOR=    0.24454680195387, 1,            1
##FIRST=     3531.77374419266, 0,            0
##LAST=      -474.636512217603, 0,           0
##MIN=       -474.636512217603, -79654,      0
##MAX=       3531.77374419266, 329312616,    0
$$ Real data points
##PAGE= N=1
##DATA TABLE= (X++(R..R)), XYDATA
$$ [...]
$$ plain form
8801 -1346 1493 -2288 -3503 -3220 -3105 -4577 -3458 2752 4417 -415 -3943 -4209 -988 -433 -1681 -1501
8785 -1501 -2564 1433 2184 1883 -2654 -3129 -2871 246 1303 -775 -662 -179 3149 4304 3164 7390
8769 7390 24 -2725 -3222 -4555 2154 2428 357 -2888 -2094 129 -485 -2647 -5002 -1837 -1145 1568
8753 1568 119 -3263 -2712 -2853 -3270 3467 5018 -339 -221 -2925 -7323 -2104 -4037 -3130 -2915 -2759 -5626
8736 -5626 -6317 -1664 -1977 -1211 -3563 -4224 -4575 -206 -2109 -4228 -4163 -7663 -8762 -5966 -1970 -1096 1133
8719 1133 -2062 1655 3162 -230 -1562 4062 2534 -2163 -4920 -2309 410 4841 -314 -4590 -1955
8704 -1955 -1346 -3318 -4059 -4674 -2252 1497 -335 216 -1452 -3019 -2010 -2912 -1799 -5953 -3599 -4833
8688 -4833 -4427 717 247 -1587 544 389 1393 -803 -5390 -3931 -3187 1969 -2543 -1720 -2885 794
$$ packed form
8801a346K839l781j215K83J15j472J119O210J665m832l528k66L221N55j248J80
8785a501j063L997P51l01m537m75K58L117J057k078J13M83L328J155j140M226
8769G390p366k749m97j333O709K74k071l245P94K223o14k162k355L165O92K713
8753A568j449l382N51j41m17O737J551n357J18k704m398N219j933R07K15J56k867
8736e626o91M653l13P66k352o61l51M369j903k119O5l500j099K796L996Q74K229
8719A133l195L717J507l392j332N624j528m697k757K611K719M431n155m276K635
8704a955O09j972p41o15K422L749j832N51j668j567J009r02J113m154K354j234
8688d833M06N144m70j834K131j55J004k196m587J459P44N156m512Q23j165L679
$$ plain form
8672 794 -2219 -1503 -912 378 -316 -1385 1527 4733 431 25 -257 2630 168 270 -1345 675 -1000
8655 -1000 -2727 -3060 -979 -6010 -3732 -1348 411 800 -1153 -4262 87 2078 -813 -1433 -4467 -3045
8639 -3045 644 -1817 -1894 -1979 -1091 -3371 -3433 -62 -1202 2945 3075 823 47 2701 2973 -4435 169
8622 169 1734 -1256 -4328 -3297 -50 2566 -396 -4011 -1525 -1932 2692 497 3122 3517 2808 2431
8606 2431 187 -6004 -5412 -2011 -2708 -9760 -4826 1359 -1278 -2968 3982 -14 -1414 -170 -3171
8591 -3171 5227 1549 1676 -1155 -3606 1372 5538 2836 430 -3028 2944 7227 5776 2637 2770
8576 2770 2491 2589 1459 1292 6454 9956 13680 10281 12903 15644 21910 20110 22414 27676 29565 25553
8560 25553 32076 28585 23700 21359 15531 14769 17460 10699 7373 8348 3603 3070 6765 2968 -123
$$ packed form
8672G94l013P16N91J290o94j069K912L206m302m06k82K887k462J02j615K020j675
8655a000j727l33K081n031K278K384J759L89j953l109M349J991k891o20l034J422
8639c045L689k461p7q5Q88k280o2L371j140M147J30k252p76K654K72p408M604
8622A69J565k990l072J031L247K616k962l615K486m07M624k195K625L95p09l77
8606B431k244o191N92L401o97p052M934O185k637j690O950l996j400J244l001
8591c171Q398l678J27k831k451M978M166k702k406l458N972M283j451l139J33
8576B770k79R8j130j67N162L502L724l399K622K741O266j800K304N262J889m012
8560B5553O523l491m885k341n828p62K691o761l326R75m745n33L695l797l091
$$ plain form
8545 -123 3636 15948 10732 8584 8641 4462 6724 13145 9502 4659 8616 5478 4040 -683 -1214 -1013
8529 -1013 -821 1589 2764 -232 -597 -188 -1274 775 3951 -2077 -1403 -955 1367 2865 2476 1784 2685
8512 2685 4557 1401 -320 580 -317 543 3086 3713 1321 2254 3300 -4845 -2310 -1313 3196 7065
8496 7065 6567 -651 -1109 2079 -2232 -5027 -5561 -5269 -6833 -946 2177 -3744 -1828 1073 3731 1693
8480 1693 -4374 -4938 -1984 -1092 2021 2072 -1524 2658 645 -1414 367 -6090 -510 -1416 -2810 1432
8464 1432 -2765 -2339 -3698 -4785 3262 2108 -2484 -1767 737 4206 -839 -1748 -3369 -7338 1664 2850
8448 2850 96 201 2942 3999 450 14 -3573 1965 -204 -3058 250 2091 -5433 -3488 -2649 -313
8432 -313 -1988 2474 -864 -371 1646 835 2196 2490 80 -1578 2570 -2118 -186 3403 607 2034
$$ packed form
8545a23L759J2312n216k148N7m179K262O421l643m843L957l138j438m723n31K01
8529a013J92K410J175k996l65M09j086K049L176o028O74M48K322J498l89o92R01
8512B685J872l156j721R00q97Q60K543O27k392R33J046q145K535R97M509L869
8496G065m98p218m58L188m311k795n34K92j564N887L123n921J916K901K658k038
8480A693o067n64K954Q92L113N1l596M182k013k059J781o457N580r06j394M242
8464A432m197M26j359j087Q047j154m592P17K504L469n045r09j621l969R002J186
8448B850k754J05K741J057l549m36l587N538k169k854L308J841p524J945Q39K336
8432c13j675M462l338M93K017q11J361K94k410j658M148m688J932L589k796J427
$$ plain form
8416 2034 -1332 -4918 -1562 -158 711 -296 -2600 -6653 -4665 -690 -3323 -153 3450 2861 2963 -370
8400 -370 -3672 459 615 -343 -91 -97 5190 6180 761 -1533 -2721 -358 -204 -3744 -4543 -3164 -3950 -4798
8382 -4798 452 -493 -4002 4751 -1166 -1770 -419 -4757 -3171 334 3704 3587 708 1813 -3890 -2983
8366 -2983 304 -2785 -4790 -4430 -1283 -1547 -4682 -3296 -139 -1084 -744 3932 -3597 -5699 -1715 -1157
8350 -1157 -1236 -3882 -368 -1259 833 -1162 -4268 -3647 -4343 -4863 -1387 -1559 -2303 -5486 -5852 -8413 -3363
8333 -3363 -4652 -1299 709 1796 2501 -44 -209 1316 1716 -1375 -2734 -906 2697 -75 -4724 -1733
8317 -1733 -3754 -7746 -4717 1858 182 -243 -1904 -1755 -1148 1386 -1942 2304 -1800 -2792 1278 148
8301 148 -1919 -2400 -891 -2906 4539 -2705 -10659 -9048 -6126 699 -2647 348 -1555 -2300 790 -420
$$ packed form
8416B034l366l586L356J404Q69j007k304m053J988L975k633L170L603n89J02l333
8400c70l302M131J56r58K52oN287R90n419k294j188K363J54l540p99J379p86q48
8382d798N250r45l509Q753n917o04J351m338J586L505L370j17k879J105n703R07
8366b983L287l089k005L60L147k64l135J386L157r45L40M676p529k102L984N58
8350a157p9k646L514q91K092j995l106O21o96n20L476j72p44l183l66k561N050
8333c363j289L353K008J087P05k545j65J525M00l091j359J828L603k772m649K991
8317a733k021l992L029O575j676m25j661J49O07K534l328M246m104r92M070j130
8301A48k067m81J509k015P445p244p954J611K922O825l346K995j903p45L090j210
$$ plain form
8285 -420 1832 -414 -1293 -379 -911 1613 -485 -4991 -8899 -8276 -9737 -8186 -6055 -6624 -9676 -11716
8269 -11716 -12337 -6312 -5215 -3038 -4880 -4037 4213 -1335 -6512 -349 507 -5805 -2011 -1034 -1804 -4122
8253 -4122 -1409 -360 2484 -3094 1180 5248 1999 -2044 -3208 -2341 -2651 -1805 2206 -399 -2047 -1529
8237 -1529 -1146 -5104 -794 3858 5483 2520 2944 -299 -2304 -4744 -3431 -4006 -6731 -8684 -6691 -4849
8221 -4849 -2918 -3056 1871 760 -2233 -1212 -5329 211 -3378 -288 2848 -1879 -1687 -6216 -6673 -2722
8205 -2722 6531 948 655 -66 428 132 4488 4413 12545 2437 13399 15761 38519 81336 31
8190 31 -4212 -4118 -9331 -1046 -4793 -1750 1723 -946 -5170 -716 1138 1025 -5096 -6626 -2381 -5593
8174 -5593 -3988 -4043 -4550 -8343 -3078 706 88 -2259 -8319 -7319 -6762 -2528 -5999 -7059 -8422 -304
$$ packed form
8285d20K252k246q79R14n32K524k098m506l908O23j461J551K131n69l052k040
8269a1716o21O025J097K177j842Q43Q250n548n177O163Q56o312L794R77p70k318
8253d122K713J049K844n578M274M068l249m043j164Q67l10Q46M011k605j648N18
8237a529L83l958M310M652J625k963M24l243k005k440J313n75k725j953J993J842
8221d849J931j38M927j111k993J021m117N540l589L090L136m727J92m529m57L951
8205b722R253n583k93p21M94k96M356p5Q132j0108J0962K362K2758M2817q1305
8190C1m243R4n213Q285l747L043L473k669m224M454J854j13o121j530M245l212
8174e593J605n5n07l793N265L784o18k347o060J000N57M234l471j060j363Q118
$$ plain form
8158 -304 -5663 -5406 -7884 -5988 -9170 -406 229 660 1398 -3679 -6130 -3285 -376 -2713 -954 -3032
8142 -3032 1922 3923 -4791 -7267 -5412 -1224 -8210 -4772 -764 -3687 -3201 -6208 -5457 -2327 -3290 -5175
8126 -5175 -855 -348 1110 5077 4611 1763 -1660 55 -1260 2020 2663 -419 3184 3843 162 2701
8110 2701 988 -440 3415 1768 3541 2361 2174 3572 2699 107 -1112 1969 2486 618 -3126 -2028
8094 -2028 -3290 -7446 -7456 68 4024 -1767 -302 -7421 -5971 -1610 -4482 -2395 -2446 -4948 436 3386
8078 3386 4955 5488 3670 6595 6141 4354 2460 5070 9328 6612 3732 2953 7792 7824 4844 2974
8062 2974 5652 7659 898 247 7040 7015 10025 11290 12276 12685 14565 13578 12400 9051 12643 14299
8046 14299 11769 8860 11166 10759 12197 17435 19099 20350 15502 12372 18309 22003 19311 22772 25675
$$ packed form
8158c04n359K57k478J896l182Q764O35M31P38n077k451K845K909k337J759k078
8142c032M954K001q714k476J855M188o986L438M008k923M86l007P51L130r63j885
8126e175M320N07J458L967m66k848l423J715j315L280O43l082L603O59l681K539
8110B701j713j428L855j647J773j180j87J398q73k592j219L081N17j868l744J098
8094b028j262m156j0P524L956n791J465p119J450M361k872K087n1k502N384K950
8078C386J569N33j818K925m54j787j894K610M258k716k880p79M839L2k980j870
8062B974K678K007o761o51O793k5L010J265R86M09J880r87j178l349L592J656
8046A4299k530k909K306m07J438N238J664J251m848l130N937L694k692L461K903
$$ plain form
8031 25675 24558 24422 27261 32213 33453 35757 40055 42751 47593 56972 63288 66538 75763 83337 94243
8016 94243 109158 126292 147947 172960 200120 242322 295302 355179 361545 308677 262011 210717
8004 210717 169183 139755 118887 103676 92621 80796 69026 61281 59371 51243 44441 39677 39259
7991 39259 42673 44135 41343 35479 33551 29068 24367 26079 27176 24256 27249 25916 19631 18404 16540
7976 16540 20985 23885 22529 20161 14002 14984 19160 17821 13289 17288 14793 7534 7851 5421 819
7961 819 1908 7478 8088 6413 8279 4386 8372 7873 8297 7038 5554 9179 6821 4999 635 4182
7945 4182 6025 2777 881 -498 -1029 -492 2537 1202 6186 3889 2457 -737 1814 5081 6226
7930 6226 3647 4324 10914 8237 5059 7532 5605 7685 6480 2268 1797 1160 2371 5349 2388 4662
$$ packed form
8031B5675j117j36K839M952J240K304M298K696M842R379O316L250R225P574J0906
8016I4243J4915J7134K1655K5013K7160M2202N2980N9877O366n2868m6666n1294
8004B10717m1534k9428k0868j5211j1055j1825j1770p745j910q128o802m764m18
7991C9259L414J462k792n864j928m483m701J712J097k920K993j333o285j227j864
7976A6540M445K900j356k368o159R82M176j339m532L999k495p259L17k430m602
7961H19J089N570O10j675J866l893L986m99M24j259j484L625k358j822m364L547
7945D182J843l248j896j379n31N37L029j335M984k297j432l194K551L267J145
7930F226k579O77O590k677l178K473j927K080j205m212m71o37J211K978k961K274
$$ plain form
7914 4662 3314 6023 10590 4480 2517 129 -5725 -2923 -3443 -3780 5074 4784 5610 6235 810 -1330
7898 -1330 -1650 2730 2085 477 -40 3454 3255 2818 3373 713 391 897 4566 1065 -2351 2794 2905
7881 2905 -1479 -2647 598 1464 1712 -1126 -8631 -6728 388 -3441 -4195 -3399 -3539 -6814 -5017 -5017 -3086
7864 -3086 -2939 -5652 -6159 -2258 -424 1361 2593 -2111 -6190 -6298 -88 2155 -3090 -2705 -1121 1021
7848 1021 -633 -2771 3557 281 1142 66 -1616 14707 2914 -15254 -3953 -6787 -4868 -1035
7834 -1035 1026 -1507 -4161 -5439 -6678 -4738 1527 -609 -464 -7865 -3867 2231 -1321 -3229 -3115
7819 -3115 -4574 -3851 -5416 -2284 -3015 -5369 -1933 2779 -2044 -283 -6570 -72 -2506 -345 -1494
7804 -1494 -1659 1651 1618 -1312 -2145 -2716 -2770 -4781 -2501 -4970 -1656 1190 -694 1659 -471 1067 -912
$$ packed form
7914D662j348K709M567o110j963k388n854K802n20l37Q854k90Q26O25n425k140
7898a330l20M380o45j608n17L494j99m37N55k660l22N06L669l501l416N145J11
7881B905m384j168L245Q66K48k838p505J903P116l829p54P96j40l275J797%J931
7864c086J47k713n07L901J834J785J232m704m079j08O210K243n245L85J584K142
7848A021j654k138O328l276Q61j076j682J6323j1793j8168J1301k834J919L833
7834a035K061k533k654j278j239J940O265k136J45p401L998O098l552j908J14
7819c115j459P23j565L132p31k354L436M712m823J761o287O498k434K161j149
7804a494j65L310l3k930q33n71n4k011K280k469L314K846j884K353k130J538j979
$$ plain form
7787 -912 2907 -557 1645 1982 402 3001 -199 -2370 -2232 -3838 -1131 1548 -404 -3514 -5202 -3726
7771 -3726 -4643 -2022 2855 2359 -3189 -3443 1531 664 3696 -1412 -5489 -825 2403 720 1803 42
7755 42 -2195 -4276 -3044 -4527 -5634 -4021 68 455 -515 -1353 -1308 -4045 -3480 -5473 -6951 -1974 -2732
7738 -2732 -2001 -61 -6330 -6608 -6525 -8177 -4668 1322 -1041 -3519 -2742 -3118 -6776 -6262 -4653 -1925 -10056
7721 -10056 -6247 -4466 -448 -1133 -3512 -3272 -2014 -2443 -3020 -3204 -6074 -4786 -1773 -7045 -6798 -3933
7705 -3933 -5991 -2652 -4655 -1209 1889 -2006 2309 1075 -2248 -466 2570 1246 3168 -8 -86
7690 -86 1558 1521 -4347 -3089 -5103 423 6329 2701 -1444 -1877 -6030 -4791 -5409 -6214 -5501 -7806 -6181
7673 -6181 -6530 -6816 -3612 128 -244 -3732 -4963 -5205 -5670 -3527 -134 4782 2220 2367 2225 -350 1124
$$ packed form
7787i12L819l464K202L37j580K599l200k171J38j606K707K679j952l110j688J476
7771c726r17K621M877m96n548k54M974q67L032n108m077M664L228j683J083j761
7755D2k237k081J232j483j107J613M089L87r70q38M5k737N65j993j478M977p58
7738b732P31J940o269k78Q3j652L509N990k363k478P77l76l658N14J609K728q131
7721a0056L809J781M018o85k379K40J258m29n77j84k870J288L013n272K47K865
7705c933k058L339k003L446L098l895M315j234l323J782L036j324J922l176p8
7690h6J644l7n868J258k014N526N906l628m145m33m153J239o18q05P13k305J625
7673f181l49k86L204L740l72l488j231k42m65K143L393M916k562J47j42k575J474
$$ plain form
7656 1124 3528 -3178 -2146 784 2885 3581 344 1901 -2918 -5303 2557 747 -807 -714 -1245 -3843
7640 -3843 -3617 -6349 -2775 851 -684 -5876 -4850 -2766 -217 -2012 2745 -811 -1752 -4287 -6022
7625 -6022 -4151 -3850 -5482 -2064 -594 -1 -3237 -1446 250 1389 -2558 -3533 -1559 -2480 -2654 -4279
7609 -4279 -502 2774 -1719 48 -101 489 2299 -2393 -5674 -2110 -3652 -4568 -2322 -5650 -4148 -257
7593 -257 -1684 1853 -808 2254 -3253 -5257 -3681 -8489 -5593 -2428 -3987 -3162 -1714 1934 211
7578 211 97 2454 -1421 551 1458 -1030 -1798 -1911 -614 -4223 -4898 -5389 -6290 -3973 -887 -1096 -2028
7561 -2028 -3155 -5978 -810 1724 2890 -2826 -970 -1822 -5483 -4808 -2084 2163 2696 682 -1679 -3877
7545 -3877 1285 732 2826 2055 1059 -4421 -2979 -3307 1324 -2768 -7425 -5898 -2760 -2366 -1620 546
$$ packed form
7656A124K404o706J032K930K101O96l237J557m819k385P860j810j554R3n31k598
7640c843K26k732L574L626j535n192J026K084K549j795M757l556r41k535j735
7625f022J871L01j632L418J470N93l236J791J696J139l947r75J974r21j74j625
7609d279L777L276m493J767j49N90J810m692l281L564j542r16K246l328J502L891
7593b57j427L537k661L062n507k004J576m808K896L165j559Q25J448L648j723
7578B11j14K357l875J972R07k488p68j13J297l609o75m91r01K317L086k09r32
7561b028j127k823N168K534J166n716J856q52l661O75K724M247N33k014k361k198
7545c877N162n53K094p71r96n480J442l28M631m092m657J527L138L94P46K166
$$ plain form
7529 546 2907 -17 -2483 -4341 -3719 -2051 -2019 3655 2814 1801 -2947 -4351 -1755 666 1430 -239
7513 -239 2149 -158 -4485 -7376 -4861 -81 -853 -2240 967 -614 870 -1672 -2466 -7436 -7993 -3943
7497 -3943 -615 -2540 -4165 -5646 -9197 -6317 -6014 -7114 -5706 -3248 -552 -3265 -942 -1825 -1116 -2321
7481 -2321 -6538 -2271 2106 -269 -1661 2822 -1164 -1824 -3047 -1340 -1777 -3475 -6354 -3635 -1665
7466 -1665 -4133 -1612 -1799 -1746 -1256 -779 -4232 -5081 -10110 -12983 -3168 -1243 -846 -1885 -5947 -2482 -3378
7449 -3378 -2483 -390 -2695 -3308 -7688 -3653 132 -4340 -7666 -3476 -1657 -4931 -6897 -2323 -753
7434 -753 -5369 -1354 -1289 -4547 -2132 -6417 -10982 -11746 -11378 -11743 -5371 -7333 -7063 -4155 -3925 -7105 -5862
7417 -5862 -3741 -5059 -4762 -2661 -2145 -2427 -1865 -2751 -6339 -6298 -6784 -7400 -5629 -7576 -2460 1520 -1216
$$ packed form
7529E46K361k924k466j858O22J668L2N674q41j013m748j404K596K421P64j669
7513b39K388k307m327k891K515M780p72j387L207j581J484k542p94m970n57M050
7497c943L328j925j625j481l551K880L03j100J408K458K696k713K323q83P09j205
7481b321m217M267M377k375j392M483l986o60j223J707m37j698k879K719J970
7466a665k468K521j87N3M90M77l453q49n029k873R815J925L97j039m062L465q96
7449c378Q95K093k305o13m380M035L785m472l326M190J819l274j966M574J570
7434g53m616M015O5l258K415m285m565p64L68l65O372j962K70K908K30l180J243
7417e862K121j318K97K101N16k82N62q86l588M1m86o16J771j947N116L980k736
$$ plain form
7400 -1216 -3176 -8679 -5183 -4669 -9522 -2052 -3314 -5588 -6368 -4149 -1937 -1853 -6408 -5777 -5562 -5912 -5381
7383 -5381 -8458 -6652 -1882 242 -2362 -2843 924 -4210 -5000 -5692 -3151 -223 -1450 2828 -663 -1680
7367 -1680 -8118 -3040 1285 -50 -3189 -443 52 -625 -5432 -4938 48 3687 4582 9 -1163 -2423
7351 -2423 -478 -1749 2207 3896 -586 -1653 -859 -3241 -5795 -6685 -6705 -5246 -7228 -6460 -5968 -7821
7335 -7821 -3654 -1101 -729 2222 1941 -3416 -3319 -1607 910 -1359 -3282 -179 -181 2601 1342 -957 -661
7318 -661 -4059 -3214 -1029 -852 -1226 -3131 -5634 -3353 -4602 -7577 -1949 1152 4111 2112 835 -94
7302 -94 -1690 -7078 -2029 -4193 -5593 -432 -1888 -1839 -336 -1719 -5748 -3967 -561 -1129 -3573 -2691
7286 -2691 329 -97 -2208 -3100 -4388 -3313 -2372 -2839 -5250 -6579 -2246 -4388 -3387 -1689 -5739 -4824
$$ packed form
7400a216j960n503L496N14m853P470j262k274p80K219K212Q4m555O31K15l50N31
7383e381l077J806M770K124k604m81L767n134p90o92K541K928j227M278l491j017
7367a680o438N078M325j335l139K746M95o77m807M94M986L639Q95m573j172j260
7351b423J945j271L956J689m482j067P94k382k554q90k0J459j982P68M92j853
7335g821M167K553L72K951k81n357R7J712K517k269j923L103kK782j259k299K96
7318f61l398Q45K185J77l74j905k503K281j249k975N628L101K959j999j277r29
7302i4j596n388N049k164j400N161j456M9J503j383m029J781L406n68k444Q82
7286b691L020m26k111q92j288J075R41m67k411j329M333k142J001J698m050R15
$$ plain form
7270 -4824 -2259 462 -360 -2329 -4679 -2401 -3204 -1747 -3011 -3801 -2873 -1311 -5437 -7794 -1866 -1755
7254 -1755 -4450 -3248 -3585 -2102 -6308 -3112 -1037 -3637 -4953 -9309 -8273 -5197 -10564 -12065 -7674
7239 -7674 -10428 -10560 -4961 -4472 -3975 -5112 -4266 -5119 -5497 -7012 -4179 -4174 -1652 -1408 90 -1599 -1919 -2463
7221 -2463 -4944 -7468 -9824 -5048 -4260 -1041 -3121 -1747 -4029 -6506 -9995 -6232 -2937 -2081 -869
7206 -869 -3850 -4873 -165 2047 -3934 -4438 -7173 -3137 -3621 -737 -989 1854 3155 3750 -1169 1987
7190 1987 2604 64 -1555 -1549 -1697 -2790 120 -3327 -2499 -848 -2853 -6836 -4296 -3311 -3441 -7515 -9177
7173 -9177 -6680 -4260 -7600 -7702 2296 1145 -459 2269 -400 -525 -1996 -1918 -2233 -2299 -2309 -2255 -6080 -3519
7155 -3519 -2115 -3093 -987 -2149 -5015 -3841 1954 -632 -2947 -1230 636 1573 -5720 -2448 1294
$$ packed form
7270d824K565K721q22j969k350K278q03J457j264p90R28J562m126k357N928J11
7254a755k695J202l37J483m206L196K075k600j316m356J036L076n367j501M391
7239g674k754j32N599M89M97j137Q46q53l78j515K833NK522K44J498j689l20n44
7221b463k481k524k356M776P88L219k080J374k282k477l489L763L295Q56J212
7206h69k981j023M708K212n981n04k735M036m84K884k52K843J301N95m919L156
7190A987O17k540j619Oj48j093K910l447Q28J651k005l983K540R85j30m074j662
7173i177K497K420l340j02R998j151j604K728k669j25j471P8l15o6j0N4l825K561
7155c519J404r78K106j162k866J174N795k586k315J717J866R37p293L272L742
$$ plain form
7140 1294 129 -3008 -3482 -2941 -3005 -2968 -452 1015 1510 -1753 -751 -1496 -1449 1871 4471 132 686 -1000
7122 -1000 560 497 -750 -828 2715 2981 1009 -2693 -5094 -3191 -2810 -304 3197 295 95 41 1429
7105 1429 -2077 -2095 -4364 -3450 -1536 -2294 -5213 -1863 2601 1305 -3081 -5218 -3695 -2000 -3850 -4174
7089 -4174 -2776 2329 1703 281 -6175 -3915 -2024 -5165 -3131 -4690 -3248 -3343 2204 -545 790 1168
7073 1168 3445 -1997 -1488 1587 955 2063 1039 -4310 -171 54 -3083 -3707 -1962 -2650 -341 -2034
7057 -2034 -3385 -3044 -5782 -2477 -2981 58 4083 -3899 -2776 -8097 -8601 -6457 -5982 -3210 -1075 312
7041 312 -232 -4006 -2548 710 2084 -568 -3079 -2598 -3538 -1975 -987 -3740 -1683 -6989 -2982 -5589
7025 -5589 -3218 -88 -905 3095 -5452 -4015 -2381 -491 -199 -762 4358 6340 2020 3659 -395 -2246
$$ packed form
7140A294j165l137m74N41o4L7K516J467M95l263J002p45M7L320K600m339N54j686
7122a000J560o3j247p8L543K66j972l702k401J903L81K506L501k902k00n4J388
7105A429l506j8k269R14J914p58k919L350M464j296m386k137J523J695j850l24
7089d174J398N105o26j422o456K260J891l141K034j559J442r5N547k749J335L78
7073A168K277n442N09L075o32J108j024n349M139K25l137o24J745o88K309j693
7057b034j351L41k738L305n04L039M025p982J123n321n04K144M75K772K135J387
7041C12n44l774J458L258J374k652k511M81r40J563R88k753K057n306M007k607
7025e589K371L130q17M000q547J437J634J890K92n63N120J982m320J639m054j851
$$ plain form
7009 -2246 -2545 -380 -2975 -1575 -1193 425 -1664 -3750 -2823 -3088 -6654 -7348 327 -529 -179 -1923 -5254
6992 -5254 -982 1180 -6682 -2812 -1270 1295 -5146 -4381 -1794 -1902 -5178 -100 -2109 -3076 1517 1167
6976 1167 -1297 -2612 1827 2050 1747 2757 3305 -1639 -1635 -2327 -479 -3725 -7068 -962 -546 897 -7761
6959 -7761 -10496 -5575 -3334 -3647 -2398 -5535 -6367 -1361 -3527 -6484 -6861 -6334 -5292 -7075 -2744 3703
6943 3703 -529 -3408 -3730 -4001 -4566 -4166 -5567 -6549 -7299 -2586 -1700 -2714 -2290 -400 -879 -1499 -2076 651
6925 651 -2092 -2822 -210 -943 -3783 744 851 -1974 437 2812 -794 -1150 54 2234 2296 2950 2516
6908 2516 4881 -2762 -1767 1808 -993 -2507 -5289 -512 3162 89 -1636 -1515 -4125 -6664 -7593 -4282
6892 -4282 -1269 -1281 1720 1567 2742 832 900 1223 4080 1775 1396 2850 -215 -499 1095 -770 1523
$$ packed form
7009b246k99K165k595J400L82J618k089k086R27k65l566o94P675q56L50j744l331
6992e254M272K162p862L870J542K565o441P65K587j08l276N078k009r67M593l50
6976A167k464j315M439K23l03J010N48m944Mo92J848l246l343O106M16J443q658
6959g761k735M921K241l13J249l137q32N006k166k957l77N27J042j783M331O447
6943C703m232k879l22k71n65M00j401r82p50M713Q86j014M24J890m79o20n77K727
6925F51k743p30K612p33k840M527J07k825K411K375l606l56J204K180O2O54m34
6908B516K365p643R95L575k801j514k782M777L674l073j725J21k610k539r29L311
6892d282L013j2L001j53J175j910O8L23K857k305l79J454l065k84J594j865K293
$$ plain form
6875 1523 -1000 2122 -1339 2156 -269 -4354 -4369 -6051 -5178 -4350 -8813 -4614 593 1311 4368 -4690
6859 -4690 -2316 2043 -823 -608 -1268 -4367 -3605 -407 5634 2784 1395 131 3922 5788 1166 -2908
6843 -2908 -633 573 1699 977 -95 3322 4097 -2636 -4905 -9290 -6928 -5652 318 -353 790 674
6827 674 -413 829 4664 140 -1920 831 1306 3340 1678 -2349 -2531 -3372 -1801 -3443 -1944 -75
6811 -75 -2316 -8030 -1809 1965 3428 7237 3226 -1313 -7051 -1176 -2763 -3866 -3004 -1400 1314 -1072
6795 -1072 -2767 723 395 -230 449 68 -1614 1874 -4176 -3814 -4726 -334 279 -2631 -563 -1383 -1185
6778 -1185 -1457 1374 218 -772 -3908 763 1627 -204 2040 650 2521 -856 -1619 -1811 -1074 -2681
6762 -2681 -2828 4366 2615 1658 4758 2898 382 731 4522 5404 2207 4354 5537 1086 -1266 -5621
$$ packed form
6875A523k523L122l461L495k425m085j5j682Q73Q28m463M199N207P18L057r058
6859d690K374M359k866K15o60l099P62L198O041k850j389j264L791J866m622m074
6843b908K275J206J126p22j072L417P75o733k269m385K362J276N970o71J143j16
6827F74j087J242L835m524k060K751M75K034j662m027j82q41J571j642J499J869
6811g5k241n714O221L774J463L809m011m539n738N875j587j103Q62J604K714k386
6795a072j695L490l28o25O79l81j682L488o050L62r12M392O13k910K068q20J98
6778a185k72K831j156r90l136M671Q64j831K244j390J871l377p63j92P37j607
6762b681j47P194j751r57L100j860k516L49L791Q82l197K147J183m451k352m355
$$ plain form
6746 -5621 -6060 2888 4715 5094 2402 -1829 -4763 -5546 -3871 752 -399 -420 -2121 1030 1137 3737
6730 3737 -387 1080 -3587 -5108 -6746 -3077 -6276 -24 -848 -3826 -1503 -356 6225 6591 2199
6715 2199 -283 -3613 -3569 52 2368 3535 3806 1578 -166 1860 -3342 -3673 -284 3347 4472 6541
6699 6541 2097 3961 4639 365 -759 2 -1508 1927 -164 26 5210 2908 1545 1773 3094 621
6683 621 1242 4808 4942 2728 -1826 -1796 -682 1707 -1057 2027 194 -2602 -3883 -20 -2665 -1952
6667 -1952 -3335 -1206 -1508 -1897 -677 -5534 -4528 -576 -1050 3167 3803 4979 -1221 -3068 2766 3773
6651 3773 4726 3701 -1657 4905 3873 2927 -2267 1039 -1952 -1504 -1451 1294 260 -4584 1038 7090
6635 7090 3845 4665 6148 4954 2579 2035 5843 1309 -2710 -1714 1957 1593 5819 1309 825 2106
$$ packed form
6746e621m39Q948J827L79k692m231k934p83J675M623j151k1j701L151J07K600
6730C737m124J467m667j521j638L669l199O252q24k978K323J147O581L66m392
6715B199k482l330M4L621K316J167K71k228j744K026n202l31L389L631J125K069
6699F541m444J864O78m274j124P61j510L435k091J90N184k302j363K28J321k473
6683F21O21L566J34k214m554L0J114K389k764L084j833k796j281L863k645P13
6667a952j383K129l02l89J220m857J006L952m74M217O36J176o200j847N834J007
6651C773R53j025n358O562j032r46n194L306k991M48N3K745j034m844N622O052
6635G090l245Q20J483j194k375n44L808m534m019R96L671l64M226m510m84J281
$$ plain form
6619 2106 1825 3618 1635 2699 1222 -1587 -204 4688 4051 6246 3296 -621 -201 2179 3716 3581
6603 3581 3402 2538 1970 -3403 -644 -4025 -107 3150 847 -891 -2167 -4718 -2960 -2394 -815 984
6587 984 3277 400 -1676 -1060 -824 4455 6466 868 -1768 813 504 -1290 3275 2037 277 -460
6571 -460 652 1862 -595 2767 -202 -957 -433 -732 -7 827 -1353 -2901 1614 -644 -1884 264
6555 264 1684 657 399 405 2670 1747 3453 -616 444 3764 7010 3802 8462 6908 5030 -276
6539 -276 4943 7336 5390 4443 3678 3714 4292 1823 3641 3883 1553 6636 4027 445 2311 -5499 -152
6522 -152 2146 2218 3961 63 7014 6499 3624 2270 1650 5058 -1398 -787 442 -225 -648 2196 845
6505 845 -389 2153 -1846 496 896 -2927 1424 5366 2669 2820 2676 2478 5653 1551 4013 2695
$$ packed form
6619B106k81J793j983J064j477k809J383M892o37K195k950l917M20K380J537j35
6603C581j79q64n68n373K759l381L918L257k303j738j276k551J758N66J579J799
6587I84K293k877k076O16K36N279K011n598k636K581l09j794M565j238j760p37
6571d60J112J210k457L362k969p55N24k99P25Q34k180j548M515k258j240K148
6555B64J420j027k58OK265r23J706m069J060L320L246l208M660j554j878n306
6539b76N219K393j946r47p65L6N78k469J818K42k330N083k609l582J866p810N347
6522a52K298P2J743l898O951n15k875j354o20L408o456O11J229o67m23K844j351
6505H45j234K542l999K342M00l823M351L942k697J51j44j98L175m102K462j318
$$ plain form
6489 2695 -1960 949 5080 7247 3187 -829 887 1832 634 3827 3946 1402 2624 1550 -3036
6474 -3036 1572 1346 1958 4105 4865 5318 -67 -1120 3283 -815 -2131 885 4140 -920 3831 3615
6458 3615 7830 9648 4705 544 1991 -1833 2486 -1540 -415 3971 2603 -1218 2666 -540 4904
6443 4904 7601 2180 -360 720 1632 5315 5393 -625 -1797 -1670 -110 1173 -3361 -3020 2498 2701
6427 2701 4619 949 -661 2878 1905 1330 150 1720 2327 -38 -948 2014 4176 7411 4385 -218
6411 -218 3320 7584 6391 6463 5861 9266 4375 1390 1180 4756 1649 808 -650 1568 4818 919
6395 919 3117 1581 -358 2947 2675 -385 1400 -3712 3055 3848 1926 6922 8342 8865 6473 3831
6379 3831 5131 -692 650 -736 -1030 280 -2756 -475 1093 1167 -4535 -1516 3828 1820 3000 1973
$$ packed form
6489B695m655K909M131K167m060m016J716R45j198L193J19k544J222j074m586
6474c036M608k26O12K147P60M53n385j053M403m098j316L016L255n060M751k16
6458C615M215J818m943m161J447l824M319m026J125M386j368l821L884l206N444
6443D904K697n421k540J080R12L683P8o018j172J27J560J283m534L41N518K03
6427B701J918l670j610L539r73n75j180J570O07k365r10K962K162L235l026m603
6411b18L538M264j193P2o02L405m891k985k10L576l107q41j458K218L250l899
6395I19K198j536j939L305k72l060J785n112O767P93j922M996J420N23k392k642
6379C831J300n823J342j386k94J310l036K281J568P4n702L019N344k008J180j027
$$ plain form
6363 1973 3820 3410 446 6219 7436 3779 4825 3119 6476 5565 7846 9452 7588 5931 3484
6348 3484 1439 -2037 6530 10049 5532 6551 2762 800 1032 3613 5716 10723 9246 5624 7939
6333 7939 4990 3953 7193 5234 12505 13983 10083 7833 9701 7825 7180 5816 6365 5076 8375
6318 8375 5520 2944 4695 7000 2607 5847 9654 6137 4115 6094 3920 7952 6968 6284 3361
6303 3361 2437 5425 8122 9120 10051 9273 3580 5875 4646 11882 5653 4922 6519 5355 10150 8023
6287 8023 8300 10720 7359 2291 8057 7442 3819 821 1322 163 1951 6508 6169 4208 2589 2628
6271 2628 3958 4738 9622 7967 6139 9605 11061 9421 12398 12069 10116 11919 12439 3649 3217 4379
6255 4379 5227 5829 8732 4825 -350 5270 9746 10260 5794 7138 12821 11764 12076 10139 9829 8799
$$ packed form
6363A973J847m10k964N773J217l657J046j706L357r11K281J606j864j657k447
6348C484k045l476Q567L519m517J019l789j962K32K581K103N007j477l622K315
6333G939k949j037L240j959P271J478l900k250J868j876o45j364N49j289L299
6318H375k855k576J751K305m393L240L807l517k022J979k174M032r84o84k923
6303C361r24K988K697R98R31p78n693K295j229P236o229p31J597j164M795k127
6287H023K77K420l361n068N766o15l623k998N01j159J788M557l39j961j619L9
6271B628J330P80M884j655j828L466J456j640K977l29j953J803N20q790m32J162
6255D379Q48O02K903l907n175N620M476N14m466J344N683j057L12j937l10j030
$$ plain form
6239 8799 8239 7996 11426 16688 11162 13030 8563 7204 2676 -760 -547 2459 665 -2032 -1191 3752
6223 3752 306 1800 5192 8667 9353 9129 6016 6519 3118 12 4649 11878 8555 4945 4194 12903
6207 12903 5213 269 4142 6988 9728 6803 7354 11321 11142 10085 8787 10945 11560 8017 5256
6192 5256 9113 2263 3421 4465 9201 9437 5655 6333 11657 10258 15998 15362 10924 4779 8149 11359
6176 11359 9872 7817 12417 15313 11707 8766 12612 14725 11716 16520 11748 13219 20897 18092 15410
6161 15410 12177 7273 8744 6349 8313 9303 12812 12918 16349 12259 8060 10641 11844 14577 14902
6146 14902 13306 8912 10020 13994 15475 13119 14216 12435 11918 12072 12067 12077 12395 13189 14632 15029 12091
6129 12091 15450 12700 11606 11637 10065 12020 15840 12880 13807 12699 14896 13093 19592 20520 16341 14493
$$ packed form
6239H799n60k43L430N262n526J868m467j359m528l436K13L006j794k697Q41M943
6223C752l446J494L392L475O86k24l113N03l401l106M637P229l323l610p51Q709
6207A2903p690m944L873K846K740k925N51L967j79j057j298K158O15l543k761
6192E256L857o850J158J044M736K36l782O78N324j399N740o36m438o145L370L210
6176A1359j487k055M600K896l606k941L846K113l009M804m772J471P678k805k682
6161A5410l233m904J471k395J964R90L509J06L431m090m199K581J203K733L25
6146A4902j596m394J108L974J481k356J097j781n17J54nJ0L18P94J443L97k938
6129A2091L359k750j094L1j572J955L820k960R27j108K197j803O499R28m179j848
$$ plain form
6113 14493 16287 17382 17728 14915 14870 18716 15871 14578 18343 14468 16666 16841 16272 12791 13411 13973
6097 13973 12339 13201 15137 12072 10520 11900 15941 14552 14053 13209 17614 16312 17563 19745 15060
6082 15060 15023 15685 14434 15936 14780 14679 9852 9751 13957 15414 12797 18720 18888 22660 21836 20033
6066 20033 20971 25121 21205 16598 11561 20065 21918 22227 23836 25319 22284 16671 22749 24564 25349
6051 25349 32214 30541 25306 20593 18831 24002 23613 20473 19048 23239 20991 22956 23477 22055 20055
6036 20055 22088 23510 18938 18363 19322 22094 24475 20266 20676 22929 23213 20260 19071 19166 22192 21072
6020 21072 20822 19902 20466 16307 20127 22651 23429 25917 29992 29973 24260 18910 19710 22619 26046 26620 28073
6003 28073 27189 24185 24251 24190 24225 27777 20017 21632 20121 20695 21955 20002 21600 26693 28523 30237 27356
$$ packed form
6113A4493J794J095L46k813m5L846k845j293L765l875K198J75n69l481O20N62
6097A3973j634Q62J936l065j552J380M041j389m99q44M405j302J251K182m685
6082A5060l7O62j251J502j156j01m827j01M206J457k617N923J68L772q24j803
6066B0033R38M150l916m607n037Q504J853L09J609J483l035n613O078J815P85
6051B5349O865j673n235m713j762N171l89l140j425M191k248J965N21j422k000
6036B0055K033J422m572n75R59K772K381m209M10K253K84k953j189R5L026j120
6020B1072k50r20N64m159L820K524P78K488M075j9n713n350Q00K909L427N74J453
6003B8073q84l004O6o1L5L552p760J615j511N74J260j953J598N093J830J714k881
$$ plain form
5986 27356 25186 27724 29966 23452 20819 22164 23732 25337 26278 26604 27453 25459 25483 24489 22623 20994
5970 20994 21013 20775 22414 21954 19862 12704 17614 19010 17694 18769 19226 16557 16959 22053 20644 19048
5954 19048 18013 16928 24448 28728 27428 18612 19206 17479 22542 23940 28686 24017 22938 29110 27739
5939 27739 27718 24610 27647 28404 31551 32133 29406 31659 33752 30640 34341 35298 32585 38156 36946 41828
5923 41828 42391 36272 39634 39578 39650 36451 38701 38121 37999 37532 33007 31985 32703 25356 27231 29862 30689
5906 30689 30731 27929 30858 30403 31965 32443 35875 33869 30888 35121 34675 34074 32982 32477 34418 40336
5890 40336 39182 38174 35481 36626 38743 42577 40529 40484 39263 39453 42382 44966 39744 37213 38196 45115
5874 45115 40866 42730 45427 45744 42968 40168 36268 36862 36350 40837 42290 42336 40079 41652 40012 44069
$$ packed form
5986B7356k170K538K242o514k633J345J568J605R41L26Q49j994K4r94j866j629
5970B0994J9k38J639m60k092p158M910J396j316J075M57k669M02N094j409j596
5954A9048j035j085P520M280j300q816N94j727N063J398M746m669j079O172j371
5939B7739k1l108L037P57L147N82k727K253K093l112L701R57k713N571j210M882
5923D1828N63o119L362n6P2l199K250n80j22m67m525j022P18p347J875K631Q27
5906C0689M2k802K929m55J562M78L432k006k981M233m46o01j092n05J941N918
5890D0336j154j008k693J145K117L834k048m5j221J90K929K584n222k531R83O919
5874D5115m249J864K697L17k776k800l900N94n12M487J453M6k257J573j640M057
$$ plain form
5858 44069 44376 43789 44466 42456 41894 43174 40763 40179 42647 45388 48085 46808 47331 50186 50256 49751 46777
5841 46777 47235 45002 45362 45179 47396 45111 49277 50433 51794 53168 55742 59905 58811 57977 55819 60930
5825 60930 59126 62782 64339 59565 61182 62061 62426 61593 60598 62090 66128 64897 60918 55295 57733 61814
5809 61814 62917 66829 66615 67225 68909 74036 76655 82345 83739 80292 87284 93301 98443 107896 114372
5794 114372 126685 136657 139853 130887 118403 107393 98196 86280 81525 78038 72729 70575 69172
5781 69172 66648 61322 55561 58853 65506 64750 64253 63780 65691 63457 60827 55950 55424 53379 53533 55654
5765 55654 51973 55142 58428 62330 59533 59713 62881 65261 60884 66270 70508 68465 60339 65744 71260
5750 71260 69474 67244 68779 68052 69632 68467 77204 84196 88550 92647 92455 104147 114765 106727 109482
$$ packed form
5858D4069L07n87O77k010n62J280k411n84K468K741K697j277N23K855P0n05k974
5841D6777M58k233L60j83K217k285M166J156J361J374K574M163j094q34k158N111
5825F0930j804L656J557m774J617Q79L65q33r95J492M038j231l979n623K438M081
5809F1814J103L912k14O10J684N127K619N690J394l447O992O017N142R453O476
5794A14372J2313R972L196q966j2484j1010r197j1916m755l487n309k154j403
5781F9172k524n326n761L292O653p56m97m73J911k234k630m877n26k045J54K121
5765E5654l681L169L286L902k797J80L168K380m377N386M238k043q126N405N516
5750G1260j786k230J535p27J580j165Q737O992M354M097j92J1692J0618q038K755
$$ plain form
5735 109482 107829 101680 93298 93865 87871 85555 85520 85465 86813 83231 84866 90042 92376 96227 96500 97493
5719 97493 98776 101761 99673 106882 112391 115508 123063 131154 137851 143938 148418 162026 168942 177029
5705 177029 187873 198813 207565 223696 236492 259839 294381 331483 331482 288628 253633 226093 193299
5692 193299 173502 167516 160834 156407 153604 148628 147120 143223 138514 140324 137736 137065 136709 130906 131345
5677 131345 126772 128996 139214 136906 140080 140222 144299 140800 140046 138741 136090 136453 137943 136808 138585
5662 138585 142632 150761 153666 156096 158498 159108 162369 171951 171716 173397 174883 179562 181787 184871 186282
5647 186282 192775 188499 189292 187485 189041 187254 188141 184345 192888 193478 190366 189619 192362 190856 189295
5632 189295 190554 199820 199562 197668 196472 195899 191989 194116 197558 203695 203402 208486 213775 209619 210590
$$ packed form
5735A09482j653o149q382N67n994k316l5n5J348l582J635N176K334L851K73R93
5719I7493J283K985k088P209N509L117P555Q091O697O087M480J3608O916Q087
5705A77029J0844J0940Q752J6131J2796K3347L4542L7102jm2854l4995k7540l2794
5692A93299j9797n986o682m427k803m976j508l897m709J810k588o71l56n803M39
5677A31345m573K224J0218k308L174J42M077l499p54j305k651L63J490j135J777
5662A38585M047Q129K905K430K402O10L261R582k35J681J486M679K225L084J411
5647A86282O493m276P93j807J556j787Q87l796Q543N90l112p47K743j506j561
5632A89295J259R266k58j894j196n73l910K127L442O137k93N084N289m156R71
$$ plain form
5617 210590 218050 223892 224438 227293 225425 223052 222770 219798 218602 217435 222748 221774 227034 228426 236502
5602 236502 239153 239567 242566 247543 254190 257476 265139 270675 276681 285271 285254 293121 292244 294199 292365
5587 292365 294117 297257 300565 304633 306368 316388 323256 327608 328898 339823 349486 355306 355158 361813
5573 361813 368913 374159 375372 376428 375957 377672 375109 371573 370234 377090 380236 382528 388529 398851
5559 398851 410214 420066 434195 446421 460282 482688 500466 530886 556974 575482 593928 604639
5547 604639 608302 608419 610224 610799 603633 610922 617341 626042 630670 643018 651269 669529 682274 695005
5533 695005 706403 721701 731832 736085 748740 766116 778061 789790 791237 802057 808361 825081
5521 825081 840266 863979 883818 907764 925184 943975 954432 964056 972184 976805 989521 993839
$$ packed form
5617B10590P460N842N46K855j868k373k82k972j196j167N313r74N260J392Q076
5602B36502K651M14K999M977O647L286P663N536O006Q590j7P867q77J955j834
5587B92365J752L140L308M068J735J0020O868M352J290J0925R663N820j48O655
5573C61813P100N246J213J056m71J715k563l536j339O856L146K292O001J0322
5559C98851J1363R852J4129J2226J3861K2406J7778L0420K6088J8508J8446J0711
5547F04639L663J17J805N75p166P289O419Q701M628J2348Q251J8260J2745J2731
5533F95005J1398J5298J0131M253J2655J7376J1945J1729J447J0820O304J6720
5521H25081J5185K3713J9839K3946J7420J8791J0457R624Q128M621J2716M318
$$ plain form
5509 993839 1005034 1016765 1030416 1048149 1068603 1093891 1116470 1132538 1156106 1179959 1199890 1220356
5497 1220356 1240101 1267593 1291814 1324430 1362364 1397993 1426725 1465581 1504995 1546282 1584082
5486 1584082 1617741 1649655 1680359 1706278 1731322 1763819 1797061 1828267 1867024 1916810 1962999
5475 1962999 2018173 2080164 2151310 2237195 2321001 2413390 2512313 2621939 2735231 2852666 2976573
5464 2976573 3098780 3218960 3324040 3433440 3538054 3633111 3726202 3825821 3923155 4026296
5454 4026296 4139071 4246596 4361647 4484254 4608756 4741248 4868498 4999521 5149418 5298672
5444 5298672 5448631 5623440 5822391 6024579 6234746 6448528 6654546 6868576 7094964 7349689
5434 7349689 7623657 7908286 8206500 8520246 8861420 9231441 9615808 10034254 10478946 10976032
$$ packed form
5509I93839J1195J1731J3651J7733K0454K5288K2579J6068K3568K3853J9931K0466
5497A220356J9745K7492K4221L2616L7934L5629K8732L8856L9414M1287L7800
5486A584082L3659L1914L0704K5919K5044L2497L3242L1206L8757M9786M6189
5475A962999N5174O1991P1146Q5885Q3806R2389R8923J09626J13292J17435J23907
5464B976573J22207J20180J05080J09400J04614R5057R3091R9619R7334J03141
5454D026296J12775J07525J15051J22607J24502J32492J27250J31023J49897J49254
5444E298672J49959J74809J98951K02188K10167K13782K06018K14030K26388K54725
5434G349689K73968K84629K98214L13746L41174L70021L84367M18446M44692M97086
$$ plain form
5424 10976032 11509252 12097918 12724437 13393837 14107155 14885216 15741796 16689151 17729741
5415 17729741 18908868 20233151 21731466 23429163 25393248 27661560 30284638 33298336
5407 33298336 36736603 40565516 44803106 49563357 55136217 61756676 69597866 78777188
5399 78777188 89519651 101869645 115737484 130017079 140505200 141037503 131670650 118193625
5391 118193625 103239284 88402431 75564772 65197906 56941527 50279750 44793885
5384 44793885 40205899 36311418 32985243 30167966 27791239 25774705 24030089 22483139
5376 22483139 21097519 19875591 18797418 17838476 16972983 16190872 15468124 14798531 14175512
5367 14175512 13601088 13061267 12552015 12054682 11579388 11128949 10703325 10300539 9911708
$$ packed form
5424A0976032N33220N88666O26519O69400P13318P78061Q56580R47355J040590
5415A7729741J179127J324283J498315J697697J964085K268312K623078L013698
5407C3298336L438267L828913M237590M760251N572860O620459P841190R179322
5399G8777188J0742463J2349994J3867839J4279595J0488121N32303r366853j3477025
5391A18193625j4954341j4836853j2837659j0366866q256379o661777n485865
5384D4793885m587986l894481l326175k817277k376727k016534j744616j546950
5376B2483139j385620j221928j078173r58942q65493p82111p22748o69593o23019
5367A4175512n74424n39821n09252m97333m75294m50439m25624m02786l88831
$$ plain form
5358 9911708 9528612 9140986 8759879 8408494 8080781 7773345 7479316 7204229 6946256 6720899
5348 6720899 6513782 6327123 6145210 5960995 5771759 5590439 5411724 5239672 5077625 4932927
5338 4932927 4805134 4679882 4552599 4430844 4321200 4216771 4115217 4015153 3917958 3837657
5328 3837657 3761399 3697813 3648007 3608867 3569798 3539478 3517694 3498352 3486445 3481994 3479845 3493593
5316 3493593 3545960 3623888 3711225 3733387 3621281 3411927 3189388 2970288 2773645 2613592
5306 2613592 2485497 2379991 2285675 2201890 2133868 2077340 2026625 1983178 1951718 1914031 1879280
5295 1879280 1835017 1805384 1775186 1735690 1681543 1633155 1585834 1541889 1500909 1463294 1428358
5284 1428358 1407872 1384825 1360124 1334871 1309885 1275500 1247317 1226127 1203998 1187082 1178812 1169019
$$ packed form
5358I911708l83096l87626l81107l51385l27713l07436k94029k75087k57973k25357
5348F720899k07117j86659j81913j84215j89236j81320j78715j72052j62047j44698
5338D932927j27793j25252j27283j21755j09644j04429j01554j00064r7195q0301
5328C837657p6258o3586m9806l9140l9069l0320k1784j9342j1907m451k149J3748
5316C493593N2367P7928Q7337K2162j12106k09354k22539k19100j96643j60053
5306B613592j28095j05506r4316q3785o8022n6528n0715m3447l1460l7687l4751
5295A879280m4263k9633l0198l9496n4147m8388m7321m3945m0980l7615l4936
5284A428358k0486k3047k4701k5253k4986l4385k8183k1190k2129j6916q270r793
$$ plain form
5272 1169019 1168418 1160824 1149345 1130545 1113453 1089948 1058292 1027042 1006068 979517 961045 940614
5260 940614 927497 917446 903726 885068 870548 856099 845750 830456 821900 804881 788842 774339
5248 774339 757159 739881 729211 712116 698984 687036 674075 659841 643054 639256 640457 646466
5236 646466 658357 662291 666684 669774 669735 672119 669193 668095 664765 652656 645820 633823 618190 602596
5222 602596 591200 583941 570823 560086 555990 551084 548633 549062 546242 546219 540813 533827 528157 519686
5208 519686 512782 511024 504948 505287 499109 489539 474904 465899 460913 455001 452436 455502 451080 448402
5194 448402 451154 456570 454041 450916 440235 433512 424529 421365 413080 406928 404615 409184 401216 394097
5180 394097 387227 385223 373121 369806 365994 356827 345605 340972 333116 337077 338644 341209 344360 345182
$$ packed form
5272A169019o01p594j1479j8800j7092k3505l1656l1250k0974k6551j8472k0431
5260I40614j3117j0051j3720j8658j4520j4449j0349j5294q556j7019j6039j4503
5248G74339j7180j7278j0670j7095j3132j1948j2961j4234j6787l798J201O009
5236F46466J1891L934M393L090l9K384k926j098l330j2109o836j1997j5633j5594
5222F02596j1396p259j3118j0737m096m906k451M29k820k3n406o986n670q471
5208E19686o904j758o076L39o178r570j4635r005m986n912k565L066m422k678
5194D48402K752N416k529l125j0681o723q983l164q285o152k313M569p968p119
5180C94097o870k004j2102l315l812r167j1222m633p856L961J567K565L151Q22
$$ plain form
5166 345182 337747 342073 346708 339250 334190 335877 327618 326525 321078 314290 311697 305199 303200 302408 297564
5151 297564 294708 291040 287496 285151 287445 278977 276396 275713 278151 274071 278523 282875 283676 282588 275591
5136 275591 275116 276862 270911 270094 270603 272644 276186 282528 279019 280369 277691 280747 279383 284124 282888
5121 282888 283260 276695 270118 265717 267096 266389 274797 275709 280705 284934 285483 288945 292645 293930 288502
5106 288502 285352 283929 282524 279468 280786 281583 288301 296958 305907 313280 318391 324266 329521 334251 338779
5091 338779 338319 339401 342879 352411 354719 360270 372775 386681 402071 418446 442993 474178 512975
5078 512975 551571 590366 638353 682264 744337 808030 884786 971436 1082538 1215377 1392588
5067 1392588 1607119 1861363 2043903 1998217 1784410 1555704 1339712 1149884 1004846 913159
$$ packed form
5166C45182p435M326M635p458n060J687q259j093n447o788k593o498j999p92m844
5151B97564k856l668l544k345K294q468k581o83K438m080M452M352Q01j088o997
5136B75591m75J746n951q17N09K041L542O342l509J350k678L056j364M741j236
5121B82888L72o565o577m401J379p07Q408R12M996M229N49L462L700J285n428
5106B88502l150j423j405l056J318P97O718Q657Q949P373N111N875N255M730M528
5091C38779m60J082L478R532K308N551J2505J3906J5390J6375K4547L1185L8797
5078E12975L8596L8795M7987M3911O2073O3693P6756Q6650J11102J32839J77211
5067A392588K14531K54244J82540m5686k13807k28706k15992j89828j45038r1687
$$ plain form
5057 913159 838300 787469 742306 713881 686155 679886 665289 662544 657259 664815 665763 677982 687755
5044 687755 707809 718431 738765 750468 771598 786622 811339 838284 864823 879327 891541 898752
5032 898752 918127 939766 985248 1025781 1070308 1117763 1182142 1253142 1343887 1453364 1596080
5021 1596080 1774831 2006063 2288573 2541193 2521839 2263369 2013194 1761242 1523517 1350911
5011 1350911 1230589 1150861 1091531 1042347 1001681 966012 931341 907880 900678 906425 914325 929845
4999 929845 942678 962469 989328 1026720 1058358 1098878 1146520 1201868 1265000 1338699 1431750 1548729
4987 1548729 1693029 1867238 2078062 2250027 2261044 2114938 1964473 1796139 1646330 1538853
4977 1538853 1468134 1421281 1397190 1384821 1390106 1406317 1439047 1475854 1534738 1607464 1689908 1772219
$$ packed form
5057I13159p4859n0831m5163k8425k7726o269j4597k745n285P556R48J2219R773
5044F87755K0054J0622K0334J1703K1130J5024K4717K6945K6539J4504J2214P211
5032H98752J9375K1639M5482M0533M4527M7455O4379P1000R0745J09477J42716
5021A596080J78751K31232K82510K52620j9354k58470k50175k51952k37725j72606
5011A350911j20322p9728n9330m9184m0666l5669l4671k3461p202N747P900J5520
4999I29845J2833J9791K6859L7392L1638M0520M7642N5348O3132P3699R3051J16979
4987A548729J44300J74209K10824J71965J1017j46106j50465j68334j49809j07477
4977A538853p0719m6853k4091j2369N285J6211L2730L6807N8884P2726Q2444Q2311
$$ plain form
4965 1772219 1879152 1990872 2140368 2319861 2555239 2834006 3193117 3623685 4160940 4783723
4955 4783723 5283595 5207085 4698339 4189727 3668168 3176324 2807186 2538329 2349020 2195928
4945 2195928 2093657 2018510 1965067 1939198 1941872 1957010 2002191 2065355 2141965 2226595 2331196
4934 2331196 2464995 2648672 2874877 3162708 3523713 3957642 4497114 5105921 5481562 5221138
4924 5221138 4617923 4081135 3514784 3041817 2691802 2456826 2270191 2137050 2026638 1943496
4914 1943496 1873492 1828071 1794899 1778563 1765392 1769022 1769864 1776047 1781808 1810859 1850852 1915951
4902 1915951 1996391 2116571 2255309 2437294 2632035 2723677 2592598 2409737 2238043 2066420
4892 2066420 1930231 1844224 1791553 1779231 1784841 1785471 1779272 1771243 1756604 1726770 1698754 1672206
$$ packed form
4965A772219J06933J11720J49496J79493K35378K78767L59111M30568N37255O22783
4955D783723M99872p6510n08746n08612n21559m91844l69138k68857j89309j53092
4945B195928j02271p5147n3443k5869K674J5138M5181O3164P6610Q4630J04601
4934B331196J33799J83677K26205K87831L61005M33929N39472O08807L75641k60424
4924E221138o03215n36788n66351m72967l50015k34976j86635j33141j10412q3142
4914A943496p0004m5421l3172j6336j3171L630Q42O183N761K9051L9993O5099
4902A915951Q0440J20180J38738J81985J94741R1642j31079j82861j71694j71623
4892B066420j36189q6007n2671j2322N610O30o199q029j4639k9834k8016k6548
$$ plain form
4880 1672206 1643444 1626798 1620928 1614272 1606816 1600054 1607299 1626867 1648298 1671973 1695452 1698286 1703567
4867 1703567 1714965 1736136 1747106 1759794 1769210 1786803 1804176 1822031 1834164 1849877 1881538 1932536
4855 1932536 1972888 2019842 2053260 2084978 2098151 2118452 2128088 2143266 2143139 2163742 2173899 2193123
4843 2193123 2222654 2277490 2318253 2367637 2398297 2446004 2483598 2532919 2562129 2613077 2648646
4832 2648646 2693597 2741187 2814938 2884487 2959668 3026759 3119675 3197741 3284803 3359459 3428170
4821 3428170 3469382 3536334 3583601 3633644 3682399 3760604 3821062 3908342 3983101 4084596 4191235
4810 4191235 4352878 4510628 4695103 4872904 5095591 5303712 5549163 5797329 6064203 6328124
4800 6328124 6614055 6849358 7070898 7277180 7497901 7675072 7870726 8050807 8275738 8497264
$$ packed form
4880A672206k8762j6646n870o656p456o762P245J9568K1431K3675K3479K834N281
4867A703567J1398K1171J0970J2688R416J7593J7373J7855J2133J5713L1661N0998
4855A932536M0352M6954L3418L1718J3173K0301R636J5178j27K0603J0157J9224
4843B193123K9531N4836M0763M9384L0660M7707L7594M9321K9210N0948L5569
4832B648646M4951M7590P3751O9549P5181O7091R2916P8066Q7062P4656O8711
4821C428170M1212O6952M7267N0043M8755P8205O0458Q7280P4759J01495J06639
4810D191235J61643J57750J84475J77801K22687K08121K45451K48166K66874K63921
4800F328124K85931K35303K21540K06282K20721J77171J95654J80081K24931K21526
$$ plain form
4790 8497264 8730892 8945511 9200590 9452524 9731050 9992464 10277851 10551436 10857142 11155705
4780 11155705 11506034 11909453 12360525 12806484 13266107 13696192 14121067 14566078 15102593
4771 15102593 15680043 16253558 16804750 17394847 18019968 18727686 19467777 20270491 21125157
4762 21125157 22073784 23138398 24321579 25605912 26927308 28311456 29806191 31449808
4754 31449808 33248577 35247448 37486429 40025381 42859085 46083937 49788998 54142464
4746 54142464 59215348 65156934 72019950 79930043 88461576 97699229 108144062 121024863
4738 121024863 136664018 155166281 176943147 203186376 233379053 269894830 308809706
4731 308809706 329312616 309171239 274461538 241953079 204663458 171323641 145433900
$$ packed form
4790H497264K33628K14619K55079K51934K78526K61414K85387K73585L05706K98563
4780A1155705L50329M03419M51072M45959M59623M30085M24875M45011N36515
4771A5102593N77450N73515N51192N90097O25121P07718P40091Q02714Q54666
4762B1125157R48627J064614J183181J284333J321396J384148J494735J643617
4754C1449808J798769J998871K238981K538952K833704L224852L705061M353466
4746E4142464N072884N941586O863016P910093Q531533R237653J0444833J2880801
4738A21024863J5639155J8502263K1776866K6243229L0192677L6515777L8914876
4731C08809706K0502910k0141377l4709701l2508459l7289621l3339817k5889741
$$ plain form
4724 145433900 125942697 110526375 98205013 87931302 79401486 71920834 65578790
4717 65578790 60221312 55859505 52111141 48873403 45804180 43172166 40829089 38863566
4709 38863566 37037879 35459930 34008202 32730666 31357584 30033571 28777199 27645966
4701 27645966 26492942 25434436 24413131 23505710 22622290 21828619 21010653 20199366 19282738
4692 19282738 18445778 17680004 17021594 16351361 15734317 15127424 14614763 14145211 13751437
4683 13751437 13364226 12996649 12573092 12168062 11770466 11402028 11026824 10710403 10418013
4674 10418013 10159768 9885351 9645837 9415954 9196908 8937272 8679389 8428136 8204207
4665 8204207 7990530 7801339 7620745 7470326 7327030 7193033 7067760 6966204 6863286 6745637
$$ packed form
4724A45433900j9491203j5416322j2321362j0273711q529816p480652o342044
4717F5578790n357478m361807l748364l237738l069223k632014k343077j965523
4709C8863566j825687j577949j451728j277536j373082j324013j256372j131233
4701B7645966j153024j058506j021305r07421q83420p93671q17966q11287r16628
4692A9282738q36960p65774o58410o70233o17044o06893n12661m69552l93774
4683A3751437l87211l67577m23557m05030l97596l68438l75204l16421k92390
4674A0418013k58245k74417k39514k29883k19046k59636k57883k51253k23929
4665H204207k13677j89191j80594j50419j43296j33997j25273j01556j02918j17649
$$ plain form
4655 6745637 6565010 6380597 6210006 6055553 5893651 5729251 5559349 5385941 5213540 5055579
4645 5055579 4911898 4762826 4609406 4469462 4335670 4201366 4099936 4015860 3940239 3877480
4635 3877480 3816510 3738344 3665997 3591905 3525808 3447183 3379778 3299690 3228148 3148113 3081046
4624 3081046 3017173 2943912 2872548 2829036 2780147 2736544 2679925 2626968 2561599 2504548 2428946
4613 2428946 2375101 2310879 2268650 2215416 2180071 2147980 2135415 2121473 2116167 2085109 2055107 2006578
4601 2006578 1959759 1911114 1877803 1837682 1812276 1779981 1758573 1726031 1690756 1651832 1633499
4590 1633499 1613260 1595602 1577059 1560020 1521139 1501829 1468347 1442068 1401677 1369983 1330579
4579 1330579 1296599 1256516 1236955 1212731 1215437 1224098 1251920 1269454 1286253 1286668 1292727 1285517 1283742
$$ packed form
4655F745637j80627j84413j70591j54453j61902j64400j69902j73408j72401j57961
4645E055579j43681j49072j53420j39944j33792j34304j01430q4076p5621o2759
4635C877480o0970p8166p2347p4092o6097p8625o7405q0088p1542q0035o7067
4624C081046o3873p3261p1364m3512m8889m3603n6619n2957o5369n7051p5602
4613B428946n3845o4222m2229n3234l5345l2091j2565j3942n306l1058l0002m8529
4601B006578m6819m8645l3311m0121k5406l2295k1408l2542l5275l8924j8333
4590A633499k0239j7658j8543j7039l8881j9310l3482k6279m0391l1694l9404
4579A330579l3980m0083j9561k4224K706Q661K7822J7534J6799M15O059p210j775
$$ plain form
4566 1283742 1278692 1276579 1264708 1249253 1223866 1202893 1168683 1148966 1122476 1096341 1062844 1034094
4554 1034094 1009787 996378 984055 974325 964249 964445 955295 949448 933126 926589 915742 908727 899757
4541 899757 888608 871565 858444 844466 822742 811091 809251 803449 801139 794917 795837 800680 797716
4528 797716 785130 775995 769190 751635 739536 726440 714097 702734 694159 682059 671753 661842
4516 661842 653085 642785 626485 610624 602674 596062 587922 577258 572820 562027 561325 562247 567083 561925
4502 561925 560304 549958 548765 535714 530283 518030 510249 497417 492285 482558 481563 477085 476284 464841
4488 464841 459941 453936 449901 440662 436286 423698 420420 413253 406875 402428 397829 392414 395456 394890
4474 394890 405000 411616 421441 417105 428484 437433 448469 452841 458279 466054 476217 482835 499859
$$ packed form
4566A283742n050k113j1871j5455k5387k0973l4210j9717k6490k6135l3497k8750
4554A034094k4307j3409j2323r730j0076J96r150n847j6322o537j0847p015q970
4541H99757j1149j7043j3121j3978k1724j1651j840n802k310o222R20M843k964
4528G97716j2586r135o805j7555j2099j3096j2343j1363q575j2100j0306r911
4516F61842q757j0300j6300j5861p950o612q140j0664m438j0793p02R22M836n158
4502E61925j621j0346j193j3051n431j2253p781j2832n132r727r95m478q01j1443
4488D64841m900o005m035r239m376j2588l278p167o378m447m599n415L042n66
4474C94890J0110O616R825m336J1379Q949J1036M372N438P775J0163O618J7024
$$ plain form
4461 499859 510667 523122 534624 547080 558727 577106 597480 632032 675875 726106 772404 830306
4449 830306 890773 972530 1073604 1200797 1359416 1555652 1799975 2093777 2318821 2237760
4439 2237760 1958924 1712412 1450201 1224702 1053331 934937 839766 767427 695943 642574
4429 642574 596756 554790 513491 485182 460653 431844 406237 382969 365729 355688 347305 349968
4417 349968 345100 350576 350097 348285 343242 340877 336532 329246 324126 323219 321659 317585 307057 297740 288586
4402 288586 284808 284325 278968 279062 278075 274880 258966 252674 240850 233576 226397 228342 224242 220443 217769
4387 217769 223398 224619 229919 228763 227495 220446 221540 225103 226538 224714 222147 215088 214964 210167 204976
4372 204976 199693 197656 196560 197630 193982 192269 188420 191872 193774 196946 192914 198457 192569 192783 183794
$$ packed form
4461D99859J0808J2455J1502J2456J1647J8379K0374L4552M3843N0231M6298N7902
4449H30306O0467Q1757J01074J27193J58619J96236K44323K93802K25044q1061
4439B237760k78836k46512k62211k25499j71371j18394r5171p2339p1484n3369
4429F42574m5818m1966m1299k8309k4529k8809k5607k3268j7240j0041q383K663
4417C49968m868N476m79j812n043k365m345p286n120r07j560m074j0528r317r154
4402B88586l778m83n357R4r87l195j5914o292j1824p274p179J945m100l799k674
4387B17769N629J221N300j156j268p049J094L563J435j824k567p059j24m797n191
4372B04976n283k037j096J070l648j713l849L452J902L172m032N543n888K14q989
$$ plain form
4357 183794 178037 168764 164803 158396 155241 148930 147721 145433 146729 147202 150120 145174 146215 137211 128530
4342 128530 128888 126989 123161 124994 120014 122365 116798 115735 113470 111208 111078 114354 107586 104870 101801
4327 101801 98939 90027 87406 89925 89942 82161 88210 87464 90170 87032 85284 89327 94533 92608 93774
4312 93774 88578 82266 78751 82157 81662 82658 80230 80285 74497 74869 68353 66143 65311 64120 65667 68161
4296 68161 68099 64959 67543 72293 76619 77995 70220 74029 74463 74165 79573 79074 79170 72998 74387 68715
4280 68715 74889 74638 77969 73035 77271 76800 83503 83504 76565 71677 68990 71021 67023 65961 63903 65536
4264 65536 68833 65861 69810 65784 66551 64575 61634 61440 62678 55941 55827 49795 50596 44997 50730 47851
4248 47851 53086 50416 46935 47799 45614 46734 47590 42223 48274 44357 49759 49241 50468 48758 52619
$$ packed form
4357A83794n757r273l961o407l155o311j209k288J296M73K918m946J041r004q681
4342A28530L58j899l828J833m980K351n567j063k265k262j30L276o768k716l069
4327A01801k862q912k621K519J7p781O049p46K706l138j748M043N206j925J166
4312I3774n196o312l515L406m95R96k428N5n788L72o516k210q32j191J547K494
4296F8161o2l140K584M750M326J376p775L809M34k98N408m99R6o172J389n672
4280F8715O174k51L331m934M236m71O703Jo939m888k687K031l998j062k058J633
4264F5536L297k972L949m026P67j976k941j94J238o737j14o032Q01n599N733k879
4248D7851N235k670l481Q64k185J120Q56n367O051l917N402n18J227j710L861
$$ plain form
4233 52619 51965 48774 48979 50665 53428 60934 57570 56587 51053 55808 56001 59964 60548 57385 58969 59412
4217 59412 54932 57159 51938 50986 48785 43111 32629 30233 27541 28136 26643 25893 27870 25502 20964
4202 20964 22081 21681 26202 24223 28332 34189 34806 40151 42783 39105 38249 39544 46506 46589 45170 42015
4186 42015 40943 45851 50166 53978 46206 48916 50873 50906 54075 53675 56484 56209 55999 56376 52662 55638
4170 55638 55388 51619 49917 51366 52252 52534 49351 47873 47021 47306 42035 43169 40659 44444 38359 39360
4154 39360 38178 36903 30140 32759 30773 37543 35450 38427 37344 34387 36408 37679 34412 33918 38464
4139 38464 35101 28174 24300 26006 27269 23501 33109 32146 35687 29245 35359 32228 28533 27075 28659
4124 28659 29094 30220 32001 28174 26174 29439 29869 29381 29584 24977 31985 35100 31077 33598 37451 35995
$$ packed form
4233E2619o54l191K05J686K763P506l364r83n534M755J93L963N84l163J584M43
4217E9412m480K227n221r52k201n674j0482k396k692N95j493p50J977k368m538
4202B0964J117m00M521j979M109N857O17N345K632l678q56J295O962Q3j419l155
4186D2015j072M908M315L812p772K710J957L3L169m00K809k75k10L77l714K976
4170E5638k50l769j702J449Q86K82l183j478q52K85n271J134k510L785o085J001
4154C9360j182j275o763K619j986O770k093K977j083k957K021J271l267m94M546
4139C8464l363o927l874J706J263l768R608r63L541o442O114l131l695j458J584
4124B8659M35J126J781l827k000L265M30m88K03m607P008L115m023K521L853j456
$$ plain form
4108 35995 37003 38645 32280 28484 30870 24890 20155 20896 22920 25779 26147 29889 29520 32857 32875 29530
4092 29530 30870 37338 33532 33760 37270 36102 38647 36696 36096 38499 35836 40231 40401 37302 28874
4077 28874 34581 36541 30303 19625 16975 20224 30957 40171 40282 38647 45933 50406 40664 28228
4063 28228 18867 17451 21473 23885 26833 26141 26192 21888 23734 25007 20789 23862 31456 36216 30423
4048 30423 30419 31675 31138 28643 28101 24549 24437 20289 19001 24124 25431 22942 24082 20553 21070 18827
4032 18827 18019 21871 26204 23412 29353 26452 28981 21820 23470 25302 28443 24516 19389 17901 18651
4017 18651 20179 20612 22102 23482 17089 15563 16687 17629 16585 14751 15421 12692 10557 12956 10708
4002 10708 14343 8604 11170 10393 10354 15801 16783 14302 10499 10290 9796 15727 15999 10944 17504 17899 16839
$$ packed form
4108C5995J008J642o365l796K386n980m735P41K024K859L68L742l69L337J8l345
4092B9530J340O468l806K28L510j168K545j951o00K403k663M395J70l099q428
4077B8874N707J960o238j0678k650L249J0733R214J11j635P286M473r742j2436
4063B8228r361j416M022K412K948o92N1m304J846J273m218L073P594M760n793
4048C0423mJ256n37k495n42l552j12m148j288N123J307k489J140l529N17k243
4032A8827q08L852M333k792N941k901K529p161J650J832L141l927n127j488P50
4017A8651J528M33J490J380o393j526J124R42j044j834O70k729k135K399k248
4002A0708L635n739K566p77l9N447R82k481l803k09m94N931K72n055O560L95j060
$$ plain form
3985 16839 16657 16358 14334 19762 15820 19425 18169 15169 20083 17559 19096 14397 9989 13980 14157
3970 14157 13835 11735 15404 15373 17683 20184 17926 21297 21241 16492 19565 19437 14462 15520 13046 13920
3954 13920 13780 16088 16759 12158 16729 11965 14977 17290 17255 15363 12582 13526 11293 17090 17366 21563
3938 21563 19518 15034 14571 11798 9805 14418 17146 16716 15208 18820 18279 18727 16442 15586 17430 21730
3922 21730 21846 20445 19630 19703 20605 17701 15249 18248 14744 15261 12782 13990 17862 21525 18765 16999
3906 16999 18738 24724 21318 16974 20456 20415 19870 23068 21261 17845 15912 13842 13542 13865 11573 16790
3890 16790 15029 16060 11342 9333 9052 12644 15645 9191 13418 12233 10868 12489 13307 16123 14621
3875 14621 11014 8970 12508 13823 10388 10379 15276 14726 7196 12104 15624 10965 13462 12533 12312 11551
$$ packed form
3985A6839j82k99k024N428l942L605j256l000M914k524J537m699m408L991J77
3970A4157l22k100L669l1K310K501k258L371n6m749L073j28m975J058k474Q74
3954A3920j40K308O71m601M571m764L012K313l5j892k781R44k233N797K76M197
3938B1563k045m484m63k773j993M613K728m30j508L612n41M48k285q56J844M300
3922B1730J16j401q15P3R02k904k452K999l504N17k479J208L872L663k760j766
3906A6999J739N986l406m344L482m1n45L198j807l416j933k070l00L23k292N217
3890A6790j761J031m718k009k81L592L001o454M227j185j365J621Q18K816j502
3875A4621l607k044L538J315l435rM897n50p530M908L520m659K497r29k21p61
$$ plain form
3859 11551 14859 15678 19976 20550 20606 18479 18028 17967 19688 19644 19230 20181 15762 13682 10398 9573 18549 18578
3841 18578 14468 10917 14764 12733 12913 6947 6909 14499 17471 18033 17437 18994 14072 14474 16853 16315
3825 16315 15744 13154 17031 12133 8387 9822 10795 11137 11884 12194 10249 11049 10770 10248 10203 12422 11885
3808 11885 9790 10795 13771 13963 15768 9357 8244 7233 10972 16255 18367 12664 11491 7778 10617
3793 10617 9625 11770 13770 8104 7206 10400 9202 10365 14910 12364 11725 11764 12229 12443 12456 10826 9581
3776 9581 12818 7117 9094 11052 15160 12950 10774 10449 13779 16525 14837 15661 15195 11647 9845 11105
3760 11105 13731 17789 17265 14398 11700 8315 13165 16748 16055 15507 16957 15268 12147 11442 14750 18256
3744 18256 20496 19916 19814 20458 22605 20218 16638 11683 15941 10207 15778 16995 14616 6358 7237 8177
$$ packed form
3859A1551L308Q19M298N74N6k127m51o1J721m4m14R51m419k080l284q25Q976K9
3841A8578m110l551L847k031J80n966l8P590K972N62n96J557m922M02K379n38
3825A6315n71k590L877m898l746J435R73L42P47L10j945Q00k79n22m5K219n37
3808A1885k095J005K976J92J805o411j113j011L739N283K112n703j173l713K839
3793A0617r92K145K000n666q98L194j198J163M545k546o39L9M65K14J3j630j245
3776I581L237n701J977J958M108k210k176l25L330K746j688Q24m66l548j802J260
3760A1105K626M058n24k867k698l385M850L583o93n48J450j689l121p05L308L506
3744A8256K240n80j02O44K147k387l580m955M258n734N571J217k379q258Q79R40
$$ plain form
3728 8177 12925 14478 16209 10438 2987 6856 10334 9692 10587 8481 7267 13396 8771 9748 10789 11834
3712 11834 7458 5435 2535 2585 2584 5820 3790 8079 9734 8699 6968 3980 4028 5697 10268 9479 11547
3695 11547 13170 9224 7194 5865 6185 7204 8798 12256 13840 11040 13963 16984 19110 18219 13040
3680 13040 10970 13863 12560 13327 9953 10962 15941 16849 13640 12276 11398 12625 14730 16773 16623 17640
3664 17640 19364 20774 21505 21918 21169 25080 22874 26361 24465 24607 27278 30437 34239 31353 35169 41647
3648 41647 45049 51432 53794 65291 68397 78963 93478 109649 132704 157069 181006 186881 172185
3635 172185 149952 126996 103026 82786 73487 64696 54267 48816 43244 42273 38264 35380 33635
3622 33635 32779 28328 24868 25147 23111 19775 18129 17646 16845 19559 20186 19601 15060 18647 18360 13088
$$ packed form
3728H177M748J553J731n771p451L869L478o42Q95k106j214O129m625R77J041J045
3712A1834m376k023k900N0jL236k030M289J655j035j731k988M8J669M571p89K068
3695A1547J623l946k030j329L20J019J594L458J584k800K923L021K126q91n179
3680A3040k070K893j303P67l374J009M979R08l209j364q78J227K105K043j50J017
3664A7640J724J410P31M13p49L911k206L487j896J42K671L159L802k886L816O478
3648D1647L402O383K362J1497L106J0566J4515J6171K3055K4365K3937N875j4696
3635A72185k2233k2956k3970k0240r299q791j0429n451n572r71m009k884j745
3622C3635q56m451l460K79k036l336j646m83q01K714O27n85m541L587k87n272
$$ plain form
3606 13088 8583 12500 15230 12384 10496 7346 5869 11901 8202 5949 6370 8860 13027 9461 5281
3591 5281 6038 3191 3974 445 1753 3669 1624 7699 6706 5029 3474 5262 -1177 1376 4758 -1834
3575 -1834 -1358 -99 3616 5203 5555 5860 2499 7950 10807 9522 8968 6896 2735 9942 8002 4260
3559 4260 8441 7567 5927 3830 2952 7627 6545 9547 4288 2673 8693 7628 3054 6275 2610
3544 2610 4732 1660 6907 11406 8952 4813 5378 5961 7307 8546 6685 11239 9974 12739 8782
3529 8782 7144 7728 7720 8530 6801 3478 4188 5222 4210 4110 -53 -643 1127 3492 1664 967 -2078
3512 -2078 -846 -3503 -2402 2396 6215 3561 1374 1811 3745 3334 1617 -717 5019 3969 4310 2781
3496 2781 -530 -421 2834 4262 -2 -1653 -770 3203 4826 426 -1511 2554 -1020 4032 3159 113
$$ packed form
3606A3088m505L917K730k846j888l150j477O032l699k253M21K490M167l566m180
3591E281P57k847P83l529J308J916k045O075r93j677j555J788o439K553L382o592
3575a834M76J259L715J587L52L05l361N451K857j285n54k072m161P207j940l742
3559D260M181q74j640k097q78M675j082L002n259j615O020j065m574L221l665
3544B610K122l072N247M499k454m139N65N83J346J239j861M554j265K765l957
3529H782j638N84qQ10j729l323P10J034j012j00m163n90J770K365j828o97l045
3512b078J232k657J101M798L819k654k187M37J934m11j717k334N736j050L41j529
3496B781l311J09L255J428m264j651Q83L973J623m400j937M065l574N052q73l046
$$ plain form
3480 113 1833 4269 4201 -226 1361 4854 3774 5500 5786 5597 6081 7973 7365 3361 4387 3861 970
3463 970 3822 4781 3874 3145 4033 -48 2152 7681 2548 2521 5658 3507 6954 2585 205 1331 4846
3446 4846 41 834 0 1635 -287 -3355 420 -3279 -2109 626 122 2626 8594 3861 1016 -1438
3430 -1438 1837 2149 6427 5658 2614 4401 2697 -769 2642 3064 10 3404 6770 4734 5561 1049
3414 1049 -939 1056 1105 4508 884 769 -1861 -3212 -1665 -2241 -3134 -7439 -11032 -7654 -2871 -777
3398 -777 3260 8739 -1048 -4149 -1664 3057 887 3306 1667 -232 -36 805 3706 6445 3194 2323
3382 2323 -414 578 1892 2609 4587 5116 -1731 -46 -1267 94 -431 1956 5016 3431 385 707
3366 707 1211 6657 7646 6631 7136 2852 3675 2433 7403 7113 4666 3256 2974 4269 3317 1355 -1771
$$ packed form
3480A13J720K436o8m427J587L493j080J726K86j89M84J892o08m004J026n26k891
3463I70K852R59r07p29Q88m081K200N529n133k7L137k151L447m369k380J126L515
3446D846m805P93q34J635j922l068L775l699J170K735n04K504N968m733k845k454
3430a438L275L12M278p69l044J787j704l466L411M22l054L394L366k036Q27m512
3414A049j988J995M9L403l624j15k630j351J547n76q93m305l593L378M783K094
3398g77M037N479r787l101K485M721k170K419j639j899J96Q41K901K739l251q71
3382B323k737R92J314P17J978N29o847J685j221J361n25K387L060j585l046L22
3366G07N04N446R89j015N05m284Q23j242M970k90k447j410k82J295r52j962l126
$$ plain form
3349 -1771 -1287 6280 2098 5130 4838 1887 1692 407 1442 3678 2253 5354 2681 1911 5181 7419
3333 7419 6636 3431 2901 3181 2880 2089 6329 5770 4199 5880 5069 4891 4905 533 -1167 651 2641
3316 2641 119 779 2537 6246 10004 5456 2586 3830 -2747 -2562 2257 4216 5619 5458 3124 -161
3300 -161 2011 4570 4624 3987 578 1711 3655 1147 6310 988 773 988 4730 -1118 -5266 -862
3284 -862 3377 1210 618 2977 4529 6957 11957 4170 2277 1724 3316 1962 7221 8088 5307 3238
3268 3238 4007 9036 7750 3504 3013 5394 9116 11136 9402 8580 9402 6322 5206 9201 8543 9483
3252 9483 8418 9210 11177 3338 5542 10786 13786 13084 11620 11611 10526 11730 12734 9950 6430 7848
3236 7848 10688 19879 15392 11661 14028 13990 12191 16229 15218 11250 13286 17385 19818 17698 19074
$$ packed form
3349a771M84P567m182L032k92k951j95j285J035K236j425L101k673p70L270K238
3333G419p83l205n30K80l01p91M240n59j571J681q11j78J4m372j700J818J990
3316B641k522O60J758L709L758m548k870J244o577J85M819J959J403j61k334l285
3300a61K172K559N4o37l409J133J944k508N163n322k15K15L742n848m148M404
3284h62M239k167n92K359J552K428N000p787j893n53J592j354N259Q67k781k069
3268C238P69N029j286m246m91K381L722K020j734q22Q22l080j116L995o58R40
3252I483j065P92J967p839K204N244L000p02j464rj085J204J004k784l520J418
3236G848K840R191m487l731K367l8j799M038j011l968K036M099K433k120J376
$$ plain form
3221 19074 22062 26137 30571 31490 31648 28125 27707 28946 20799 15351 18883 19352 20471 21624 18973 17748
3205 17748 17740 16492 19634 21393 21904 25539 23004 18948 21225 22030 25561 27193 32634 34839 42737 50361
3189 50361 57482 58058 51186 48264 44388 37397 37887 28621 28956 25569 22565 22627 22787 22077 22636 27851 26089
3172 26089 22500 23203 28624 25126 18176 23725 28880 30218 30638 27834 32468 39029 43621 39531 37139
3157 37139 37376 34779 35796 33005 30329 33256 31344 27933 24189 21148 19560 22368 23213 19029 21650
3142 21650 20961 22369 23449 24477 19443 17419 22126 21409 21308 21988 25452 25601 25544 30940 32288 27390
3126 27390 23768 21812 22047 22436 23118 28523 27859 33361 29981 30534 33296 37121 32287 28266 32915 38935
3110 38935 40560 38285 42482 36168 39074 37992 37088 38334 38753 34260 38518 41332 46434 45601 45355 44584
$$ packed form
3221A9074K988M075M434R19J58l523m18J239q147n448L532M69J119J153k651j225
3205A7748qj248L142J759N11L635k535m056K277Q05L531J632N441K205P898P624
3189E0361P121N76o872k922l876o991M90r266L35l387l004O2J60p10N59N215j762
3172B6089l589P03N421l498o950N549N155J338M20k804M634O561M592m090k392
3157C7139K37k597J017k791k676K927j912l411l744l041j588K808Q45m184K621
3142B1650o89J408J080J028n034k024M707p17j01O80L464J49n7N396J348m898
3126B7390l622j956K35L89O82N405o64N502l380N53K762L825m834m021M649O020
3110C8935J625k275M197o314K906j082r04J246M19m493M258K814N102q33k46p71
$$ plain form
3094 44584 44868 41617 45424 53702 55286 54591 56083 54779 56397 56478 51952 51141 56437 59965 58956 58300
3078 58300 59852 61587 60538 60982 60740 65592 68793 67478 69806 73718 73016 74012 73312 77051 78841 84828
3062 84828 86178 86803 91215 95467 96045 99795 103622 110065 110141 116171 119917 123151 125649 125982 124256 123429
3046 123429 122278 120250 122034 119754 126700 133486 139350 142622 145430 146589 154993 153373 156365 162381
3032 162381 170819 178968 190784 198420 205227 213492 223215 229347 238023 247886 256549 258543 259350 265058
3018 265058 270298 272511 282471 291518 284863 285270 290367 297884 304929 311825 314253 320157 333205 344533
3004 344533 358087 375444 386434 400800 415100 434607 446885 461233 483175 505178 528899 541566
2992 541566 554408 569761 582303 604302 625724 640702 665405 696738 725975 759583 803153 850832
$$ packed form
3094D4584K84l251L807Q278J584o95J492j304J618Q1m526q11N296L528j009o56
3078E8300J552J735j049M44k42M852L201j315K328L912p02R96p00L739J790N987
3062H4828J350O25M412M252N78L750L827O443P6O030L746L234K498L33j726q27
3046A23429j151k028J784k280O946O786N864L272K808J159Q404j620K992O016
3032A62381Q438Q149J1816P636O807Q265R723O132Q676R863Q663J994Q07N708
3018B65058N240K213R960R047o655M07N097P517P045O896K428N904J3048J1328
3004C44533J3554J7357J0990J4366J4300J9507J2278J4348K1942K2003K3721J2667
2992E41566J2842J5353J2542K1999K1422J4978K4703L1333K9237L3608M3570M7679
$$ plain form
2980 850832 896791 953112 1015896 1087639 1172786 1275261 1385136 1498834 1628096 1773563 1951646
2969 1951646 2182282 2452013 2787362 3209808 3731033 4397510 5083189 5255793 4749140 4188027
2959 4188027 3654729 3127323 2741730 2490363 2317811 2203552 2131746 2087759 2066225 2073322
2949 2073322 2111474 2184305 2286698 2428031 2594976 2778441 2980963 3242329 3567334 3981672
2939 3981672 4486183 5139306 5948554 6972543 8290275 9518998 9430148 8225039 7144418
2930 7144418 6017335 4988733 4251072 3749127 3391370 3136574 2924241 2716411 2527733
2921 2527733 2387590 2273503 2199694 2166339 2165534 2178914 2213245 2264819 2352325 2480028 2655739
2910 2655739 2881946 3186075 3562773 4063237 4678983 5156198 4962979 4353666 3816259 3263043
$$ packed form
2980H50832M5959N6321O2784P1743Q5147J02475J09875J13698J29262J45467J78083
2969A951646K30636K69731L35349M22446N21225O66477O85679J72604n06653n61113
2959D188027n33298n27406l85593k51367j72552j14259p1806m3987k1534P097
2949B073322L8152P2831J02393J41333J66945J83465K02522K61366L25005M14338
2939C981672N04511O53123Q09248J023989J317732J228723q8850j205109j080621
2930G144418j127083j028602p37661n01945l57757k54796k12333k07830j88678
2921B527733j40143j14087p3809l3355q05J3380L4331N1574Q7506J27703J75711
2910B655739K26207L04129L76698N00464O15746M77215j93219o09313n37407n53216
$$ plain form
2900 3263043 2785881 2436749 2154157 1921209 1724875 1558653 1422529 1301982 1201141 1114845
2890 1114845 1047251 982773 929843 886605 845299 804071 773371 740319 706734 680851 655730
2879 655730 628308 609508 587018 568645 550012 530102 509263 491792 470928 456511 446769 430355
2867 430355 414308 403975 389369 378197 369876 359027 349461 341903 332432 325135 316352 306814 292616
2854 292616 284963 279202 271411 260965 253062 240518 237622 231484 225051 218634 213358 197758 190998 189530
2840 189530 188815 183742 177982 178035 174789 170060 171168 166466 166397 163493 159170 151929 146602 138827 142500 142073
2824 142073 130922 127640 124983 123994 121408 123233 117730 112347 110298 106629 103805 97773 98252 98469 94337
2809 94337 89503 88107 89559 88856 88968 88326 89377 87534 79800 80679 79394 76433 73660 73061 74810 70917
$$ packed form
2900C263043m77162l49132k82592k32948j96334j66222j36124j20547j00841q6296
2890A114845o7594o4478n2930m3238m1306m1228l0700l3052l3585k5883k5121
2879F55730k7422j8800k2490j8373j8633j9910k0839j7471k0864j4417r742j6414
2867D30355j6047j0333j4606j1172q321j0849r566p558r471p297q783r538j4198
2854B92616p653n761p791j0446p903j2544k896o138o433o417n276j5600o760j468
2840A89530p15n073n760N3l246m729J108m702o9k904m323p241n327p775L673m27
2824A42073j1151l282k657r89k586J825n503n383k049l669k824o032M79K17m132
2809I4337m834j396J452p03J12o42J051j843p734Q79j285k961k773n99J749l893
$$ plain form
2793 70917 69754 63831 61106 66209 63269 62852 58470 61471 58175 56855 57229 55199 55081 53543 51681
2778 51681 51210 53426 49613 50159 51833 55380 60724 58304 49850 52160 52651 51613 50734 47391 48346 48472
2762 48472 46689 46804 45615 45254 46739 40382 38061 39386 34466 34363 32702 36993 38339 40422 33595
2747 33595 32572 34563 38240 40058 38092 39160 38828 38501 38647 39877 33520 33966 38855 37070 35881 30928
2731 30928 29403 28893 28002 27436 30747 29524 26645 28448 29203 27250 30666 29363 28409 29377 28042 27892
2715 27892 29144 26401 28918 29313 31999 29572 36877 37650 38803 43791 45780 45820 43293 38637 35600 34637
2699 34637 34174 31503 29481 27426 30991 35604 28321 29717 26156 28156 27494 30308 28361 29598 33244
2684 33244 30164 35099 37177 39334 41305 46135 52539 61697 68389 70867 58425 53114 49095 42610
$$ packed form
2793G0917j163n923k725N103k940m17m382L001l296j320L74k030j18j538j862
2778E1681m71K216l813N46J674L547N344k420q454K310M91j038q79l343R55J26
2762D8472j783J15j189l61J485o357k321J325m920j03j661M291J346K083o827
2747C3595j023J991L677J818j966J068l32l27J46J230o357M46M889j785j189m953
2731C0928j525n10q91n66L311j223k879J803P55j953L416j303r54R68j335j50
2715B7892J252k743K517L95K686k427P305P73J153M988J989M0k527m656l037r63
2699C4637m63k671k022k055L565M613p283J396l561K000o62K814j947J237L646
2684C3244l080M935K078K157J971M830O404R158O692K478j2442n311m019o485
$$ plain form
2670 42610 37019 29029 28294 30575 30528 25201 27618 31349 27425 22672 24657 24993 30193 24055 22270 19657
2654 19657 18469 20764 23322 21909 22594 26426 35113 40831 38942 34263 22950 23902 23094 25208 26129
2639 26129 20884 19455 18517 17593 15186 14809 18612 12670 11883 14777 17446 13229 9631 7782 6566 5748
2623 5748 4415 2318 6822 5781 6281 7637 4302 12621 11044 9382 9465 3595 1056 6471 2332 3832
2607 3832 6061 8170 11356 10036 8079 6460 8397 4872 1026 3990 6166 5979 892 1332 3764
2592 3764 2559 1687 5463 2731 -184 582 2126 5527 -663 -1592 1376 3459 6009 3681 6863 3584
2576 3584 5045 1825 -1233 5251 6367 3014 -957 748 5190 5476 3324 4005 5473 5857 5819 1915
2560 1915 250 422 -3191 -4372 -3614 374 3375 252 -815 -1692 120 -544 -2468 -1544 -2797 -5777
$$ packed form
2670D2610n591p990p35K281m7n327K417L731l924m753J985L36N200o138j785k613
2654A9657j188K295K558j413O85L832Q687N718j889m679j1313R52q08K114R21
2639B6129n245j429r38r24k407l77L803n942p87K894K669m217l598j849j216q18
2623E748j333k097M504j041N00J356l335Q319j577j662Q3n870k539N415m139J500
2607C832K229K109L186j320j957j619J937l525l846K964K176j87n087M40K432
2592C764j205q72L776k732k915P66J544L401o190r29K968K083K550k328L182l279
2576C584J461l220l058O484J116l353l971J705M442K86k152O81J468L84l8l904
2560A915j665J72l613j181P58L988L001l123j067q77J812o64j924R24j253k980
$$ plain form
2544 -5777 -6199 -4931 -1055 -1755 -1231 -265 -1903 -2409 923 -2164 -2313 -5487 -5108 -8148 -6373 -1679 -2484
2527 -2484 -4074 -1897 -1696 -2375 -1471 -1337 945 -1197 -2616 -4908 -4176 -2377 -3183 -2520 -2418 -3072 -1808
2510 -1808 -4440 -6967 -4917 -93 -2601 -1499 -6205 -4756 -2699 -7210 -7400 -6556 -5755 -6844 -4433 -4294
2494 -4294 -3960 -2602 1297 -809 -6057 -3106 -5689 -7737 -2298 572 -238 -44 -2571 -8505 -8624 -8700
2478 -8700 -8487 -9120 -8214 -5575 -7477 -4002 -2940 -5110 -5788 -8674 -8023 -2119 -3277 -1238 314 -3262
2462 -3262 -3067 4315 -1779 -3147 -2698 -4497 -2849 995 -5 2172 -2956 -6633 -7247 -5004 -7815 -5816
2446 -5816 -5281 -2731 475 -1479 -115 -890 -6625 -5231 -6881 -2916 -2250 -7558 -2039 251 1563 -1523
2430 -1523 -5443 -3222 -8179 -1232 -334 -3020 -5121 -5588 -825 2424 -2242 -3269 -1402 -3284 -5274
$$ packed form
2544e777m22J268L876p00N24R66j638n06L332l087j49l174L79l040J775M694q05
2527b484j590K177K01o79R04J34K282k142j419k292P32J799q06O63J02o54J264
2510a808k632k527K050M824k508J102m706J449K057m511j90Q44Q01j089K411J39
2494d294L34J358L899k106n248K951k583k048N439K870q10J94k527n934j19p6
2478h700K13o33R06K639j902L475J062k170o78k886O51N904j158K039J552l576
2462c262J95P382o094j368M49j799J648L844j000K177n128l677o14K243k811J999
2446e816N35K550L206j954J364p75n735J394j650L965O66n308N519K290J312l086
2430a523l920K221m957O947Q98k686k101m67M763L249m666j027J867j882j990
$$ plain form
2415 -5274 -7919 -6899 -1827 -368 -4139 -1715 -4601 -9306 -9673 -5512 -7911 -8432 -6711 -5788 -5808 -4015
2399 -4015 -3013 -6782 -10768 -8011 -2924 -1120 -1930 -5883 -5045 -5619 -7364 -4681 -9283 -8508 -9473 -6353
2383 -6353 -7274 -2600 -6792 -5575 -4706 -4156 -5751 -6352 -7145 -4405 782 -6561 -8707 -3950 -2685 -2757 -2831
2366 -2831 -7233 -2348 -2517 -2106 -12 -6258 -5697 -6746 -8164 -6093 -855 -7981 -5340 -5347 -7224 -2373
2350 -2373 -275 -2913 989 -892 -1433 -3988 -3449 -3146 -1627 -1647 -3372 -1663 -2954 -696 -1043 -710 -2528
2333 -2528 -775 -4020 -3172 -3651 -486 -3861 -4463 -4653 -5228 -2716 -798 -5060 -5877 -2206 -2101 -4055 -1882
2316 -1882 1545 -2814 -910 -1108 1793 -2714 -4512 512 -4316 -4935 -5021 -5087 -6754 -8302 -6171 -7030 -4490
2299 -4490 -3351 -1511 -3792 -1053 -4857 -4497 -2110 830 -1311 -3828 -2032 -4629 -6263 -4433 -4833
$$ packed form
2415e274k645J020N072J459l771K424k886m705l67M161k399n21J721R23k0J793
2399d015J002l769l986K757N087J804q10l953Q38n74j745K683m602P75r65L120
2383f353r21M674m192J217Q69N50j595o01p93K740N187p343k146M757J265p2p4
2366b831m402M885j69M11K094o246N61j049j418K071N238p126K641pj877M851
2350b373K098k638L902j881n41k555N39L03J519k0j725J709j291K258l47L33j818
2333b528J753l245Q48m79L165l375o02j90n75K512J918m262q17L671J05j954K173
2316a882L427m359J904j98K901m507j798N024m828o19q6o6j667j548K131q59K540
2299d490J139J840k281K739l804L60K387K940k141k517J796k597j634J830m00
$$ plain form
2284 -4833 -3846 -66 -3483 -10951 -11255 -5315 -3219 -6627 -6072 -2620 -5671 -5593 -1791 879 -2167 -2160 1
2267 1 -1444 -2128 -1613 -5068 -3612 -4727 -2115 -1406 -5895 -5429 -3071 -3412 -7393 -2257 591 690 3170
2250 3170 -30 -2343 -4607 -5939 -3783 -2514 -5670 -5444 -6184 385 1490 400 -3155 -2979 -5083 -1068
2234 -1068 1100 -1439 -3284 -5912 -1987 -4699 -8148 -7337 -8696 -2135 -4506 -3033 -3265 -6269 -5208
2219 -5208 -1696 -4410 -5205 -1285 1013 -521 -3453 -3476 -2906 -4633 -7351 -4701 -3300 -1192 -3548 -2458
2203 -2458 -2434 2380 530 -3547 -2620 -4273 -3803 -1108 19 854 3079 841 2777 1129 -190 -3669
2187 -3669 430 -1659 902 156 -683 1523 59 -2160 -781 -2438 -5222 -4420 -1134 161 -1670 -2048
2171 -2048 -2420 -2223 -1977 3005 1837 -2038 -4205 -5638 -3967 -3467 -2830 -5920 -5087 -4799 -2837 1333 1693
$$ packed form
2284d833R87L780l417p468l04N940K096l408N55L452l051P8L802K670l046PK161
2267Aj445o84N15l455J456j115K612P09m489M66K358l41l981N136K848R9K480
2250C170l200k313k264j332K156J269l156K26p40O569J105j090l555J76k104M015
2234a068K168k539j845k628L925k712l449Q11j359O561k371J473k32l004J061
2219e208L512k714p95L920K298j534k932k3N70j727k718K650J401K108k356J090
2203b458K4M814j850m077R27j653M70K695J127Q35K225k238J936j648j319l479
2187c669M099k089K561p46q39K206j464k219J379j657k784Q02L286J295j831l78
2171b048l72J97K46M982j168l875k167j433J671N00O37l090Q33K88J962M170L60
$$ plain form
2154 1693 72 -942 361 -9117 -10434 -6846 -5341 2162 778 -5889 -2468 -1465 -1574 -2672 -1430
2139 -1430 -1741 -3271 -5731 -2741 -871 618 604 -260 3689 4080 -2426 -3715 -4637 -182 -2406 66
2123 66 -2155 -2992 -2766 -5817 -6132 -6194 -4513 -142 -462 405 -2321 -1228 -1665 -644 -184 -1762 -654 -3052
2105 -3052 -3591 2209 2077 -3628 -4643 -2231 -130 -311 1483 1974 -2653 -5549 -1891 1077 1898 -2028
2089 -2028 -268 267 574 -3439 -3281 -414 -137 557 -465 -3079 -6958 -4701 -1 3626 1366 1787
2073 1787 -1607 -470 -938 -1128 -855 2781 -3833 -2345 -314 2357 3219 7285 3927 6259 6004 4607
2057 4607 2838 4559 5271 6596 6394 7652 7219 6628 6104 4529 8405 8193 5313 6384 11641 8831
2041 8831 7399 8252 7304 4652 6582 4525 6448 2171 8401 8994 9214 6517 7718 2994 4087 10669
$$ packed form
2154A693j621j014J303r478j317L588J505P503j384o667L421J003j09j098J242
2139a430l11j530k460K990J870J489j4q64L949L91o506j289r22M455k224K472
2123F6k221q37K26l051l15o2J681M371l20Q67k726J093m37J021M60j578J108k398
2105c052n39N800j32n705j015K412K101j81J794M91m627k896L658K968Q21l926
2089b028J760N35L07m013J58K867K77O94j022k614l879K257M700L627k260M21
2073A787l394J137m68j90K73L636o614J488K031K671Q62M066l358K332k55j397
2057D607j769J721P12J325k02J258m33n91n24j575L876k12k880J071N257k810
2041H831j432Q53r48k652J930k057J923m277O230N93K20k697J201m724J093O582
$$ plain form
2025 10669 9885 6142 7244 5072 9993 11440 11732 16185 20985 17025 10869 8497 16311 20488 18678
2010 18678 17903 19290 23187 18711 19862 24189 26671 21083 21336 19665 22601 23727 27575 31487 26998
1995 26998 31322 29168 27783 30336 37835 35633 36471 37021 39458 34107 37414 36993 34478 38734 44016
1980 44016 43844 42664 46776 55050 51248 50896 56810 63060 57914 64238 66786 68936 75502 83021 87000
1965 87000 90035 95878 102129 105625 116702 125510 135859 154169 169252 186106 209290 233035 253138
1952 253138 273014 299465 328305 364156 409337 472367 544218 647584 764105 907476 1099069
1941 1099069 1284558 1247464 1042878 892775 723538 577172 473351 408170 352298 310323
1931 310323 274203 246619 226049 214101 202408 188007 168200 156144 144703 135168 125375 115624
$$ packed form
2025A0669p84l743J102k172M921J447K92M453M800l960o156k372P814M177j810
2010A8678p75J387L897m476J151M327K482n588K53j671K936J126L848L912m489
1995B6998M324k154j385K553P499k202Q38N50K437n351L307m21k515M256N282
1980D4016j72j180M112Q274l802l52N914O250n146O324K548K150O566P519L979
1965H7000L035N843O251L496J1077Q808J0349J8310J5083J6854K3184K3745K0103
1952B53138J9876K6451K8840L5851M5181O3030P1851J03366J16521J43371J91593
1941A099069J85489l7094k04586j50103j69237j46366j03821o5181n5872m1975
1931C10323l6120k7584k0570j1948j1693j4401j9807j2056j1441r535r793r751
$$ plain form
1919 115624 106387 104385 99967 96272 88499 88320 84067 80147 73959 74662 74008 71828 70096 64675 57707
1904 57707 60092 59827 55885 55257 54214 49663 43288 39937 40183 39329 41483 44020 38270 39031 35977 35102
1888 35102 33992 31800 28949 26467 27430 28475 30098 26401 25944 26958 24927 19774 19761 17808 21439 18860
1872 18860 17015 20223 18059 18051 21993 21849 21046 21665 18164 15740 10063 8246 9256 10880 4393 7529
1856 7529 11317 12205 9009 8640 10146 5980 7979 9521 13513 9944 6985 4411 5401 4030 5279 5076
1840 5076 4158 1513 8095 5060 2856 4838 2560 3323 2574 -892 470 -530 -1075 2022 570 209
1824 209 4521 2909 644 4056 2193 6077 2568 2142 -1058 -1851 1479 2660 2297 -473 -3884 -557
1808 -557 514 4174 7212 3553 -784 -767 -3302 -1860 -1628 -2563 -55 3875 3221 2882 2476 3594 1851
$$ packed form
1919A15624r237k002m418l695p773j79m253l920o188P03o54k180j732n421o968
1904E7707K385k65l942o28j043m551o375l351K46q54K154K537n750P61l054q75
1888C5102j110k192k851k482R63J045J623l697m57J014k031n153j3j953L631k579
1872A8860j845L208k164qL942j44q03O19l501k424n677j817J010J624o487L136
1856G529L788Q88l196l69J506m166J999J542L992l569k959k574R90j371J249k03
1840E076r18k645O582l035k204J982k278P63p49l466J362j000n45L097j452l61
1824B09M312j612k265L412j863L884l509m26l200p93L330J181l63k770l411L327
1808e57J071L660L038l659m337J7k535J442K32r35K508L930o54l39m06J118j743
$$ plain form
1791 1851 232 -1563 18 -6187 -2822 -3532 -4086 -2805 892 -1847 -2234 -2238 1205 33 2860 1557
1775 1557 2086 1498 1276 -3598 -4969 -2703 -3174 -1535 -1888 -2007 -1364 261 -745 457 6407 3481 2127
1758 2127 -578 -5430 -732 1166 254 -2415 -3710 -2313 3650 2201 3331 -2039 -1394 3604 -2657
1743 -2657 -3959 -1690 -221 619 738 1124 205 -2827 -3258 -6534 -3787 -3333 -1915 -1118 -3112 -721 1868
1726 1868 -2717 -5238 -3017 -3915 -5003 -3048 -143 577 -3420 -1468 -1524 -879 1070 -3204 -590 -1102
1710 -1102 452 -3604 -4788 1201 -70 -875 2430 394 4421 5194 7369 3936 4849 -1374 31 1372
1694 1372 390 -2437 -307 -3057 -7094 -5367 -5570 -8771 -4921 -5222 -1967 -3616 -2253 -6145 -7432 -4890
1678 -4890 -4902 -7766 -8877 -3123 -1060 1346 -2336 -2004 -3659 -4539 -5204 -5209 41 1348 -278 -982 -2920
$$ packed form
1791A851j619j795J581o205L365p10n54J281L697k739l87mL443j172K827j303
1775A557N29n88k22m874j371K266m71J639l53j19O43J625j006J202N950k926j354
1758B127k705m852M698J898r12k669j295J397N963j449J130n370O45M998o261
1743b657j302K269J469Q40J19L86r19l032m31l276K747M54J418P97j994K391K589
1726A868m585k521K221q98j088J955K905P20l997J952n6O45J949m274K614n12
1710a102J554m056j184N989j271q05L305k036M027P73K175l433R13o223J405J341
1694A372r82k827K130k750m037J727k03l201L850l01L255j649J363l892j287K542
1678d890j2k864j111N754K063K406l682L32j655q80o65nN250J307j626p04j938
$$ plain form
1661 -2920 -3041 -5058 -6607 -4502 -6291 -4044 -6901 -5946 -9163 -6809 -6905 -8906 -4679 -4204 -5029 -7813
1645 -7813 -6323 -7458 -6271 -6224 -8200 -6416 -5906 -3934 -2676 -5456 -5005 -3325 -4253 -5051 -4140 -4464 988
1628 988 -1406 1418 -5240 -6217 -5773 -7809 -13701 -7454 -3027 -5283 -816 1256 2245 4048 -1361 -5413
1612 -5413 -422 -78 -758 -1305 -481 -6773 -4009 -4450 -3331 -645 -2065 -8092 -3846 -9008 -7746 -5905
1596 -5905 -9326 -7578 -2536 -5140 -2617 -4451 -7091 -8986 -8359 -8171 -4532 -4292 -6914 -7619 -3015 188
1580 188 175 2060 -1812 -2864 -1559 -1590 -7003 -49 -5088 -4778 -4078 -2371 -6700 -2221 -4245 -6569 -1095
1563 -1095 -2879 -4977 -3507 -4539 -4047 -1085 1786 -1252 4852 1447 -5970 -6322 -4269 -5398 -2896
1548 -2896 -4707 -2448 -1748 -3389 -3164 -5025 -8395 -5949 -703 -4494 -5342 -2690 -793 561 -468 -1979
$$ packed form
1661b920j21k017j549K105j789K247k857R55l217K354r6k001M227M75q25k784
1645g813J490j135J187M7j976J784N10J972J258k780M51J680r28p98R11l24N452
1628I88k394K824o658r77M44k036n892O247M427k256M467K072R89J803n409m052
1612e413M991L44o80n47Q24o292K764m41J119K686j420o027M246n162J262J841
1596e905l421J748N042k604K523j834k640j895O27J88L639K40k622p05M604L203
1580A88j3J885l872j052J305l1n413O954n039L10P00J707m329M479k024k324N474
1563a095j784k098J470j032M92K962K871l038O104l405p417l52K053j129K502
1548b896j811K259P00j641K25j861l370K446N246l791q48K652J897J354j029j511
$$ plain form
1532 -1979 -3673 -3750 -1054 -347 -3499 -2900 -2069 -5696 -4996 -3466 697 -473 -3423 -1358 -8087 -9595
1516 -9595 -7587 -5030 -4423 -3295 -6596 -2216 -3946 -6488 -1072 1032 -9463 -6065 -6275 -9132 747
1501 747 1627 -1724 -7402 -8544 -2538 -4315 -2945 1759 -4850 -3575 -3376 -3288 -6876 -7065 -5803 -1931
1485 -1931 -3792 -1117 -3714 -4584 -7151 -8371 -725 -3025 -2074 -4148 -4827 -3103 -2679 -4329 -2451 -3009
1469 -3009 402 1819 -2750 857 -2720 -4343 -1135 -1701 -1472 2436 987 946 -2318 -6418 -2617 -3985
1453 -3985 -4640 -4400 -9531 -3520 -6666 -6895 -8816 -5201 -3184 -2785 -5807 -4585 -1562 -3931 -3816 -3385
1437 -3385 -2083 -4470 -7892 -7484 -9279 -3705 -3075 -5865 -7959 -5961 -3025 -4218 -8755 -3302 -4019 -8372
1421 -8372 -6775 -4829 -5061 -3029 -2286 -1028 -4661 -6208 -5611 -7027 -7417 -5501 -2531 -241 -1311 -5199
$$ packed form
1532a979j694p7K696P07l152N99Q31l627P00J530M163j170k950K065o729j508
1516i595K008K557O07J128l301M380j730k542N416K104j0495L398k10k857R879
1501G47Q80l351n678j142O006j777J370M704o609J275J99Q8l588j89J262L872
1485a931j861K675k597q70k567j220P646k300R51k074o79J724M24j650J878n58
1469c009L411J417m569L607l577j623L208n66K29L908j449m1l264m100L801j368
1453c985o55K40n131O011l146k29j921L615K017L99l022J222L023k369J15M31
1437c385J302k387l422M08j795N574O30k790k094J998K936j193m537N453p17m353
1421h372J597J946k32K032P43J258l633j547N97j416l90J916K970K290j070l888
$$ plain form
1405 -5199 -3869 -3908 -2865 -4734 -5871 -1761 -1456 -413 2636 4773 1562 2640 -2497 -6359 -8834 -6136
1389 -6136 -2983 -1210 -286 -6735 -4971 -2913 -409 -5556 -6663 -10029 -7161 -940 -6087 364 -169
1374 -169 -4158 -2286 -2471 -586 390 -469 -2591 2134 2536 -3404 -5648 -7759 -8765 -4584 -7422 -5540
1358 -5540 -721 -1432 -4056 -2634 -4750 -3961 -3794 338 1417 1832 -5693 -2977 -3480 -2566 -1923 -1994 -3868
1341 -3868 -3983 -4968 -6640 -6620 -9122 -3394 -3219 -5235 -4249 -5813 1394 2848 1315 -2284 -171 -544 -1128
1324 -1128 -709 -9106 -6036 -4026 -3171 191 -423 -4460 -2080 -4016 -7407 -4925 -6453 -5619 -7801 -5631
1308 -5631 -5303 -3466 -7128 -2845 -4645 -5777 779 -1929 -565 -5364 -6737 -4290 937 -1902 -2928
1293 -2928 -1197 -2223 -2798 -1129 -1403 -1063 -2857 -1234 -2457 -8515 -5212 -4731 -2999 -5955 -2790 -305
$$ packed form
1405e199J330l9J043j869j137M110L05J043L049K137l211J078n137l862k475K698
1389f136L153J773R24o449J764K058K504n147j107l366K868O221n147O451n33
1374a69l989J872j85J885R76q59k122M725M02n940k244k111j006M181k838J882
1358e540M819p11k624J422k116P89J67M132J079M15p525K716n03R14O43p1j874
1341c868j15r85j672K0k502N728J75k016R86j564P207J454j533l599K113l73n84
1324a128M19q397L070K010Q55L362o14m037K380j936l391K482j528Q34k182K170
1308e631L28J837l662M283j800j132O556k708J364m799j373K447N227k839j026
1293b928J731j026n75J669k74L40j794J623j223o058L303M81J732k956L165K485
$$ plain form
1277 -305 4636 3813 -789 -2493 -5301 -9052 -7219 -4806 -3209 640 -3224 -6762 -6793 -6257 -1669 -244
1261 -244 -685 2086 -3908 -4018 -3379 -3748 113 525 280 -150 -3677 2742 735 -1256 2785 282 -6241
1244 -6241 -6005 1319 -974 1797 3643 -461 -2885 -4227 -2930 -901 1403 1464 1983 -669 1409 3725
1228 3725 3850 2187 -815 1387 1741 -1010 -3701 -872 -243 -3431 350 -1506 -5533 -3042 -1876 2002
1212 2002 476 -2106 -1723 -1370 372 802 4835 2379 904 1299 4968 2966 2888 -917 1611 1169 1304
1195 1304 -1226 -1035 -2652 -1998 -5066 -52 1076 3447 7864 8277 3123 1589 3170 5957 2305 1295
1179 1295 -689 -704 -2047 -8900 -6982 -6180 -3152 -3759 -2425 -2777 -3832 -2321 -2141 -1852 -1642 -4197 -3048
1162 -3048 -2939 -1957 -2340 -1461 -830 -4138 -6774 -2851 -2418 -1735 -109 4554 3526 -810 -1487 -1271 -4146
$$ packed form
1277c05M941q23m602j704k808l751J833K413J597L849l864l538l1N36M588J425
1261b44m41K771n994j10O39l69L861M12k45m30l527O419k007j991M041k503o523
1244f241K36P324k293K771J846m104k424j342J297K029K304O1N19k652K078K316
1228C725J25j663l002K202L54k751k691K829O29l188L781j856m027K491J166L878
1212B002j526k582L83L53J742M30M033k456j475L95L669k002p8l805K528m42J35
1195A304k530J91j617O54l068N014J128K371M417M13n154j534J581K787l652j010
1179A295j984j5j343o853J918Q02L028o07J334l52j055J511J80K89K10k555J149
1162c048J09R82l83Q79O31l308k636L923M33O83J626M663j028m336o77K16k875
$$ plain form
1145 -4146 -2101 -2326 -3474 -3540 -2409 -120 -507 -2847 2022 2711 -1756 204 -855 5576 1032 -6343
1129 -6343 -1481 -6572 -3508 238 76 -435 -923 427 -5626 -5730 -2898 -2396 -1151 -3602 -11380 -6134
1113 -6134 -384 -1185 -1737 -6022 -4936 -3087 1951 970 -486 -1237 1116 2042 709 -505 1743 810
1097 810 1389 286 -3662 -7145 -3883 -4118 -1162 -1556 -1922 -1449 -3113 -1119 1679 -1493 -5290 -5668 -5478
1080 -5478 -2540 -655 -2367 -6160 -5648 393 2151 2236 1138 -900 -874 -2931 -2696 -1150 -5219 310
1064 310 -1630 47 713 -2278 -2355 476 -275 5876 5772 -2597 -5219 -4012 -796 -1344 -5044 -6695 -4011
1047 -4011 -5041 -4725 -2244 -4640 -682 -433 -1273 -1269 -5685 -3521 2731 4721 1224 -3674 -5243 -1841
1031 -1841 -3349 -3189 -2626 -366 -687 866 -628 -844 -7194 -2898 2034 123 -5321 -508 -284 -1236
$$ packed form
1145d146K045k25j148o6J131K289l87k340M869O89m467J960j059O431m544p375
1129f343M862n091L064L746j62n11m88J350o053j04K832N02J245k451p778N246
1113f134N750q01n52m285J086J849N038r81j456p51K353R26j333j214K248r33
1097H10N79j103l948l483L262k35K956l94l66M73j664J994K798l172l797l78J90
1080e478K938J885j712l793N12O041J758Q5j098k038K6k057K35J546m069N529
1064C10j940J677O66k991p7K831p51O151j04q369k622J207L216n48l700j651K684
1047d011j030L16K481k396L958K49q40Mm416K164O252J990l497m898j569L402
1031a841j508J60N63K260l21J553j494k16o350M296M932j911n444M813K24r52
$$ plain form
1015 -1236 -3699 -3 -1065 -6296 -4001 1013 149 2213 2009 299 45 1617 -1276 -5602 -7690 -425
999 -425 -1378 -4656 -4022 597 -769 -7144 -820 -1803 -2951 -1790 -640 256 -280 1031 3247 1941 4663
982 4663 7055 3484 -1177 -2272 -1984 -2918 -4770 -5720 -999 1952 -1997 -2369 -3153 -120 -2343 -251
966 -251 -1380 -6202 -4659 -6260 -2597 456 -495 628 -1291 1520 925 -6137 -2576 -1587 2293 5297
950 5297 -1704 -5042 -3374 675 -893 -1878 1986 1985 3466 2385 54 3814 2736 2694 3638 3020 5768
933 5768 2925 3595 1551 -1964 -1848 -2904 -4759 -1271 36 4536 4591 -1782 -677 844 1168 -3982
917 -3982 -2985 -2287 -922 -355 -143 3057 5104 4398 3647 -344 -5234 -3866 -1605 5188 6568 1763 2808
900 2808 5864 3276 1997 -1023 -584 4999 4357 58 -531 -4364 -5653 -3727 -1221 -572 1750 280
$$ packed form
1015a236k463L696j062n231K295N014q64K064k04j710k54J572k893m326k088P265
999d25r53l278O34M619j366o375O324r83j148J161J150Q96n36J311K216j306K722
982D663K392l571m661j095K88r34j852r50M721K951l949l72p84L033k223K092
966b51j129m822J543j601L663L053r51J123j919K811n95p062L561R89L880L004
950E297p001l338J668M049j568r85L864jJ481j081k331L760j078m2R44o18K748
933E768k843O70k044l515J16j056j855L488J307M500N5o373J105J521L24n150
917c982R97O98J365N67K12L200K047p06p51l991m890J368K261O793J380m805J045
900B808L056k588j279l020M39N583o42m299n89l833j289J926K506O49K322j470
$$ plain form
884 280 376 -969 -4023 -2428 -397 -3279 162 469 -1925 3834 4682 1964 -1402 1475 2375 1705 2238
867 2238 -321 -4129 101 -712 518 4406 -488 -1092 2559 421 1086 -676 -1377 -766 1358 -2317
851 -2317 -5625 -3762 -364 3514 4214 969 2086 3835 1451 -3692 -2761 -3878 5 2831 4559 5363
835 5363 2284 271 2284 3375 1210 -22 326 -1553 2507 3002 3521 2959 2285 177 -407 -1027 1782
818 1782 2782 3597 1040 3437 4204 1958 2228 2802 58 2659 1239 -2571 -1006 4248 3956 3866 2353
801 2353 2499 6479 1543 -4589 193 4179 252 2612 654 1005 -108 -642 -2338 669 3278 6165
785 6165 830 -3775 -2652 971 -2048 260 3719 6013 2871 -3809 4807 6653 6447 5372 1698
770 1698 4765 6746 9854 5034 7883 2641 3818 3740 2854 7197 5880 3548 3778 1562 64 -2199
$$ packed form
884B80R6j345l054J595K031k882L441L07k394N759Q48k718l366K877R00o70N33
867B238k559l808M230q13J230L888m894o04L651k138O65j762p01O11K124l675
851b317l308J863L398L878P00l245J117J749k384n143R31j117L883K826J728Q04
835E363l079k013K013J091k165j232L48j879M060M95N19n62o74k108n84o20K809
818A782J000Q15k557K397P67k246K70N74k744K601j420l810J565N254k92r0j513
801B353J46L980m936o132M782L986l927K360j958L51j113n34j696L007K609K887
785F165n335m605J123L623l019K308L459K294l142o680Q616J846k06j075l674
770A698L067J981L108m820K849n242J177p8q86M343j317k332K30k216j498k263
$$ plain form
754 -2199 1110 1377 -2360 858 3280 270 505 -648 2646 -1976 -1134 67 -1153 535 1637 -1740
738 -1740 -1402 705 -1229 -1556 1134 3923 2271 -3872 -2034 1179 -645 -1038 2888 3514 -2690 -331
722 -331 -3103 -1305 370 529 -1491 -4636 -816 1847 4056 -1427 -4883 -3456 -1749 -423 -1560 -2409
706 -2409 -3173 116 -1065 570 258 830 918 -3990 -2149 303 -2451 -1210 3451 -531 -3125 5109
690 5109 2297 748 -387 4893 5078 -964 876 1203 3061 5121 7373 7070 3195 668 3232 5126
674 5126 686 -1549 248 -4272 -3057 879 3108 2633 -1723 -1321 304 3041 6846 4175 5603 4875
658 4875 6235 4014 -1490 548 -4926 -5155 -935 950 3377 -5937 -3007 3614 -1244 -3381 -5470
643 -5470 94 -3921 -5612 -6925 -2500 -2984 -1491 -801 -1730 -3386 -11 1520 4468 3713 5264 3212
$$ packed form
754b199L309K67l737L218K422l010K35j153L294m622Q42J201j220J688J102l377
738a740L38K107j934l27K690K789j652o143J838L213j824l93L926O26o204K359
722c31k772J798J675J59k020l145L820K663K209n483l456J427J707J326j137q49
706b409p64L289j181J635l12N72Q8m908J841K452k754J241M661l982k594Q234
690E109k812j549j135N280J85o042J840L27J858K060K252l03l875k527K564J894
674E126m440k235J797m520J215L936K229m75m356M02J625K737L805k671J428p28
658D875J360k221n504K038n474k29M220J885K427r314K930O621m858k137k089
643e470N564m015j691j313M425m84J493O90r29j656L375J531K948p55J551k052
$$ plain form
627 3212 2847 5195 2395 1280 4307 5439 736 3371 -2447 -3796 -1440 3367 3607 4877 4552 4134
611 4134 4799 4498 -165 154 4399 5457 8008 8307 9400 4451 3452 2696 1455 3825 5149 7398 4826
594 4826 1313 605 -1517 -4046 -931 1976 1664 3613 2901 2168 -1386 -1389 -4447 4541 6452 4263 5908
577 5908 5769 7767 9286 2411 174 5778 4502 4140 7003 2969 30 822 1179 4923 7347 3734
561 3734 -1801 -901 -2878 1721 4515 4874 4955 2045 5365 4575 -767 3239 3281 2418 4602 814 1268
544 1268 4457 548 3211 1171 7548 3794 737 4432 7087 4232 4299 4741 2512 2475 -914 4827
528 4827 6920 5073 -1986 1861 -2508 -1117 -149 606 4482 1383 2542 3838 6251 2329 660 1449
512 1449 2405 2453 294 -548 1579 3097 6101 3060 4619 2521 3138 2898 795 518 -825 -115 3297
$$ packed form
627C212l65K348k800j115L027J132m703K635n818j349K356M807K40J270l25m18
611D134O65l01m663L19M245J058K551K99J093m949r99p56j241K370J324K249k572
594D826l513p08k122k529L115K907l12J949p12p33l554ll058Q988J911k189J645
577E908j39J998J519o875k237N604j276l62K863m034k939P92L57L744K424l613
561C734n535R00j977M599K794L59Q1k910L320p90n342M006M2q63K184l788M54
544A268L189l909K663k040O377l754l057L695K655k855O7M42k229l7l389N741
528D827K093j847p059L847m369J391R68P55L876l099J159J296K413l922j669P89
512A449R56M8k159q42K127J518L004l041J559k098O17k40k103k77j343P10L412
$$ [...]
##END NTUPLES=NMR SPECTRUM
##END=
