##TITLE=1H_CA-8888-1
 CDCl3, 8 sc, 
 30.06.2021
##JCAMPDX= 6.0         $$ Bruker NMR JCAMP-DX V2.0
##DATA TYPE= NMR SPECTRUM
##DATA CLASS= NTUPLES
##ORIGIN= UXNMR, Bruker Analytische Messtechnik GmbH
##OWNER= root
$$ XWIN-NMR		Version 3.5
$$ Wed Jun 30 10:40:26 2021 Russian Standard Time (UT+4h)  she@DPX200
##.OBSERVE FREQUENCY= 200.131506
##.OBSERVE NUCLEUS= ^1H
##.ACQUISITION MODE= SIMULTANEOUS
##.ACQUISITION SCHEME= undefined
##.AVERAGES= 8
##.DIGITISER RES= 18
##SPECTROMETER/DATA SYSTEM= spect
##.PULSE SEQUENCE= zg30
##.SOLVENT NAME= CDCl3
##.SHIFT REFERENCE= (INTERNAL, CDCl3, 0, 17.5668)
##AUDIT TRAIL= $$ (NUMBER, WHEN, WHO, WHERE, WHAT)
$$ ##TITLE= Audit trail, XWIN-NMR		Version 3.5
$$ ##JCAMPDX= 5.01
$$ ##ORIGIN= Bruker BioSpin GmbH
$$ ##OWNER= she
$$ F:/spectra/data/she/nmr/H-F/1/pdata/1/auditp.txt
$$ ##AUDIT TRAIL=  $$ (NUMBER, WHEN, WHO, WHERE, WHAT)
(   1,<2021-06-30 10:39:11.89 +0400>,<she>,<DPX200>,
      <created by zg, POWCHK disabled, PULCHK disabled
       configuration hash MD5:
       00 E9 B6 7A A2 85 ED C7 34 08 36 98 17 FE 4E 26
       data hash MD5: 16K
       1D 8E 67 2C 5B 25 DA BA FB 3C 96 44 0C AC 25 BB>)
(   2,<2021-06-30 10:39:14.14 +0400>,<she>,<DPX200>,
      <Start of raw data processing
       efp BC_mod = 2 LB = 0.24 FT_mod = 6 PKNL = 1 PHC0 = -11913.63 PHC1 = 7.20101 SI = 16K 
       data hash MD5: 16K
       F6 67 3E A2 D3 E3 2F BA 7B 16 2E 50 0F B9 3E BA>)
(   3,<2021-06-30 10:39:35.12 +0400>,<she>,<DPX200>,
      <pk PHC0 = -159.3793 PHC1 = 2.6 
       data hash MD5: 16K
       30 48 8D B1 A9 BF D5 E1 87 8D 7B 15 A0 46 D0 95>)
(   4,<2021-06-30 10:39:38.92 +0400>,<she>,<DPX200>,
      <abs ABSG = 5 
       data hash MD5: 16K
       D2 5C 2F 3B FF 11 6B A5 3D C3 EB 30 AD 0E 50 E7>)
$$ ##END=
$$ 
$$ hash MD5
$$ 56 A3 F6 34 94 D4 21 73 5E 48 4F AB 44 B6 48 3C
##$RELAX= 
##$RELAX= 
##$RELAX= 
##$RELAX= 
##$RELAX= 
##$RELAX= 
$$ Bruker specific parameters
$$ --------------------------
##$DU= <F:/spectra>
##$EXPNO= 1
##$NAME= <H-F>
##$PROCNO= 1
##$TYPE= <nmr>
##$USER= <she>
##$AMP= (0..31)
100 100 100 100 100 100 100 100 100 100 100 100 100 100 100 100 100 100 
100 100 100 100 100 100 100 100 100 100 100 100 100 100 
##$AQSEQ= 0
##$AQ_mod= 1
##$AUNM= <au_zg>
##$AUTOPOS= <>
##$BF1= 200.13
##$BF2= 200.13
##$BF3= 200.13
##$BF4= 200.13
##$BF5= 200.13
##$BF6= 200.13
##$BF7= 200.13
##$BF8= 200.13
##$BYTORDA= 1
##$CFDGTYP= 0
##$CFRGTYP= 5
##$CHEMSTR= <none>
##$CNST= (0..31)
1 1 145 1 1 1 1 1 1 1 1 1 1 1 1 1 1 1 1 1 1 1 1 1 1 1 1 1 1 1 1 1 
##$CPDPRG= <>
##$CPDPRG1= <>
##$CPDPRG2= <>
##$CPDPRG3= <>
##$CPDPRG4= <mlev>
##$CPDPRG5= <mlev>
##$CPDPRG6= <mlev>
##$CPDPRG7= <mlev>
##$CPDPRG8= <mlev>
##$CPDPRGB= <>
##$CPDPRGT= <>
##$D= (0..31)
0 1.2 0 0 0 0 0 0 0 0.06 0 0.03 0 0 0 0 0.0002 0 0 0 0 0 0 0 0 0 0 0 0 
0 0 0 
##$DATE= 1625035151
##$DBL= (0..7)
120 120 120 120 120 120 120 120 
##$DBP= (0..7)
150 150 150 150 150 150 150 150 
##$DBP07= 0
##$DBPNAM0= <>
##$DBPNAM1= <>
##$DBPNAM2= <>
##$DBPNAM3= <>
##$DBPNAM4= <>
$$ [...]
##$SUBNAM3= <"">
##$SUBNAM4= <"">
##$SUBNAM5= <"">
##$SUBNAM6= <"">
##$SUBNAM7= <"">
##$SUBNAM8= <"">
##$SUBNAM9= <"">
##$SW= 20.0188882624521
##$SWIBOX= (0..15)
0 0 2 0 0 0 0 0 0 0 0 0 0 0 0 0 
##$SW_h= 4006.41025641026
##$TD= 16384
##$TD0= 1
##$TE= 0
##$TE2= 300
##$TE3= 300
##$TEG= 300
##$TL= (0..7)
0 120 120 120 120 120 120 120 
##$TP= (0..7)
150 150 150 150 150 150 150 150 
##$TP07= 0
##$TPNAME0= <>
##$TPNAME1= <>
##$TPNAME2= <>
##$TPNAME3= <>
##$TPNAME4= <>
##$TPNAME5= <>
##$TPNAME6= <>
##$TPNAME7= <>
##$TPOAL= (0..7)
0.5 0.5 0.5 0.5 0.5 0.5 0.5 0.5 
##$TPOFFS= (0..7)
0 0 0 0 0 0 0 0 
##$TUNHIN= 0
##$TUNHOUT= 0
##$TUNXOUT= 0
##$USERA1= <user>
##$USERA2= <user>
##$USERA3= <user>
##$USERA4= <user>
##$USERA5= <user>
##$V9= 5
##$VALIST= <valist>
##$VCLIST= <CCCCCCCCCCCCCCC>
##$VD= 0
##$VDLIST= <DDDDDDDDDDDDDDD>
##$VPLIST= <PPPPPPPPPPPPPPP>
##$VTLIST= <TTTTTTTTTTTTTTT>
##$WBST= 1024
##$WBSW= 4
##$XGAIN= (0..3)
0 0 0 0 
##$XL= 0
##$YL= 0
##$YMAX_a= 386021
##$YMIN_a= -370891
##$ZGOPTNS= <>
##$ZL1= 120
##$ZL2= 120
##$ZL3= 120
##$ZL4= 120
##$ABSF1= 17.56676
##$ABSF2= -2.45228
##$ABSG= 5
##$ABSL= 3
##$ALPHA= 0
##$AQORDER= 0
##$ASSFAC= 0
##$ASSFACI= 0
##$ASSFACX= 0
##$ASSWID= 0
##$AUNMP= <proc_1d>
##$AZFE= 0.1
##$AZFW= 0.1
##$BCFW= 0
##$BC_mod= 2
##$BYTORDP= 0
##$COROFFS= 0
##$CY= -3
##$DATMOD= 1
##$DC= 0
##$DFILT= <>
##$DTYPP= 0
##$F1P= 0
##$F2P= 0
##$FCOR= 1
##$FTSIZE= 16384
##$FT_mod= 6
##$GAMMA= 0
##$GB= 0
##$INTBC= 1
##$INTSCL= 1.334414e-10
##$ISEN= 128
##$LB= 0.24
##$LEV0= 0
##$LPBIN= 0
##$MAXI= 10000
##$MC2= 0
##$MEAN= 0
##$ME_mod= 0
##$MI= 1.114404
##$NCOEF= 0
##$NC_proc= -7
##$NLEV= 6
##$NOISF1= 3.799351
##$NOISF2= 2.8
##$NSP= 0
##$NTH_PI= 0
##$NZP= 0
##$OFFSET= 17.56676
##$PC= 1
##$PHC0= -12073.01
##$PHC1= 9.80101
##$PH_mod= 1
##$PKNL= yes
##$PPARMOD= 0
##$PSCAL= 0
##$PSIGN= 0
##$REVERSE= no
##$SF= 200.129993571256
##$SI= 16384
##$SIGF1= 3
##$SIGF2= 2
##$SINO= 5.538805
##$SIOLD= 16384
##$SREGLST= <1H.CDCl3>
##$SSB= 0
##$STSI= 16384
##$STSR= 0
##$SW_p= 4006.41025641026
##$SYMM= 0
##$S_DEV= 0
##$TDeff= 16384
##$TDoff= 0
##$TI= <>
##$TILT= no
##$TM1= 0
##$TM2= 0
##$TOPLEV= 0
##$USERP1= <user>
##$USERP2= <user>
##$USERP3= <user>
##$USERP4= <user>
##$USERP5= <user>
##$WDW= 1
##$XDIM= 16384
##$YMAX_p= 584685061
##$YMIN_p= -263058
$$ End of Bruker specific parameters
$$ ---------------------------------
##NTUPLES= NMR SPECTRUM
##VAR_NAME=  FREQUENCY,     SPECTRUM/REAL,   SPECTRUM/IMAG
##SYMBOL=    X,             R,               I
##VAR_TYPE=  INDEPENDENT,   DEPENDENT,       DEPENDENT
##VAR_FORM=  AFFN,          ASDF,            ASDF
##VAR_DIM=   16384,         16384,           16384
##UNITS=     HZ,            ARBITRARY UNITS, ARBITRARY UNITS
##FACTOR=    0.24454680195387, 1,            1
##FIRST=     3515.63538765145, 0,            0
##LAST=      -490.774868758809, 0,           0
##MIN=       -490.774868758809, -263058,     0
##MAX=       3515.63538765145, 584685061,    0
$$ Real data points
##PAGE= N=1
##DATA TABLE= (X++(R..R)), XYDATA
$$ [...]
$$ plain form
5455 6671172 6795976 6949470 7081829 7307756 7455277 7631046 7818311 7949528 8138223 8461510
5445 8461510 8677624 8966954 9245835 9505098 9865205 10320618 10763983 11246269 11805572 12364272
5435 12364272 13004652 13644074 14342917 15074895 15730828 16454947 17059062 17606025 18089041
5426 18089041 18417736 18676674 18842905 19027493 19151121 19264203 19357648 19388436 19384585 19452606
5416 19452606 19581666 19801166 20080683 20484857 20834927 21274783 21745253 22228307 22709613
5407 22709613 23086496 23384372 23655403 23898695 24257208 24599776 24829876 25202359 25609074
5398 25609074 26096845 26707474 27313974 28068641 28848313 29853362 31067266 32301622 33608782
5389 33608782 35162648 36773057 38378997 39917727 41173506 42080691 42667914 42976142 43016477
$$ packed form
5455F671172J24804J53494J32359K25927J47521J75769J87265J31217J88695L23287
5445H461510K16114K89330K78881K59263L60107M55413M43365M82286N59303N58700
5435A2364272O40380O39422O98843P31978O55933P24119O04115N46963M83016
5426A8089041L28695K58938J66231J84588J23628J13082R3445L0788l851O8021
5416A9452606J29060K19500K79517M04174L50070M39856M70470M83054M81306
5407B2709613L76883K97876K71031K43292L58513L42568K30100L72483M06715
5398B5609074M87771O10629O06500P54667P79672J005049J213904J234356J307160
5389C3608782J553866J610409J605940J538730J255779R07185N87223L08228M0335
$$ plain form
5380 43016477 42791864 42602402 42215565 41711417 41258177 40772321 40257961 39778906 39436768
5371 39436768 39214110 39134508 39282375 39496809 39862750 40491416 41295887 42252539 43280780
5362 43280780 44309623 45481874 46795749 48361477 49899665 51411847 52939178 54290844
5354 54290844 55502323 56569823 57581360 58364714 59126591 59918451 60667127 61409327 62104009
5345 62104009 62694888 63215023 63557754 63767939 63790518 63472730 62863067 61877408 60588028
5336 60588028 59043563 57226691 55217112 53253261 51380970 49596576 47995737 46641797
5328 46641797 45635294 44896018 44448911 44152680 44097427 44210362 44497550 45041093 45642458
5319 45642458 46198401 46696023 47107646 47534774 47815365 47869561 47692078 47233132 46572747 45493066
$$ packed form
5380D3016477k24613j89462l86837n04148m53240m85856n14360m79055l42138
5371C9436768k22658p9602J47867K14434L65941O28666Q04471R56652J028241
5362D3280780J028843J172251J313875J565728J538188J512182J527331J351666
5354E4290844J211479J067500J011537P83354P61877P91860P48676P42200O94682
5345F2104009N90879N20135L42731K10185K2579l17788o09663r85659j289380
5336F0588028j544465j816872k009579j963851j872291j784394j600839j353940
5328D6641797j006503p39276m47107k96231n5253J12935K87188N43543O01365
5319D5642458N55943M97622M11623M27128K80591N4196j77483m58946o60385j079681
$$ plain form
5309 45493066 44110079 42377198 40472145 38505308 36491927 34343265 32338321 30392085
5301 30392085 28653495 27072759 25615591 24370772 23197128 22091530 21101828 20244929
5293 20244929 19285148 18421481 17661956 17043648 16218221 15569345 14995854 14451915 13932408
5284 13932408 13459643 13072535 12738519 12336916 11964868 11704380 11539723 11295954 11088062
5275 11088062 10910431 10740247 10598278 10487912 10400034 10289535 10225713 10147116 9911296 9702428
5265 9702428 9592506 9450633 9328193 9167075 8993424 8775688 8669249 8523250 8308234 8152621
5255 8152621 8084032 8022482 7940722 7817464 7828983 7834031 7861085 7851408 7793814 7824141 7879046 7950652
5243 7950652 8020548 8141569 8205928 8306316 8324068 8391860 8520387 8652055 8768545 8897164
$$ packed form
5309D5493066j382987j732881j905053j966837k013381k148662k004944j946236
5301C0392085j738590j580736j457168j244819j173644j105598r89702q56899
5293B0244929r59781q63667p59525o18308q25427o48876n73491n43939n19507
5284A3932408m72765l87108l34016m01603l72048k60488j64657k43769k07892
5275A1088062j77631j70184j41969j10366q7878j10499o3822p8597k35820k08868
5265I702428j09922j41873j22440j61118j73651k17736j06439j45999k15016j55613
5255H152621o8589o1550q1760j23258J1519N048K7054r677n7594L0327N4905P1606
5243G950652O9896J21021O4359J00388J7752O7792J28527J31668J16490J28619
$$ plain form
5233 8897164 8999646 9118018 9291959 9450021 9642710 9834354 9974320 10164545 10371805 10543257
5223 10543257 10712730 10954358 11129333 11347472 11576105 11709611 11941130 12214495 12466108
5214 12466108 12671878 12941232 13217427 13517118 13862805 14250455 14608886 15047938 15459366
5205 15459366 15863362 16342711 16692223 17046706 17464198 17878009 18267876 18691157 19165226
5196 19165226 19580385 20102819 20604231 21265298 21899568 22737141 23493252 24342234 25351728
5187 25351728 26343034 27481657 28710212 29902099 31196410 32568844 34051507 35696263
5179 35696263 37468245 39269638 41203020 43310172 45372290 47557220 49556644 51416328
5171 51416328 53028357 54354990 55305397 55865118 56037169 55912802 55668829 55299873 54832759
$$ packed form
5233H897164J02482J18372J73941J58062J92689J91644J39966J90225K07260J71452
5223A0543257J69473K41628J74975K18139K28633J33506K31519K73365K51613
5214A2466108K05770K69354K76195K99691L45687L87650L58431M39052M11428
5205A5459366M03996M79349L49512L54483M17492M13811L89867M23281M74069
5196A9165226M15159N22434N01412O61067O34270Q37573P56111Q48982J009494
5187B5351728R91306J138623J228555J191887J294311J372434J482663J644756
5179C5696263J771982J801393J933382K107152K062118K184930J999424J859684
5171E1416328J612029J326633R50407N59721J72051j24367k43973l68956m67114
$$ plain form
5162 54832759 54356501 53897160 53497754 53152517 52939097 52905929 53047496 53384208 53920247 54654211
5152 54654211 55643118 56694156 57755739 58888302 59916963 60756856 61338808 61546717 61409010
5143 61409010 61114958 60611161 59859863 59034276 58260341 57507955 56800461 56182618 55695650
5134 55695650 55255611 54869723 54476762 54241135 54148821 53967508 53566043 53114367 52561038 51800741
5124 51800741 50812115 49559121 48314100 47025144 45712289 44537837 43474072 42531394
5116 42531394 41684223 41135997 40711361 40406040 40337302 40337176 40349032 40396446 40555164 40732141
5106 40732141 40821936 40744252 40630615 40237981 39652943 38661870 37554396 36010426 34513496
5097 34513496 32866034 31212504 29535068 27913548 26519171 25194229 23917982 22769078
$$ packed form
5162E4832759m76258m59341l99406l45237k13420l3168J41567L36712N36039P33964
5152E4654211R88907J051038J061583J132563J028661Q39893N81952K07909j37707
5143F1409010k94052n03797p51298q25587p73935p52386p07494o17843m86968
5134E5695650m40039l85888l92961k35627r2314j81313m01465m51676n53329p60297
5124E1800741r88626j252994j245021j288956j312855j174452j063765r42678
5116D2531394q47171n48226m24636l05321o8738j26J1856M7414J58718J76977
5106D0732141Q9795p7684j13637l92634n85038r91073j107474j543970j496930
5097C4513496j647462j653530j677436j621520j394377j324942j276247j148904
$$ plain form
5089 22769078 21774597 20857893 20029921 19206477 18593735 17966802 17443414 16916460 16450309
5080 16450309 16042797 15710312 15341302 15067363 14830726 14671320 14498157 14465384 14504436 14625469
5070 14625469 14815981 14993988 15339400 15673947 15890850 16337638 16834439 17356389 18120447
5061 18120447 19073571 20257828 21826543 23450502 24529835 24270955 23074993 21713778
5053 21713778 20150781 18609838 17328877 16429073 15758446 15290749 14961321 14817075 14771780
5044 14771780 14832051 14992762 15319350 15756944 16414285 17263402 18289954 19601127 20664720
5035 20664720 21009627 20291730 19033554 17516830 16057887 14758744 13549330 12608730 11855518
5026 11855518 11333031 10874769 10468610 10105556 9731879 9490998 9347491 9234919 8954541
$$ packed form
5089B2769078r94481r16704q27972q23444o12742o26933n23388n26954m66151
5080A6450309m07512l32485l69010k73939k36637j59406j73163l2773L9052J21033
5070A4625469J90512J78007L45412L34547K16903M46788M96801N21950P64058
5061A8120447R53124J184257J568715J623959J079333k58880j195962j361215
5053B1713778j562997j540943j280961q99804o70627m67697l29428j44246m5295
5044A4771780O0271J60711L26588M37594O57341Q49117J026552J311173J063593
5035B0664720L44907p17897j258176j516724j458943j299143j209414r40600p53212
5026A1855518n22487m58262m06159l63054l73677k40881j43507j12572k80378
$$ plain form
5017 8954541 8808515 8752062 8710380 8634207 8668336 8652232 8713664 8798091 8888816 8942514 8904594
5006 8904594 8890000 8880773 8840821 8795730 8859762 8849431 8939136 9041207 9123287 9199775 9325570
4995 9325570 9374384 9512621 9595415 9670406 9755813 9829486 9846089 9744450 9625551 9458825 9235558
4984 9235558 8972481 8798763 8629405 8396084 8174642 8052671 8091205 8020686 7942199 7918655
4974 7918655 7992171 8125777 8188246 8272306 8263111 8330999 8253980 8122401 8116028 8021873 7945385
4963 7945385 7921886 7836989 7798359 7876350 7857382 7900570 7861133 7905647 8029048 8245351 8393926
4952 8393926 8558430 8732087 8879922 9188261 9625681 10030049 10343724 10792300 11230292 11576112
4942 11576112 11889860 12074644 12225000 12427076 12563660 12780332 13052776 13394674 13707117
$$ packed form
5017H954541j46026n6453m1682p6173L4129j6104O1432Q4427R0725N3698l7920
5006H904594j4594r227l9952m5091O4032j0331Q9705J02071Q2080P6488J25795
4995I325570M8814J38237Q2794P4991Q5407P3673J6603j01639j18899j66726k23267
4984I235558k63077j73718j69358k33321k21442j21971L8534p0519p8487k3544
4974G918655P3516J33606O2469Q4060r195O7888p7019j31579o373r4155p6488
4963G945385k3499q4897l8630P7991j8968M3188l9437M4514J23401K16303J48575
4952H393926J64504J73657J47835L08339M37420M04368L13675M48576M37992L45820
4942A1576112L13748J84784J50356K02076J36584K16672K72444L41898L12443
$$ plain form
4933 13707117 14082206 14470613 14785337 15030788 15180865 15399726 15613031 15918719 16265005
4924 16265005 16600447 16858031 17071765 17267090 17361936 17304476 17137739 16869035 16469294 16000805
4914 16000805 15641677 15221289 14866507 14696754 14541006 14310275 14091273 13837274 13558102
4905 13558102 13276562 13015117 12748972 12515098 12370845 12253654 12092437 11914587 11670349
4896 11670349 11274694 10844926 10346462 9804131 9327371 8883148 8364328 7926471 7511376
4887 7511376 7265745 7090430 6883118 6613917 6331950 6064629 5889631 5685158 5549655 5472836
4877 5472836 5230622 5066325 4849273 4599834 4546753 4461185 4356611 4216967 4114364 4062399
4867 4062399 4069243 3986018 3866257 3882230 3868445 3768135 3690296 3550126 3480603 3347163 3345743
$$ packed form
4933A3707117L75089L88407L14724K45451J50077K18861K13305L05688L46286
4924A6265005L35442K57584K13734J95325R4846n7460j66737k68704l99741m68489
4914A6000805l59128m20388l54782j69753j55748k30731k19002k53999k79172
4905A3558102k81540k61445k66145k33874j44253j17191j61217j77850k44238
4896A1670349l95655m29768m98464n42331m76760m44223n18820m37857m15095
4887G511376k45631j75315k07312k69201k81967k67321j74998k04473j35503p6819
4877E472836k42214j64297k17052k49439n3081q5568j04574j39644j02603n1965
4867D062399O844q3225j19761J5973j3785j00310p7839j40170o9523j33440j420
$$ plain form
4856 3345743 3307912 3231309 3180788 3108010 3109766 3059011 3010969 2905261 2922441 2906163 2816290
4845 2816290 2787597 2739080 2641129 2646605 2688996 2536117 2478676 2498565 2438540 2415584 2409421 2388214
4833 2388214 2394301 2350083 2294346 2342725 2367446 2369913 2312046 2216172 2187141 2207550 2244906 2270313
4821 2270313 2181828 2181046 2181489 2128890 2169303 2240438 2156682 2076576 2086357 2041116 2022874 2003670
4809 2003670 1973310 1953821 1908100 1934413 1883089 1844806 1869811 1894015 1882250 1872438 1849193 1787743
4797 1787743 1756412 1747835 1749092 1720621 1698988 1725245 1700739 1674480 1710246 1759241 1732088 1753849
4785 1753849 1783408 1783033 1873845 1876262 1932953 1937783 1943157 2030891 2103525 2093529 2072487 2001359 2049402
4772 2049402 2024370 1960542 1827299 1780905 1799554 1802134 1774308 1759348 1732239 1646291 1727412
$$ packed form
4856C345743l7831p6603n0521p2778J756n0755m8042j05708J7180j6278q9873
4845B816290k8693m8517r7951N476M2391j52879n7441J9889o0025k2956o163k1207
4833B388214O087m4218n5737M8379K4721K467n7867r5874k9031K0409L7356K5407
4821B270313q8485p82M43n2599M0413P1135q3756q0106R781m5241j8242j9204
4809B003670l0360j9489m5721K6313n1324l8283K5005K4204j1765r812k3245o1450
4797A787743l1331q577J257k8471k1633K6257k4506k6259L5766M8995k7153K1761
4785A753849K9559l75R0812K417N6691M830N374Q7734P2634r996k1042p1128M8043
4772B049402k5032o3828j33243m6394J8649K580k7826j4960k7109q5948Q1121
$$ plain form
4761 1727412 1752840 1726853 1719488 1860456 1796044 1817264 1885671 1930466 1954775 1998622 2001237 1910755
4749 1910755 1859201 1879952 1914244 1904506 1971504 1934075 1875305 1852305 1805984 1879050 1785876 1761045
4737 1761045 1731183 1714752 1755848 1727617 1582014 1557756 1619513 1585571 1531462 1575235 1574508 1497933
4725 1497933 1582303 1631817 1595318 1613868 1690575 1646747 1666731 1686940 1744081 1721698 1726187 1649231
4713 1649231 1515170 1460603 1546419 1549035 1512922 1503018 1482900 1503751 1437405 1419389 1459783 1486408
4701 1486408 1434109 1424295 1425179 1494301 1447720 1420390 1459363 1421804 1448599 1469835 1560050 1552137
4689 1552137 1474878 1528795 1566866 1584724 1630342 1689452 1715748 1699936 1685301 1651964 1687806
4678 1687806 1709244 1741697 1723041 1770937 1802243 1835717 1849824 1789800 1775086 1839732 1904894
$$ packed form
4761A727412K5428k5987p365J40968o4412K1220O8407M4795K4309M3847K615r0482
4749A910755n1554K0751L4292r738O6998l7429n8770k3000m6321P3066r3174k4831
4737A761045k9862j6431M1096k8231j45603k4258O1757l3942n4109M3773p27p6575
4725A497933Q4370M9514l6499J8550P6707m3828J9984K0209N7141k2383M489p6956
4713A649231j34061n4567Q5816K616l6113r904k0118K0851o6346j8016M0394K6625
4701A486408n2299r814Q84O9122m6581k7330L8973l7559K6795K1236R0215p913
4689A552137p7259N3917L8071J7858M5618N9110K6296j5812j4635l3337L5842
4678A687806K1438L2453j8656M7896L1306L3474J4107o0024j4714O4646O5162
$$ plain form
4667 1904894 1889028 1884814 1855321 1904629 1914632 1902070 1923826 1956276 2016123 2121394 2160818
4656 2160818 2184643 2209941 2275146 2288540 2303912 2347603 2357918 2346767 2425694 2475212 2491858
4645 2491858 2427323 2384278 2445880 2508238 2526550 2500204 2571777 2655825 2785087 2819893 2855779
4634 2855779 2897468 2941577 3045970 3074216 3173367 3254882 3346134 3443135 3575766 3668894 3719531
4623 3719531 3827121 3835168 4082277 4250548 4385390 4555355 4654801 4814825 5015992 5155423
4613 5155423 5161171 5281988 5422794 5466774 5501065 5505538 5574047 5579976 5588539 5659110 5565937 5585123
4601 5585123 5542296 5579861 5573222 5570157 5671613 5593630 5627249 5522889 5529717 5504492 5407907 5338391
4589 5338391 5263228 5222017 5195308 5157617 5203001 5152570 5143315 5171525 5202138 5298589 5347688 5456308
$$ packed form
4667A904894j5866m214k9493M9308J0003j2562K1756L2450N9847J05271L9424
4656B160818K3825K5298O5205J3394J5372M3691J0315j1151P8927M9518J6646
4645B491858o4535m3045O1602O2358J8312k6346P1573Q4048J29262L4806L5886
4634B855779M1689M4109J04393K8246R9151Q1515R1252R7001J32631R3128N0637
4623C719531J07590Q047K47109J68271J34842J69965R9446J60024K01167J39431
4613E155423N748J20817J40806M3980L4291M473O8509N929Q563P0571r3173J9186
4601E585123m2827L7565o639l065J01456p7983L3619j04360O828k5225r6585o9516
4589E338391p5163m1211k6709l7691M5384n0431r255K8210L0613R6451M9099J08620
$$ plain form
4577 5456308 5577860 5681750 5724855 5801290 6008765 6128428 6147442 6213447 6304936 6395118 6514085
4566 6514085 6575084 6733350 6748223 6789218 6947427 6973664 7042269 7164336 7240783 7278463 7313195
4555 7313195 7405610 7550967 7605420 7664416 7792898 7863698 7938663 8042690 8106772 8174511 8213011
4544 8213011 8402306 8437557 8462330 8513633 8593577 8691400 8730065 8716737 8646342 8609237 8549362
4533 8549362 8525801 8522619 8496995 8411509 8264257 8199378 8070853 7992239 7762046 7535726 7369037
4522 7369037 7156701 7075502 6985057 6866493 6787929 6730921 6770060 6755924 6773396 6798379 6899306
4511 6899306 6866188 6866079 6961717 7028001 7029237 7073497 7213715 7254630 7468979 7634098 7720006
4500 7720006 7811222 7978029 8162106 8329469 8452755 8591638 8759727 8930277 9162671 9214652
$$ packed form
4577E456308J21552J03890M3105P6435K07475J19663J9014O6005R1489R0182J18967
4566F514085O0999J58266J4873M0995J58209K6237O8605J22067P6447L7680L4732
4555G313195R2415J45357N4453N8996J28482P0800P4965J04027O4082O7739L8500
4544H213011J89295L5251K4773N1303P9944R7823L8665j3328p0395l7105n9875
4533H549362k3561l182k5624q5486j47252o4879j28525p8614k30193k26320j66689
4522G369037k12336q1199r0445j18564p8564n7008L9139j4136J7472K4983J00927
4511F899306l3118j09R5638O6284J236M4260J40218M0915K14349J65119Q5908
4500G720006R1216J66807J84077J67363J23286J38883J68089J70550K32394N1981
$$ plain form
4490 9214652 9255137 9356861 9460153 9455698 9413491 9374727 9309368 9332489 9316368 9283150 9183449
4479 9183449 9065988 9034570 8947885 8779894 8614457 8398820 8333689 8288471 8114940 8110658 8159134
4468 8159134 8099125 8033929 8008802 8021605 8029488 7919770 7786979 7767876 7860307 7812604 7736656
4457 7736656 7576960 7476878 7451878 7396738 7330487 7216152 7217509 7245379 7211346 7131790 7017139
4446 7017139 7013396 7055951 7014127 7051709 7037458 7035999 7090125 7128023 7107001 7081755 7103452 7178409
4434 7178409 7237267 7285082 7383797 7600075 7691716 7738139 7811702 7921984 8068409 8168780 8303150
4423 8303150 8547881 8630026 8637422 8692016 8635836 8600357 8539729 8411909 8307330 8140948 7965723
4412 7965723 7839532 7678173 7503897 7462492 7377521 7271665 7141269 7025986 6944705 6876801
$$ packed form
4490I214652M0485J01724J03292m455m2207l8764o5359K3121j6121l3218r9701
4479I183449j17461l1418q6685j67991j65437k15637o5131m5218j73531m282M8476
4468H159134o0009o5196k5127J2803P883j09718j32791j9103R2431m7703p5948
4457G736656j59696j00082k5000n5140o6251j14335J357K7870l4033p9556j14651
4446G017139l743M2555m1824L7582j4251j459N4126L7898k1022k5246K1697P4957
4434G178409N8858M7815R8715K16278R1641M6423P3563J10282J46425J00371J34370
4423H303150K44731Q2145P396N4594n6180l5479o0628j27820j04579j66382j75225
4412G965723j26191j61359j74276m1405q4971j05856j30396j15283q1281o7904
$$ plain form
4402 6876801 6822046 6849883 6912061 6856806 6882244 6999802 7103130 7116615 7077374 7246679 7473280
4391 7473280 7519252 7674453 7828611 8043696 8321649 8503678 8644643 8863687 9070112 9200839
4381 9200839 9225457 9349399 9509222 9521680 9562593 9472767 9464121 9344933 9292196 9193249 9058031
4370 9058031 8890395 8790479 8649155 8513060 8372650 8221984 8065028 7810388 7695159 7483859
4360 7483859 7230385 7002629 6836132 6682732 6611562 6466967 6291368 6088842 5937893 6013180
4350 6013180 5950265 5784377 5786472 5800344 5847531 5915703 5917083 5959471 6060610 6114865 6229083
4339 6229083 6336656 6459843 6483197 6568645 6768536 6806736 6901103 6901085 7016756 7095630 7095979 7198779
4327 7198779 7235699 7283122 7441673 7558154 7561067 7603919 7745332 7882197 7865911 7901898 7995761
$$ packed form
4402F876801n4755K7837O2178n5255K5438J17558J03328J3485l9241J69305K26601
4391G473280M5972J55201J54158K15085K77953J82029J40965K19044K06425J30727
4381I200839K4618J23942J59823J2458M0913q9826q646j19188n2737r8947j35218
4370I058031j67636r9916j41324j36095j40410j50666j56956k54640j15229k11300
4360G483859k53474k27756j66497j53400p1170j44595j75599k02526j50949P5287
4350F013180o2915j65888K095J3872M7187O8172J380M2388J01139N4255J14218
4339F229083J07573J23187K3354Q5448J99891L8200R4367j8J15671P8874L49J02800
4327G198779L6920M7423J58551J16481K913M2852J41413J36865j6286L5987R3863
$$ plain form
4316 7995761 8008388 7926076 7956434 7887220 7820483 7689348 7669020 7638861 7509759 7365419 7256859
4305 7256859 7160832 6958144 6787332 6651228 6549531 6328753 6158814 5988413 5848227 5738264
4295 5738264 5597019 5475216 5304298 5125475 5019164 4818413 4648687 4645088 4465920 4404528
4285 4404528 4340764 4316811 4272744 4239401 4215597 4198677 4122623 4123676 4138347 4049980 4059440 4046316
4273 4046316 4002752 3960918 4010237 3995469 3938875 3871617 3898985 3876789 3786116 3916577 3940694
4262 3940694 4017691 3970119 3986577 4039667 4060167 4046710 4122093 4114030 4015205 4077153 4109156 4116441
4250 4116441 4058665 3955816 3907498 3947183 3857394 3955517 3978947 3968492 3877429 3822270 3883923
4239 3883923 3848475 3751902 3769276 3698290 3593447 3562830 3556658 3547241 3467304 3453477 3505605 3507948
$$ packed form
4316G995761J2627q2312L0358o9214o6737j31135k0328l0159j29102j44340j08560
4305G256859r6027k02688j70812j36104j01697k20778j69939j70401j40186j09963
4295E738264j41245j21803j70918j78823j06311k00751j69726l599j79168o1392
4285D404528o3764k3953m4067l3343k3804j6920p6054J053J4671q8367R460j3124
4273D046316m3564m1834M9319j4768n6594o7258K7368k2196r0673J30461K4117
4262C940694P6997m7572J6458N3090K0500j3457P5383q063r8825O1948L2003P285
4250D116441n7776j02849m8318L9685q9789R8123K3430j0455r1063n5159O1653
4239C883923l5448r6573J7374p0986j04843l0617o172r417p9937j3827N2128K343
$$ plain form
4227 3507948 3456479 3378777 3380121 3464631 3401547 3350840 3412491 3446042 3378429 3362208 3455433 3397356
4215 3397356 3443902 3518660 3523011 3447990 3479258 3498695 3536028 3612846 3620380 3648740 3622345 3591020
4203 3591020 3469014 3485460 3550682 3552437 3543323 3589718 3562578 3517551 3535172 3489473 3536432 3603761
4191 3603761 3690285 3766131 3759184 3747885 3748369 3792462 3885807 4010985 4104934 4205539 4325176
4180 4325176 4294559 4399045 4516874 4649650 4730912 4847190 4881450 4928781 4958868 4950842 4890373
4169 4890373 4880087 4811423 4732851 4678780 4570274 4514428 4419553 4297571 4234550 4221210 4100050
4158 4100050 4048766 4065725 4124879 4065652 4010559 3973016 3981905 4042469 4109857 4165308 4197170 4320088
4146 4320088 4480263 4564721 4627601 4688129 4807439 4971439 5025746 5073002 5216835 5291869 5354372
$$ packed form
4227C507948n1469p7702J344Q4510o3084n0707O1651L3551o7613j6221R3225n8077
4215C397356M6546P4758M351p5021L1268J9437L7333P6818P534K8360k6395l1325
4203C591020j22006J6446O5222J755r114M6395k7140m5027J7621m5699M6959O7329
4191C603761Q6524P5846o947j1299M84M4093R3345J25178R3949J00605J19637
4180D325176l0617J04486J17829J32776Q1262J16278L4260M7331L0087q026o0469
4169D890373j0286o8664p8572n4071j08506n5846r4875j21982o3021j3340j21160
4158D100050n1284J6959N9154n9227n5093l7543Q889O0564O7388N5451L1862J22918
4146D320088J60175Q4458O2880O0528J19310J64000N4307M7256J43833P5034O2503
$$ plain form
4135 5354372 5449280 5432338 5512579 5530381 5467177 5387237 5327947 5333895 5290990 5271789 5163515
4124 5163515 5148430 5133827 5203388 5162944 5197171 5335617 5375370 5358359 5303847 5345528 5477021
4113 5477021 5442318 5408622 5394436 5419260 5398453 5330474 5244847 5216785 5205736 5209256 5231008 5267666
4101 5267666 5379094 5394949 5366030 5394264 5434522 5468871 5505468 5604227 5643904 5708228 5799055
4090 5799055 5774764 5786510 5681000 5649048 5624282 5588021 5620835 5571609 5482138 5446769 5516226
4079 5516226 5571106 5511451 5492871 5405152 5387671 5370722 5309929 5224091 5183790 5091969 4965047
4068 4965047 4869555 4757257 4633904 4578042 4577750 4524451 4442298 4464070 4462429 4445931 4506443 4543990
4056 4543990 4541981 4537349 4544716 4514066 4560080 4474639 4482072 4491685 4495087 4417773 4386321 4358928 4330301
$$ packed form
4135E354372R4908j6942Q0241J7802o3204p9940n9290N948m2905j9201j08274
4124E163515j5085j4603O9561m0444L4227J38446L9753j7011n4512M1681J31493
4113E477021l4703l3696j4186K4824k0807o7979q5627k8062j1049L520K1752L6658
4101E267666J11428J5855k8919K8234M0258L4349L6597R8759L9677O4324R0827
4090E799055k4291J1746j05510l1952k4766l6261L2814m9226q9471l5369O9457
4079E516226N4880n9655j8580q7719j7481j6949o0793q5838m0301r1821j26922
4068D965047r5492j12298j23353n5862k92n3299q2153K1772j641j6498O0512L7547
4056D543990k009m632P367l0650M6014q5441P433R613L402p7314l1452k7393k8627
$$ plain form
4043 4330301 4365066 4296610 4255710 4315625 4330366 4302425 4290348 4237246 4201406 4113911 4124022
4032 4124022 4079492 4007437 3939553 3977031 3941562 3868143 3850776 3721625 3633711 3491789 3477834
4021 3477834 3459272 3335634 3327944 3313505 3296962 3234075 3172659 3174188 3127705 3121172 3049255 3065045
4009 3065045 3031557 3023056 2975634 2982952 3009308 3029100 2995713 3021948 3054605 3039775 3067814 3124008
3997 3124008 3106676 3088186 3150402 3160922 3114634 3162681 3206580 3102205 3047033 3018802 2986044
3986 2986044 2956675 2922463 2804226 2818502 2731981 2700779 2709424 2675230 2633156 2613344 2564362
3975 2564362 2496085 2467141 2375756 2344375 2409494 2355361 2370803 2333301 2355320 2331983 2323193 2374051
3963 2374051 2403129 2420067 2392126 2340431 2326251 2285281 2298879 2337947 2386977 2398933 2444971
$$ packed form
4043D330301L4765o8456m0900N9915J4741k7941j2077n3102l5840q7495J0111
4032D124022m4530p2055o7884L7478l5469p3419j7367j29151q7914j41922j3955
4021C477834j8562j23638p690j4439j6543o2887o1416J529m6483o533p1917J5790
4009C065045l3488q501m7422P318K6356J9792l3387K6235L2657j4830K8039N6194
3997C124008j7332j8490O2216J0520m6288M8047M3899j04375n5172k8231l2758
3986B986044k9369l4212j18237J4276q6521l1202Q645l4194m2074j9812m8982
3975B564362o8277k8944r1385l1381O5119n4133J5442l7502K2019k3337q790N0858
3963B374051K9078J6938k7941n1695j4180m0970J3598L9068M9030J1956M6038
$$ plain form
3952 2444971 2524909 2565591 2659427 2692515 2654179 2806267 2961766 3105448 3264416 3466865
3942 3466865 3587656 3690980 3885537 4101939 4069386 3954812 3921489 3808965 3761635 3702892
3932 3702892 3614688 3487229 3367999 3288699 3194769 3005634 2966765 2861142 2793237 2835302 2773879
3921 2773879 2727768 2683917 2687295 2713671 2672756 2657691 2647963 2605099 2544108 2550868 2541141 2564888
3909 2564888 2608802 2600546 2591636 2618089 2648446 2683673 2706998 2775876 2712463 2687767 2777532 2767360
3897 2767360 2771433 2730287 2709181 2726378 2698848 2732653 2781329 2774210 2784718 2794194 2798590 2873798
3885 2873798 2886640 2917220 2910928 2964253 3013029 3075471 3172202 3224443 3167278 3243161 3270173 3308365
3873 3308365 3352745 3398141 3464554 3576958 3632088 3696707 3768392 3869352 3941279 4008883 4088548
$$ packed form
3952B444971P9938M0682R3836L3088l8336J52088J55499J43682J58968K02449
3942C466865J20791J03324J94557K16402l2553j14574l3323j12524m7330n8743
3932C702892q8204j27459j19230p9300r3930j89135l8869j05623o7905M2065o1423
3921B773879m6111m3851L378K6376m0915j5065r728m2864o0991O760r727K3747
3909B564888M3914q256q910K6453L0357L5227K3325O8878o3413k4696Q9765j0172
3897B767360M073m1146k1106J7197k7530L3805M8676p119J0508R476M396P5208
3885B873798J2842L0580o292N3325M8776O2442R6731N2241n7165P5883K7012L8192
3873C308365M4380M5396O6413J12404N5130O4619P1685J00960P1927O7604P9665
$$ plain form
3862 4088548 4122799 4228431 4320981 4527182 4651306 4690189 4729443 4858077 4969998 5022684
3852 5022684 5138595 5251808 5442500 5645451 5779993 6010390 6203959 6435903 6612974 6873086
3842 6873086 7158432 7379115 7665788 8028024 8343308 8774356 9144160 9597789 10109123 10587043
3832 10587043 11044036 11503412 11823478 12021161 12201961 12395899 12557139 12876872 13198823
3823 13198823 13620196 14091801 14618071 15210752 15775918 16573685 17334990 18143795 18968776
3814 18968776 19877649 20831879 21935189 23096707 24200773 25405002 26681611 27904746
3806 27904746 29168446 30436135 31754786 33004353 34349913 35799468 37323604 38820583
3798 38820583 40284181 41796197 43151491 44406549 45703089 46843645 47913989 49010349
$$ packed form
3862D088548L4251J05632R2550K06201J24124L8883L9254J28634J11921N2686
3852E022684J15911J13213J90692K02951J34542K30397J93569K31944J77071K60112
3842F873086K85346K20683K86673L62236L15284M31048L69804M53629N11334M77920
3832A0587043M56993M59376L20066J97683J80800J93938J61240L19733L21951
3823A3198823M21373M71605N26270N92681N65166P97767P61305Q08805Q24981
3814A8968776R08873R54230J103310J161518J104066J204229J276609J223135
3806B7904746J263700J267689J318651J249567J345560J449555J524136J496979
3798C8820583J463598J512016J355294J255058J296540J140556J070344J096360
$$ plain form
3790 49010349 49956917 50819376 51816001 52690638 53501527 54227750 54778607 55270393 55680148
3781 55680148 55812206 55754596 55477423 55238702 54926493 54462861 54016006 53643299 53242110 52744560
3771 52744560 52057500 51459205 50779358 49937632 49077515 48164190 47212255 46215842 45227791
3762 45227791 44312577 43459030 42536685 41698103 40845702 40036771 39205976 38418312 37699001
3753 37699001 36940964 36252278 35561018 34857218 34175897 33545673 32953457 32390525 31951867
3744 31951867 31461599 31129650 30646303 30280386 29993179 29675754 29378672 29146827 28962514
3735 28962514 28850478 28729018 28658735 28569904 28496164 28443281 28273969 28049205 27814189 27481119
3725 27481119 27172637 26848089 26560645 26428189 26430885 26448390 26725932 26873766 27149167 27481531
$$ packed form
3790D9010349R46568Q62459R96625Q74637Q10889P26223N50857M91786M09755
3781E5680148J32058n7610k77173k38721l12209m63632m46855l72707m01189m97550
3771E2744560o87060n98295o79847q41726q60117r13325r51935r96413r88051
3762D5227791r15214q53547r22345q38582q52401q08931q30795p87664p19311
3753C7699001p58037o88686o91260p03800o81321o30224n92216n62932m38658
3744C1951867m90268l31949m83347l65917k87207l17425k97082k31845j84313
3735B8962514j12036j21460p0283q8831p3740n2883j69312k24764k35016l33070
3725B7481119l08482l24548k87444j32456K696J7505K77542J47834K75401L32364
$$ plain form
3715 27481531 27836350 28428564 29132838 29805225 30483173 30909232 31122989 31324923 31525737
3706 31525737 31879876 32460564 33110828 33976639 35029369 36272967 37507624 38940521 40494458
3697 40494458 42144943 44189440 46445649 48609022 50539247 52068568 53636322 55145658
3689 55145658 56419355 58013540 60164039 63037023 66744167 71521837 77374733 84368776
3681 84368776 92703368 102630325 114184037 127085975 140076673 149527906 149421973 142773630
3673 142773630 134565197 125703412 117194827 110828004 106695017 103938053 100348312 94426252
3665 94426252 87216615 79476064 71677595 64248612 57679926 52029178 47325324 43340603
3657 43340603 39947539 37084709 34550773 32338666 30297531 28481808 26934146 25521231
$$ packed form
3715B7481531L54819N92214P04274O72387O77948M26059K13757K01934K00814
3706C1525737L54139N80688O50264Q65811J052730J243598J234657J432897J553937
3697D0494458J650485K044497K256209K163373J930225J529321J567754J509336
3689E5145658J273697J594185K150499K872984L707144M777670N852896O994043
3681H4368776Q334592R926957J1553712J2901938J2990698R451233j05933o648343
3673A42773630q208433q861785q508585o366823m132987k756964l589741n922060
3665I4426252p209637p740551p798469p428983o568686n650748m703854l984721
3657D3340603l393064k862830k533936k212107k041135j815723j547662j412915
$$ plain form
3649 25521231 24191747 23059009 21955423 20929839 20064845 19266418 18559392 17831301 17199393
3640 17199393 16771893 16246162 15827579 15437514 14963858 14490677 14041692 13687338 13327930
3631 13327930 12952411 12587589 12336780 11950675 11525884 11266095 11009602 10706117 10407096
3622 10407096 10043636 9769555 9466660 9196631 8922406 8628064 8442971 8304493 8045989
3613 8045989 7890721 7703426 7550123 7449196 7319901 7222497 7102195 6911980 6801233 6802084
3603 6802084 6651748 6523537 6495612 6459963 6437805 6361945 6304390 6162008 6078462 6060681 6042180
3592 6042180 6055482 5890594 5772295 5746578 5685445 5570703 5531638 5514026 5484471 5389086 5401372
3581 5401372 5446667 5356387 5259041 5297492 5292730 5303920 5295208 5222219 5252462 5222166 5201236 5268760
$$ packed form
3649B5521231j329484j132738j103586j025584q64994p98427p07026p28091o31908
3640A7199393m27500n25731m18583l90065m73656m73181m48985l54354l59408
3631A3327930l75519l64822k50809l86105m24791k59789k56493l03485k99021
3622A0407096l63460k74081l02895k70029k74225k94342j85093j38478k58504
3613H045989j55268j87295j53303j00927j29295r7404j20302j90215j10747Q51
3603F802084j50336j28211k7925l5649k2158p5860n7555j42382q3546j7781j8501
3592F042180J3302j64888j18299k5717o1133j14742l9065j7612k9555r5385J2286
3581E401372M5295r0280r7346L8451m762J1190q712p2989L0243l0296k0930O7524
$$ plain form
3569 5268760 5289850 5286713 5295794 5312448 5299297 5304664 5282591 5290559 5377006 5358448 5368260 5438022
3557 5438022 5543539 5505920 5520077 5573806 5627929 5702657 5764548 5871903 5889469 5947414 6054250
3546 6054250 6079653 6196858 6318709 6365758 6449070 6536515 6585689 6714841 6782950 6994407 7072162
3535 7072162 7191360 7343954 7484990 7710827 7939566 8168674 8396458 8594624 8813461 9015286
3525 9015286 9277928 9559099 9896010 10240977 10620653 10973291 11299903 11703327 12068290 12357928
3515 12357928 12733093 13048658 13324611 13643290 13829305 13999829 14166100 14367339 14484177
3506 14484177 14617501 14746399 14805184 14843912 14899158 14963864 14902821 14937563 14855436 14721283 14651172
3495 14651172 14562254 14439350 14340388 14262920 14129097 14067560 13982166 13936594 13968315 13951142 13923090
$$ packed form
3569E268760K1090l137R081J6654j3151N367k2073P968Q6447j8558R812O9762
3557E438022J05517l7619J4157N3729N4123P4728O1891J07355J7566N7945J06836
3546F054250K5403J17205J21851M7049Q3312Q7445M9174J29152O8109K11457P7755
3535G072162J19198J52594J41036K25837K28739K29108K27784J98166K18837K01825
3525I015286K62642K81171L36911L44967L79676L52638L26612M03424L64963K89638
3515A2357928L75165L15565K75953L18679J86015J70524J66271K01239J16838
3506A4484177J33324J28898N8785L8728N5246O4706o1043L4742q2127j34153p0111
3495A4651172q8918j22904r8962p7468j33823o1537q5394m5572L1721j7173k8052
$$ plain form
3484 13923090 14067815 14172709 14263437 14403564 14643731 14796726 15010672 15274661 15545279 15886699
3474 15886699 16245539 16463806 16865415 17241546 17563263 17950548 18288700 18591612 18878819
3465 18878819 19189876 19450990 19776077 20102487 20232322 20385644 20546312 20737704 20841636
3456 20841636 20958638 21034919 21036185 21063348 21038874 20896967 20745202 20498621 20232895 19926501
3446 19926501 19676932 19368627 19065727 18817166 18527759 18229980 17933069 17590577 17287676
3437 17287676 16935633 16553876 16153223 15779879 15424070 14989342 14667699 14367208 14086637
3428 14086637 13781465 13527944 13270342 13142759 12904733 12692443 12595548 12472814 12373926 12333679
3418 12333679 12248580 12291573 12354295 12369130 12329666 12283171 12197480 12236045 12233971 12278747 12316125
$$ packed form
3484A3923090J44725J04894R0728J40127K40167J52995K13946K63989K70618L41420
3474A5886699L58840K18267M01609L76131L21717L87285L38152L02912K87207
3465A8878819L11057K61114L25087L26410J29835J53322J60668J91392J03932
3456B0841636J17002P6281J266K7163k4474j41907j51765k46581k65726l06394
3446A9926501k49569l08305l02900k48561k89407k97779k96911l42492l02901
3437A7287676l52043l81757m00653l73344l55809m34728l21643l00491k80571
3428A4086637l05172k53521k57602j27583k38026k12290r6895j22734r8888m0247
3418A2333679q5099M2993O2722J4835l9464m6495q5691L8565k074M4776L7378
$$ plain form
3407 12316125 12378261 12470318 12558796 12669849 12801204 12979838 13160749 13298103 13349593 13506971
3397 13506971 13691664 13847220 13876874 14026073 14099841 14355248 14572607 14661448 14769797 14939820
3387 14939820 15124603 15212603 15353636 15419084 15499174 15628420 15715960 15782258 15908015 15945748
3377 15945748 16133711 16275275 16437970 16597903 16808193 16952707 17046181 17265778 17557741 17898902
3367 17898902 18206352 18529228 18773113 19108548 19403462 19791011 20167878 20580702 21049992
3358 21049992 21577914 22130283 22656585 23238360 23824352 24591347 25358127 26130604 26929011
3349 26929011 27804872 28847173 29842415 30825764 31902848 33057496 34215523 35393699 36536488
3340 36536488 37713740 38848069 39901588 40899120 41805057 42694668 43515890 44357579 45138174
$$ packed form
3407A2316125O2136R2057Q8478J11053J31355J78634J80911J37354N1490J57378
3397A3506971J84693J55556K9654J49199P3768K55407K17359Q8841J08349J70023
3387A4939820J84783Q8000J41033O5448Q0090J29246Q7540O6298J25757L7733
3377A5945748J87963J41564J62695J59933K10290J44514R3474K19597K91963L41161
3367A7898902L07450L22876K43885L35435K94914L87549L76867M12824M69290
3358B1049992N27922N52369N26302N81775N85992P66995P66780P72477P98407
3349B6929011Q75861J042301R95242R83349J077084J154648J158027J178176J142789
3340C6536488J177252J134329J053519R97532R05937Q89611Q21222Q41689P80595
$$ plain form
3331 45138174 45892665 46560805 47407423 48250530 49029230 49875091 50770948 51853721 52953927
3322 52953927 54155589 55550732 57017654 58790973 60678824 62839873 65173667 67784882
3314 67784882 70812895 73954709 77307679 80911524 84810366 88777327 92922434 97016679
3306 97016679 101086554 105097756 108811786 112220780 115200249 117739860 119870806 121560466
3298 121560466 122747755 123629036 124287315 124750256 124900127 124794854 124399704 123654405 122515705
3289 122515705 120889233 118939632 116527298 113824521 110748236 107369651 103933944 100515205
3281 100515205 97104694 93838825 90684363 87782840 85125291 82614067 80354702 78219312
3273 78219312 76176977 74307967 72458399 70637674 68846779 67152864 65473902 63779125
$$ packed form
3331D5138174P54491O68140Q46618Q43107P78700Q45861Q95857J082773J100206
3322E2953927J201662J395143J466922J773319J887851K161049K333794K611215
3314F7784882L028013L141814L352970L603845L898842L966961M145107M094245
3306I7016679M069875M011202L714030L408994K979469K539611K130946J689660
3298A21560466J187289Q81281O58279M62941J49871j05273l95150p45299j138700
3289A22515705j626472j949601k412334k702777l076285l378585l435707l418739
3281A00515205l410511l265869l154462k901523k657549k511224k259365k135390
3273G8219312k042335j869010j849568j820725j790895j693915j678962j694777
$$ plain form
3265 63779125 62141597 60523047 58969040 57428880 55960151 54693848 53404645 52268074
3257 52268074 51344654 50413552 49554969 48756415 48108937 47551817 46998580 46462986 46020797
3248 46020797 45614491 45206560 44713299 44234916 43767365 43340544 42889993 42357036 41935005
3239 41935005 41444000 40961070 40556385 40032691 39559437 39108858 38760564 38341875 37968493
3230 37968493 37525429 37120707 36763209 36385935 36051531 35687964 35371459 35023893 34676178
3221 34676178 34346057 34081269 33801176 33493042 33278767 33191620 32995455 32860488 32775754 32605124
3211 32605124 32545849 32460269 32308882 32386528 32346932 32338580 32426517 32466134 32499332 32587795 32587058 32663051
3199 32663051 32714976 32778692 32788576 32909065 33061089 33115378 33250827 33360193 33610249 33868267
$$ packed form
3265F3779125j637528j618550j554007j540160j468729j266303j289203j136571
3257E2268074r23420r31102q58583p98554o47478n57120n53237n35594m42189
3248D6020797m06306m07931m93261m78383m67551m26821m50551n32957m22031
3239D1935005m91005m82930m04685n23694m73254m50579l48294m18689l73382
3230C7968493m43064m04722l57498l77274l34404l63567l16505l47566l47715
3221C4676178l30121k64788k80093l08134k14275q7147j96165j34967q4734j70630
3211C2605124n9275q5580j51387P7646l9596q352Q7937L9617L3198Q8463p37P5993
3199C2663051N1925O3716R884J20489J52024N4289J35449J09366K50056K58018
$$ plain form
3189 33868267 34160552 34448593 34832212 35242410 35699278 36266988 36893696 37590448 38317493
3180 38317493 39116106 39994779 40871867 41797864 42664086 43688913 44770409 45750287 46598474
3171 46598474 47373603 48067747 48750428 49260967 49548991 49848620 50006142 50108988 50294728
3162 50294728 50427263 50612741 50877897 51248607 51721451 52319418 53012886 53862393 54757259
3153 54757259 55806412 56951730 58237035 59624708 61069868 62771941 64672791 66625896
3145 66625896 68824452 71217300 73723866 76507233 79549982 82833108 86403917 90399254
3137 90399254 94751537 99346849 104408987 110018483 115982678 122386695 129212604 136455450
3129 136455450 143952128 151679820 159370824 167029511 174579637 181679815 188168061 193918878
$$ packed form
3189C3868267K92285K88041L83619M10198M56868N67710O26708O96752P27045
3180C8317493P98613Q78673Q77088R25997Q66222J024827J081496R79878Q48187
3171D6598474P75129O94144O82681N10539K88024K99629J57522J02846J85740
3162E0294728J32535J85478K65156L70710M72844N97967O93468Q49507Q94866
3153E4757259J049153J145318J285305J387673J445160J702073J900850J953105
3145F6625896K198556K392848K506566K783367L042749L283126L570809L995337
3137I0399254M352283M595312N062138N609496N964195O404017O825909P242846
3129A36455450P496678P727692P691004P658687P550126P100178O488246N750817
$$ plain form
3121 193918878 198879830 202899382 205869783 207904390 208914669 208922145 207936312 206048721 203307057
3112 203307057 199742979 195525581 190715859 185398928 179619122 173706759 167609435 161516176
3104 161516176 155550539 149716874 144227073 138969484 134234386 129799011 125757543 122128570
3096 122128570 118871290 115960341 113421701 111311590 109507398 107988447 106791205 105928321
3088 105928321 105448895 105244438 105287965 105565280 106093508 106925073 108101271 109438381 110899401
3079 110899401 112522394 114514460 116552113 118665382 120968935 123456025 126059933 128703122
3071 128703122 131520235 134386245 137419895 140492612 143645196 146733106 149979320 153253242
3063 153253242 156401163 159545580 162850789 166134094 169517671 172969701 176663668 180711674
$$ packed form
3121A93918878M960952M019552K970401K034607J010279P476r85833j887591k741664
3112B03307057l564078m217398m809722n316931n779806n912363o097324o093259
3104A61516176n965637n833665n489801n257589m735098m435375m041468l628973
3096A22128570l257280k910949k538640k110111j804192j518951j197242q62884
3088A05928321m79426k04457M3527K77315N28228Q31565J176198J337110J461020
3079A10899401J622993J992066K037653K113269K303553K487090K603908K643189
3071A28703122K817113K866010L033650L072717L152584L087910L246214L273922
3063A53253242L147921L144417L305209L283305L383577L452030L693967M048006
$$ plain form
3055 180711674 184953637 189493556 194415304 199657957 205235212 211184261 217397039 223944177
3047 223944177 230620597 237411839 244069533 250543262 256633326 262100670 266746915 270514722
3039 270514722 273328801 275187496 276220779 276440189 275864107 274697973 272960217 270561232
3031 270561232 267630908 264049772 259758513 254713703 248964476 242451218 235228954 227523921
3023 227523921 219296741 210819034 202151646 193513852 185074019 176960234 169381039 162007551
3015 162007551 154878098 148288860 142281032 136705363 131737355 127452513 123273156 118365680
3007 118365680 113339834 108607000 104177135 100042055 96367258 93026089 90112686 87492601
2999 87492601 85106539 82883534 80769168 79010033 77399869 75988644 74783740 73673123
$$ packed form
3055A80711674M241963M539919M921748N242653N577255N949049O212778O547138
3047B23944177O676420O791242O657694O473729O090064N467344M646245L767807
3039B70514722K814079J858695J033283K19410n76082j166134j737756k398985
3031B70561232k930324l581136m291259n044810n749227o513258p222264p705033
3023B27523921q227180q477707q667388q637794q439833q113785p579195p373488
3015A62007551p129453o589238o007828n575669m968008m284842m179357m907476
3007A18365680n025846m732834m429865m135080l674797l341169k913403k620085
2999H7492601k386062k223005k114366j759135j610164j411225j204904j110617
$$ plain form
2991 73673123 72742576 72104944 71546598 71133695 71060873 71012315 71193368 71138882 70056921 68551389
2981 68551389 67025519 65419253 63994585 62811745 61759930 60891325 60083751 59480560 58921203
2972 58921203 58351614 57754598 57279262 56949924 56592215 56288873 55964277 55836303 55701170
2963 55701170 55422107 55145940 54746503 54299796 53854329 53234523 52468550 51701491 50920564
2954 50920564 50047638 49243408 48523795 47885896 47357053 46912825 46522666 46393327 46422855 46498582
2944 46498582 46701921 46923270 47272154 47828471 48469337 49179551 49849141 50744213 51704208
2935 51704208 52754956 54041987 55325103 56762196 58288428 59827073 61497004 63205176
2927 63205176 64894103 66768021 68586705 70428632 72308238 74289346 76271213 78464226
$$ packed form
2991G3673123r30547o37632n58346m12903p2822m8558J81053n4486j081961j505532
2981F8551389j525870j606266j424668j182840j051815q68605q07574o03191n59357
2972E8921203n69589n97016m75336l29338l57709l03342l24596j27974j35133
2963E5701170k79063k76167l99437m46707m45467o19806p65973p67059p80927
2954E0920564q72926q04230p19613o37899n28843m44228l90159j29339K9528P5727
2944D6498582K03339K21349L48884N56317O40866P10214O69590Q95072R59995
2935E1704208J050748J287031J283116J437093J526232J538645J669931J708172
2927F3205176J688927J873918J818684J841927J879606J981108J981867K193013
$$ plain form
2919 78464226 80782354 83128268 85489200 87847438 90367586 92948491 95420580 97817165
2911 97817165 100040853 101932232 103521209 104646771 105217307 105312054 104810478 103827583 102481386
2902 102481386 100740455 98825135 96964877 95080415 93362900 91876753 90694402 89774135
2894 89774135 89128096 88786317 88821871 89053066 89511327 90096185 90777958 91423080 92032122 92424324
2884 92424324 92545998 92376176 91846467 90833957 89379825 87503641 85360950 82920584 80208304
2875 80208304 77447283 74530474 71604529 68687493 65928070 63303780 60773800 58369511
2867 58369511 56105264 54000981 52045679 50138042 48312111 46635777 45074798 43576466
2859 43576466 42199071 40906962 39682578 38432220 37322685 36336775 35337401 34471926 33663047
$$ packed form
2919G8464226K318128K345914K360932K358238K520148K580905K472089K396585
2911I7817165K223688J891379J588977J125562N70536R4747n01576r82895j346197
2902A02481386j740931j915320j860258j884462j717515j486147j182351r20267
2894H9774135o46039l41779L5554K31195M58261N84858O81773O45122O09042L92202
2884I2424324J21674j69822n29709j012510j454132j876184k142691k440366k712280
2875H0208304k761021k916809k925945k917036k759423k624290k529980k404289
2867E8369511k264247k104283j955302j907637j825931j676334j560979j498332
2859D3576466j377395j292109j224384j250358j109535r85910r99374q65475q08879
$$ plain form
2850 33663047 32892591 32226418 31553862 30945679 30392391 30009986 29598645 29427165 29223459
2841 29223459 29072677 29064708 29060153 29123249 29254982 29448526 29618457 29834020 30054747 30160869
2831 30160869 30333998 30265690 30093523 29788069 29391806 28934270 28311118 27646908 26927583 26166335
2821 26166335 25444121 24789804 24032289 23380830 22816380 22235452 21663910 21154322 20660166
2812 20660166 20275727 19966054 19621713 19352174 19149441 18951641 18727221 18515074 18390221
2803 18390221 18191432 17953750 17820281 17724220 17590428 17424895 17342936 17288089 17218729 17115029
2793 17115029 17074953 17082463 17087582 17054536 16967177 16954566 16952494 16898442 16946093 17030753 17060906 17041599
2781 17041599 17008335 17112479 17139234 17205760 17314137 17391851 17436109 17546377 17597672 17662127 17786959
$$ packed form
2850C3663047p70456o66173o72556o08183n53288l82405m11341j71480k03706
2841B9223459j50782p969m555O3096J31733J93544J69931K15563K20727J06122
2831C0160869J73129o8308j72167l05454l96263m57536o23152o64210p19325p61248
2821B6166335p22214o54317p57515o51459n64450n80928n71542n09588m94156
2812B0660166l84439l09673l44341k69539k02733j97800k24420k12147j24853
2803A8390221j98789k37682j33469r6061j33792j65533q1959n4847o9360j03700
2793A7115029m0076P510N119l3046q7359j2611k072n4052M7651Q4660L0153j9307
2781A7041599l3264J04144K6755O6526J08377P7714M4258J10268N1295O4455J24832
$$ plain form
2770 17786959 17882543 18020659 18234140 18490005 18653563 18828777 19053622 19286563 19474639 19740676
2760 19740676 19943627 20188944 20384200 20567179 20869573 21310848 21614456 21956624 22440103
2751 22440103 22930757 23515815 24101105 24553503 25173244 25918977 26587135 27379259 28142947
2742 28142947 28878769 29714811 30561897 31296062 32108133 32986929 33810276 34652697 35541971
2733 35541971 36383266 37377711 38328608 39346610 40420832 41556532 42732567 43972230 45316243
2724 45316243 46623472 48098797 49761730 51567561 53449401 55498851 57772279 60170611
2716 60170611 62714635 65367007 68281565 71423743 74783370 78292238 82091019 86126734
2708 86126734 90495072 95016645 99936355 105392462 111047801 117130725 123852655 131083716
$$ packed form
2770A7786959R5584J38116K13481K55865J63558J75214K24845K32941J88076K66037
2760A9740676K02951K45317J95256J82979L02394M41275L03608L42168M83479
2751B2440103M90654N85058N85290M52398O19741P45733O68158P92124P63688
2742B8142947P35822Q36042Q47086P34165Q12071Q78796Q23347Q42421Q89274
2733C5541971Q41295R94445R50897J018002J074222J135700J176035J239663J344013
2724D5316243J307229J475325J662933J805831J881840K049450K273428K398332
2716F0170611K544024K652372K914558L142178L359627L508868L798781M035715
2708H6126734M368338M521573M919710N456107N655339O082924O721930P231061
$$ plain form
2700 131083716 138982038 147454983 156437219 165897684 175876106 186596119 198047866 210521215
2692 210521215 224277080 239416535 256259801 274875636 295255911 317398689 341001311
2685 341001311 365740108 391098003 416911773 443198791 469824116 496680541 523174584
2678 523174584 547911830 568593290 581897156 584685061 575471832 555277739 526834014
2671 526834014 493421754 458405645 424203309 392498740 364013603 338786653 316665896
2664 316665896 297402081 280615730 265959920 253122424 241842372 232091321 223522746
2657 223522746 215645585 208164699 200817629 193362563 185706355 177991352 170394260 162989813
2649 162989813 155896775 149174677 142827073 136662452 130875177 125255376 119788507 114630005
$$ packed form
2700A31083716P898322Q472945Q982236R460465R978422J0720013J1451747J2473349
2692B10521215J3755865J5139455J6843266J8615835K0380275K2142778K3602622
2685C41001311K4738797K5357895K5813770K6287018K6625325K6856425K6494043
2678E23174584K4737246K0681460J3303866K787905r213229k0194093k8443725
2671E26834014l3412260l5016109l4202336l1704569k8485137k5226950k2120757
2664C16665896j9263815j6786351j4655810j2837496j1280052r751051q568575
2657B23522746p877161p480886p347070p455066p656208p715003p597092p404447
2649A62989813p093038o722098o347604o164621n787275n619801n466869n158502
$$ plain form
2641 114630005 109767904 105089867 100674748 96563263 92672822 88919436 85412790 81988216
2633 81988216 78776624 75742768 72840841 70086871 67458677 64896434 62423914 60145064
2625 60145064 57845938 55684263 53568763 51524081 49673036 47871464 46178090 44583650
2617 44583650 43057572 41604435 40352460 39046609 37850082 36747576 35682895 34736336
2609 34736336 33801350 32958315 32085207 31290047 30538750 29805782 29153056 28483201 27891979
2600 27891979 27202299 26514562 25803398 25159767 24551817 23932273 23382398 22748839 22067506
2591 22067506 21455909 20921073 20343246 19784356 19282126 18819348 18314728 17876299 17471040
2582 17471040 17066469 16770010 16454048 15952205 15551252 15173669 14900279 14572214 14175663
$$ packed form
2641A14630005m862101m678037m415119m111485l890441l753386l506646l424574
2633H1988216l211592l033856k901927k753970k628194k562243k472520k278850
2625F0145064k299126k161675k115500k044682j851045j801572j693374j594440
2617D4583650j526078j453137j251975j305851j196527j102506j064681r46559
2609C4736336r34986q43035q73108p95160p51297p32968o52726o69855n91222
2600B7891979o89680o87737p11164o43631o07950o19544n49875o33559o81333
2591B2067506o11597n34836n77827n58890n02230m62778n04620m38429m05259
2582A7471040m04571k96459l15962n01843m00953l77583k73390l28065l96551
$$ plain form
2573 14175663 13759028 13443265 13163167 12809874 12494083 12229670 11873226 11640562 11430891
2564 11430891 11209430 11021641 10788046 10565485 10320794 10211918 10047807 9788812 9668988
2555 9668988 9554785 9443785 9350644 9258593 9206566 9081424 8920896 8842908 8732854 8624920
2545 8624920 8585875 8427822 8284994 8192137 8081435 8001822 7913066 7803858 7684775 7582964
2535 7582964 7422318 7302785 7183830 6998483 6946121 6809324 6704152 6612500 6518109 6430418
2525 6430418 6244360 6175580 6066380 6015819 5915266 5856493 5715080 5643380 5559147 5428638
2515 5428638 5400618 5344814 5277727 5140020 5138873 5069705 5009919 4902200 4796821 4747188 4709539
2504 4709539 4643410 4542605 4414735 4345134 4289979 4220738 4006126 3911176 3898565 3854618 3770043
$$ packed form
2573A4175663m16635l15763k80098l53293l15791k64413l56444k32664k09671
2564A1430891k21461j87789k33595k22561k44691j08876j64111k58995j19824
2555I668988j14203j11000r3141r2051n2027j25142j60528p7988j10054j07934
2545H624920l9045j58053j42828r2857j10702p9613q8756j09208j19083j01811
2535G582964j60646j19533j18955j85347n2362j36797j05172r1652r4391q7691
2525F430418j86058o8780j09200n0561j00553n8773j41413p1700q4233j30509
2515E428638k8020n5804o7087j37707j147o9168n9786j07719j05379m9633l7649
2504D709539o6129j00805j27870o9601n5155o9241k14612r4950j2611m3947q4575
$$ plain form
2493 3770043 3733872 3620043 3548465 3514725 3451096 3385573 3372184 3371271 3245143 3185347 3233088
2482 3233088 3185762 3209211 3173566 3171722 3179600 3066497 3069609 3020910 3043015 3103059 2989343 2955322
2470 2955322 2930221 2926092 2973392 2994370 3013667 2915871 2881620 2807643 2827921 2876098 2918060 2904252
2458 2904252 2863610 2877972 2894762 2917338 2862440 2876307 2895280 2951493 3056291 2924902 2912926
2447 2912926 2925444 2973414 3011781 2964409 2942901 2933909 2931888 3022855 3086001 3092501 3139923 3112995
2435 3112995 3163792 3282026 3395128 3466905 3453863 3585614 3625650 3722284 3898071 4051434
2425 4051434 4070621 4174672 4298531 4271797 4399117 4470308 4481683 4565349 4520243 4438642 4213252
2414 4213252 4089793 4052213 3859583 3648834 3516416 3361856 3273857 3236738 3094469 2966964
$$ packed form
2493C770043l6171j13829p1578l3740o3629o5523j3389r13j26128n9796M7741
2482C233088m7326K3449l5645j844P878j13103L112m8699K2105O0044j13716l4021
2470B955322k5101m129M7300K0978J9297r7796l4251p3977K0278M8177M1962j3808
2458B904252m0642J4362J6790K2576n4898J3867J8973N6213J04798j31389j1976
2447B912926J2518M7970L8367m7372k1508q992k021R0967O3146O500M7422k6928
2435C112995N0797J18234J13102P1777j3042J31751M0036R6634J75787J53363
2425D051434J9187J04051J23859k6734J27320P1191J1375Q3666m5106q1601k25390
2414D213252j23459l7580j92630k10749j32418j54560q7999l7119j42269j27505
$$ plain form
2404 2966964 2888243 2824343 2729229 2642478 2689455 2565016 2477395 2463835 2407087 2293029 2265133
2393 2265133 2217125 2153970 2144439 2009397 1947002 1952377 1959529 1902743 1907621 1833012 1779953 1657641
2381 1657641 1621137 1657367 1650341 1642433 1634405 1542224 1493873 1492593 1445792 1390080 1342252 1360229
2369 1360229 1414656 1385119 1408079 1355952 1350130 1311419 1268765 1241927 1264914 1206134 1132278 1083846
2357 1083846 1056006 1036411 1017387 949875 991712 991567 971808 871245 781636 792922 802858 784046
2345 784046 768533 673688 744966 813954 786909 807275 707547 720715 783495 883301 905948 805525
2333 805525 808069 763027 809331 872696 853969 858505 801256 783920 771983 753028 760431 707278
2321 707278 731322 798996 730174 784092 734691 707114 632830 694421 668996 703411 700635 679788
$$ packed form
2404B966964p8721o3900r5114q6751M6977j24439q7621j3560n6748j14058k7896
2393B265133m8008o3155r531j35042o2395N375P152n6786M878p4609n3059j22312
2381A657641l6504L6230p026p908q028r2181m8351j280m6801n5712m7828J7977
2369A360229N4427k9537K2960n2127n822l8711m2654k6838K2987n8780p3856m8432
2357A083846k7840j9595j9024o7512M1837j45j9759j00563q9609J1286R936j8812
2345G84046j5513r4845P1278O8988k7045K0366r9728J3168O2780R9806K2647j00423
2333H05525K544m5042M6304O3365j8727M536n7249j7336j1937j8955P403n3153
2321G07278K4044O7674o8822N3918m9401k7577p4284O1591k5425L4415k776k0847
$$ plain form
2309 679788 681704 639306 575625 579062 608519 632083 660201 656034 615427 643847 657761 631428
2297 631428 723678 703356 672943 652683 662988 684611 586010 553302 623823 634930 634156 681206
2285 681206 615272 608994 620432 567011 574410 584330 647670 640969 664523 644181 623524 595954
2273 595954 549522 578735 510068 442093 533931 524729 511040 486730 395782 427495 528168 536576
2261 536576 564667 542415 480011 455253 446047 328788 366533 478131 539000 481412 404504
2250 404504 445895 437949 444302 520293 514827 455882 434178 412958 378786 360631 321274 337832
2238 337832 408518 356981 401578 397547 402300 357490 364148 352976 322878 311366 353736 363446
2226 363446 331871 320150 327525 226155 206182 247609 186032 177656 177549 206756 135281 122725
$$ packed form
2309F79788J916m2398o3681L437K9457K3564K8118m167m0607K8420J3914k6333
2297F31428R2250k0322l0413k0260J0305K1623r8601l2708P0521J1107p74M7050
2285F81206o5934o278J1438n3421P399R920O3340o701K3554k0342k0657k7570
2273E95954m6432K9213o8667o7975R1838r202j3689k4310r0948L1713J00673Q408
2261E36576K8091k2252o2404k4758r206j17259L7745J11598O0869n7588p6908
2250D04504M1391p946O353P5991n466n8945k1704k1220l4172j8155l9357J6558
2238C37832P0686n1537M4597m031M753m4810O658j1172l0098j1512M2370R710
2226C63446l1575j1721P375j01370j9973M1427o1577q376j07K9207p1475j2556
$$ plain form
2214 122725 219190 269685 289540 216760 190499 140009 184741 218791 161065 93810 90178 133742
2202 133742 174738 193324 132130 150482 168892 177974 150544 96983 96474 146253 115742 150338
2190 150338 140415 137762 121848 126790 79397 57986 118868 134260 135251 172470 143371 76926 72449
2177 72449 76500 148039 94375 104363 60368 58878 13151 -17598 36563 54560 85748 92922 133622
2164 133622 163285 46867 -26022 61925 53100 54881 71393 21260 -12379 17889 35004 64839
2152 64839 83895 33355 30343 97431 94461 56115 -39848 23626 134421 125625 93188 97216
2140 97216 148202 120155 158882 120789 158653 206588 157320 196467 208994 161692 171984 147798
2128 147798 181769 174464 220203 235026 152452 102902 132615 202450 189783 209779 171650 88047
$$ packed form
2214A22725R6465N0495J9855p2780k6261n0490M4732L4050n7726o7255l632M3564
2202A33742M0996J8586o1194J8352J8410R082k7430n3561n09M9779l0511L4596
2190A50338r923k653j5914M942m7393k1411O0882J5392R91L7219k9099o6445m477
2177G2449M051P1539n3664R988m3995j490m5727l0749N4161J7997L1188P174M0700
2164A33622K9663j16418p2889Q7947q825J781J6512n0133l3639L0268J7115K9835
2152F4839J9056n0540l012O7088k970l8346r5963O3474J10795q796l2437M028
2140I7216N0986k8047L8727l8093L7864M7935m9268L9147J2527m7302J0292k4186
2128A47798L3971p305M5739J4823q2574m9550K9713O9835j2667J9996l8129q3603
$$ plain form
2116 88047 85543 188225 176874 167856 118721 154987 148824 163689 219513 180324 105498 152300
2104 152300 127267 174041 143828 110495 143312 117201 104251 49733 62064 115433 116169 80022
2092 80022 9507 32189 103761 40629 60209 15280 72277 93803 94419 147016 136357 186122
2080 186122 151133 143656 130682 150124 233050 241247 189795 259330 270714 230931 307798 301480
2068 301480 314873 268386 226010 215950 270885 295869 276680 349994 383949 360099 281259 297558
2056 297558 317417 397117 407031 401358 415785 449099 494894 479987 548389 612293 578967 595816
2044 595816 673490 742761 686084 667680 722058 848957 934937 962565 941349 917290 931401
2033 931401 1019598 1151596 1243868 1308726 1369886 1385486 1486220 1566721 1719970 1906845 2096934
$$ packed form
2116H8047k504J02682j1351r018m9135L6266o163J4865N5824l9189p4826M6802
2104A52300k5033M6774l0213l3333L2817k6111j2950n4518J2331N3369P36l6147
2092H0022p0515K2682P1572o3132J9580m4929N6997K1526O16N2597j0659M9765
2080A86122l4989p477j2974J9442Q2926Q197n1452O9535J1384l9783P6867o318
2068C01480J3393m6487m2376j0060N4935K4984j9189P3314L3955k3850p8840J6299
2056B97558J9859P9700R914n673J4427L3314M5795j4907O8402O3904l3326J6849
2044E95816P7674O9271n6677j8404N4378J26899Q5980K7628k1216k4059J4111
2033I31401Q8197J31998R2272O4858O1160J5600J00734Q0501J53249J86875J90089
$$ plain form
2022 2096934 2372847 2585552 2785991 3089533 3365146 3667049 4114389 4669845 5313179 6112918
2012 6112918 7104249 8301318 9951450 12076839 14737191 14636114 12621731 11146362 9583355
2003 9583355 7784099 6246220 5256997 4612073 4071857 3675523 3266748 2973533 2807236
1994 2807236 2592009 2398079 2215707 2025071 1874739 1802292 1582983 1505312 1411307 1255160
1984 1255160 1222791 1078657 1014397 1007866 1009563 925803 900180 950975 883460 857587 784628 760818
1972 760818 778725 721005 731174 718494 683650 571427 594424 606820 562559 538635 516966
1961 516966 488315 484309 481042 416304 450333 393860 472351 431173 373673 259809 275922 316808
1949 316808 272090 301393 237284 298251 295214 288316 297687 235253 167214 205037 205987 248432 175952
$$ packed form
2022B096934K75913K12705K00439L03542K75613L01903M47340N55456O43334P99739
2012F112918R91331J197069J650132K125389K660352j01077k014383j475369j563007
2003I583355j799256j537879r89223o44924n40216l96334m08775k93215j66297
1994B807236k15227j93930j82372j90636j50332p2447k19309p7671r4005j56147
1984A255160l2369j44134o4260o531J697q3760k5623N0795o7515k5873p2959k3810
1972G60818J7907n7720J0169j2680l4844j12223K2997J2396m4261k3924k1669
1961E16966k8651m006l267o4738L4029n6473P8491m1178n7500j13864J6113M0886
1949C16808m4718K9303o4109O0967l037o898R371o2434o8039L7823R50M2445p2480
$$ plain form
1936 175952 191407 216330 169615 149819 189774 202335 179426 140277 104476 105972 111412 163973
1924 163973 172677 182662 139717 222181 172414 97135 82365 110914 104017 171465 175806 102737
1912 102737 103589 129870 67590 16135 39601 64375 -51500 -39598 -19597 103559 -14385
1901 -14385 -27060 -70649 26998 1667 4048 10603 18136 1486 25478 47008 19975 -53574
1889 -53574 12132 -16582 -80994 14409 59437 97757 31224 35973 19608 83159 49314 24620
1877 24620 12011 -800 -12568 37651 2122 -33201 -2181 -21050 -61117 -85981 -104207 -4990
1865 -4990 -38033 25354 -2458 -1292 -4107 3506 -21494 -68190 -94956 -35918 -52673 7696 23637
1852 23637 4514 7486 -67394 -121123 -61067 -87057 -46824 -21000 -9571 -38147 -41591 -88754
$$ packed form
1936A75952J5455K4923m6715j9796L9955J2561k2909l9149l5801J496N440N2561
1924A63973Q704R985m2945Q2464m9767p5279j4770K8549o897O7448M341p3069
1912A02737Q52K6281o2280n1455K3466K4774j15875J1902K0001J23156j17944
1901a4385j2675m3589R7647k5331K381O555P533j6650K3992K1530k7033p3549
1889e3574O5706k8714o4412R5403M5028L8320o6533M749j6365O3551l3845k4694
1877B4620j2609j2811j1768N0219l5529l5323L1020j8869m0067k4864j8226R9217
1865d990l3043O3387k7812J166k815P613k5000m6696k6766N9038j6755O0369J5941
1852B3637j9123K972p4880n3729O0056k5990M0233K5824J1429k8576l444m7163
$$ plain form
1840 -88754 -106290 -69220 -26862 8763 -7690 -27117 -74219 -3917 3498 18855 -64545 -60748
1828 -60748 -19489 -66671 -108032 -37406 -81532 -82290 -83675 -54576 -56247 -147995 -144135 -85150 -136660
1815 -136660 -203081 -128500 -50116 -56122 -148359 -107371 -105307 -127001 -42140 -88161 -100257 -64375
1803 -64375 -107280 -74565 -66491 -52727 -106152 -19802 24192 -22004 -113063 -203700 -123949 -74481
1791 -74481 -12618 -54271 7922 -24221 -16140 8182 -91976 -145152 -173321 -124323 -94083 -38071
1779 -38071 -22498 -73593 -93010 -135391 -119855 -125787 -127032 -161433 -150508 -73746 -35541 -60557
1767 -60557 -28223 45876 831 13578 40036 21220 -8980 -28524 -95180 -65531 -26402 -17951
1755 -17951 -41227 28225 45483 34806 -37791 -147024 -137159 -55414 -33683 -107161 -130617 -98441
$$ packed form
1840h8754j7536L7070M2358L5625j6453j9427m7102P0302P415J5357q3400L797
1828f0748M1259m7182m1361P0626m4126p58j385K9099j671r1748L860N8985n1510
1815a36660o6421P4581P8384o006r2237M0988K064k1694Q4861m6021j2096L5882
1803f4375m2905L2715Q074J3764n3425Q6350M3994m6196r1059r0637P9751M9468
1791g4481O1863m1653O2193l2143Q081K4322j00158n3176k8169M8998L0240N6012
1779c8071J5573n1095j9417m2381J5536n932j245l4401J0925P6762L8205k5016
1767f0557L2334P4099m5045J2747K6458j8816l0200j9544o6656K9649L9129Q451
1755a7951k3276O9452J7258j0677p2597j09233R865Q1745K1731p3478k3456L2176
$$ plain form
1743 -98441 -159313 -93890 -25465 -13542 11590 -13393 -87642 -78655 -69393 -42338 -62408 -54987
1731 -54987 21880 -10444 -38166 -73269 -124732 -168591 -155248 -121046 -139296 -107305 -69648 -107484
1719 -107484 -113951 -101328 -118318 -111051 -108980 -82331 -112752 -80880 -94647 -153549 -183917 -131851
1707 -131851 -107652 -107719 -62294 -78634 -114501 -130623 -75862 -140020 -156967 -197535 -171871 -125233
1695 -125233 -104021 -83921 -8464 -40008 -84424 -61783 -31147 -38268 -62886 -178037 -105251 -109496
1683 -109496 -91501 -51980 -23140 -20762 22228 -31425 -132899 -131089 -132392 -129316 -128020 36629
1671 36629 66684 -12882 -3478 38103 1704 -2343 -62300 -58734 -132402 -159010 -132067 -77096
1659 -77096 -54772 -117769 -70550 -85796 -80651 -75163 -50639 -101623 -116919 -61785 1829 -58379
$$ packed form
1743i8441o0872O5423O8425J1923K5132k4983p4249Q987R262K7055k0070P421
1731e4987P6867l2324k7722l5103n1463m3859J3343L4202j8250L1991L7657l7836
1719a07484o467J2623j6990P267K071K6649l0421L1872j3767n8902l0368N2066
1707a31851K4199o7M5425j6340l5867j6122N4761o4158j6947m0568K5664M6638
1695a25233K1212K0100P5457l1544m4416K2641L0636p121k4618j15151P2786m245
1683a09496J7995L9521K8840K378M2990n3653j01474J810j303L076J296J64649
1671C6629L0055p9566R404M1581l6399m047n9957L566p3668k6608K6943N4971
1659g7096K2324o2997M7219j5246N145N488K4524n0984j5296N5134O3614o0208
$$ plain form
1647 -58379 -15253 -88011 -57764 -109972 -110400 2862 32913 5925 -42134 -21706 17194 7026
1635 7026 -92935 -88503 -88974 -94914 -116411 -158887 -182946 -142441 -113578 -82523 -62935 -73686 -45534
1622 -45534 -117566 -128422 -75232 25077 -23232 -81781 -66277 -114679 -96084 -112526 -100552 -91484
1610 -91484 -69161 -88024 -104730 -79745 -10107 -54564 -42884 -71968 -12472 -113252 -165197 -105909
1598 -105909 -126264 -90364 -99502 -101005 -147758 -150021 -174588 -151259 -57072 -94711 -62465 -79185
1586 -79185 -80815 -120819 -110354 -103190 -123299 -71748 -16425 -55570 -86239 -80781 -57276 -90182
1574 -90182 -96773 -85041 -75694 -63505 -40869 -13895 23745 -65550 -80614 -112564 -92168 -39503
1562 -39503 -45989 -75808 -88701 -77459 -74216 -46722 -54193 -67771 -124795 -97126 -39159 -56046
$$ packed form
1647e8379M3126p2758L0247n2208m28J13262L0051k6988m8059K0428L8900j0168
1635G026r9961M432m71n940k1497m2476k4059M0505K8863L1055J9588j0751K8152
1622d5534p2032j0856N3190J00309m8309n8549J5504m8402J8595j6442J1974R068
1610i1484K2323j8863j6706K4985O9638m4457J1680k9084N9496j00780n1945N9288
1598a05909k0355L5900r138j503m6753k263k4567K3329R4187l7639L2246j6720
1586g9185j630m0004J0465P164k0109N1551N5323l9145l0669N458K3505l2906
1574i0182o591J1732R347J2189K2636K6974L7640q9295j5064l1950K0396N2665
1562c9503o486k9819j2893J1242L243K7494p471j3578n7024K7669N7967j6887
$$ plain form
1550 -56046 -116834 -105392 -74877 -110988 -71355 -30610 -9805 -31582 -142667 -147085 -156857 -165324
1538 -165324 -128275 -61171 -39855 -66023 -98005 -50964 -3779 -45660 -10863 -49701 -34354 -40818
1526 -40818 -120561 -55617 -106046 -99172 -75948 -88860 -54741 -121397 -111536 -110382 -128472 -48502
1514 -48502 -64574 -24334 -29679 -17308 -73005 -122961 -173518 -174154 -125848 -185718 -116738 -91093
1502 -91093 -149825 -180375 -115956 -171598 -209663 -172028 -183721 -171445 -117731 -60683 -50918 -66347
1490 -66347 -106534 -134247 -46186 -92423 -112554 -121100 -101819 -70669 -62956 21599 10887 -19965
1478 -19965 -15732 13305 -26690 -36231 -127063 -165621 -188306 -140602 -144361 -157163 -102634 -67503
1466 -67503 -72893 -95597 -103036 -24822 -38538 -83107 -53392 -47462 -115720 -67366 -43586 -33825 -25126
$$ packed form
1550e6046o0788J1442L0515l6111L9633M0745K0805k1777j11085m418r772q467
1538a65324L7049O7104K1316k6168l1982M7041M7185m1881L4797l8838J5347o464
1526d0818p9743O4944n0429O874K3224j2912L4119o6656R861J154j8090P9970
1514d8502j6072M0240n345J2371n5697m9956n0557o36M8306n9870O8980K5645
1502i1093n8732l0550O4419n5642l8065L7635j1693J2276N3714N7048R765j5429
1490f6347m0187k7713Q8061m6237k0131q546J9281L1150P713Q4555j0712l0852
1478a9965M233K9037l9995r541r0832l8558k2685M7704l759j2802N4529L5131
1466f7503n390k2704p439P8214j3716m4569K9715N930o8258M8354K3780R761Q699
$$ plain form
1453 -25126 -39543 -65518 16985 -14794 -109393 -103343 -73298 -35638 13048 -96689 -70364 -16741
1441 -16741 -31210 -22966 -41809 -32536 -88440 -86288 -106439 -74304 -16600 -37742 -40007 -23703 17306
1428 17306 -15243 -60786 -63986 -43640 -17857 -35044 -151947 -145956 -82169 -102151 -12171 21677
1416 21677 -110159 -211515 -176328 -145969 -124040 -66816 -117281 -97933 -81127 -114836 -58743
1405 -58743 -110965 -54628 -46545 -117719 -164801 -97777 -115674 -114148 -71895 -52078 -41273 -53716
1393 -53716 -22850 -53220 -2177 -33695 -58902 49472 -34680 -112067 -137098 -181744 -156843 -67174
1381 -67174 -60648 -91028 -44032 -6573 -3526 29545 -81392 -82092 -62720 -89983 -95174 -53417 -88341
1368 -88341 -51938 -30815 -89203 -15147 -37436 -7848 32340 -31999 -74664 -26446 -44212 4127
$$ packed form
1453b5126j4417k5975Q2503l1779r4599O050L0045L7660M8686j09737K6325N3623
1441a6741j4469Q244j8843R273n5904K152k0151L2135N7704k1142k265J6304M1009
1428A7306l2549m5543l200K0346K5783j7187j16903N991O3787j9982Q9980L3848
1416B1677j31836j01356L5187L0359K1929N7224n0465J9348J6806l3709N6093
1405e8743n2222N6337Q083p1174m7082O7024j7897J526M2253J9817J0805j2443
1393e3716L0866l0370N1043l1518k5207J08374q4152p7387k5031m4646K4901Q9669
1381f7174O526l0380M6996L7459L047L3071j10937p00J9372k7263n191M1757l4924
1368h8341L6403K1123n8388P4056k2289K9588M0188o4339m2665M8218j7766M8339
$$ plain form
1356 4127 22490 -6175 55656 -53890 -30664 -104408 -8069 15558 20581 -29135 -21671 -75605
1344 -75605 -107754 -54248 -141937 -72846 -12915 13031 -73980 -64272 -60286 -62638 -29386 -77425
1332 -77425 -87426 -39602 -101699 -150100 -64002 -90868 -120120 599 -23413 -46532 -69725 -54867
1320 -54867 -3398 -90971 -47539 27435 -27913 -18053 -101706 -89945 -75544 -84036 -83204 -85045 -52935
1307 -52935 -16704 -39799 -86436 11931 61709 25319 -29660 -6611 10034 11363 -123746 -139958
1295 -139958 -99426 -6587 -35105 -90914 -84063 -87209 -87365 -73159 -99908 -85614 -13113 -8369 70543
1282 70543 -13305 -23151 -39381 -54007 -15171 -45686 -12498 -615 -64100 -63462 -78098 -60359
1270 -60359 7326 -12439 -149064 -73298 -115858 -43995 -15354 30625 -71729 -166395 -33719
$$ packed form
1356D127J8363k8665O1831j09546K3226p3744R6339K3627N023m9716P464n3934
1344g5605l2149N3506q7689O9091N9931K5946q7011R708L986k352L3252m8039
1332g7425j0001M7824o2097m8401Q6098k6866k9252J20719k4012k3119k3193J4858
1320e4867N1469q7573M3432P4974n5348R860q3653J1761J4401q492Q32j841L2110
1307e2935L6231k3095m6637R8367M9778l6390n4979K3049J6645J329j35109j6212
1295a39958M0532R2839k8518n5809O851l146j56J4206k6749J4294P2501M744P8912
1282G0543q3848r846j6230j4626L8836l0515L3188J1883o3485O38j4636J7739
1270f0359O7685j9765j36625P5766m2560P1863K8641M5979j02354r4666J32676
$$ plain form
1259 -33719 -19626 -61124 -62406 -11993 -52870 -99367 -128551 -39612 76963 3775 -31476 -83796
1247 -83796 -102149 -123332 -35295 -40013 -62891 -41211 -57618 -17233 -49060 -27235 -70943 -24962
1235 -24962 19311 -14763 -18268 -18736 -26168 -40047 -53998 -43970 -76922 -82290 -55976 -26758 -41033
1222 -41033 -111538 -75814 -35069 -38214 -57631 -80242 -105312 -98524 -94191 -50247 -3939 7089
1210 7089 -8412 -29510 -44995 -62899 -137112 -113945 -3178 -63061 -86091 -42113 -21711 32416
1198 32416 25602 53123 44918 -68684 -102510 -71250 -105781 -117099 -78584 -138934 -99544 -59816
1186 -59816 -60543 -77661 -80144 -44171 -34682 -96881 -62338 -32549 -33424 -79803 -71128 -24843 -68173
1173 -68173 -7935 33250 14897 13845 -44168 -35371 -90886 -12946 -1172 -51933 -27871 -8083
$$ packed form
1259c3719J4093m1498j282N0413m0877m6497k9184Q8939J16575p3188l5251n2320
1247h3796j8353k1183Q8037m718k2878K1680j6407M0385l1827K1825m3708M5981
1235b4962M4273l4074l505m68p432j3879j3951J0028l2952n368K6314K9218j4275
1222d1033p0505L5724M0745l145j9417k2611k5070O788M333M3944M6308J1028
1210G089j5501k1098j5485j7904p4213K3167J10767n9883k3030M3978K0402N4127
1198C2416o814K7521q205j13602l3826L1260l4531j1318L8515o0350L9390L9728
1186e9816p27j7118k483L5973R489o2199L4543K9789q75m6379Q675M6285m3330
1173f8173O0238M1185j8353j052n8013Q797n5515P7940J1774n0761K4062J9788
$$ plain form
1161 -8083 -29634 -3276 -36971 -37137 41662 71375 30848 -86940 -52164 -49168 -40796 -34088 -21683
1148 -21683 -41835 -77230 -55693 -107276 -153851 -94348 -22892 -14063 -7624 27685 89 50904
1136 50904 -46410 -75623 -32685 -31407 18081 -35091 -23724 -1576 15467 -43911 -68758 -59814
1124 -59814 -118715 -78478 -55880 -40849 8346 -9983 -15427 -64172 -85776 -79819 -16460 11830
1112 11830 29411 35206 34416 24707 -18740 -43844 13007 -10250 10495 27329 68504 41602 2057
1099 2057 -29706 -15430 660 -37824 -17292 15011 57243 -19942 -29548 -82363 -14805 22171
1087 22171 -8754 -62708 -133819 -122282 -52642 -12421 -87434 -125815 -134780 -32862 34267 12047
1075 12047 -4322 -33299 -51600 95 -33845 -70510 -60420 40243 15140 -70379 -91369 -100518
$$ packed form
1161h083k1551K6358l3695j66P8799K9713m0527j17788L4776K996Q372O708J2405
1148b1683k0152l5395K1537n1583m6575N9503P1456Q829O439L5309k7596N0815
1136E0904r7314k9213M2938J278M9488n3172J1367K2148J7043n9378k4847Q944
1124e9814n8901M0237K2598J5031M9195j8329n444m8745k1604N957O3359K8290
1112A1830J7581N795p90r709m3447k5104N6851k3257K0745J6834M1175k6902l9545
1099B057l1763J4276J6090l8484K0532L2303M2232p7185r606n2815O7558L6976
1087B2171l0925n3954p1111J1537O9640M0221p5013l8381q965J01918O7129k2220
1075A2047j6369k8977j8301N1695l3940l6665J0090J00663k5103q5519k0990r149
$$ plain form
1063 -100518 -153259 -164252 -17836 -14844 -14830 18342 -1443 -77756 -61135 -34353 -45017 -36272
1051 -36272 9946 14825 -47913 -33587 -5851 -32598 -46321 -53560 -45213 39697 -21337 -26186 70048
1038 70048 -69604 -84318 -72661 -61723 -54956 -1486 -16261 -25497 -8052 -28598 -3316 -5959
1026 -5959 -20649 15777 20732 1679 51373 46337 80025 71083 -6397 30971 30810 -11888 -42327
1013 -42327 -29927 -11166 -39479 -10519 -55241 -106400 -48077 -77356 -44903 -64971 -27649 -526
1001 -526 44502 28484 90681 26132 -5989 -50687 18989 72411 28822 -76019 -56949 -22902
989 -22902 -39042 32918 70802 83623 78383 70824 -3271 -22992 30087 50969 22604 -59752
977 -59752 -123991 -48770 31594 -756 -37172 -24019 -16196 -11419 -20849 46470 5341 28895 -40320
$$ packed form
1063a00518n2741j0993J46416K992J4L3172j9785p6313J6621K6782j0664Q745
1051c6272M6218M879o2738J4326K7736k6747j3723p239Q347Q4910o1034m849R6234
1038G0048j39652j4714J1657J0938O767N3470j4775r236J7445k0546K5282k643
1026e959j4690L6426M955j9053M9694n036L3688q942p7480L7368j61m2698l0439
1013d2327J2400J8761k8313K8960m4722n1159N8323k9279L2453k0068L7322K7123
1001e26M5028j6018O2197o4549l2121m4698O9676N3422m3589j04841J9070L4047
989b2902j6140P1960L7884J2821n240p559p4095j9721N3079K0882k8365q2356
977e9752o4239P5221Q0364l2350l6416J3153P823M777r430O7319m1129K3554o9215
$$ plain form
964 -40320 -18842 -9722 -26056 6326 -42401 -20489 23266 -37 84792 49927 41732 17854
952 17854 17403 -3432 17995 -72311 -46374 -855 3389 1913 -36056 38464 21737 -75791 -3202
939 -3202 29728 5174 -42006 838 14459 11119 -12574 36043 18849 -35834 -48941 -24860
927 -24860 -86214 2705 -19837 -696 -25891 -69530 -57212 2028 71769 18502 -19159 -51523
915 -51523 -21004 -36330 -93844 -166369 -79304 -65052 -5859 4240 32717 45553 9728 4581
903 4581 39213 12622 1253 9671 -55270 -40908 -40460 -39436 124413 93223 55474 -2825 37861
890 37861 -39314 -101934 -95474 -59419 23983 64392 72563 78717 36590 84892 26627 62654 45777
877 45777 51826 69581 23636 32605 31364 71430 106005 28538 10684 28026 10200 34694 32992
$$ packed form
964d0320K1478R120j6334L2382m8727K1912M3755k3303Q4829l4865q195k3878
952A7854m51k0835K1427r0306K5937M5519M244j476l7969P4520j6727r7528P2589
939c202L2930k4554m7180M2844J3621l340k3693M8617j7194n4683j3107K4081
927b4860o1354Q8919k2542J9141k5195m3639J2318N9240O9741n3267l7661l2364
915e1523L0519j5326n7514p2525Q7065J4252N9193J0099K8477J2836l5825n147
903D581L4632k6591j1369Q418o4941J4362M48J024J63849l1190l7749n8299M0686
890C7861p7175o2620O460L6055Q3402M0409Q171O154m2127M8302n8265L6027j6877
877D5777O049J7755m5945Q969j241M0066L4575p7467j7854J7342j7826K4494j702
$$ plain form
864 32992 83353 117615 72648 3318 -19525 -28232 30865 -4232 -24510 -81741 -30607 45454
852 45454 37158 14597 35329 60519 -14645 -1666 -33205 -85378 -72222 -52154 -7044 84014
840 84014 24038 -39569 -11911 -59544 -48579 -13787 -10565 -3844 -4891 7694 51688 82939 87342
827 87342 41126 -10296 12790 6495 -57769 -47375 -21528 -15744 -37 22269 17078 34194 50776
814 50776 -14102 -10102 -67248 -47738 38899 40873 60438 35065 33944 26994 -7221 -43201 28187
801 28187 -15238 -22083 -10604 25570 56748 57078 3397 35885 -37516 -17935 -36814 4892 57768
788 57768 -29776 76062 25856 1048 27173 51301 85644 50578 78832 22943 43005 62121
776 62121 88594 87639 60636 47258 17638 65055 55652 55921 61963 -25540 22609 78998 17528
$$ packed form
864C2992N0361L4262m4967o9330k2843q707N9097l5097k0278n7231N1134P6061
852D5454q296k2561K0732K5190p5164J2979l1539n2173J3156K0068M5110R1058
840H4014n9976o3607K7658m7633J0965L4792L222O721j047J2585M3994L1251M403
827H7342m6216n1422K3086o295o4264J0394K5847N784J5707K2306n191J7116J6582
814E0776o4878M000n7146J9510Q6637J974J9565k5373j121o950l4215l5980P1388
801B8187m3425o845J1479L6174L1178L30n3681L2488p3401J9581j8879M1706N2876
788E7768q7544J05838n0206k4808K6125K4128L4343l5066K8254n5889K0062J9116
776F2121K6473r55k7003j3378k9620M7417r403K69O042q7503M8149N6389o1470
$$ plain form
763 17528 23535 67557 162323 39736 54397 19556 7470 87369 65366 66971 -24626 -34202
751 -34202 12154 11082 46206 45875 -10677 5840 -113 14452 68176 118146 119506 94842 55679
738 55679 1257 75932 64199 61358 77769 28724 19676 70655 8482 53856 79617 -20358
726 -20358 4125 36899 75334 76329 8487 7889 -18560 98377 102017 95844 44687 40209 21443
713 21443 30596 55437 67201 48560 29876 51658 60655 58200 92362 119393 63677 -21162 -11414
700 -11414 43982 1199 -16499 4759 75954 95459 79113 96612 57246 -18053 12550 115848
688 115848 37651 84283 48727 -17917 1010 -30897 -57940 2965 52139 -35543 13765 26896
676 26896 50418 28966 66805 101572 89029 29483 74625 40001 82293 67337 83690 62853
$$ packed form
763A7528O007M4022R4766j22587J4661l4841j2086P9899k2003J605r1597r576
751c4202M6356j072L5124l31n6552J6517n953J4565N3724M9970J360k4664l9163
738E5679n4422P4675j1733k841J6411m9045r048N0979o2173M5374K5761r9975
726b0358K4483L2774L8435R95o7842n98k6449J16937L640o173n1157m478j8766
713B1443R153K4841J1764j8641j8684K1782Q997k455L4162K7031n5716q4839R748
700a1414N5396m2783j7698K1258P1195J9505j6346J7499l9366p5299L0603J03298
688A15848p8197M6632l5556o6644J8927l1907k7043O0905M9174q7682M9308J3131
676B6896K3522k1452L7839L4767j2543n9546M5142l4624M2292j4956J6353k0837
$$ plain form
664 62853 63805 67325 81857 59540 33947 12845 46443 39468 49450 26606 7835 27544 31568
651 31568 40799 43924 114458 120090 20765 17735 17373 90551 29678 58130 58285 48853 22384 -3315
637 -3315 18170 54958 69208 79279 16138 35414 62216 -10834 -20096 -4704 99587 40363
625 40363 -38346 10595 132571 117268 59040 99113 110426 12120 89524 -9829 -5501 -12096
613 -12096 -32473 39136 24907 -11647 22702 54037 77276 83026 145839 109105 73727 59993
601 59993 63787 99455 27952 53631 96975 152863 99781 100545 78385 74404 119824 58278 65900
588 65900 -7214 22799 17259 37056 69696 120822 140821 79310 30726 75574 41903 40963 77506
575 77506 83596 86620 87465 94535 86486 79644 64900 -15201 23750 87002 71323 100362 75407
$$ packed form
664F2853R52L520J4532k2317k5593k1102L3598o975R982k2844j8771J9709M024
651C1568R231L125P0534N632r9325l030l62P3178o0873K8452J55r432k6469k5699
637c315K1485L6788J4250J0071o3141J9276K6802p3050r262J5392J04291n9224
625D0363p8709M8941J21976j5303n8228M0073J1313r8306P7404r9353M328o595
613a2096k0377P1609j4229l6554L4349L1335K3239N750O2813l6734l5378j3734
601E9993L794L5668p1503K5679M3344N5888n3082P64k2160l981M5420o1546P622
588F5900p3114L0013n540J9797L2640N1126J9999o1511m8584M4848l3671r40L6543
575G7506O090L024Q45P070q049o842j4744q0101L8951O3252j5679K9039k4955
$$ plain form
562 75407 17826 55552 63637 71983 113213 1609 -18911 74848 73583 54094 48240 42644 81943
549 81943 150214 104786 83715 80861 75858 50833 115355 170966 117722 136392 131060 103596 99072
536 99072 55113 -35611 255 -40696 -21013 -8854 50529 15077 39884 86918 114468 154527
524 154527 107212 21016 -13828 16325 83109 77508 73090 9479 26380 3746 66215 120054
512 120054 19508 -2332 36718 141964 97359 73942 45997 128704 155285 176537 128451
501 128451 95567 63995 96657 62188 32920 -9044 50910 45476 33800 33899 15532 17593 88497
488 88497 82685 35947 89982 122447 103771 82749 86181 74585 147097 70461 168881 165942 91983
475 91983 55129 66388 105271 60364 53851 116398 144238 145320 46870 129873 153323 56541
$$ packed form
562G5407n7581L7726Q085Q346M1230j11604k0520R3759j265j9489n854n596L9299
549H1943O8271m5428k1071k854n003k5025O4522N5611n3244J8670n332k7464m524
536I9072m3959r0724L5866m0951J9683J2159N9383l5452K4807M7034K7550M0059
524A54527m7315q6196l4844L0153O6784n601m418o3611J6901k2634O2469N3839
512A20054j00546k1840L9050J05246m4605k3417k7945Q2707K6581K1252m8086
501A28451l2884l1572L2662l4469k9268m1964N9954n434j1676R9j8367K061P0904
488H8497n812m6738N4035L2465j8676k1022L432j1596P2512p6636R8420k939p3959
475I1983l6854J1259L8883m4907o513O2547K7840J082r8450Q3003K3450r6782
$$ plain form
463 56541 112916 104198 79613 133486 114658 121268 93571 150953 160347 69179 96147 113009 161240
450 161240 114216 85054 122616 76092 75464 67030 88077 87960 65081 145998 167472 98972 66394
437 66394 36794 36087 96680 35265 31511 105590 90101 125792 40232 77037 145113 62626 60754
424 60754 103217 63338 65939 69918 48411 71254 101228 71282 80736 35821 36980 83265 109333
411 109333 111596 39163 39526 75254 99997 94190 119947 89568 156412 207308 95192 26463
399 26463 70576 107312 77103 98896 95217 101442 10187 26715 134273 143421 122555 186423
387 186423 138224 144622 153083 147879 177891 182827 128691 21838 22148 43388 115952 112260 121999
374 121999 91430 127556 102878 66718 33208 33647 20841 64991 90977 41607 32908 71090
$$ packed form
463E6541N6375q718k4585N3873j8828O610k7697N7382R394r1168K6968J6862M8231
450A61240m7024k9162L7562m6524o28q434K1047j17k2879Q0917K1474o8500l2578
437F6394k9600p07O0593o1415l754P4079j5489L5691q5560L6805O8076q2487j872
424F0754M2463l9879K601L979k1507K2843K9974k9946R454m4915J159M6285K6068
411A09333K263p2433L63L5728K4743n807K5757l0379O6844N0896j12116o8729
399B6463M4113L6736l0209K1793l679O225r1255J6528J07558R148k0866O3868
387A86423m8199O398Q461n204L0012M936n4136j06853L10K1240P2564l692R739
374A21999l0569L6126k4678l6160l3510M39j2806M4150K5986m9370q699L8182
$$ plain form
362 71090 20425 73832 74660 77535 52399 118108 125762 106737 80344 114689 75957 50076 86948
349 86948 122469 152245 102093 167377 121590 141802 154781 103053 115327 16696 -26374 22211
337 22211 49540 100239 102790 125526 173660 122350 107577 124096 120611 14031 23267 119482
325 119482 97941 57710 31820 14717 57421 116362 62163 122601 138507 86234 61484 54243
313 54243 20667 97524 70450 96133 107648 106793 157274 76361 136439 124756 121342 121353 97371
300 97371 140853 144121 113882 110394 115358 187463 152583 156273 177710 221566 217065 153987 153610
287 153610 224113 170600 122296 105171 52423 80057 34040 116826 135533 156511 107874 143455
275 143455 121859 103982 86124 81136 86378 21528 59134 173403 116034 31577 105337 125963
$$ packed form
362G1090n0665N3407Q28K875k5136O5709P654j9025k6393L4345l8732k5881L6872
349H6948L5521K9776n0152O5284m5787K0212J2979n1728J2274r8631m3070M8585
337B2211K7329N0699K551K2736M8134n1310j4773J6519l485j06580R236R6215
325A19482k1541m0231k5890j7103M2704N8941n4199O0438J5906n2273k4750p241
313E4243l3576P6857k7074K5683J1515q55N0481q0913O0078j1683l414J1k3982
300I7371M3482L268l0239l488M964P2105l4880L690K1437M3856m501o3078l77
287A53610P0503n3513m8304j7125n2748K7634m6017Q2786J8707K0978m8637L5581
275A43455k1596j7877j7858m988N242o4850L7606J14269n7369q4457P3760K0626
$$ plain form
263 125963 6258 20269 75638 83691 111067 135505 154003 134471 136271 151761 104273 82135
251 82135 98100 80029 49570 33177 8640 26973 56593 38447 88952 108996 52767 42811
239 42811 67299 107578 121289 142189 174330 93448 117988 106551 53852 102150 65995 133427
227 133427 168561 103135 127304 171103 109346 101091 110651 133090 172577 177880 139098 97603
215 97603 100791 112330 80864 61740 95486 123218 120497 56240 40403 42560 57465 127130 107807
202 107807 33146 56189 104369 182909 172203 203313 131310 51379 110698 124475 124536 155412
190 155412 132614 120356 78905 80866 130075 94961 125571 137389 187529 87526 63141 131239
178 131239 99240 147238 145986 80902 125901 112176 102771 133848 130704 52023 38533 85311
$$ packed form
263A25963j19705J4011N5369Q053K7376K4438J8498j9532J800J5490m7488k2138
251H2135J5965j8071l0459j6393k4537J8333K9620j8146N0505K0044n6229r956
239D2811K4488M0279J3711K0900L2141q0882K4540j1437n2699M8298l6155O7432
227A33427L5134o5426K4169M3799o1757q255R560K2439L9487N303l8782m1495
215I7603L188J1539l1466j9124L3746K7732k721o4257j5837K157J4905O9665j9323
202A07807p4661K3043M8180P8540j0706L1110p2003p9931N9319J3777O1L0876
190A55412k2798j2258m1451J961M9209l5114L0610J1818N0140j00003k4385O8098
178A31239l1999M7998j252o5084M4999j3725r405L1077l144p8681j3490M6778
$$ plain form
166 85311 92443 136822 136084 134846 174462 183103 144158 119633 82143 50252 104137 164543 115639
153 115639 108354 100432 109711 34524 54629 48245 78909 24329 41382 85903 73934 49566 52923
140 52923 83056 66629 92839 110363 138439 135371 130015 159059 152937 117947 173236 112766 104771
127 104771 125729 140953 132700 67483 112466 181693 64188 55163 44862 -17040 48435 109910
115 109910 122148 101859 133577 113322 135221 164733 101914 84414 87628 111680 59554 77692
103 77692 85695 53132 155212 160742 158566 101357 145207 162926 77238 48875 94245 133861
91 133861 151545 129246 197867 138620 96274 115519 91276 129193 149978 182253 192786 129969
79 129969 122547 184544 142746 130094 65258 110655 113012 77824 92493 69363 142029 123485
$$ packed form
166H5311P132M4379p38j238L9616Q641l8945k4525l7490l1891N3885O0406m8904
153A15639p285p922R279p5187K0105o384L0664n4580J7053M4521j1969k4368L357
140E2923L0133j6427K6210J7524K8076l068n356K9044o122l4990N5289o0470p995
127A04771K0958J5224q253o5217M4983O9227j17505r025j0301o1902O5475O1475
115A09910J2238k0289L1718k0255K1899K9512o2819j7500L214K4052n2126J8138
103G7692Q003l2563J02080N530k176n7209M3850J7719q5688k8363M5370L9616
91A33861J7684k2299O8621n9247m2346J9245k4243L7917K0785L2275J0533o2817
79A29969p422O1997m1798j2652o4836M5397K357l5188J4669k3130P2666j8544
$$ plain form
67 123485 118325 109392 75310 75103 136206 102328 79672 79753 81351 117777 88079 101468 117389 119182
53 119182 111231 101939 80493 101119 118717 177447 150697 135160 97082 94697 129763 142951 164950
40 164950 138745 136878 145698 101272 92521 135523 130650 139884 127006 102964 101973 136568 159207
27 159207 120903 163129 158706 155145 105931 91535 124050 70915 59308 14835 81567 77780 76276
14 76276 139315 143125 122808 155921 134636 102140 145939 121966 99162 63507 126004 132593 116513
1 116513 100021
0 100021
$$ packed form
67A23485n160q933l4082k07O1103l3878k2656Q1J598L6426k9698J3389J5921J793
53A19182p951r292k1446K0626J7598N8730k6750j5537l8078k385L5066J3188K1999
40A64950k6205j867Q820m4426q751M3002m873R234j2878k4042r91L4595K2639
27A59207l8304M2226m423l561m9214j4396L2515n3135j1607m4473O6732l787j504
14G6276O3039L810k0317L3113k1285l2496M3799k3973k2804l5655O2497O589j6080
1A16513j6492
0A00021
$$ Imaginary data points
##PAGE= N=2
##DATA TABLE= (X++(I..I)), XYDATA
$$ plain form
16383 -3673846 -3662126 -3609879 -3500990 -3426628 -3407232 -3333919 -3295408 -3247474 -3172534 -3115880 -3092448
16372 -3092448 -3065515 -2988709 -2954971 -2961971 -2868387 -2785450 -2718157 -2699180 -2620014 -2545422 -2498155
16361 -2498155 -2476145 -2439354 -2410870 -2332290 -2308278 -2246006 -2223742 -2205307 -2204093 -2130396 -2042660
16350 -2042660 -2003054 -1943875 -1836421 -1804916 -1798900 -1771303 -1762483 -1618560 -1550846 -1488185 -1414750
16339 -1414750 -1439682 -1414828 -1343284 -1322351 -1273638 -1244629 -1229499 -1163933 -1080337 -1021618 -968250
16328 -968250 -957440 -898584 -847690 -805249 -673873 -652333 -639342 -614088 -545678 -538884 -504396
16317 -504396 -431936 -362067 -369567 -330509 -231067 -213713 -193295 -99946 -32572 9884 -20441 46376
16305 46376 149262 159723 182295 224400 220142 262949 351141 421525 427559 495889 510895 584279
$$ packed form
16383c673846J1720N2247J08889P4362J9396P3313L8511M7934P4940N6654K3432
16372c092448K6933P6806L3738p000R3584Q2937O7293J8977P9166P4592M7267
16361b498155K2010L6791K8484P8580K4012O2272K2264J8435J214P3697Q7736
16350b042660L9606N9179J07454L1505O016K7597Q820J43923O7714O2661P3435
16339a414750k4932K4854P1544K0933M8713K9009J5130O5566Q3596N8719N3368
16328i68250J0810N8856N0894M2441J31376K1540J2991K5254O8410O794L4488
16317e04396P2460O9869p500L9058R9442J7354K0418R3349O7374M2456l0325O6817
16305D6376J02886J0461K2572M2105m258M2807Q8192P0384O034O8330J5006P3384
$$ plain form
16293 584279 607409 656256 689304 706340 738399 769144 872366 881434 977520 1010450 956793
16282 956793 978167 1069596 1076209 1116437 1177323 1159357 1190501 1223122 1228213 1287315 1389943 1435454
16270 1435454 1411987 1490055 1506440 1577713 1544676 1559553 1533983 1578678 1663953 1651831 1719294
16259 1719294 1752502 1830852 1899188 1927809 1986788 1904580 1893409 1982585 1975879 2003818 2115387
16248 2115387 2157048 2163374 2166533 2218455 2219241 2209988 2297443 2347536 2345165 2344316 2314842 2412486 2426954
16235 2426954 2455130 2511167 2560095 2636171 2574891 2581183 2600547 2677838 2748707 2725492 2728887 2740134
16223 2740134 2744233 2794425 2841100 2866126 2908187 2875864 2919037 2944432 3015046 3016507 3084739 3056573
16211 3056573 3013279 3098991 3093466 3102439 3077807 3073708 3198808 3230132 3190424 3208925 3288798 3330574
$$ packed form
16293E84279K3130M8847L3048J7036L2059L0745J03222R068R6086L2930n3657
16282I56793K1374R1429O613M0228O0886j7966L1144L2621N091N9102J02628M5511
16270A435454k3467P8068J6385P1273l3037J4877k5570M4695Q5275j2122O7463
16259A719294L3208P8350O8336K8621N8979q2208j1171Q9176o706K7939J11569
16248B115387M1661O326L159N1922P86r253Q7455N0093k371q49k9474R7644J4468
16235B426954K8176N6037M8928P6076o1280O292J9364P7291P0869k3215L395J1247
16223B740134M099N0192M6675K5026M2061l2323M3173K5395P0614J461O8232k8166
16211C056573m3294Q5712n525Q973k4632m099J25100L1324l9708J8501P9873M1776
$$ plain form
16199 3330574 3246787 3233654 3284823 3341135 3359652 3335959 3351694 3355383 3411177 3368413 3375860 3494589
16187 3494589 3481540 3489926 3508697 3561121 3565225 3590268 3648654 3688550 3672298 3606076 3649686 3669935
16175 3669935 3601993 3680137 3637263 3626610 3684777 3723955 3720305 3624063 3711919 3778747 3719684
16164 3719684 3791842 3841702 3820816 3787846 3735433 3730500 3811325 3855853 3859482 3808066 3858890 3882625
16152 3882625 3906399 3869037 3833270 3825497 3865124 3901237 3923640 3992079 3920787 3926804 3914380 3919662
16140 3919662 4006108 4054190 4007084 3948402 3992155 4087598 4040124 4075386 4049574 4014281 4077321
16129 4077321 4145929 4057055 4040483 4126383 4112340 4138489 4154429 4185841 4142863 4193028 4175170
16118 4175170 4132020 4127272 4142680 4181605 4225892 4168072 4203242 4195511 4148538 4183270 4223578 4195564
$$ packed form
16199C330574q3787j3133N1169N6312J8517k3693J5735L689N5794m2764P447J18729
16187C494589j3049Q386J8771N2424M104K5043N8386L9896j6252o6222M3610K0249
16175C669935o7942P8144m2874j0653N8167L9178l650r6242Q7856O6828n9063
16164C719684P2158M9860k0886l2970n2413m933Q0825M4528L629n1416N0824K3735
16152C882625K3774l7362l5767p773L9627L6113K2403O8439p1292O017j2424N282
16140C919662Q6446M8082m7106n8682M3753R5443m7474L5262k5812l5293O3040
16129D077321O8608q8874j6572Q5900j4043K6149J5940L1412m2978N0165j7858
16118D175170m3150m748J5408L8925M4287n7820L5170p731m6973L4732M0308k8014
$$ plain form
16106 4195564 4210608 4233150 4240560 4268351 4223886 4203061 4186782 4208247 4297157 4271404 4249974
16095 4249974 4276481 4256319 4199958 4208489 4152144 4162060 4194028 4245017 4262440 4210036 4247307 4328552
16083 4328552 4303888 4282794 4200979 4262627 4299741 4310315 4333753 4267407 4216545 4225661 4328262
16072 4328262 4265608 4272870 4244050 4328912 4354861 4314533 4264151 4364027 4432848 4327518 4289136
16061 4289136 4329771 4324361 4356870 4411504 4334594 4367809 4395738 4332326 4296175 4310196 4304246 4329272
16049 4329272 4327314 4338027 4326558 4309261 4368152 4345107 4328100 4350270 4424666 4426106 4347822 4386810
16037 4386810 4403418 4416380 4449562 4415770 4449666 4405609 4390183 4355929 4373191 4327868 4347597
16026 4347597 4325795 4327170 4313535 4319410 4344245 4385779 4358030 4352917 4384379 4385816 4383846 4347114
$$ packed form
16106D195564J5044K2542P410K7791m4465k0825j6279K1465Q8910k5753k1430
16095D249974K6507k0162n6361Q531n6345R916L1968N0989J7423n2404L7271Q1245
16083D328552k4664k1094q1815O1648L7114J0574K3438o6346n0862R116J02601
16072D328262o2654P262k8820Q4862K5949m0328n0382R9876O8821j05330l8382
16061D289136M0635n410L2509N4634p6910L3215K7929o3412l6151J4021n950K5026
16049D329272j958J0713j1469j7297N8891k3045j7007K2170P4396J440p8284L8988
16037D386810J6608J2962L3182l3792L3896m4057j5426l4254J7262m5323J9729
16026D347597k1802J375j3635N875K4835M1534k7749n113L1462J437j970l6732
$$ plain form
16014 4347114 4353448 4370975 4430788 4402156 4355004 4341907 4373626 4368245 4368471 4420283 4401458 4413936
16002 4413936 4447902 4382776 4359012 4366501 4325187 4370794 4440631 4400957 4343688 4406927 4403204 4360056
15990 4360056 4380035 4418949 4357653 4397218 4316215 4264415 4345501 4356921 4437531 4402501 4423693
15979 4423693 4422561 4349486 4359371 4371152 4364139 4365640 4363957 4361879 4340008 4412482 4379050 4456379
15967 4456379 4486619 4442621 4462681 4475164 4449653 4408771 4399217 4420751 4462653 4469219 4479045 4425553
15955 4425553 4463378 4392236 4367037 4433576 4345878 4354069 4469302 4468009 4445393 4423848 4410876
15944 4410876 4448841 4426343 4406406 4433095 4468622 4456528 4438531 4369858 4368958 4459597 4397366 4391500
15932 4391500 4353320 4320621 4370962 4428230 4482708 4481199 4478513 4524674 4465635 4409594 4472328 4429914
$$ packed form
16014D347114O334J7527N9813k8632m7152j3097L1719n381K26N1812j8825J2478
16002D413936L3966o5126k3764P489m1314M5607O9837l9674n7269O3239l723m3148
15990D360056J9979L8914o1296L9565q1003n1800Q1086J1420Q0610l5030K1192
15979D423693j132p3075R885J1781p013J501j683k078k1871P2474l3432P7329
15967D456379L0240m3998K0060J2483k5511m0882r554K1534M1902O566R826n3492
15955D425553L7825p1142k5199O6539q7698Q191J15233j293k2616k1545j2972
15944D410876L7965k2498j9937K6689L5527j2094j7997o8673r00R0639o2231n866
15932D391500l8180l2699N0341N7268N4478j509k686M6161n9039n6041O2734m2414
$$ plain form
15920 4429914 4415257 4409998 4407432 4386786 4394489 4424109 4488712 4374394 4409802 4429995 4399204 4410189
15908 4410189 4427676 4398762 4490471 4499698 4498723 4540476 4475940 4450360 4425497 4486045 4474576 4481292
15896 4481292 4461227 4409923 4461779 4422366 4447823 4458867 4350322 4389725 4423222 4419420 4482949
15885 4482949 4430848 4390416 4350334 4363126 4398956 4399153 4405009 4397290 4368516 4456301 4394982 4353378
15873 4353378 4407947 4446664 4445450 4432266 4460294 4407126 4431142 4491472 4481353 4486378 4471750 4397006
15861 4397006 4443359 4463395 4465305 4417228 4407659 4364445 4340989 4386738 4465035 4474262 4532761 4523788
15849 4523788 4509935 4477126 4463731 4461720 4453756 4490471 4446312 4369776 4359981 4430611 4411989 4420038
15837 4420038 4419051 4398800 4375489 4381270 4308722 4368275 4468887 4515178 4525703 4483564 4492113 4414942
$$ packed form
15920D429914j4657n259k566k0646P703K9620O4603j14318L5408K0193l0791J0985
15908D410189J7487k8914R1709R227r75M1753o4536k5580k4863O0548j1469O716
15896D481292k0065n1304N1856l9413K5457J1044j08545L9403L3497l802O3529
15885D482949n2101m0432m0082J2792L5830J97N856p719k8774Q7785o1319m1604
15873D353378N4569L8717j214j3184K8028n3168K4016O0330j0119N025j4628p4744
15861D397006M6353K0036J910m8077r569m3214k3456M5749P8297R227N8499q973
15849D523788j3853l2809j3395k011p964L6715m4159p6536r795P0630j8622Q049
15837D420038r87k0251k3311N781p2548N9553J00612M6291J0525m2139Q549p7171
$$ plain form
15825 4414942 4524978 4524274 4545412 4506200 4426014 4478068 4532246 4496823 4508813 4460679 4529317
15814 4529317 4499005 4458030 4456355 4376510 4497395 4495621 4441378 4451450 4450178 4465908 4449602 4414031
15802 4414031 4441367 4508891 4508770 4503759 4457745 4456633 4470983 4406576 4424838 4456816 4469766 4496655
15790 4496655 4460958 4449799 4524896 4511371 4534621 4532502 4469616 4442275 4401851 4464735 4465294 4413881
15778 4413881 4442464 4474320 4395367 4444982 4501753 4498685 4539810 4514461 4494115 4451364 4429973
15767 4429973 4492449 4519973 4486815 4455794 4570779 4543337 4509339 4576283 4473078 4503207 4550688
15756 4550688 4550337 4572767 4583540 4576224 4489809 4479587 4469680 4436453 4512922 4528125 4538209 4526280
15744 4526280 4539756 4513594 4467020 4476160 4527210 4489481 4519751 4505079 4505543 4593462 4572687 4601958
$$ packed form
15825D414942J10036p04K1138l9212q0186N2054N4178l5423J1990m8134O8638
15814D529317l0312m0975j675p9845J20885j774n4243J0072j272J5730j6306l5571
15802D414031K7336O7524j21n011m6014j112J4350o4407J8262L1978J2950K6889
15790D496655l5697j1159P5097j3525K3250k119o2886k7341m0424O2884N59n1413
15778D413881K8583L1856p8953M9615N6771l068M1125k5349k0346m2751k1391
15767D429973O2476K7524l3158l1021J14985k7442l3998O6944j03205L0129M7481
15756D550688l51K2430J0773p316q6415j0222r907l3227P6469J5203J0084j1929
15744D526280J3476k6162m6574R140N1050l7729L0270j4672M64Q7919k0775K9271
$$ [...]
##END NTUPLES=NMR SPECTRUM
##END=
