##TITLE=1H_CA-8887-8
 CDCl3, 8 sc, 
 5.07.2021
##JCAMPDX= 6.0         $$ Bruker NMR JCAMP-DX V2.0
##DATA TYPE= NMR SPECTRUM
##DATA CLASS= NTUPLES
##ORIGIN= UXNMR, Bruker Analytische Messtechnik GmbH
##OWNER= root
$$ XWIN-NMR		Version 3.5
$$ Mon Jul  5 10:57:09 2021 Russian Standard Time (UT+4h)  she@DPX200
##.OBSERVE FREQUENCY= 200.131506
##.OBSERVE NUCLEUS= ^1H
##.ACQUISITION MODE= SIMULTANEOUS
##.ACQUISITION SCHEME= undefined
##.AVERAGES= 8
##.DIGITISER RES= 18
##SPECTROMETER/DATA SYSTEM= spect
##.PULSE SEQUENCE= zg30
##.SOLVENT NAME= CDCl3
##.SHIFT REFERENCE= (INTERNAL, CDCl3, 0, 17.5228)
##AUDIT TRAIL= $$ (NUMBER, WHEN, WHO, WHERE, WHAT)
$$ ##TITLE= Audit trail, XWIN-NMR		Version 3.5
$$ ##JCAMPDX= 5.01
$$ ##ORIGIN= Bruker BioSpin GmbH
$$ ##OWNER= she
$$ F:/spectra/data/she/nmr/H-F/1/pdata/1/auditp.txt
$$ ##AUDIT TRAIL=  $$ (NUMBER, WHEN, WHO, WHERE, WHAT)
(   1,<2021-07-05 10:55:35.56 +0400>,<she>,<DPX200>,
      <created by zg, POWCHK disabled, PULCHK disabled
       configuration hash MD5:
       00 E9 B6 7A A2 85 ED C7 34 08 36 98 17 FE 4E 26
       data hash MD5: 16K
       0E 7F 43 B4 0A 26 B2 3F E7 27 DE 9B 78 75 12 F7>)
(   2,<2021-07-05 10:55:39.23 +0400>,<she>,<DPX200>,
      <Start of raw data processing
       efp BC_mod = 2 LB = 0.24 FT_mod = 6 PKNL = 1 PHC0 = -12070.26 PHC1 = 8.00099 SI = 16K 
       data hash MD5: 16K
       AD 5E 53 0B 0D 9A F5 0F 78 66 F2 58 BD 96 7C 35>)
(   3,<2021-07-05 10:55:59.20 +0400>,<she>,<DPX200>,
      <pk PHC0 = -2.997095 PHC1 = 4.800001 
       data hash MD5: 16K
       AE 77 35 49 9A 33 C0 4F C2 28 E6 99 2E F5 F7 5B>)
(   4,<2021-07-05 10:56:04.12 +0400>,<she>,<DPX200>,
      <abs ABSG = 5 
       data hash MD5: 16K
       D6 F6 60 61 0E 05 AB 76 8C FD 83 0F 9C F0 D9 1C>)
$$ ##END=
$$ 
$$ hash MD5
$$ FA E9 9F 9F 07 30 CB 69 BE 76 E7 72 81 A8 3E 7A
##$RELAX= 
##$RELAX= 
##$RELAX= 
##$RELAX= 
##$RELAX= 
##$RELAX= 
$$ Bruker specific parameters
$$ --------------------------
##$DU= <F:/spectra>
##$EXPNO= 1
##$NAME= <H-F>
##$PROCNO= 1
##$TYPE= <nmr>
##$USER= <she>
##$AMP= (0..31)
100 100 100 100 100 100 100 100 100 100 100 100 100 100 100 100 100 100 
100 100 100 100 100 100 100 100 100 100 100 100 100 100 
##$AQSEQ= 0
##$AQ_mod= 1
##$AUNM= <au_zg>
##$AUTOPOS= <>
##$BF1= 200.13
##$BF2= 200.13
##$BF3= 200.13
##$BF4= 200.13
##$BF5= 200.13
##$BF6= 200.13
##$BF7= 200.13
##$BF8= 200.13
##$BYTORDA= 1
##$CFDGTYP= 0
##$CFRGTYP= 5
##$CHEMSTR= <none>
##$CNST= (0..31)
1 1 145 1 1 1 1 1 1 1 1 1 1 1 1 1 1 1 1 1 1 1 1 1 1 1 1 1 1 1 1 1 
##$CPDPRG= <>
##$CPDPRG1= <>
##$CPDPRG2= <>
##$CPDPRG3= <>
##$CPDPRG4= <mlev>
##$CPDPRG5= <mlev>
##$CPDPRG6= <mlev>
##$CPDPRG7= <mlev>
##$CPDPRG8= <mlev>
##$CPDPRGB= <>
##$CPDPRGT= <>
##$D= (0..31)
0 1.2 0 0 0 0 0 0 0 0.06 0 0.03 0 0 0 0 0.0002 0 0 0 0 0 0 0 0 0 0 0 0 
0 0 0 
##$DATE= 1625468135
##$DBL= (0..7)
120 120 120 120 120 120 120 120 
##$DBP= (0..7)
150 150 150 150 150 150 150 150 
##$DBP07= 0
##$DBPNAM0= <>
##$DBPNAM1= <>
##$DBPNAM2= <>
##$DBPNAM3= <>
##$DBPNAM4= <>
$$ [...]
##$SUBNAM3= <"">
##$SUBNAM4= <"">
##$SUBNAM5= <"">
##$SUBNAM6= <"">
##$SUBNAM7= <"">
##$SUBNAM8= <"">
##$SUBNAM9= <"">
##$SW= 20.0188882624521
##$SWIBOX= (0..15)
0 0 2 0 0 0 0 0 0 0 0 0 0 0 0 0 
##$SW_h= 4006.41025641026
##$TD= 16384
##$TD0= 1
##$TE= 0
##$TE2= 300
##$TE3= 300
##$TEG= 300
##$TL= (0..7)
0 120 120 120 120 120 120 120 
##$TP= (0..7)
150 150 150 150 150 150 150 150 
##$TP07= 0
##$TPNAME0= <>
##$TPNAME1= <>
##$TPNAME2= <>
##$TPNAME3= <>
##$TPNAME4= <>
##$TPNAME5= <>
##$TPNAME6= <>
##$TPNAME7= <>
##$TPOAL= (0..7)
0.5 0.5 0.5 0.5 0.5 0.5 0.5 0.5 
##$TPOFFS= (0..7)
0 0 0 0 0 0 0 0 
##$TUNHIN= 0
##$TUNHOUT= 0
##$TUNXOUT= 0
##$USERA1= <user>
##$USERA2= <user>
##$USERA3= <user>
##$USERA4= <user>
##$USERA5= <user>
##$V9= 5
##$VALIST= <valist>
##$VCLIST= <CCCCCCCCCCCCCCC>
##$VD= 0
##$VDLIST= <DDDDDDDDDDDDDDD>
##$VPLIST= <PPPPPPPPPPPPPPP>
##$VTLIST= <TTTTTTTTTTTTTTT>
##$WBST= 1024
##$WBSW= 4
##$XGAIN= (0..3)
0 0 0 0 
##$XL= 0
##$YL= 0
##$YMAX_a= 339604
##$YMIN_a= -232447
##$ZGOPTNS= <>
##$ZL1= 120
##$ZL2= 120
##$ZL3= 120
##$ZL4= 120
##$ABSF1= 17.6474
##$ABSF2= -2.371641
##$ABSG= 5
##$ABSL= 3
##$ALPHA= 0
##$AQORDER= 0
##$ASSFAC= 0
##$ASSFACI= 0
##$ASSFACX= 0
##$ASSWID= 0
##$AUNMP= <proc_1d>
##$AZFE= 0.1
##$AZFW= 0.1
##$BCFW= 0
##$BC_mod= 2
##$BYTORDP= 0
##$COROFFS= 0
##$CY= -3
##$DATMOD= 1
##$DC= 0
##$DFILT= <>
##$DTYPP= 0
##$F1P= 0
##$F2P= 0
##$FCOR= 1
##$FTSIZE= 16384
##$FT_mod= 6
##$GAMMA= 0
##$GB= 0
##$INTBC= 1
##$INTSCL= 1.334414e-10
##$ISEN= 128
##$LB= 0.24
##$LEV0= 0
##$LPBIN= 0
##$MAXI= 10000
##$MC2= 0
##$MEAN= 0
##$ME_mod= 0
##$MI= 1.114404
##$NCOEF= 0
##$NC_proc= -7
##$NLEV= 6
##$NOISF1= 3.799351
##$NOISF2= 2.8
##$NSP= 0
##$NTH_PI= 0
##$NZP= 0
##$OFFSET= 17.52277
##$PC= 1
##$PHC0= -12073.26
##$PHC1= 12.80099
##$PH_mod= 1
##$PKNL= yes
##$PPARMOD= 0
##$PSCAL= 0
##$PSIGN= 0
##$REVERSE= no
##$SF= 200.130002374287
##$SI= 16384
##$SIGF1= 3
##$SIGF2= 2
##$SINO= 5.538805
##$SIOLD= 16384
##$SREGLST= <1H.CDCl3>
##$SSB= 0
##$STSI= 16384
##$STSR= 0
##$SW_p= 4006.41025641026
##$SYMM= 0
##$S_DEV= 0
##$TDeff= 16384
##$TDoff= 0
##$TI= <>
##$TILT= no
##$TM1= 0
##$TM2= 0
##$TOPLEV= 0
##$USERP1= <user>
##$USERP2= <user>
##$USERP3= <user>
##$USERP4= <user>
##$USERP5= <user>
##$WDW= 1
##$XDIM= 16384
##$YMAX_p= 519883067
##$YMIN_p= -308708
$$ End of Bruker specific parameters
$$ ---------------------------------
##NTUPLES= NMR SPECTRUM
##VAR_NAME=  FREQUENCY,     SPECTRUM/REAL,   SPECTRUM/IMAG
##SYMBOL=    X,             R,               I
##VAR_TYPE=  INDEPENDENT,   DEPENDENT,       DEPENDENT
##VAR_FORM=  AFFN,          ASDF,            ASDF
##VAR_DIM=   16384,         16384,           16384
##UNITS=     HZ,            ARBITRARY UNITS, ARBITRARY UNITS
##FACTOR=    0.24454680195387, 1,            1
##FIRST=     3506.83198729042, 0,            0
##LAST=      -499.578269119835, 0,           0
##MIN=       -499.578269119835, -308708,     0
##MAX=       3506.83198729042, 519883067,    0
$$ Real data points
##PAGE= N=1
##DATA TABLE= (X++(R..R)), XYDATA
$$ [...]
5499B290564J23445N3467N8654k0888k3120k4347K5541J3067J24323K7799P330
5488B655835J0588n2903P0867M5244M8422O0151r584N3764k6219L4666N6178l3607
5476B913402O0787o4451M6864R1360p338p8467q6348J43698K9588k6713P0010
5465C092392J0095J8101L8009J8717P0585R574R4641K3913M8409N6326O7387j2468
5453C535681R019N6300P8187M927M1855N6818N6809J751Q218M2345o455R0045
5441C975500Q2109l333K4581M3584O7055J20706O1839k088R4957L361J3483L3534
5429D515288J75160J51932L0847N1247J91582J49685J79587R7823N2680N6429
5419E652260N3111J98828J28751J11843R9104j0525O0636J40904P1640J25803
$$ y = [2290564, 2414009, 2467476, 2526130, 2505242, 2482122, 2457775, 2483316, 2496383, 2620706, 2648505, 2655835, 2666423, 2613520, 2684387, 2729631, 2778053, 2838204, 2828620, 2882384, 2856165, 2890831, 2947009, 2913402, 2974189, 2909738, 2956602, 3047962, 3040624, 2962157, 2875809, 3019507, 3049095, 3022382, 3092392, 3102487, 3120588, 3158597, 3177314, 3247899, 3257473, 3352114, 3376027, 3424436, 3480762, 3548149, 3535681, 3544700, 3601000, 3679187, 3684114, 3725969, 3782787, 3839596, 3841347, 3849565, 3891910, 3885455, 3975500, 4057609, 4054276, 4078857, 4122441, 4189496, 4310202, 4372041, 4369953, 4464910, 4468271, 4481754, 4515288, 4690448, 4842380, 4873227, 4924474, 5116056, 5265741, 5445328, 5543151, 5595831, 5652260, 5705371, 5904199, 6032950, 6144793, 6243897, 6233372, 6294008, 6434912, 6506552, 6632355]
5409F632355P4413J04396J29868R6606J30961K43776J12390R0923J54786J97628
5399G968102J75399J71453M3235J91036K09110K24852K49943K28776O8906J98233
5389I729045J52866K05023J08573J86357J56033K65181K39091K80524K61846K68021
5379A1852560K12987K12614K29524L11723L82509L36022L37252M18505L74526
5370A4668222M15340M56838N55156N42166N55432O60374P03690P45192O99825
5361B0002235R71621R91429R44600J121355J266764J260634J494800J665864J730813
5352C1450115K096549K402793K694670L040069L407116L803380M197553M564159
5344E7656404M878063M737684M292274L425269K066036P96803m36896j425839
$$ y = [6632355, 6706768, 6811164, 6941032, 7037638, 7168599, 7412375, 7524765, 7615688, 7770474, 7968102, 8143501, 8314954, 8358189, 8549225, 8758335, 8983187, 9233130, 9461906, 9530812, 9729045, 9881911, 10086934, 10195507, 10381864, 10537897, 10803078, 11042169, 11322693, 11584539, 11852560, 12065547, 12278161, 12507685, 12819408, 13201917, 13537939, 13875191, 14293696, 14668222, 15083562, 15540400, 16095556, 16637722, 17193154, 17853528, 18557218, 19302410, 20002235, 20973856, 21965285, 22909885, 24031240, 25298004, 26558638, 28053438, 29719302, 31450115, 33546664, 35949457, 38644127, 41684196, 45091312, 48894692, 53092245, 57656404, 62534467, 67272151, 71564425, 74989694, 77055730, 77852533, 77415637, 75989798]
5336G5989798j924251j944412j691234j148043m96051K38787Q84373J802226K449959
5327G4161152L239939L950589M532796M929276N078326M489699L112707N67702
5319A04062186k377879m786696o329005o979288o984787o573463n905107n190394
5311E8935567m513504l982833l433386k959407k613426k323957k090143j690947
5303C5327964j466710j402227j227486r61115q44435q09045o56300m47570m31648
5294B7081428m13838j85503k73589j71183k32248j56525o5553K0943M5367J28722
5284B5778021J68766K68367L37030L69183L86877L73532L94499L58030K89864
5275B8724169R5501P8101N6217j1817J63610K39348K65815L53475M86003N60753
$$ y = [75989798, 74065547, 72121135, 70429901, 69281858, 68785807, 69024594, 69908967, 71711193, 74161152, 77401091, 81351680, 85884476, 90813752, 95892078, 100381777, 103494484, 104062186, 101684307, 96897611, 90568606, 83589318, 76604531, 70031068, 64125961, 58935567, 54422063, 50439230, 47005844, 44046437, 41433011, 39109054, 37018911, 35327964, 33861254, 32459027, 31231541, 30270426, 29425991, 28616946, 27960646, 27513076, 27081428, 26667590, 26482087, 26208498, 26037315, 25805067, 25648542, 25582989, 25603932, 25649299, 25778021, 25946787, 26215154, 26552184, 26921367, 27308244, 27681776, 28076275, 28434305, 28724169, 28819670, 28897771, 28953988, 28942171, 29105781, 29345129, 29610944, 29964419, 30450422, 31011175]
5265C1011175N91062P58158P62048O94572P10805M88126J70988J98322R5624K3581
5255C5504461M9746M7764J18016K01382J67951L61298L97333N34720N26959N84270
5245C8493900L94398K16296J63099J4487j57143k39248j37097j75578k13212J816
5235C8361718l2692L7986K12505L11982K56065L68259K51389L7524n3856l29562
5225C9421318m64847o19367o76433p02376p52273o66920o64674n48236m69418
5216C3856774l53784j76106j24420j1823m7216J73j56024l42536m26779m90579
5206C1727680n85328p52333p13197p08161q35907o76264n87217n90507m73929
5197B5804837m70127l17542k62347j34321j00218j50680k8491j52314j86545k05222
$$ y = [31011175, 31602237, 32360395, 33122443, 33817015, 34527820, 35015946, 35186934, 35385256, 35480880, 35504461, 35554207, 35601971, 35719987, 35921369, 36089320, 36450618, 36847951, 37382671, 37909630, 38493900, 38888298, 39104594, 39267693, 39282180, 39125037, 38885789, 38748692, 38573114, 38359902, 38361718, 38329026, 38367012, 38579517, 38891499, 39147564, 39515823, 39767212, 39804736, 39750880, 39421318, 38956471, 38337104, 37660671, 36958295, 36206022, 35539102, 34874428, 34326192, 33856774, 33502990, 33326884, 33202464, 33190641, 33143425, 33143598, 32987574, 32645038, 32218259, 31727680, 31142352, 30390019, 29676822, 28968661, 28132754, 27456490, 26869273, 26278766, 25804837, 25334710, 25017168, 24754821, 24620500, 24520282, 24369602, 24341111, 24188797, 24002252, 23797030]
5187B3797030k22661k44833k16814l44640l08520j53608k34267j33709j47399
5178B1790579m3410r8083n0162q0333p1391j0189J1356R4261R0355K6261n8204
5167B1601040L6140M8855J08057K8606P5603P4998K5088R0479N8882M7109L6219
5156B2231076L8123J96196J20346J39370J50034O8478J73140J39940J87920K18783
5146B3663406J36373J21784J15715J33585J78260J63242J93258J49096J50425
5137B5005144K38466K37308J54130J47271K65464K37378J98982J81616J98532
5128B6864291K47128K41398J58176J98001K43786K33342K62327P3577K34860K53591
5118B9010477K16617K09541K06813K45351K07672K05187K07985J75580K12358
$$ y = [23797030, 23574369, 23329536, 23112722, 22768082, 22459562, 22305954, 22071687, 21937978, 21790579, 21747169, 21649086, 21598924, 21518591, 21447200, 21437011, 21448367, 21542628, 21632983, 21659244, 21601040, 21637180, 21686035, 21794092, 21822698, 21898301, 21973299, 21998387, 22088866, 22147748, 22194857, 22231076, 22269199, 22465395, 22585741, 22725111, 22875145, 22943623, 23116763, 23256703, 23444623, 23663406, 23799779, 23921563, 24037278, 24170863, 24349123, 24512365, 24705623, 24854719, 25005144, 25243610, 25480918, 25635048, 25782319, 26047783, 26285161, 26484143, 26665759, 26864291, 27111419, 27352817, 27510993, 27708994, 27952780, 28186122, 28448449, 28522026, 28756886, 29010477, 29227094, 29436635, 29643448, 29888799, 30096471, 30301658, 30509643, 30685223, 30897581]
5109C0897581K45674K45674J59598J00143K32865J03382J28673K18045J61735
5100C2493370J17904J34233J91425J51407J40588J98541J23954J24005N1565K05837
5090C3932829O5824J16091O1033K803o095P5400J38951M6457n667N6534N4515
5079C4538675M3305K3339j2650J4749j6841q995J421j073q5161l8742k9035j7256
5067C4411736o8848l2096j60611p8403j08651j03335m3194j77755j23954j79288
5057C3335601k22911j54665k45296k22345k09877k54167k01067j26135k00047
5048C1499091k57191j50315j95328k05372j09840k11571j58910j47492k03854
5039B9859218j39212j51469j56097j59279k02628j87858k46333k55209j95846
$$ y = [30897581, 31143255, 31388929, 31548527, 31648670, 31881535, 31984917, 32113590, 32331635, 32493370, 32611274, 32745507, 32936932, 33088339, 33228927, 33427468, 33551422, 33675427, 33726992, 33932829, 33998653, 34114744, 34175777, 34178580, 34172485, 34247885, 34386836, 34433293, 34427626, 34484160, 34538675, 34581980, 34605319, 34592669, 34607418, 34590577, 34581582, 34583003, 34581930, 34496769, 34458027, 34428992, 34411736, 34342888, 34310792, 34150181, 34071778, 33963127, 33859792, 33816598, 33638843, 33514889, 33335601, 33112690, 32958025, 32712729, 32490384, 32280507, 32026340, 31825273, 31699138, 31499091, 31241900, 31091585, 30896257, 30690885, 30581045, 30369474, 30210564, 30063072, 29859218, 29720006, 29568537, 29412440, 29253161, 29050533, 28862675, 28616342, 28361133, 28165287]
5030B8165287j51912k42174k70166k08347j33647k18063k35922k19339k85855
5021B6199862k10324l00609k44153k20808k83853k38598l35316k81470k29638
5012B3855093k71006j94182k51896k61669k46403j83610j66627k04349l52168
5003B1723183j71191j97998r9032p7928k56017k30894j85602k01732k35007j80798
4993A9886984j83640j40617j46010j35148k31261j83767k37498j98627j95779
4984A8234637k07445j94888j34586j45422j91904j22134j87571j33979j04263
4975A6812445j57537j87671j96718j07348m6251k39724j27979j57896j28956j00210
4965A5362155j70723j38715j21560r9764j12028j02357j24861k393J5971k9392
$$ y = [28165287, 28013375, 27771201, 27501035, 27292688, 27159041, 26940978, 26705056, 26485717, 26199862, 25989538, 25688929, 25444776, 25223968, 24940115, 24701517, 24366201, 24084731, 23855093, 23584087, 23389905, 23138009, 22876340, 22629937, 22446327, 22279700, 22075351, 21723183, 21551992, 21353994, 21254962, 21177034, 20921017, 20690123, 20504521, 20302789, 20067782, 19886984, 19703344, 19562727, 19416717, 19281569, 19050308, 18866541, 18629043, 18430416, 18234637, 18027192, 17832304, 17697718, 17552296, 17360392, 17238258, 17050687, 16916708, 16812445, 16654908, 16467237, 16270519, 16163171, 16116920, 15877196, 15749217, 15591321, 15462365, 15362155, 15191432, 15052717, 14931157, 14831393, 14719365, 14617008, 14492147, 14489754, 14505725, 14476333]
4955A4476333j08558m6881j06884j06113n5748q3985q0223n0002r4937j42264
4945A3600738j08594n7036j25932j22830j13589r8538j76977J1006q7702k1981
4935A2698565m1465p6512m1264j52244m6568P5731n4152p5640K3454o8038j07739
4924A2134128j06400r1459j6662K5558p8247j9381N6107J7069m6658O4565j9906
4913A1918714j3325n8273J07263o0938J5667Q7513k4687p1444k9337l8864J9582
4902A1851871J04752K1185O4369k7108m2967J4513J3300j8335p9355r9239j28885
4891A1674101j33402k05070j14639j28421j69659j25176k37502j89564j42230
4882A0228438M0117p7845j58557k34055j04678j97868j14616j47493j64971o6305
$$ y = [14476333, 14367775, 14320894, 14214010, 14107897, 14052149, 13968164, 13887941, 13837939, 13743002, 13600738, 13492144, 13435108, 13309176, 13186346, 13072757, 12974219, 12797242, 12808248, 12720546, 12698565, 12657100, 12580588, 12539324, 12387080, 12340512, 12416243, 12362091, 12286451, 12309905, 12241867, 12134128, 12027728, 11936269, 11919607, 11945165, 11866918, 11847537, 11903644, 11920713, 11874055, 11938620, 11918714, 11905389, 11847116, 11954379, 11893441, 11909108, 11996621, 11971934, 11900490, 11871153, 11832289, 11851871, 11956623, 11977808, 12042177, 12015069, 11972102, 11986615, 11999915, 11981580, 11902225, 11802986, 11674101, 11540699, 11335629, 11220990, 11092569, 10922910, 10797734, 10560232, 10370668, 10228438, 10268555, 10190710, 10032153, 9798098, 9693420, 9495552, 9380936, 9233443, 9068472, 9002167]
4872I002167j54274j27004j68968n0197j63069j41702j3617j12605o8708j36654
4862G865369q4749n9664k1900q4879p7546p4633j31945J549j49460o3497q6707
4851G031938l2377o2228r1345O7175j53649j15134q6511j37959l1359k2161L8622
4840F405012j28777n4025j71295Q814m0899j17080p9839o8941m0194q8183l6849
4829E587744m9791r514m0413P2215J1401j2996r4474n2299K9552j20374l1638
4818E289413j2635j09353r8287n7782j50729l7730o1824n9264P428m7772N549
4807D667014P2805O4539j11840m1821o4532j30006k6547j1147o3720m5462k7263
4796D282020k1779j63454m9401J2670J7828k15084p0028J54461n2671k2603j42828
$$ y = [9002167, 8847893, 8720889, 8551921, 8501724, 8338655, 8196953, 8183336, 8070731, 8002023, 7865369, 7780620, 7720956, 7699056, 7614177, 7536631, 7461998, 7330053, 7331602, 7182142, 7118645, 7031938, 6999561, 6937333, 6845988, 6913163, 6759514, 6644380, 6557869, 6419910, 6388551, 6366390, 6405012, 6276235, 6222210, 6050915, 6059729, 6018830, 5901750, 5821911, 5752970, 5712776, 5624593, 5587744, 5537953, 5528439, 5488026, 5560241, 5571642, 5558646, 5464172, 5411873, 5441425, 5321051, 5289413, 5276778, 5167425, 5069138, 5011356, 4860627, 4822897, 4761073, 4701809, 4709237, 4661465, 4667014, 4739819, 4804358, 4692518, 4650697, 4586165, 4456159, 4429612, 4418465, 4354745, 4309283, 4282020, 4260241, 4096787, 4047386, 4060056, 4077884, 3862800, 3792772, 3947233, 3894562, 3871959, 3729131]
4785C729131M7360L959j04555j8926L4576m6070j581Q728p4918k8182n9843m3472
4773C446207m3953M9730j3120L2868j2697k7279m8054o1087k1236J1759j8524
4762C294614m6406O699m8129R700J3157k8436k8345o1886l4975k2211j2494P5764
4750C117052j290j17180p0227N8131l3876l2231r9188O743R7650k7969Q2305J7700
4738B997620r9652k2336K6551m7625l3131l0267M5339J7746J7399m3853k0006
4727B807785l4441m380m6629m5885k5364P158N3346N8773j09644p0321M4684j2665
4715B622417O0049L1922j3834j7169l311O4016K7015O4051n2278k0268J15085
4704B877695L9274L88K8109J24572O1312m6369j6714M3157m2424N4989m2564j1361
$$ y = [3729131, 3776491, 3780450, 3675895, 3656969, 3691545, 3645475, 3643894, 3652622, 3577704, 3549522, 3489679, 3446207, 3402254, 3451984, 3438864, 3471732, 3459035, 3431756, 3383702, 3322615, 3301379, 3313138, 3294614, 3248208, 3254907, 3206778, 3216478, 3229635, 3201199, 3172854, 3110968, 3075993, 3053782, 3041288, 3117052, 3115762, 2998582, 2928355, 2986486, 2952610, 2920379, 2821191, 2827934, 2925584, 2897615, 2979920, 2997620, 2897968, 2875632, 2902183, 2854558, 2821427, 2791160, 2836499, 2854245, 2871644, 2827791, 2807785, 2773344, 2768964, 2722335, 2676450, 2651086, 2658244, 2711590, 2770363, 2660719, 2590398, 2635082, 2622417, 2682466, 2714388, 2700554, 2683385, 2680074, 2744090, 2771105, 2835156, 2782878, 2762610, 2877695, 2916969, 2917357, 2945466, 3070038, 3131350, 3084981, 3068267, 3111424, 3069000, 3123989, 3081425, 3070064]
4692C070064l7053J23106M4183K2489n9613M0368k5887q9394K187L3965m5226
4681C079189j50186p8342p6448j07758O207J166k6992Q3860k0698k4733o1036
4670B624229l9253p571j9991j12072J11717P3378m3358L1180r508r3459L7254
4659B552546n4445K8915K8933j985P1409N5892P3009M9412l8667M8051M7674l4632
4647B826112j36867j08802n365Q3178J5761J2596k5777J0571j3001p544J7560
4636B668422m6119p640o9123R022L7958J3673o7857L0950n5107k0238M7243j18
4624B541066l0273J3016N3042K97n0706J2076q2146j0198L498n7100o401l6124
4612B350047K6558L1696p9443Q029n7747j2576P7246M7035j3240n120o2493o5633
$$ y = [3070064, 3033011, 3156117, 3200300, 3222789, 3163176, 3203544, 3177657, 3088263, 3090450, 3124415, 3079189, 2929003, 2850661, 2774213, 2666455, 2672662, 2673828, 2646836, 2730696, 2709998, 2685265, 2624229, 2584976, 2577405, 2557414, 2445342, 2557059, 2630437, 2587079, 2618259, 2608751, 2515292, 2552546, 2498101, 2527016, 2555949, 2553964, 2625373, 2681265, 2754274, 2803686, 2765019, 2813070, 2860744, 2826112, 2689245, 2580443, 2575078, 2658256, 2674017, 2686613, 2660836, 2671407, 2658406, 2650862, 2668422, 2622303, 2614663, 2545540, 2554562, 2592520, 2606193, 2538336, 2569286, 2514179, 2493941, 2541184, 2541066, 2510793, 2523809, 2576851, 2577148, 2526442, 2538518, 2456372, 2446174, 2449672, 2392572, 2386171, 2350047, 2376605, 2408301, 2328858, 2336887, 2279140, 2266564, 2343810, 2390845, 2377605, 2372485, 2309992, 2244359]
4600B244359N6177n7999N0795K1929O8677J304j5210R9111M4119l5889j3770L1349
4588B494952l1945K2073M5168L1099j123j9492J5595K1966o6338J498O692L4212
4576B554357o3297p2270M299J4118Q0060J881k0394R932K5093m1133k7678N8922
4564B523890p4020m3838N4211K4855p31J2105K6268P5719k6593j9264n1872J5165
4552B515895o380J2265M7279J1335p0113n6370N6653J2969J3915L3536L4197n999
4540B599182K5231O1766j979m0584k497n4435m9417m2616J2411K3760R5507L396
4528B629725K0651K9743n0492l385Q0620N0803p2259M095R1680j7287r793P6964
4516B831065K6786q938J11026n4915J09751L9557J691Q112M2200R2419J3272M1043
$$ y = [2244359, 2300536, 2242537, 2293332, 2315261, 2383938, 2385242, 2370032, 2469143, 2513262, 2477373, 2463603, 2494952, 2463007, 2485080, 2530248, 2561347, 2560224, 2540732, 2556327, 2578293, 2511955, 2513453, 2520145, 2554357, 2491060, 2418790, 2423089, 2437207, 2517267, 2519148, 2498754, 2508686, 2533779, 2492646, 2464968, 2523890, 2449870, 2406032, 2460243, 2485098, 2484367, 2496472, 2522740, 2598459, 2571866, 2552602, 2500730, 2515895, 2509515, 2521780, 2569059, 2580394, 2510281, 2453911, 2510564, 2523533, 2537448, 2570984, 2605181, 2599182, 2624413, 2686179, 2684200, 2643616, 2641119, 2586684, 2537267, 2494651, 2507062, 2530822, 2626329, 2629725, 2650376, 2680119, 2629627, 2626242, 2706862, 2757665, 2685406, 2689501, 2781181, 2763894, 2754101, 2831065, 2857851, 2848913, 2959939, 2905024, 3014775, 3054332, 3056023, 3064135, 3106335, 3198754, 3212026, 3253069]
4504C253069M7279K6174J766J22297Q5680N7417m062k8455J47354R2256o1356
4493C739419N6615P3767M0190P6908j819M9663O7208J3342M4251N694j6064J6870
4481D166044L5228J6370P3040K6657N1206O4182j7644l3207K3492K6966k0987
4470D411347J14864J00966Q1435N1412K1332J36500J21929m885Q5280J09913J22481
4459E352574P2765L4932K13621J31323J84853J08050J43431K35149J85871J37217
4449F799786J26778K43198K31358L52992K66637L13389L12150L76901M96726M25411
4439I945326M13140N06176M39499N40823O53200P81436J020591J112819J543561
4430A6956571J783148K046380K367265K718908L309377M240719N304992O635201
$$ y = [3253069, 3300348, 3326522, 3328288, 3450585, 3536265, 3593682, 3589620, 3561165, 3708519, 3800775, 3739419, 3796034, 3869801, 3909991, 3986899, 3985080, 4034743, 4101951, 4115293, 4159544, 4165238, 4149174, 4166044, 4201272, 4217642, 4290682, 4317339, 4368545, 4432727, 4415083, 4381876, 4405368, 4432334, 4411347, 4526211, 4627177, 4708612, 4760024, 4781356, 4917856, 5039785, 5034900, 5120180, 5230093, 5352574, 5425339, 5460271, 5673892, 5805215, 5990068, 6098118, 6241549, 6476698, 6662569, 6799786, 6926564, 7169762, 7401120, 7754112, 8020749, 8334138, 8646288, 9023189, 9519915, 9945326, 10358466, 10864642, 11304141, 11844964, 12498164, 13279600, 14300191, 15413010, 16956571, 18739719, 20786099, 23153364, 25872272, 29181649, 33422368, 38727360, 45362561]
4422D5362561P885003O093615J373700l059101o769135p540618o204364n237949
4414C1903712m288464l189291k407473j754206j498469j216648j085185r47089
4406A5516887p95169o07318m99344m94377l73222k20002j70977j55999L1488n8588
4396A2173379J39241J86722J61557K26874K42773K49651K26052K22711K79939
4387A4108899L64764M78565L96256O42724P98438J041540J258878J645455J997339
4378B2732858K115162K610989L267800M132726N196683O581375P207681M314140
4370E8159414O70305q79375m891357p478074o241402n058907m277378l513850
4362B6489376k591538j898704j387867j274903j022410q78197p33550n66484l58817
$$ y = [45362561, 53247564, 59341179, 60714879, 57655778, 50886643, 43346025, 37141661, 31903712, 27615248, 24425957, 22018484, 20264278, 18765809, 17549161, 16463976, 15516887, 14721718, 14114400, 13615056, 13120679, 12747457, 12527455, 12356478, 12200479, 12231967, 12173379, 12312620, 12499342, 12660899, 12887773, 13130546, 13380197, 13606249, 13828960, 14108899, 14473663, 14952228, 15348484, 15991208, 16789646, 17831186, 19090064, 20735519, 22732858, 24848020, 27459009, 30726809, 34859535, 40056218, 46637593, 53845274, 58159414, 58829719, 57950344, 53058987, 45580913, 39339511, 34280604, 30003226, 26489376, 23897838, 21999134, 20611267, 19336364, 18313954, 17435757, 16702207, 16135723, 15776906]
4353A5776906l68012k97006j13167o240P8904J65719K57084L44895N11432M95052
4343A6845567O10627Q00568P88283P10599Q30981P15991M37419K09030j40693
4334B1808372l06778n06923m66014l27225j85960p1054L4363J90462K79976M82962
4324B0932181N06958N25062L87212L11976j18423m12802o84826r11207q47371
4315A9688760o73015o42079n98993m26688l99935k13624j27724n3602n2526J49898
4305A6650472J69540K49863L87700M34585O06734P43050P46479Q83323J185909
4296B2057655J273237J438983J758563J780785J896038K014767K013380J739277
4288C5972685J105280N30210m6174n75923r20613q69143q57167p27985l38123
$$ y = [15776906, 15408894, 15111888, 14998721, 14992481, 15071385, 15237104, 15494188, 15839083, 16350515, 16845567, 17456194, 18256762, 19045045, 19755644, 20586625, 21302616, 21740035, 21949065, 21808372, 21501594, 20994671, 20528657, 20201432, 20015472, 19944418, 19978781, 20169243, 20449219, 20932181, 21439139, 21964201, 22351413, 22663389, 22544966, 22132164, 21447338, 20536131, 19688760, 19015745, 18373666, 17774673, 17347985, 16948050, 16734426, 16606702, 16553100, 16500574, 16650472, 16820012, 17069875, 17457575, 17892160, 18498894, 19241944, 19988423, 20871746, 22057655, 23330892, 24769875, 26528438, 28309223, 30205261, 32220028, 34233408, 35972685, 37077965, 37608175, 37562001, 36986078, 36065465, 35196322, 34339155, 33611170, 33273047]
4279C3273047j85676K2772K59760N99305O32086N05992K98597j76143o67507j345306
4269C3216927j598225j829045j923143j744651j717445j480027j235725j177003
4261B0511663j023497r00389p94972n65744n23712n75649m09796l29389k79902
4252A5108613k32503j27736j47573p340O6633l6552J06270P3617J47485K23352
4242A5174266L14879K05625L68364M74853M85107O20131P09831Q47755J061046
4233B0261857J146456J241766J378322J484064J681122J750499J726236J500971
4225C2171293R96566K39093l22623r52262j320273j457160j535973j410291j213963
4216B5194407j157607r22965q21937n98007m36564l11004l02652k38726q7456
$$ y = [33273047, 33087371, 33110143, 33369903, 33969208, 34601294, 35107286, 35405883, 35229740, 34562233, 33216927, 31618702, 29789657, 27866514, 26121863, 24404418, 22924391, 21688666, 20511663, 19488166, 18587777, 17792805, 17227061, 16703349, 16127700, 15717904, 15388515, 15108613, 14876110, 14748374, 14600801, 14593461, 14660094, 14623542, 14729812, 14803429, 14950914, 15174266, 15489145, 15694770, 16063134, 16537987, 17023094, 17643225, 18353056, 19200811, 20261857, 21408313, 22650079, 24028401, 25512465, 27193587, 28944086, 30670322, 32171293, 33167859, 33406952, 33084329, 32132067, 30811794, 29354634, 27818661, 26408370, 25194407, 24036800, 23113835, 22291898, 21693891, 21257327, 20946323, 20643671, 20404945, 20317489]
4207B0317489L1718K24332K95838M23056O73307P51414Q74054J004875J120779
4198B5716862J298397J436205J516872J482531J263463P25243J28679n37807r65981
4189C2064464j290978j388376j354779j128338q94747p61303n03685l90520j41287
4180B4210451O0179K41257L61519J89253J92682j12759n24755p21836q88969r75723
4170B2031299q14549q75360p53322o56460m52938l69152m07839k39872j91441
4161A7270366j48199j78406m7680R2271Q2878J88384K05993L63637L73046M19911
4151A8622201N28597O31959P41026P40090O87987O28956L43670J8423m31648p38998
4141B1772263r82166j099786j008917j048511r05629q44465p26363p33570o65556
$$ y = [20317489, 20349207, 20573539, 20869377, 21292433, 21965740, 22717154, 23591208, 24596083, 25716862, 27015259, 28451464, 29968336, 31450867, 32714330, 33439573, 33568252, 33030445, 32064464, 30773486, 29385110, 28030331, 26901993, 26007246, 25245943, 24742258, 24351738, 24210451, 24270630, 24511887, 24873406, 25062659, 25255341, 25142582, 24617827, 23895991, 23007022, 22031299, 21216750, 20341390, 19588068, 18931608, 18478670, 18109518, 17701679, 17461807, 17270366, 17122167, 16943761, 16896081, 16988352, 17071230, 17259614, 17465607, 17829244, 18202290, 18622201, 19150798, 19782757, 20523783, 21263873, 21951860, 22580816, 22924486, 22942909, 22511261, 21772263, 20790097, 19690311, 18681394, 17632883, 16727254, 15882789, 15156426, 14422856, 13757300]
4132A3757300m80183m17998l51584l80445l66390k99027k98468j88103j88897
4123A0786205j32167j13963j04319k21206j03147j60857p1901j03343j85302p3603
4113I516397q8651r2874j69916j10253q5680j07875j32387l0247l3187p8100l8529
4102H548698q1594P1330l5861K423k2552N101j12450P2288j3876l4321L1910P3451
4090H504547M751M8094k191p2355O812j43139q2156l7559n9598j08890L6567n6529
4078H038354j2490q296o0817K5480O4072k5807k8814L0943P577p686l8168r6925
4066G887423J11039m6268j3855K1264O5779K5863L5980J286K1078k3763J0062
4055H095888M7194k8094n9550o2619k6731L8561j3722O13m4591m3828N2135m9480
$$ y = [13757300, 13277117, 12859119, 12507535, 12127090, 11760700, 11461673, 11163205, 10975102, 10786205, 10654038, 10540075, 10435756, 10214550, 10111403, 9950546, 9878645, 9775302, 9590000, 9516397, 9427746, 9334872, 9164956, 9054703, 8969023, 8861148, 8728761, 8698514, 8665327, 8587227, 8548698, 8467104, 8538434, 8502573, 8504996, 8482444, 8487545, 8375095, 8447383, 8433507, 8399186, 8431096, 8504547, 8509298, 8557392, 8555201, 8482846, 8489658, 8346519, 8264363, 8226804, 8167206, 8058316, 8094883, 8038354, 8025864, 8017568, 7956751, 7982231, 8046303, 8020496, 7991682, 8022625, 8030202, 8022516, 7984348, 7887423, 7998462, 7952194, 7938339, 7959603, 8025382, 8051245, 8087225, 8088511, 8109589, 8085826, 8095888, 8143082, 8114988, 8055438, 7992819, 7966088, 8004649, 7990927, 7991540, 7946949, 7903121, 7955256, 7905776]
4043G905776R6450M1917j97K6217K7046J5664L8262l7352j2626J4732n923K0852
4031H130818M4174J9085p3079L5571K7155J2296Q8980P6771L0382O3945J6299
4020H472397J00250N8229O8338P5892J09450J71994M3268J04372J83937J15756
4010I503883R6029O6779J78214Q3017P2127O556l2824r000p058q8445j76045l5539
3998I657694O111N3715Q8969J59l7412J5837L8104J29975M4474L9771J70609L4750
3986A0242756Q2323K23524P3582J15719J22266J14672K3953n896q986R4060O4164
3975A1142137O5503k2668J09456K11486J36670J12091K26936J25420J60527L56477
3965A2624035K59262J57121K13921J68843J67266K04323K12609K60836J91001
$$ y = [7905776, 8002226, 8044143, 8043946, 8070163, 8097209, 8112873, 8151135, 8113783, 8101157, 8115889, 8109966, 8130818, 8174992, 8194077, 8120998, 8156569, 8183724, 8196020, 8285000, 8361771, 8392153, 8456098, 8472397, 8572647, 8630876, 8699214, 8775106, 8884556, 9056550, 9099818, 9204190, 9388127, 9503883, 9599912, 9666691, 9844905, 9927922, 10000049, 10006605, 9973781, 9964781, 9957723, 9869278, 9693233, 9657694, 9663805, 9717520, 9806489, 9806648, 9769236, 9785073, 9823177, 9953152, 9997626, 10037397, 10208006, 10242756, 10325079, 10548603, 10622185, 10737904, 10860170, 10974842, 10998795, 10992899, 10983913, 11077973, 11142137, 11207640, 11184972, 11294428, 11505914, 11642584, 11754675, 11981611, 12107031, 12267558, 12624035, 12883297, 13040418, 13254339, 13423182, 13590448, 13794771, 14007380, 14268216, 14459217]
3956A4459217K08544J62460J48243J68617K30643K47334J92308J39372K24631
3947A6181369K65190K96354K00335K44346L38548L32909L21634L32417L23268
3938A8836370M32785M38644L77299N68158N93185N56459O81892P31526O88481
3929B3904799P79007O90784P39911Q01031Q20367Q35333Q03763Q36253Q28921
3920C1040169Q51436R38426R98341J253161J283635J360064J416977J565805J602464
3911D2310478J634231J826142J979262K255596K497247K732043K981377L387056
3903F1603432L670331M209395M867743N745171O961147Q465030R846885J1397308
3895A16766442J3261748J5391403J8308407K1774371K6064117L0524587L2822747
$$ y = [14459217, 14667761, 14830221, 14978464, 15147081, 15377724, 15625058, 15817366, 15956738, 16181369, 16446559, 16742913, 16943248, 17187594, 17526142, 17859051, 18180685, 18513102, 18836370, 19269155, 19707799, 20085098, 20653256, 21246441, 21802900, 22484792, 23216318, 23904799, 24683806, 25374590, 26114501, 26915532, 27735899, 28571232, 29374995, 30211248, 31040169, 31891605, 32830031, 33828372, 35081533, 36365168, 37725232, 39142209, 40708014, 42310478, 43944709, 45770851, 47750113, 50005709, 52502956, 55234999, 58216376, 61603432, 65273763, 69483158, 74350901, 80096072, 87057219, 95522249, 105369134, 116766442, 130028190, 145419593, 163728000, 185502371, 211566488, 242091075, 274913822]
3888B74913822K6481591P519203j4618098k7124704k8687029k7204459k4924432
3881A86355894k1182866j7120617j3721684j1515499r989201q604324p524086
3874I6697617o916127o209223n615380m802855m060970l685896l375783l160299
3866E8871084l008176k878312k569959k236533k034273j829999j578107j360090
3858D1375635j352891j297888j239559j079190j127219r93896q95549q13167o43248
3849C1933028p19944o47951m65044l17487l32531q1319P8457R0754J20046K42045
3839B9900054J49145J42613n1557j82787k79396k44120k88165l58837o71808p64578
3829B7350564n98084n76038o06877p07697n95437n64882n46399l77886l33280
$$ y = [274913822, 301395413, 308914616, 294296518, 267171814, 238484785, 211280326, 186355894, 165173028, 148052411, 134330727, 122815228, 112826027, 104221703, 96697617, 89781490, 83572267, 77956887, 73154032, 69093062, 65407166, 62031383, 58871084, 55862908, 52984596, 50414637, 48178104, 46143831, 44313832, 42735725, 41375635, 40022744, 38724856, 37485297, 36406107, 35278888, 34284992, 33389443, 32576276, 31933028, 31213084, 30565133, 30100089, 29782602, 29450071, 29368752, 29447209, 29537963, 29658009, 29900054, 30049199, 30191812, 30140255, 29957468, 29678072, 29433952, 29145787, 28786950, 28115142, 27350564, 26752480, 26176442, 25569565, 24861868, 24266431, 23701549, 23155150, 22777264, 22443984]
3820B2443984l46542k34694k65256k3264K2641K6615P9440Q9684J12792Q8254
3810B1993654j39663N0286J89250J44006J94171K54831L22730K96553K72263L37473
3800B3915554K08675r0946k08088r5346R8729J98243K09345K42710M38328M68928
3790B5386132M66793M60514O56201P24466P13856O76901P14497O85352P17604
3781C1202316P55363Q21137P80994P18774Q26240Q13776Q28493P71269Q36640
3772C8355002R08977J085997J245208J409511J390312J578893J532795J489356
3764D8996051J226817R34586P62093M21183J93160k351m2379P8504J26073J75292
3754E2869029J70961J22056j1775l54066m95618o97573q69206r50559r47090p77052
$$ y = [22443984, 22097442, 21862748, 21597492, 21574228, 21596869, 21623484, 21702924, 21792608, 21905400, 21993654, 21853991, 21904277, 22093527, 22237533, 22431704, 22686535, 23009265, 23305818, 23578081, 23915554, 24124229, 24033283, 23825195, 23729849, 23828578, 24026821, 24236166, 24478876, 24917204, 25386132, 25852925, 26313439, 26969640, 27694106, 28407962, 29084863, 29799360, 30484712, 31202316, 31957679, 32778816, 33559810, 34278584, 35104824, 35918600, 36747093, 37518362, 38355002, 39263979, 40349976, 41595184, 43004695, 44395007, 45973900, 47506695, 48996051, 50222868, 51157454, 51919547, 52340730, 52533890, 52531539, 52489160, 52567664, 52693737, 52869029, 53039990, 53162046, 53150271, 52796205, 52300587, 51603014, 50733808, 49783249, 48836159, 48059107]
3744D8059107o97677o33784n23454n75234o07317p63382r24452j027595j345975
3735D0960237j358015j443646j471133j341323j188711j088834r73592r82555
3727C1112428j099068j040083j110620j070924j023915j194606j133815r30374
3719B2509023r82476r26971p49391p41479p55166n91275o35832o48555n38993
3710A5938885n31216n40664m45714m96530m91426l77728l95218l08819l78210
3701A1973360l85819j93035j66893k31536k58295j22045k34665j26367q5477j27737
3691A0041491k23736k05739k18737k61047j14833j85742q5666k291j6850J8607
3681H745457o0804n667k1690j75946q1172q6342k38688r4620j74424j98344j52608
$$ y = [48059107, 47361430, 46727646, 46204192, 45628958, 45021641, 44258259, 43333807, 42306212, 40960237, 39602222, 38158576, 36687443, 35346120, 34157409, 33068575, 32094983, 31112428, 30013360, 28973277, 27862657, 26791733, 25767818, 24573212, 23439397, 22509023, 21526547, 20599576, 19850185, 19108706, 18353540, 17762265, 17126433, 16477878, 15938885, 15407669, 14867005, 14421291, 13924761, 13433335, 13055607, 12660389, 12351570, 11973360, 11587541, 11394506, 11227613, 10996077, 10737782, 10615737, 10381072, 10254705, 10169228, 10041491, 9817755, 9612016, 9393279, 9132232, 9017399, 8831657, 8745991, 8743700, 8726850, 8745457, 8684653, 8678986, 8657296, 8481350, 8400178, 8313836, 8075148, 7980528, 7806104, 7607760, 7455152]
3670G455152k28521k14695k02834j64065j28726k40614k56003r2242j20265k05088
3660E602099r4473j37786j88514p0729n9297r0858j21118j58649o2354n9532k7440
3649D531349k7711j13353q6984N4269j68707m3901n8468o4891P3347j72173n7305
3638C865472M2583J4776m4385P9326q521k6928Q1837J15336O2033R2549R8949
3627D373027J22562R6599l6855j40564j13607j64376j63776j33057j80663j49829
3617C509461o2709q5058l0252q5755p0032j88671j9135k5365O6287L7682m2034
3606C004419p6887o1410K4565j6568j05788r6248P568P5365j1342K9121p8k7495
3594B745222L4989O5706J43721L8028O9099J36785j9683P7547j12513p8101j18833
$$ y = [7455152, 7226631, 7011936, 6809102, 6645037, 6516311, 6275697, 6019694, 5927452, 5807187, 5602099, 5507626, 5369840, 5181326, 5110597, 5051300, 4960442, 4839324, 4680675, 4618321, 4558789, 4531349, 4503638, 4390285, 4303301, 4357570, 4188863, 4144962, 4086494, 4021603, 4094950, 3922777, 3865472, 3908055, 3922831, 3878446, 3957772, 3949251, 3922323, 4004160, 4119496, 4181529, 4274078, 4373027, 4495589, 4592188, 4555333, 4414769, 4301162, 4136786, 3973010, 3839953, 3659290, 3509461, 3446752, 3361694, 3331442, 3245687, 3175655, 2986984, 2967849, 2942484, 3008771, 3046453, 3004419, 2927532, 2866122, 2890687, 2874119, 2768331, 2672083, 2679651, 2755016, 2743674, 2772795, 2772717, 2745222, 2780211, 2845917, 2989638, 3027666, 3096765, 3233550, 3213867, 3291414, 3178901, 3100800, 2981967]
3583B981967j67551p6012j38888j20765j92732o4264j3292M1669k0723K379n0447
3572B181341n8832p4641J040m0413j1750j7783K4826o0928J0153k8548j16463
3561A808002m3472J7610j1617m444j9088J7665M8975k4677L5403P4566P3732N613
3549A978268j12543J656r2437l8358n9643L5838k9523M0303M3263r7085K5107
3538A694846N1897r1845n3223J7752j7579P16K4794p0551n3894O8146M8525k2303
3526A597281k3821o6742M6474Q9075r9551J25M9142j02272o605P5706K8010n4080
3514A532742M182Q523N4648K2338n8899J1595l0307r355P1013o922m557o5390
3502A529611M1433O3289j388n196j7635j6988r9211J5267L0704m771P748J887
$$ y = [2981967, 2814416, 2738404, 2599516, 2478751, 2286019, 2221755, 2208463, 2250132, 2229409, 2231788, 2181341, 2122509, 2047868, 2048908, 2008495, 1996745, 1978962, 2003788, 1942860, 1953013, 1924465, 1808002, 1764530, 1782140, 1770523, 1766079, 1746991, 1764656, 1813631, 1788954, 1824357, 1898923, 1972655, 1978268, 1865725, 1867381, 1774944, 1736586, 1676943, 1712781, 1683258, 1723561, 1766824, 1669739, 1694846, 1746743, 1654898, 1601675, 1619427, 1601848, 1602564, 1627358, 1556807, 1502913, 1571059, 1619584, 1597281, 1573460, 1506718, 1553192, 1642267, 1542716, 1542841, 1591983, 1489711, 1483106, 1558812, 1586822, 1532742, 1536924, 1545447, 1600095, 1622433, 1563534, 1575129, 1544822, 1535467, 1606480, 1599558, 1595001, 1529611, 1571044, 1634333, 1632945, 1627749, 1610114, 1593126, 1493915, 1509182, 1539886, 1535115, 1542863, 1544750]
3490A544750m3286P4518j3377O987L4229M8891j7101J08103L4559M5147J7198
3479A840618O3524m2604N0797K7624K2038o663m9348M2924O6153J09057K550o8211
3467B058459K9830R9283K3504K5271O8918N5257J08825n8699L0894M0204k1176
3456B460570M5531Q2115M1127O1681m2080l4430O2381l5600J0629L0280k0935
3445B661269k1054O295j10676O982N5584p919j8672L55n8240j1423j4163N8389
3433B546727l6758j6588R380j7089j5930O8230P776K681l8030K8682P65q666K5922
3420B557102j1808K044L5823R97J1336O6462k09J1430m1849N5130o0564r2718
3408B533176m4359k3955K2788M9574n9703k9559O0310M1558L2799L8871L1976
$$ y = [1544750, 1501464, 1575982, 1562605, 1569592, 1603821, 1652712, 1635611, 1743714, 1778273, 1823420, 1840618, 1904142, 1861538, 1912335, 1939959, 1961997, 1955334, 1905986, 1948910, 2015063, 2124120, 2126670, 2058459, 2088289, 2187572, 2211076, 2236347, 2305265, 2360522, 2469347, 2410648, 2441542, 2481746, 2460570, 2506101, 2588216, 2629343, 2691024, 2648944, 2614514, 2676895, 2641295, 2651924, 2682204, 2661269, 2640215, 2646510, 2535834, 2542816, 2598400, 2590481, 2571809, 2572164, 2513924, 2502501, 2488338, 2546727, 2509969, 2493381, 2502761, 2485672, 2469742, 2537972, 2545748, 2548429, 2510399, 2539081, 2539846, 2531180, 2557102, 2545294, 2547338, 2583161, 2584158, 2595494, 2661956, 2661747, 2673177, 2631328, 2686458, 2625894, 2533176, 2488817, 2464862, 2487650, 2537224, 2477521, 2447962, 2508272, 2549830, 2582629, 2621500, 2653476]
3397B653476K2762J5692j0590o9409O0481l0663P7693K0677o6595J4571K4955
3386B713050K2167j28L4590J28927K1648K419P53P663P2143K0914J3119n8713
3374B978552J00305m7584K6330N3018L9191k1688J7081K6018Q2986N7368J1053
3363C322630L8800l0561M3508J13827L506M6567m8296j8294L0818P6522P8615
3352C657642M4807J10663J3611O7013M5452m6394M4250Q3267j256M8952J18441
3341D186448O3846P3491L3224R4965N693R0603J56160J51160J33718L7424N0618
3330E077350J17657J03149R4541J67038J20064O1604P2102N5682M7157J47911
3320F064255L1949J436R1653J43729P0634R5747J9288J2041M3646M767k6865K0338
$$ y = [2653476, 2676238, 2691930, 2681340, 2611931, 2672412, 2641749, 2719442, 2740119, 2673524, 2688095, 2713050, 2735217, 2735089, 2769679, 2898606, 2920254, 2922673, 2923426, 2931089, 3003232, 3024146, 3037265, 2978552, 3078857, 3031273, 3057603, 3110621, 3149812, 3128124, 3145205, 3171223, 3254209, 3311577, 3322630, 3361430, 3330869, 3374377, 3488204, 3491710, 3538277, 3489981, 3471687, 3502505, 3579027, 3657642, 3702449, 3813112, 3826723, 3893736, 3939188, 3892794, 3937044, 4020311, 4019055, 4068007, 4186448, 4250294, 4323785, 4357009, 4451974, 4457667, 4548270, 4704430, 4855590, 4989308, 5026732, 5077350, 5195007, 5298156, 5392697, 5559735, 5679799, 5741403, 5813505, 5869187, 5916344, 6064255, 6096204, 6097640, 6189293, 6333022, 6403656, 6499403, 6518691, 6530732, 6574378, 6579145, 6552280, 6572618]
3308F572618N365K2300P8661k1040K4332R9073K886j4637J7197L6229Q7229J17034
3296G027247N5202R7034J77487J25325J13605J3866J39182J87460Q2136K03070
3286H221614J96583J48150J11468J93955J97214J26180Q3452Q4576O3648J14987
3276I541827O5774R3750L3858L0993O9422J31713Q2044Q6615M2257L3457P9578
3265A0291288o715J20256N3586J76509O4230Q1568J05832Q8675P9489Q6656J16933
3254A1258307J67695J41135Q9008J52279J19800J80002J25619J91834J96076K64492
3244A2886247K63020J86563K41580L05245K69489K37066K15006L07448L66788
3235A5278452L47101M10381L27730L86344L63008M29351M32931L86056M08764
$$ y = [6572618, 6577983, 6600283, 6678944, 6657904, 6682236, 6781309, 6784195, 6769558, 6786755, 6822984, 6910213, 7027247, 7082449, 7179483, 7356970, 7482295, 7595900, 7609766, 7748948, 7936408, 8018544, 8221614, 8418197, 8566347, 8677815, 8871770, 9068984, 9195164, 9278616, 9363192, 9426840, 9541827, 9607601, 9701351, 9735209, 9766202, 9835624, 9967337, 10049381, 10135996, 10178253, 10211710, 10291288, 10284573, 10404829, 10458415, 10634924, 10699154, 10780722, 10886554, 10975229, 11054718, 11141374, 11258307, 11426002, 11567137, 11656145, 11808424, 11928224, 12108226, 12233845, 12425679, 12621755, 12886247, 13149267, 13335830, 13577410, 13882655, 14152144, 14389210, 14604216, 14911664, 15278452, 15625553, 16035934, 16363664, 16750008, 17113016, 17542367, 17975298, 18361354, 18770118]
3226A8770118M19048M11866L77440M56928L46937L95037L76150L49774L34334
3217B2237632L61292K67428L19772L75626L75573L29925L81259L15231L36472
3208B5300210L77489K84628L95951K37862L30202M51101M57751M81930M62896
3199B8780020O06045O91442O40584Q38193R01296J053722J215961J196016J303720
3190C7226999J407000J557186J831133K053651K244428K426813K710459K961600
3182E4419269L259983L499778L731526M061066M164076M215053M170559L998068
3174H5519378L754939L300644K954290K356677J746510J285718P46619K61642
3166A01926417Q3969p0692k25611m10871n76174p41486r67242j410775j930628
$$ y = [18770118, 19189166, 19601032, 19978472, 20435400, 20782337, 21177374, 21553524, 21903298, 22237632, 22598924, 22866352, 23186124, 23561750, 23937323, 24267248, 24648507, 24963738, 25300210, 25677699, 25962327, 26358278, 26596140, 26926342, 27377443, 27835194, 28317124, 28780020, 29386065, 30077507, 30718091, 31556284, 32457580, 33511302, 34727263, 35923279, 37226999, 38633999, 40191185, 42022318, 44075969, 46320397, 48747210, 51457669, 54419269, 57679252, 61179030, 64910556, 68971622, 73135698, 77350751, 81521310, 85519378, 89274317, 92574961, 95529251, 97885928, 99632438, 100918156, 101664775, 101926417, 102010386, 101939694, 101714083, 101303212, 100727038, 99985552, 99018310, 97607535, 95676907]
3157I5676907k319261k810802l192045l560057l757406l898462l792546l629056
3149F8717272l396179l226451k911698k611777k331131k050894j796063j471881
3141D8921198j290457j134713r80064p80669o00014n68922l34787k81842k08652
3132D2741078j55066K537M7846J8051Q3635Q7135K13088K58027L39113K84256
3122D3919700L70120L53994L98427M85173M55028M11595M04575M25091N33835
3113D7757538O10595O55143O98954Q12896Q66589Q32656Q49545R66462R11896
3104E4962274R14686Q95267R08308R79042J032734J082579J267102J340019J475652
3095F4857663J694239J796746J897143K014144K256302K336857K543381K805466
$$ y = [95676907, 93357646, 90546844, 87354799, 83794742, 80037336, 76138874, 72346328, 68717272, 65321093, 62094642, 59182944, 56571167, 54240036, 52189142, 50393079, 48921198, 47630741, 46496028, 45515964, 44735295, 44135281, 43566359, 43231572, 42949730, 42741078, 42586012, 42588549, 42636395, 42654446, 42738081, 42825216, 43038304, 43296331, 43635444, 43919700, 44289820, 44643814, 45042241, 45527414, 45982442, 46394037, 46798612, 47223703, 47757538, 48368133, 49023276, 49722230, 50535126, 51401715, 52234371, 53083916, 54050378, 54962274, 55876960, 56772227, 57680535, 58659577, 59692311, 60774890, 62041992, 63382011, 64857663, 66551902, 68348648, 70245791, 72259935, 74516237, 76853094, 79396475, 82201941]
3087H2201941L074227L430773L605767M014352M591559N079198N586910O217071
3079A17801798O914967P435782Q338987Q896969R360189R910954J0093716J0093841
3071A88847203R638092Q902738Q032167O760207N518907M469280L351913K536303
3063B38056810J936727J434640J204199R59112N31907J73792o28687j582344k769137
3054B39317019m057927n174099o182667p150996p659739p965473q137009p935543
3046A85053566p520373o954630o542458n972901n448200m870485m605908m215386
3038A38923225l774350l579430l434451l015124k793875k571010k271736k137827
3030A15345422j851950j634634j282893j120491p70978m94867k83159P5249M37810
$$ y = [82201941, 85276168, 88706941, 92312708, 96327060, 100918619, 105997817, 111584727, 117801798, 124716765, 132152547, 140491534, 149388503, 158748692, 168659646, 178753362, 188847203, 198485295, 207388033, 215420200, 222180407, 227699314, 232168594, 235520507, 238056810, 239993537, 241428177, 242632376, 243591488, 244123395, 244297187, 243668500, 242086156, 239317019, 235259092, 230084993, 223902326, 216751330, 209091591, 201126118, 192989109, 185053566, 177533193, 170578563, 164036105, 158063204, 152615004, 147744519, 143138611, 138923225, 135148875, 131569445, 128134994, 125119870, 122325995, 119754985, 117483249, 115345422, 113493472, 111858838, 110575945, 109455454, 108684476, 108189609, 107906450, 107981699, 108419509]
3021A08419509P25238J063917J358196J787903K072182K471253K770412L136100
3013A23804710L547951L811347M060136M249803M542399M763146M930876M938911
3005A58649279N026429M939465M769657M564520M245269L901190L603540L093126
2997A92792475K530605J877528J115637K00722p45352j757526k459020l061844
2989A90493225l806736m234216m281687m358435m397639m396391m370846m519298
2981A56127977m521693m807646m845518m977452n103431n229004n257775n206175
2973A16179283n082838m962960m591479m140723m014979l640631l290512k900350
2965H3554811k576226k315700k020015j754961j521964j198459j051257q68664
$$ y = [108419509, 109144747, 110208664, 111566860, 113354763, 115426945, 117898198, 120668610, 123804710, 127352661, 131164008, 135224144, 139473947, 144016346, 148779492, 153710368, 158649279, 163675708, 168615173, 173384830, 177949350, 182194619, 186095809, 189699349, 192792475, 195323080, 197200608, 198316245, 198516967, 197771615, 196014089, 193555069, 190493225, 186686489, 182452273, 178170586, 173812151, 169414512, 165018121, 160647275, 156127977, 151606284, 146798638, 141953120, 136975668, 131872237, 126643233, 121385458, 116179283, 111096445, 106133485, 101542006, 97401283, 93386304, 89745673, 86455161, 83554811, 80978585, 78662885, 76642870, 74887909, 73365945, 72167486, 71116229, 70247565]
2957G0247565p68978p19150n27113n58522l77830j69052j46409J34186J76154
2948F7290851K84311O04490P30017Q12120J058656J199754J439637J643802J898731
2939G6962369K135392K293347K554200K830968K851780K791778K723854K561615
2931I7705303K346845J918248J475818J060357M40544k64394q74251j296255j815859
2922A00696356k195512k268144k250204k262193j996558j659315j318107r50291
2914H5796032n89655l54818K0520M06849M91439P84670Q93836P84606Q16557N53332
2904H9603368J67982k92745q24970j350397j765064k318490k587449k862446l154356
2895G4615433l106283l159381l112134k881290k772556k497192k360986k112010
$$ y = [70247565, 69478587, 68759437, 68232324, 67673802, 67295972, 67126920, 66980511, 67114697, 67290851, 67575162, 68179652, 68909669, 69721789, 70780445, 71980199, 73419836, 75063638, 76962369, 79097761, 81391108, 83945308, 86776276, 89628056, 92419834, 95143688, 97705303, 100052148, 101970396, 103446214, 104506571, 104947115, 104682721, 103808470, 102512215, 100696356, 98500844, 96232700, 93982496, 91720303, 89723745, 88064430, 86746323, 85796032, 85206377, 84851559, 84872079, 85278928, 85770367, 86555037, 87448873, 88233479, 89050036, 89603368, 89771350, 89478605, 88653635, 87303238, 85538174, 83219684, 80632235, 77769789, 74615433, 71509150, 68349769, 65237635, 62356345, 59583789, 57086597, 54725611, 52613601]
2887E2613601j894485j737946j572748j419380j442281j246331j003700j036472
2879D1260258r99958q64111p66731p85719q38940o67136p08452o66723n06460
2870C4456028m42021m49933m35411l69864l01814j82279k61736j21590o271J17911
2860C2003020O4419J33935J42045K22339J76602M323K7965m2152k21281l70146
2850C2141069m07644n88775p27210p33930q21708p95668q07871o75163o93040
2841B5890060n46526o77265m97860m81262m18337l27257l84683l33937j82374
2832B2040559k32916k47090j68943k24960j49572k04736k27934k27334j65905
2823B0191169k37181j01602j17064j25309p1196k18885j12393l8791j34850j34060
$$ y = [52613601, 50719116, 48981170, 47408422, 45989042, 44546761, 43300430, 42296730, 41260258, 40260300, 39396189, 38629458, 37843739, 37004799, 36337663, 35629211, 34962488, 34456028, 34014007, 33564074, 33128663, 32758799, 32456985, 32274706, 32012970, 31891380, 31885109, 32003020, 32067439, 32201374, 32343419, 32565758, 32742360, 32746683, 32774648, 32732496, 32511215, 32141069, 31733425, 31144650, 30417440, 29683510, 28861802, 28066134, 27258263, 26583100, 25890060, 25343534, 24666269, 24168409, 23687147, 23268810, 22941553, 22556870, 22222933, 22040559, 21807643, 21560553, 21391610, 21166650, 21017078, 20812342, 20584408, 20357074, 20191169, 19953988, 19852386, 19735322, 19610013, 19538817, 19319932, 19207539, 19168748, 19033898, 18899838]
2813A8899838J11919J8175m003M6834L3878l4366J2584O1538J00738O3479q868
2802A9301746K9963R941n3644K7100O5527O7439Q0816J06781Q1069O6895J16218
2791A9899851Q5147J53254J08778K02155J32189K01925K43664L76614L24963K73427
2781B2001967L76464M25890K74783L78477M17401M25197M94566N19937M20315
2772B5734997L91420M53957P05670O36451O61777P06199P62597R09811Q00424
2763C1763303R13877J045975J132805J162106J174972J100427J118651P88089
2755D0200205M91559M40004N58639M33017N72864Q07983R04513J004974J184693
2746D6598451J210020J350519J436967J572917J771505J850203J871243K036697
$$ y = [18899838, 19011757, 19029932, 19025929, 19072763, 19106641, 19072275, 19084859, 19146397, 19247135, 19310614, 19301746, 19331709, 19341650, 19288006, 19315106, 19380633, 19448072, 19528888, 19635669, 19716738, 19783633, 19899851, 19984998, 20138252, 20247030, 20449185, 20581374, 20783299, 21026963, 21403577, 21728540, 22001967, 22378431, 22804321, 23079104, 23457581, 23874982, 24300179, 24794745, 25314682, 25734997, 26126417, 26580374, 27286044, 27922495, 28584272, 29290471, 30053068, 30962879, 31763303, 32677180, 33723155, 34855960, 36018066, 37193038, 38293465, 39412116, 40200205, 40691764, 41131768, 41690407, 42123424, 42696288, 43504271, 44408784, 45413758, 46598451, 47808471, 49158990, 50595957, 52168874, 53940379, 55790582, 57661825, 59698522]
2738E9698522K183944K253170K409805K674395L055873L362154L684601M166148
2730H3488612M607675M956094N302290N419019N464223N326476N263450N445694
2722A25273533N805039O523736P508918Q638056J0023201J1767259J4029551J6281230
2714B05850523J8644292K1056910K3852635K6918064L0569265L4310163L7758773
2707C98960625L9835826L8283002K9914788J2888826q061832k4787455l3679890
2700D53353890l6698785l6197342l3205056k9113376k5009184k1462163j8477565
2693B53190419j6212092j4620235j3483611j2521543j1857906j1278875j0533433
2686A62682724r872699r060920q368585p570843o936726o253429n653255n190629
$$ y = [59698522, 61882466, 64135636, 66545441, 69219836, 72275709, 75637863, 79322464, 83488612, 88096287, 93052381, 98354671, 103773690, 109237913, 114564389, 119827839, 125273533, 131078572, 137602308, 145111226, 153749282, 163772483, 175539742, 189569293, 205850523, 224494815, 245551725, 269404360, 296322424, 326891689, 361201852, 398960625, 438796451, 477079453, 506994241, 519883067, 511821235, 487033780, 453353890, 416655105, 380457763, 347252707, 318139331, 293130147, 271667984, 253190419, 236978327, 222358092, 208874481, 196352938, 184495032, 173216157, 162682724, 152810025, 143749105, 135380520, 127809677, 120872951, 114619522, 108966267, 103775638]
2678A03775638m757972m494813m240626m022263l788016l757030l472862l275718
2670G1966338l017679k812725k542560k451631k381846k117784k030123j952771
2662E2659219j699954j512572j440811j255921j135923j091773j055098j051373
2654D2415794q72077p59948q25075o38176o51212m12649m38586l33493l43681
2645C7140897k83776l06116m11393m61862m80130n64538p68713p72032r26487
2636C2165850j012774r83211j039644r67972j049517j009399r00494q97926q76127
2627B3428786p36329p27403p07563o40210o91577o19422n21798m28531n39363
2618A7816590m40075m42912m98222l38953l85613l62012l43900k64544k47910
$$ y = [103775638, 99017666, 94522853, 90282227, 86259964, 82471948, 78714918, 75242056, 71966338, 68948659, 66135934, 63593374, 61141743, 58759897, 56642113, 54611990, 52659219, 50959265, 49446693, 48005882, 46749961, 45614038, 44522265, 43467167, 42415794, 41543717, 40783769, 39958694, 39320518, 38669306, 38256657, 37818071, 37484578, 37140897, 36857121, 36551005, 36139612, 35677750, 35197620, 34633082, 33864369, 33092337, 32165850, 31153076, 30169865, 29130221, 28162249, 27112732, 26103333, 25202839, 24304913, 23428786, 22692457, 21965054, 21257491, 20617281, 19925704, 19306282, 18784484, 18355953, 17816590, 17376515, 16933603, 16435381, 16096428, 15710815, 15348803, 15004903, 14740359, 14492449]
2609A4492449l95057k92887k55031k55737k86401k65644k17560l43015k76941
2600A1904176k43701k03781k16949j74317j25982k04761j96184j15972k69579
2591A0152950k57901j45105j79128q3579j4769j78557k14628j11750k16304q3410
2581H667819q6737j49783j60171j32803j55324j35067r8016j10390p5103q4723
2571G479702n3716m7197j84265q2923j04485j13769j00066j8156j73604j35995
2561F465526j76147q5425k3378j68822j35400j29335j12200j28374j29335j59509
2551E217601Q825r2166j47530n0424n7462p6661j22423l9148j5356j82653q7436
2540D355167j39543p0298l5110j26657k1634k6234j81622J0178k0751k9684m096
$$ y = [14492449, 14097392, 13804505, 13549474, 13293737, 13007336, 12741692, 12524132, 12181117, 11904176, 11660475, 11456694, 11239745, 11065428, 10939446, 10734685, 10538501, 10422529, 10152950, 9895049, 9749944, 9570816, 9487237, 9472468, 9293911, 9079283, 8967533, 8751229, 8667819, 8581082, 8431299, 8271128, 8138325, 7983001, 7847934, 7749918, 7639528, 7564425, 7479702, 7425986, 7378789, 7194524, 7111601, 7007116, 6893347, 6793281, 6775125, 6601521, 6465526, 6289379, 6203954, 6180576, 6011754, 5876354, 5747019, 5634819, 5506445, 5377110, 5217601, 5226426, 5134260, 4986730, 4936306, 4878844, 4802183, 4679760, 4640612, 4625256, 4442603, 4355167, 4215624, 4145326, 4110216, 3983559, 3961925, 3935691, 3754069, 3764247, 3743496, 3713812, 3709716]
2529C709716K7990L5982p7119k0531p2330o6949q969q3709m7491K1718j14431
2518C303877j2329N6247n8567l3492M4250j13688n2143J6195p7235q956n3915
2507C010244n2908J8854j34597o4023o1058j3587o510o6195J0357k503l5749N8731
2495B661056P2937j05367q0709N4538o5652L6199P2717o6798j916j1728j11050
2484B454227K3821K6906n8619J715q7335K1703O677k8942n0862J05453P243k7983
2472B394004M1133L5399o3212L986O1872K8911O5627Q964K7983p5807P0244M2998
2460B642102J25819Q4305M7548J19763Q7851J45886R2851J27252K23777J50418
2450C847572J16611J52200n4696l9833n8389k48304j92655j30209q6949j50830
$$ y = [3709716, 3737706, 3773688, 3696569, 3676038, 3603708, 3536759, 3527790, 3444081, 3396590, 3418308, 3303877, 3291548, 3347795, 3289228, 3255736, 3299986, 3186298, 3134155, 3150350, 3073115, 3064159, 3010244, 2957336, 2976190, 2841593, 2777570, 2716512, 2702925, 2696415, 2630220, 2640577, 2638074, 2602325, 2661056, 2733993, 2628626, 2547917, 2602455, 2536803, 2573002, 2645719, 2578921, 2577005, 2565277, 2454227, 2478048, 2504954, 2446335, 2448050, 2360715, 2382418, 2389095, 2360153, 2309291, 2414744, 2421987, 2394004, 2435137, 2470536, 2407324, 2411310, 2473182, 2502093, 2567720, 2576684, 2604667, 2528860, 2599104, 2642102, 2767921, 2852226, 2899774, 3019537, 3107388, 3253274, 3346125, 3473377, 3697154, 3847572, 3964183, 4116383, 4061687, 4021854, 3963465, 3715161, 3522506, 3392297, 3305348, 3154518]
2440C154518j50848j35542j25836j24712l3578r0660j02954k3482p5962j10949
2430B179995m9429n2820r6727m0174N7838n7281r9059K2750j862k1223j17910
2419A724098n7179j08468j5315J814k4573L6849J1695n1565p0026o6450l4767
2408A346113p7472L1677L0255j12905k697l7585l7465J9993k6990j7999K126m393
2396A112658n015n4151J529N4763Q2379k0660m1607j6464L2410o0395l6950k1786
2384A026711q928K5735j6380N0730m6187k9384m7288j9168n936K072n7422J5404
2372H89959R659k6977j5476q1175M7201N1949k5737k0078k6391n390J1118O8208
2360H76870j9872n8311K3614J5696r803l7921n3054J9525l7923m7710O578Q7785
$$ y = [3154518, 3003670, 2868128, 2742292, 2617580, 2584002, 2493342, 2390388, 2366906, 2290944, 2179995, 2130566, 2077746, 1981019, 1940845, 1998683, 1941402, 1842343, 1865093, 1863231, 1842008, 1724098, 1666919, 1558451, 1543136, 1544950, 1520377, 1557226, 1568921, 1517356, 1447330, 1380880, 1346113, 1268641, 1300318, 1330573, 1217668, 1214971, 1177386, 1139921, 1159914, 1132924, 1114925, 1117051, 1112658, 1107643, 1053492, 1055021, 1109784, 1192163, 1171503, 1129896, 1113432, 1145842, 1085447, 1048497, 1026711, 1017783, 1043518, 1027138, 1077868, 1031681, 1002297, 955009, 935841, 929905, 931977, 874555, 889959, 899618, 872641, 857165, 775990, 823191, 875140, 849403, 829325, 802934, 797544, 808662, 876870, 856998, 798687, 822301, 837997, 828194, 790273, 737219, 756744, 718821, 671111, 677689, 765474]
2348G65474N3113M0947j5176k8512m0626J254j7314o0042m3917J1140P981K9519
2336G03841l6568m2434P7535K903K9299l8302R732q1572l0580p1423P8464Q1385
2324F82280p4071K3867p975o6117K6049N0699p2755q5643N2082j756K5463p058
2312E45065l4160m9595K7671k3387K0690O4238m8349n549p574N8889k1267l5239
2300D91433r346k6061O0429M746l1424M579M8144N1751r2541O2465K4525K9442
2288F18142o3084m4289J5163O6620L0442j01651N0948l817K8927n2860j9836L968
2276E28673o2996M1926K5452n6477q4820l3508o3098m5828O9105L3474j6192M0908
2264C76619P0354r3956K4482N2863n9634n454J6296K9414M365J556P432J5000
$$ y = [765474, 818587, 859534, 844358, 815846, 775220, 776474, 759160, 699118, 655201, 666341, 674322, 703841, 667273, 624839, 702374, 705277, 734576, 696274, 706006, 624434, 593854, 522431, 600895, 682280, 608209, 632076, 624101, 557984, 584033, 634732, 561977, 476334, 528416, 526660, 552123, 545065, 510905, 461310, 488981, 465594, 486284, 550522, 502173, 496624, 489050, 547939, 526672, 491433, 482087, 456026, 516455, 521201, 489777, 494356, 542500, 594251, 501710, 564175, 588700, 618142, 555058, 510769, 525932, 592552, 622994, 521343, 572291, 568474, 597401, 544541, 524705, 528673, 465677, 507603, 533055, 476578, 391758, 358250, 295152, 249324, 318429, 351903, 335711, 376619, 446973, 353017, 377499, 430362, 370728, 365274, 381570, 410984, 415349, 416905, 424337, 439337]
2252D39337O7920k3551J3804o3930l9441J4990J8441O6962K467J9578r6904R34
2240D20607R2279q367l2757k2570r5485O0374M5289n8762j2745K0099L4222p6568
2228C65616n0L1492k7699P3800j3217j1959R739J602p8689N5560J3961N656R136
2215D34948K5967K3820j4823n6318k1454N238M5658R556j02124n1571j3968L5153
2203C20082j0817O4398J0861l5817K158N7665M0225k1081j543L2824R2807o9723
2191D82039j13857p8408j9908R1361m8590l2908J0983J25828L6842j6855j14103
2180C22424K106O7607l4239j05179Q9504L3367q8930Q944m7658L4269O6761J7777
2168C66753k5996L1482m6383J2965k418l1578j825M0201k253p1111M4518l2735
$$ y = [439337, 507257, 483706, 497510, 433580, 394139, 409129, 427570, 494532, 496999, 516577, 419673, 420607, 512886, 504519, 471762, 449192, 353707, 414081, 459370, 400608, 387863, 407962, 442184, 365616, 365566, 397058, 369359, 443159, 429942, 417983, 427722, 429324, 350635, 406195, 420156, 425812, 434948, 460915, 484735, 469912, 413594, 392140, 397378, 443036, 452592, 350468, 298897, 284929, 320082, 309265, 373663, 384524, 348707, 350865, 408530, 448755, 427674, 426131, 458955, 551762, 482039, 368182, 289774, 269866, 361227, 312637, 279729, 290712, 416540, 453382, 436527, 322424, 324530, 392137, 357898, 252719, 342223, 375590, 286660, 295604, 247946, 282215, 348976, 366753, 340757, 372239, 325856, 338821, 336403, 304825, 303000, 343201, 340948, 269837, 314355, 281620]
2156B81620l2565o130j7015L7504J9307K6119n8000M0875Q916N1857J14874m4707
2144D22655k9129N1830n8898J0081Q1702n3776p6714p3906m338Q0555L7454R161
2132C96677J71l6459r641K2120M8667k2492j3758L6253m138p4967M1508J42764
2120E26705j8409K4918M334J5943j3026K3102k982o8325O1607l2113N6282n4290
2108E23746J0104K3426p1920k3045J1565O718N5517L7083P092j216k8906N4593
2096F04757p415L6358l7310O212J9429p8414J02181K6528J1416j6059N4212O1158
2084G83053l2395M2082O0174k7323L1757J0563l6308M8134J16526L5522m1336
2073I90449Q67M2109P4070M9740L2534M4473J48466J00518K8627J35057Q0985
$$ y = [281620, 249055, 242925, 225910, 263414, 282721, 308840, 250840, 291715, 300631, 352488, 467362, 422655, 393526, 445356, 386458, 396539, 478241, 424465, 347751, 273845, 269507, 350062, 387516, 396677, 396848, 360389, 350748, 372868, 421535, 399043, 385285, 421538, 417400, 342433, 383941, 526705, 508296, 533214, 537548, 553491, 540465, 563567, 560585, 492260, 553867, 521754, 578036, 523746, 533850, 557276, 485356, 462311, 473876, 480594, 536111, 573194, 580286, 579070, 550164, 604757, 597342, 633700, 596390, 602602, 622031, 543617, 645798, 672326, 683742, 667683, 721895, 783053, 750658, 792740, 852914, 825591, 857348, 867911, 831603, 879737, 996263, 1031785, 990449, 991316, 1033425, 1107495, 1157235, 1189769, 1234242, 1382708, 1483226, 1511853, 1646910, 1727895]
2062A727895N5812J78405K33973K60961J09227J21767J35891K06500L62828L42243
2052C735502M51374N52586O73747O87428J000128J228799J599834K157467K782057
2043A4868922J491230k248648k517749j379845j535166j571801j185608q55879
2035E065456o37987m51648l55187j93125k38341j84957k56777k42511j65463j93134
2025B146326k09202j60071j0139q7266j43750j41412P409m8062j15462o5659j01851
2014A070861k1210O8393j2818j03305r2566p1446j8858K9905N6161q0752p3176
2003G51189K2558J2258m8838r6400n6086N07l6007K5088k2025j3225P1751k1885
1991E88885j3967n0621J0795o6294p4582J9114N189J384j8746J1674L6438L5866
$$ y = [1727895, 1783707, 1962112, 2196085, 2457046, 2566273, 2688040, 2823931, 3030431, 3393259, 3735502, 4186876, 4739462, 5413209, 6100637, 7100765, 8329564, 9929398, 12086865, 14868922, 16360152, 14111504, 11593755, 10213910, 8678744, 7106943, 5921335, 5065456, 4427469, 3975821, 3620634, 3427509, 3189168, 3004211, 2747434, 2504923, 2339460, 2146326, 1937124, 1777053, 1766914, 1679648, 1535898, 1394486, 1401895, 1353833, 1238371, 1172712, 1070861, 1049651, 1118044, 1105226, 1001921, 909355, 837909, 819051, 848956, 905117, 824365, 751189, 773747, 786005, 737167, 640767, 584681, 585188, 549181, 574269, 552244, 539019, 610770, 588885, 574918, 524297, 535092, 468798, 394216, 413330, 418519, 419903, 401157, 412831, 449269, 485135]
1979D85135p8022M7319q668K6819n6611n8515o5170p253R4000m7828M3688M1438
1967D16332j6112n2589l0158L3083l9510m7596k3451k3280M0057K1060l8726R115
1955B48225N4984k996o4058m145O4305r479L8967k3966k9961q919l4396L4902
1943B63463j18951K062k0020K6691L9916J4662l017l6544k1757J7373j1693l3415
1931A18770M5239J0888L8216k4844j2570K6782l1680k6327l4915K8464L9380M0528
1919B17931J2606l1240r7997M7346r273O954j4844L518Q966n3069K1247k54M0287
1906A52178l5339k3556N5086J3623L670k6799l9068l8787J16639N8651r6964m9001
1894I0333j371R7253J9558q8920k3983M9823o544n8190O5002N2772j36400K2622
$$ y = [485135, 407113, 454432, 445764, 472583, 415972, 357457, 292287, 285034, 379034, 331206, 374894, 416332, 400220, 347631, 317473, 350556, 311046, 263450, 239999, 216719, 256776, 277836, 239110, 248225, 303209, 300213, 236155, 232010, 296315, 286836, 325803, 301837, 271876, 262957, 228561, 263463, 144512, 146574, 126554, 153245, 193161, 207823, 204806, 168262, 146505, 163878, 152185, 118770, 164009, 174897, 213113, 188269, 175699, 202481, 170801, 144474, 109559, 138023, 177403, 217931, 230537, 199297, 101300, 148646, 139373, 146327, 131483, 135001, 143967, 90898, 112145, 111891, 152178, 116839, 93283, 148369, 161992, 165662, 138863, 99795, 61008, 177647, 236298, 139334, 90333, 88962, 186215, 205773, 116853, 92870, 142693, 136149, 77959, 142961, 195733, 59333, 81955]
1882H1955N0052M3335m1340M4823J8170q66o9677N5364P054J5174n6159K0083
1870A67968J3358j7173m3786p2468J8430M055J6766N0394N4468K8493n7365n0604
1858A12536K992r255m9144J1879R3483J072J7224k985p8766j2106L7181p2075
1846E2036J3777l3677P4237m3454N89N9103q8363L6407m15O553L2345M2690p6078
1833G5750k1018J08956K966p4175j7948q2908J5863Q5380j941q4134K1205L2394
1821F0390n6261P6387p2664K5508L4673n1035L7544J02302k9139j6782L4603q9295
1809E6231Q392J259Q1949N3745j02018l717R7730o7281r866M3019n9700k0782
1797G8961J7193m8402k900Q1134j1904N131r4582r075o2m1967m7482O6346K7717
$$ y = [81955, 132007, 175342, 134002, 178825, 196995, 196129, 126452, 181816, 188870, 204044, 147885, 167968, 181326, 164153, 120367, 47899, 66329, 70384, 87150, 137544, 192012, 220505, 163140, 112536, 115528, 106273, 57129, 69008, 162491, 163563, 180787, 177802, 99036, 86930, 124111, 52036, 65813, 32136, 106373, 62919, 63508, 122611, 34248, 70655, 70240, 76793, 109138, 151828, 75750, 54732, 163688, 166654, 92479, 74531, -8377, 7486, 92866, 90925, 6791, 27996, 60390, 4129, 80516, 7852, 33360, 68033, 16998, 54542, 156844, 127705, 110923, 145526, 56231, 64623, 65882, 147831, 201576, 99558, 95841, 193571, 126290, 116424, 159443, 99743, 78961, 96154, 47752, 44852, 125986, 114082, 119213, 24631, 15556, 15494, -26473, -73955, -7609, 20108]
1784B0108J7638o3096K6808N904l9511O0133O1163j1537j0115k1166l3652O9810
1772H2487k5205j3372j0326j0198k6519q208M4397j8024M7255n407l9781M0027
1760E7126Q296l208K5507m779k1810q2123p748P2214K3017k5346k9170k8688m432
1747b1144o769L7602P8593J0729j3961n0098K8483M239M3361Q993n6982k0162
1735D2884j4447M9486m0688K6624j2191l5745O8097n92o8612L7490l3138Q289
1723B7457J00R204Q9958p9781o9720l6124n7731R7806R6591k4265n4317k6665
1711b7487Q745k9836k0823P9314O0201o1972k0092o6195J19198k6033M655j9791
1699a16j0237N8228j6800k3557J4331J2422P471m6817K2157m9825n8026P3716
$$ y = [20108, 37746, -25350, 1458, 7362, -32149, 27984, 89147, 77610, 67495, 46329, 12677, 82487, 57282, 43910, 33584, 23386, -3133, -11341, 33056, 15032, 62287, 56880, 17099, 57126, 65422, 62214, 87721, 82942, 61132, -20991, -28739, 43475, 66492, 41146, 11976, -16712, -21144, -27913, 9689, 88282, 99011, 85050, 34952, 63435, 67674, 111035, 120028, 63046, 42884, 28437, 77923, 37235, 63859, 51668, 15923, 84020, 83428, 14816, 52306, 19168, 27457, 27557, 36761, 126719, 46938, -22782, -58906, -116637, -18831, 77760, 53495, -822, -27487, -18742, -48578, -69401, 9913, 70114, 8142, -11950, -78145, 41053, 15020, 19675, -116, -10353, 47875, 31075, 7518, 21849, 34271, 41742, -5075, 17082, -32743, -90769, -17053]
1687a7053L2332j7985k090q445M1478k7091M7942j9605j2318k2518m3210J36571
1675H8008j02504l6706K0579K9049l7716M0534L6551k4066k7374L7244K5219p4097
1663b5279K481L4144m531l1729l8475J3161Q54o135n166R4297L352n5818M6746
1650B7902p6483M9030R305K7936l3045O2429l0524J0085K8168l8301r1299K2494
1638c2303O7753l2423m7827J05650K1157r1776l6634J8822L0923M800M8506n5748
1626I00K6027j2566M3624J8842j1044m1893r5666O8932j826M329L7929l239P0872
1613A05221n9052p0873N5563J8837k5856M1214q2740L8020k4260M5419o0246m676
1601b3429K4127O3291k9559k1625m4806k7061O1951K536j3583J7451l4115J1740
$$ y = [-17053, 15279, -2706, -4796, -13241, 28237, 1146, 49088, 29483, 17165, -5353, -48563, 88008, -14496, -51202, -30623, -1574, -39290, 1244, 37795, 13729, -13645, 23599, 48818, -25279, -22798, 11346, 6815, -24914, -63389, -50228, -49374, -55509, -60675, 33622, 36974, -18844, 27902, -48581, 449, 9754, 37690, 4645, 67074, 36550, 46635, 74803, 36502, -54797, -32303, 35450, 3027, -44800, 60850, 82007, -9769, -46403, -27581, 3342, 8142, 56648, 900, 26927, 14361, 57985, 76827, 65783, 23890, -71776, -2844, -4670, -341, 37588, 34349, 105221, 46169, -24704, 30859, 49696, 23840, 65054, -17686, 20334, -3926, 41493, -18753, -23429, 698, 63989, 34430, 12805, -32001, -59062, 2889, 5425, -8158, 9293, -24822, -13082]
1589a3082l5797n2217J04834O3604k5016p3450M1478J8231j0589p327N851M8986
1577F5506O116L2120p9583j3869k4339O5503L3675m5863j4422R634k9331J0867
1565A6014j0049N088j9448N465j1899K8323L3192n0805M3642P519l034L724L7721
1552H5453j03884R8590L398q0069k1958r21O4065j9660l6485m868k5847L4378
1540g808J3389M3112j14369P2665L1214m0428J8680m693M5373L3187P9790m530
1528A65582j22178M2115k2409p3431M0501K5127j01253l9073R9169M5624K945
1517F2719l2349L0450Q9152K1812k8551j14855l7486K2565K2994J955o2820q5090
1505a09504J3565J1537N4286P2275M7510p7387L3626L8281K826J2537r8429j2805
$$ y = [-13082, -48879, -101096, 3738, 67342, 42326, -31124, 10354, 28585, 17996, 10669, 16520, 65506, 71622, 103742, 24159, 10290, -14049, 51454, 85129, 39266, 24844, 34478, 5147, 16014, 5965, 11053, -8395, -2930, -14829, 13494, 46686, -4119, 39523, 47042, 44008, 47732, 85453, -18431, 80159, 83557, 3488, -18470, -19391, 44674, 25014, -11471, -16339, -42186, -7808, 5581, 48693, -65676, 6989, 38203, -2225, 16455, 11762, 57135, 90322, 170112, 165582, 43404, 85519, 63110, -10321, 30180, 55307, -45946, -85019, 14150, 59774, 62719, 30370, 60820, 149972, 171784, 143233, 28378, -9108, 13457, 36451, 38406, -24414, -109504, -95939, -84402, -30116, 42159, 89669, 12282, 45908, 84189, 87015, 99552, 1123, -11682]
1493a1682m027n046P4609L960N005k681m4490j7086J5065J5419m8987k5401N0615
1480E273Q1592k8620k5571o4183R0381J1005j4035K5713r6627K592O2867K8189
1468G8576p5654n4382P1498M0222k0486l0578K301m9012n9734O2149J19648n5616
1456B8932q1988j6519M4871L0591L09R127m249r487L1246n1917m0172P9174P2089
1443I2007j06064M6922J8923o8517l3102M952l649N7911L1379o9727N8746m1348
1431a1567O3115M1465r3775j6593l883R5563k8600p0410L6288l3895K1931j4213
1419a4574O6833L815l5450n9468o0278P2387l1078O4249P747q6527O9300k9435
1407c2479q846J0570o5441O3112M6091K3558j6600j0893j87k589m0844j03786
$$ y = [-11682, -15709, -20755, 53854, 57814, 62819, 60138, 15648, -1438, 13627, 29046, -19941, -45342, 5273, 86865, 58245, 32674, -31509, 58872, 69877, 55842, 81555, -15072, -12480, 50387, 78576, 2922, -51460, 20038, 60260, 39774, 9196, 11497, -37515, -97249, -35100, 84548, 28932, -53056, -69575, -24704, 5887, 6196, 15323, 11074, 1587, 32833, -19084, -59256, 19918, 92007, -14057, 32865, 51788, -16729, -49831, -44879, -48528, 9383, 40762, -28965, 29781, -11567, 51548, 93013, -762, -17355, -21238, 74325, 45725, -24685, 11603, -22292, -361, -14574, 52259, 56074, 20624, -38844, -99122, -26735, -57813, 6436, 14183, -72344, -3044, -32479, -41325, -30755, -96196, -33084, 13007, 36565, 19965, 9072, 8885, 6296, -34548, -138334]
1395a38334J36525j820l3563O4387o0993j881K0294J01537j05172k7954K4245
1384b2729k2057Q546M5023Q460m618j4201j20495L5214O1269M984N3306k7981
1372D721q5776N864P6113n720m8108J106m922j8955L2923l6129M3715P2027n0473
1359a3614l3461m3783J2207N1118J5607o220l7869k7587O167j2242J06264M2331
1347E8918j09881K4422j7353j0722m8173L715O2890j4957J05991J8886m6987J6683
1335D3432o7277n5348J08321k4309n44l8619k4275P4214P515o5399J57397l9177
1323G5931n96p0517j4935L6988n2086K662q941J3694J1675L3527l0945m051n8493
1310f6087K1576K6562L1223K7342q1229Q9661o2157j2140N2873q147j6882l1683
$$ y = [-138334, -1809, -3629, -37192, 27195, -33798, -35679, -15385, 86152, -19020, -46974, -22729, -44786, -36240, 8783, 17243, 12625, -1576, -122071, -86857, -25588, -20604, 32702, 4721, -81055, -75191, 922, -4798, -52906, -51800, -56722, -75677, -42754, -78883, -35168, 36859, -13614, -47075, -90858, -78651, -27533, -11926, -18146, -56015, -83602, -77435, -89677, 16587, 58918, -50963, -26541, -43894, -54616, -102789, -99074, -36184, -51141, 54850, 73736, 26749, 43432, -23845, -79193, 29128, 4819, 4275, -34344, -58619, 15595, 23110, -42289, 115108, 75931, 75335, 4818, -10117, 26871, -25215, -22553, -31494, -17800, -6125, 27402, -3543, -7594, -66087, -44511, -17949, 13274, 40616, -40613, 49048, -13109, -25249, 27624, 19477, 2595, -29088]
1298b9088k6067M1037n0049M9174L4172j6937r650n4475J3139K0078m2082q2255
1286a53003N4975q4723O1567M2978O507J4262L8600q756N5716j2557N5445O8058
1274A39069r3704m6611K2408L7070j9877P619P718l034J8827l3825n6314k1533
1262d2187l76M1050k1350m126N6559j0171J8488j3026k9292K3122L353n0513k6245
1249e4714M9843R4902J4594m4974r0752J02349k9304k8663j741m1989K904L042
1237b4503J3949J10437J9338n2645K0969k4544p2552j5432M937j0985Q028j8386
1225d1389j0199M983L0218K8852k5727j8127p587k9422Q8756Q4588k3570j14095
1213c2719m975l3881K6178Q785j3981m9947K9793J00893K7838l3857k352N8076
$$ y = [-29088, -55155, -14118, -64167, -14993, 19179, 2242, -7408, -61883, -48744, -28666, -70748, -153003, -98028, -182751, -121184, -78206, -71699, -57437, -18837, -27593, 28123, 15566, 71011, 139069, 45365, -1246, 21162, 58232, 38355, 45974, 53692, 50658, 69485, 35660, -20654, -42187, -42563, -1513, -22863, -26989, 29570, 19399, 37887, 24861, -4431, 18691, 22044, -28469, -54714, -4871, 90031, 104625, 59651, -31101, 71248, 41944, 13281, 11540, -30449, -27545, -24503, -10554, 99883, 119221, 66576, 87545, 63001, -9551, -24983, -20046, -31031, -23003, -41389, -51588, -46605, -16387, 12465, -13262, -31389, -38976, -68398, 20358, 104946, 81376, -32719, -37694, -71575, -45397, -36612, -50593, -100540, -70747, 30146, 57984, 24127, 21775, 79851]
1201G9851k4702M297p0922J7937q9267L3890O0371o7757n6974K8791M8579K7583
1189h323P0324k7068o0632k9460L7261l1557Q179N0802j0168n150n5143j7550
1177g8485M1694N9122J2704m7166N7898k7274r0965l3233L7596l1605k5299M555
1165a20458l4435l4414R8129N4400N55l4707k6538N1304l9613K6867L017j01500
1153a57393J17324l133M0820K6871K6310o384j8195q452j1285J5503k0630j2636
1141a1280L4715k7734j9357l0445L5649K759K5996l6190l1641k8748J9548Q4804
1129A8076p7868R1990m9722j0901j743q177J16877R574n8645p4313j34952Q1492
1117i8312N5916L0685r400J8666J5389m7568L0746K0493p2960L3659P1436K0779
$$ y = [79851, 55149, 59446, -11476, 6461, -82806, -48916, 11455, -56302, -113276, -84485, -35906, -8323, 62001, 34933, -25699, -55159, -17898, -49455, -41276, 9526, -642, -5792, -60935, -78485, -36791, 22331, 35035, -12131, 45767, 18493, -72472, -105705, -68109, -99714, -125013, -120458, -154893, -189307, -91178, -36778, -36223, -70930, -97468, -46164, -85777, -58910, -55893, -157393, -40069, -43202, -2382, 24489, 50799, 44415, 26220, 17768, 6483, 21986, 1356, -11280, 23435, -4299, -23656, -54101, -18452, -15693, 10303, -25887, -57528, -86276, -66728, 18076, -59792, 32198, -17524, -28425, -30168, -38345, 78532, 88106, 29461, -44852, -179804, -98312, -42396, -11711, -21111, -2445, 12944, -34624, -3878, 16615, -56345, -22686, 48750, 69529]
1105F9529n0595l1252o131j7263k2128P5629j5074O1140N3979r3780j2224m8993
1093c7163Q134j8313N1397O1620K0024l5045j8170l0298N303l2968N8917k2889
1081A0549m0213K9664m8545K0978K7899K5146q1916N6795O1762o4828k277J633
1069c353K1174J0377O221o955r6203J3226N5677O588O8283j7012L2242J3402n8179
1056D5488o2790m5859M3852L6040N0538m2907J7203k3923n2558k1288K3120K6544
1044f540K9993J2090P48n8027J5526m576o8902L4246k698J03345l4829o4570J3958
1031c0236M1059L4009j2405k4465j7292k018l2179l92L8035o297P0146n1348q4071
1018g7454K8497M5630p175n217j9996K8292M8852J1944m7306o2263J11717J44
$$ y = [69529, 18934, -12318, -18449, -35712, -57840, 17789, 2715, 63855, 117834, 24054, 11830, -37163, -29029, -47342, 4055, 65675, 85699, 50654, 32484, 2186, 7489, -25479, 33438, 10549, -29664, 0, -48545, -27567, 332, 25478, -56438, 357, 62119, -2709, -4986, -3353, 17821, 28198, 34419, 27464, -68739, -55513, 164, 6752, 75035, 58023, 90265, 103667, 45488, -17302, -63161, -19309, 16731, 67269, 24362, 41565, 17642, -34916, -56204, -33084, -6540, 23453, 35543, 36291, -21736, -6210, -10786, -79688, -45442, -48140, 55205, 20376, -44194, -30236, 10823, 44832, 32427, 7962, -9330, -11348, -43527, -43919, -5884, -12181, 57965, 6617, -77454, -48957, -3327, -10502, -15719, -35715, -7423, 41429, 53373, 6067, -56196, 55521, 55665]
1006E5665m4580j04404M9218j0350l0521L693N3040P4295l8853N6690Q378l4606
994C7665j116o56k5987l5851O6661N7017q2122j15836j1649P8605j1473j2077
982e6819O5188J0883p0968K1053j0043J4261j4076N2774j0297j085n0147k1081
970g0357j4440l5044j2077J7918L2762K9183K7470l4097M9219m3156j9925p484
958h0028P9734j0198M4508l6946r8201Q1558M0724N6319o2336J8697J829l0544
946E116K3900p652L5376r347L6840M1456k7844k4454P127m5817l1938K5719O0999
933H9481p2452k3528m452K9037J609m2191K333l6917J4455O8037m454L5968k3495
920C3431p4356j227L2547m774n2216L5521P5129M9512n8830L2782n6553o5997
$$ y = [55665, 11085, -93319, -44101, -54451, -84972, -81279, -28239, 46056, 7203, 63893, 72271, 37665, 36549, 35893, 9906, -25945, 40716, 97733, 15611, -100225, -111874, -33269, -44742, -56819, 8369, 19252, -51716, -30663, -40706, -26445, -40521, 12253, 1956, 871, -49276, -70357, -84797, -119841, -131918, -114000, -81238, -52055, -24585, -58682, -9463, -52619, -72544, -80028, -294, -10492, 34016, -2930, -101131, -19573, 21151, 77470, 15134, 33831, 35660, 5116, 29016, 21364, 56740, 47393, 84233, 125689, 97845, 73391, 80518, 34701, 2763, 28482, 89481, 17029, -6499, -10951, 18086, 19695, -22496, -20163, -57080, -42625, 25412, 20958, 56926, 33431, -40925, -42152, -9605, -14379, -66595, -31074, 44055, 93567, 34737, 67519, 10966, -55031]
908e5031n0782k133P1678K2168l3478J4094M0017q501J8325M9970p5472k3263
896c2408L2939j5677K0298m0470J7586L9934J2738k8275n1685n5215R0651N6972
884D7388k6993o53M9555J5396J9634m3895k0728p0403L599O5454q3365P5093N0972
871H1054J8970K8373j6236p9742j1589O1918m2685n2285O3588l0938l5005J0617
859c960Q3884p231o1404m9035J3649k4393O9536Q882K4379r580o3332J11122J7768
846A10285n2108m4101k5719J1537L9380k6593O0432J7238j22467J8841M0641r2150
834f4784j4073M0378j3647L1632K3096K2171n50K2594J4187j02848Q9525m0142
822G539K7240k7891l3241o5924n427Q2429J7443k7203j9440n828l9679Q7257J8389
$$ y = [-55031, -105813, -107946, -36268, -14100, -47578, -33484, 6533, -1968, 16357, 66327, -9145, -32408, 531, -15146, 5152, -35318, -17732, 22202, 34940, 6665, -45020, -100235, -9584, 47388, 20395, 19742, 69297, 84693, 104327, 60432, 39704, -30699, -27100, 38354, -45011, 30082, 81054, 100024, 128397, 112161, 32419, 20830, 82748, 40063, -12222, 51366, 20428, -14577, -3960, 79924, 72693, 11289, -37746, -24097, -48490, 21046, 29928, 54307, 44727, -18605, 92517, 110285, 58177, 14076, -11643, -106, 39274, 12681, 73113, 90351, -32116, -13275, 27366, -64784, -78857, -38479, -52126, -20494, 2602, 24773, 24223, 46817, 61004, -41844, 47681, 7539, 34779, 6888, -26353, -92277, -97704, -15275, 2168, -25035, -44475, -50303, -89982, -2725, 15664]
809A5664l4757l2122M6198L7622N358o2537q4072J5571Q3573L7040K1446k4186
797B4798L3671m035r4784K2537M2932k5913J181J5672k0635N2295M925m5422K038
784I260J428J8808l2652J946J2392l7642j6557q851M1552L2817O4854n6254l5662
771d561M4721p5014l1418O6151m0512r268M5543K5971J5146r7759M121m2511O0831
758c8559P5063m790j672o5797M6216n9179q150K5069j1699N0827L5594j7140k0346
745E437K909n0739l8543L8641j6500L6851n0464m1222R4551j569m0540K7942Q8222
732E4976P037m2466M6322o9328l3001r439J407M8754k1378J01433j25463m8002
720h9148J01973l2419K7791K0285K5754k2241P6489l2047m4338l571J1136L6155
$$ y = [15664, -19093, -51215, -5017, 32605, 37963, -24574, -108646, -93075, -9502, 27538, 48984, 24798, 58469, 54434, -40350, -17813, 25119, -794, 387, 16059, -4576, 47719, 52644, 7222, 9260, 10688, 29496, -3156, -1210, 11182, -26460, -43017, -51868, -10316, 22501, 87355, 31101, -4561, 40160, -34854, -66272, -121, -40633, -49901, -4358, 21613, 36759, -61000, -56879, -99390, -38559, 36504, 31714, 30042, -35755, 10461, -48718, -56868, -31799, -43498, 7329, 42923, 25783, 5437, 8346, -42393, -80936, -42295, -58795, -21944, -72408, -113630, -19079, -20648, -61188, -33246, 54976, 62013, 19547, 65869, -3459, -36460, -45899, -44492, 4262, -17116, 84317, -41146, -89148, 12825, -19594, 8197, 28482, 54236, 31995, 108484, 76437, 32099, 28528, 39664, 75819]
708G5819n4013j0981j2341O776P7011n9015m0267R4299q150q4753j7295J7531
696a5379j5151O6074m9579j0089J2957J4608m5752L764k4394K945J5207K2656
684b2133o4048J3362l8372N2767J9907O045K7326K3735J0796P468k9309M5835
672E3379r2810r520q252N4430P2245l0180N345o5614N0728m9344k3602l0114N8728
659a4581j0552L2269M477j8678l584l6165j303Q5299p2348N9598P1629r5518K735
646C278O7523K5826L6197m8236k4947m9093n8495k380N6901N8365r9878k0658
634e5597P2623n4725N3618J4691n5675o921Q2584L9161m9774m3116Q946J5764
622B1579K4260m8816K1726j1845l5633N5514L6543j6755N32p9139j3062J9520
$$ y = [75819, 21806, 10825, -1516, 5260, 82271, 23256, -17011, 77288, 69138, -15615, -32910, -15379, -30530, 35544, -14035, -24124, -11167, 3441, -42311, -38547, -62941, -59996, -44789, -22133, -86181, -72819, -111191, -58424, -38517, -32472, -5146, 18589, 29385, 36853, 7544, 53379, -39431, -48951, -57203, -2773, 69472, 39292, 44637, -20977, 29751, -19593, -43195, -73309, -14581, -25133, 7136, 11613, -7065, -10649, -46814, -48117, 37182, -35166, 24432, 96061, 543, 3278, 70801, 96627, 132824, 84588, 59641, 10548, -47947, -50327, 6574, 64939, -34939, -55597, 17026, -37699, 15919, 30610, -25065, -31986, 50598, 89759, 39985, -3131, 5815, 21579, 45839, -2977, 18749, 6904, -28729, 26785, 63328, 46573, 47105, -32034, -45096, -25576]
610b5576J4290L3117j1435K7159o954n8312l971k0323q921N8026k3586Q377J5189
597b920k122m6381O6029m0546o7984L2222M4599l824J1954N1160O0708l5036l1465
584C6394l859p8490n4880M5627N0936K7336R201M3098q0149o9369N3753j1007
572c1409k2794N0839o835k0156j0373k6790j1314Q3590M1392l5810o9928j0527
560g0115J15187n6620R570j6137K2980M4309m2384J7415m1656Q766J881m531R5420
547H4085j6129j2636m2814k4103J8244k6958L6458M8055M6132r3170p2181k5685
535h0702M9230J428l8640j974m3279J8888k1966J2345M6702M5202l4907k5931
523g3604O9630J8242q534o856K1644J8196P7051o8522j0258n3154j788N3829M2091
$$ y = [-25576, -11286, 21831, 10396, 37555, 30601, -27711, -31682, -52005, -60926, -2900, -26486, -18109, -2920, -5042, -51423, 14606, -25940, -93924, -61702, -17103, -20927, -8973, 42187, 102895, 67859, 36394, 32535, -45955, -100835, -55208, -4272, 23064, 32265, 75363, -4786, -74155, -20402, -31409, -54203, -3364, -10199, -30355, -40728, -67518, -78832, 4758, 46150, 10340, -59588, -70115, 45072, -11548, -1978, -18115, 4865, 49174, 6790, 24205, -17451, -8685, -6804, -11335, 84085, 67956, 55320, 12506, -11597, 6647, -20311, 16147, 64202, 110334, 17164, -55017, -80702, -31472, -30044, -68684, -70658, -113937, -95049, -117015, -104670, -57968, -12766, -47673, -73604, -3974, 14268, 5734, -1122, 20522, 38718, 115769, 47247, 36989, -16165, -17953, 35876, 77967]
510G7967r5221k2629P3786L2733o4770K8540N1463j09925N1963k5098m7044l7786
498h6021K6415P919L5033P733P6261n2711l8237n610J021l0124P1663J41444p1912
485H2874j08010L9538O636l6844M928n013k1672L1301Q495j3693j9972p1019M2554
472e9897K9391l8996M2127J03783p3126j3435K1938p6930j0081o089O1298l182
460b3199J5202N0205k7684L2333j6494J7784m9450l2154R163L1935P16m9598K8429
447a2812J6834J9975o5214J33931k2547j0622Q5792q7238n6136j768k7304N975
435b1134O5209N3872J9756r8911k8302j9180L9430j6014J191O2455N1066p3831
423C5607l7707k0548L0504K1367m0097M6874n1033q702Q1052l7292j0145K8174
$$ y = [77967, -17254, -39883, 33903, 66636, 1866, 30406, 81869, -28056, 23907, -1191, -48235, -86021, -59606, -51687, -16654, -8921, 67340, 14629, -23608, -29218, -28197, -58321, 13342, 154786, 82874, -25136, 14402, 21038, -15806, -10878, -15891, -37563, -6262, 2233, -11460, -31432, -102451, -59897, -30506, -69502, -27375, 76408, 3282, -10153, 11785, -65145, -75226, -81315, -20017, -23199, -7997, 42208, 14524, 46857, 30363, 48147, -1303, -33457, -24294, 7641, 8357, -41241, -12812, 4022, 23997, -41217, 92714, 70167, 59545, 145337, 58099, 1963, 195, -27109, -21134, 44075, 97947, 117703, 18792, -9510, -28690, 10740, -5274, -4083, 58372, 109438, 35607, -2100, -22648, 7856, 29223, -10874, 36000, -15033, -23735, 57317, 20025, 9880, 38054]
411C8054p629j9128j08886Q0371J5250K851j8735J0706K3242l4800N4069l177
399C2188q04n7829l3076k6279O5182K4446L7910o9478L726K6592J1303M2347M061
386F0289m6703m0724R0834N9060L550k2270m0648p0403O1089O74l9791k3124P0940
373F2773J1848J5547l5338j05557j0418N786J7840J6183J9081K1064M5810k3887
361D0732r9857P032M6018M1628p4091M5419M510o1206M8571k2622l6274p3739
349a33879M1174L7840L6836m1315O1726n0523K407L0417M8950O8839n8158n2849
337h535n6811N6713N8451K3509k1946r3706p7562L216O3317N0105R058L9099l3874
324A1034Q000J7471j6515K6515J0991O494J2977k1680k7362k2316Q424m8084k7417
$$ y = [38054, 30425, 11297, -97589, -17218, -1968, 883, -17852, -7146, 16096, -18704, 35365, 32188, 31384, -26445, -59521, -85800, -20618, 3828, 41738, -27740, -24014, 2578, 13881, 56228, 60289, 13586, -27138, 63696, 122756, 126306, 104036, 63388, -7015, 54074, 54748, 14957, -8167, 62773, 74621, 90168, 54830, -50727, -61145, -55359, -37519, -21336, -2255, 18809, 64619, 40732, -59125, -52093, -6075, 35553, -38538, 6881, 11391, -49815, -1244, -23866, -60140, -133879, -92705, -54865, -18029, -59344, 2382, -48141, -45734, -15317, 33633, 102472, 44314, -8535, -65346, -8633, 49818, 73327, 51381, -42325, -119887, -116671, -53354, -3249, 5809, 44908, 11034, 19034, 36505, 19990, 46505, 57496, 63990, 76967, 55287, 27925, 5609, 14033, -34051, -61468]
311f1468M549O4085j7266n5077R2034l2561m1013Q6372j5566L9956m6022o8521
299e0498K3317j0584K8959L9855l2475J5524Q7935l1732j32087N2862O4396l5805
287A9667o0626K7169O070M7793k3754k1255L1928j6606j9784K8163K8314p64M5431
274I1746j4654l6849m7009P4758L0412k3937q1824l0293L043m6446K2016k093
262f1130M5552L1373m4564M6701K4870m6523J1908K1960l1622j8871j2209O9580
250C7025m3789N6203j4588k0793q105N4486K4227r8670L1689J7955o250K5663
238E5053j72011M9293j2602j9489J12672k8911l3846M6698K5227R790L0199k2096
226C9977n2637O7874k47m7791L2959q8029j2355K5003P3327l5121n156Q504L7933
$$ y = [-61468, -56919, 7166, -10100, -65177, 26857, -5704, -46717, 39655, 24089, 64045, 18023, -50498, -27181, -37765, -8806, 31049, -1426, 14098, 102033, 70301, -61786, -8924, 55472, 19667, -40959, -13790, -7720, 40073, 16319, -4936, 26992, 10386, -9398, 18765, 47079, 46315, 91746, 77092, 40243, -6766, 67992, 98404, 74467, -7357, -37650, -34607, -81053, -59037, -61130, -15578, 15795, -28769, 17932, 42802, -3721, 8187, 30147, -1475, -20346, -32555, 37025, -6764, 49439, 34851, 14058, 5953, 60439, 84666, -14004, 17685, 35640, 29390, 55053, -116958, -67665, -80267, -99756, 12916, -15995, -49841, -3143, 22084, 31874, 62073, 39977, -12660, 55214, 54967, 7176, 40135, -47894, -60249, -35246, 38081, 2960, -2196, 6308, 44241]
213D4241j3028l6069J6893o0536O761N4097j3365o5435l9466J53478q1572q0933
201a14934Q6820R6454n803o0657m4967k1312L7280L2502J7494J4241l3616r568
189f066L6088j8096j2424O463P406Q476p918K9954J4769l9517O0083l0853O162
176E4527J0330J1206J1064n172j2212j7330k9285o2259N303m0613n888M6756O9329
163C5756p1353P381M5341m7637L6717L747j6272K4528q882j4699J2057N420l7902
150b5798O8413j4394l984R43m3191N4956j1024o0656Q015k320k2158j8154O7840
137a512n8854l3782R1818m9596M5602Q0498n5342l7760N0660k9682m5204M1480
125a674K9390K2949P1488j5840n2561J2376q3103L7883J9009q047k3788n4635
$$ y = [44241, 31213, -4856, 12037, -48499, -41738, 12359, -1006, -66441, -105907, 47571, -34001, -114934, -28114, 68340, 62537, 1880, -43087, -64399, -27119, 5383, 22877, 37118, 3502, -6066, 30022, 11926, -498, 5965, 13371, 21847, 13929, 43883, 58652, 19135, 79218, 48365, 54527, 64857, 76063, 87127, 81955, 69743, 52413, 23128, -39131, -33828, -74441, -80329, -33573, 35756, -35597, -28216, 17125, -30512, 6205, 9952, -6320, 18208, 9326, -5373, 6684, 12104, -25798, 42615, 28221, 24237, 25180, -18011, 36945, 25921, -34735, -26720, -29040, -51198, -69352, -1512, -60366, -94148, -2330, -51926, -6324, 74174, 18832, -18928, 31732, 2050, -43154, -1674, 27716, 50665, 122153, 106313, 53752, 66128, -16975, 20908, 39917, 31870, 8082, -46553]
113d6553M0505n2935P2678j1939l3323N7932J4234o9139M1056P026j1535j1318
101c311K3622N0507p868q310l3071l583M6017K1471k6967p7590K8264j988o4807
88e7614K5648J2390J4057J330L5235K0584l5701j311K928Q386q858P4518n8643
75C2949j053j6003j807K7096q2873L9222m677K4250J5581k4091n657j086J3716
62A5567K0982M753j3465j4446O81j8378m4696O0384P038J4581J400p0332K62L2878
48b791m259J1236j480n2676L3061k9448k2988M1421M3637K2386K312l6470K3692
35B7633O915l7641K5718K255j4868J4309k1214l4443k8403O8130k2256j0891O0695
22C5939l8313K8499J0493m3341K0778j0987k7294J7356J8795K5251o013m5795
$$ y = [-46553, -6048, -58983, 13695, 1756, -31567, 26365, 40599, -28540, 12516, 19542, 8007, -3311, 20311, 70818, 62950, 54640, 21569, 17986, 64003, 85474, 58507, -19083, 9181, 7193, -57614, -31966, -19576, -5519, -4189, 31046, 51630, 15929, 14618, 17546, 25932, 17074, 91592, 32949, 31896, 15893, 14086, 41182, -41691, -2469, -7146, 17104, 32685, 8594, 2937, 1851, 15567, 36549, 41302, 27837, 13391, 14072, -4306, -49002, 11382, 18420, 33001, 34401, -35931, -35669, -2791, -7050, 4186, 2706, -49970, -16909, -46357, -69345, -27924, 15713, 38099, 40411, 3941, 27633, 34548, -3093, 22625, 24880, 10012, 24321, 3107, -31336, -59739, 8391, -13865, -24756, 35939, -2374, 26125, 36618, -6723, 14055, 3068, -24226, -6870, 11925, 37176, 31163, -14632]
10a4632j0676L0618O0905l469Q519n3201j7288j0753N6264j8108
0B8179
$$ y = [-14632, -25308, 5310, 66215, 62746, 71265, 18064, 776, -9977, 46287, 28179]
$$ Imaginary data points
##PAGE= N=2
##DATA TABLE= (X++(I..I)), XYDATA
16383c050434K5038L5048k2115O2912N7685M6617O1463K7761O3803P9368K3375
16372b589479J2462O5262n95Q1102J7716K9030M3031J8302M2007J7216M2604N4258
16360b167084N3752O6143M6083L2033K8872M6362N8214J7351M8387O9330N0764
16349a649793q762M008Q4791P5638j9784K6811N4381K4309M213N1131L1590N5616
16337a265851M9554N1617N7256M8057R793J9611N7180M3637j6846M7321P4587
16326h24084o210M5115j0712L7486J09959K1470M703P1491O0170k8831M7218O1894
16314d10331K9343O964M6007L0764N8889O8597M2845O284l6034N8247L5412N898
16302e7115p67L8583P1977N2967K6937L9675J6262J1461M0772O4715J7665O951
$$ y = [-3050434, -3025396, -2990348, -3012463, -2949551, -2891866, -2845249, -2783786, -2756025, -2692222, -2612854, -2589479, -2577017, -2511755, -2512350, -2431248, -2413532, -2384502, -2341471, -2323169, -2281162, -2263946, -2221342, -2167084, -2113332, -2047189, -2001106, -1969073, -1940201, -1893839, -1835625, -1818274, -1769887, -1700557, -1649793, -1658555, -1654547, -1569756, -1494118, -1513902, -1487091, -1432710, -1408401, -1404188, -1353057, -1321467, -1265851, -1216297, -1164680, -1107424, -1059367, -1049574, -1029963, -972783, -929146, -945992, -898671, -824084, -830294, -785179, -795891, -758405, -648446, -626976, -622273, -550782, -490612, -519443, -472225, -410331, -380988, -374024, -328017, -297253, -238364, -169767, -126922, -120638, -156672, -98425, -63013, -57115, -57882, -19299, 52678, 105645, 132582, 172257, 188519, 199980, 240752, 305467, 323132, 330083]
16290C30083J0778O5369L2566M3719p157N8477M4228Q906O3670O798Q1927l0738
16278G08626m8559J17855M1522j11L0250J3031K1444M525J3942N1354L9101N6358
16266A049338J05538p4882m1574N6649L2940j81J30206q961q590N0744M0347J3127
16254A344701n917L1473q937J5525K7869L0246N3245Q9461Q465J1231P377M428
16242A609167J1121K0207M4483N4148K6806k1994M300N3143O970n5789R5444O8424
16230A916430K141N2550j6840J890P557M2082q685N2717P159k9066L0962K4442
16218B083339l5548N7744M1758J4400J1368J6928L2181K7955O7074K5153J4367
16207B356719o8498m7918J4132O1220O3068j07729K6234J02402P2993n4097J0926
$$ y = [330083, 340861, 406230, 438796, 482515, 475358, 533835, 578063, 586969, 650639, 657437, 739364, 708626, 660067, 777922, 819444, 819333, 849583, 862614, 884058, 888583, 902525, 953879, 992980, 1049338, 1154876, 1079994, 1038420, 1095069, 1128009, 1127828, 1258034, 1249073, 1240483, 1291227, 1331574, 1344701, 1338784, 1370257, 1361320, 1376845, 1404714, 1434960, 1488205, 1577666, 1586131, 1597362, 1604739, 1609167, 1620288, 1640495, 1684978, 1739126, 1765932, 1743938, 1748238, 1801381, 1808351, 1752562, 1848006, 1916430, 1918571, 1971121, 1954281, 1956171, 1963728, 2005810, 1997125, 2049842, 2057001, 2027935, 2058897, 2083339, 2047791, 2105535, 2147293, 2161693, 2173061, 2189989, 2222170, 2250125, 2317199, 2342352, 2356719, 2288221, 2240303, 2254435, 2315655, 2378723, 2270994, 2297228, 2399630, 2472623, 2418526, 2429452]
16196B429452O4716j6710J291k9300N1532J306O0472o6108o6500J29961M6514
16185B606626K7487O368M794k6446M3042l017K4116L5704O0988J4652o4492l0199
16173B699623K5552J8161P8654l6504j9532O0390K7066L295n7426O500j7649J9765
16161B807895M6591j6165j0494l5684l0175O2940M6306O5565M2809m2302n5720
16150B881566r027P8879M5908n8077L2349n913J4783q460k8225j1903J2098L3708
16138B977686O852n4455R7162L8858k0740o23j8774j6745K232j5217R4515L3043
16126C123794L179j71K3416Q39J1566m9906O2100K5672m5942j5153k0588n8877
16114C059929M4650k1473n2021M1953n055K8933J0027N4111L4344j1624o0340
$$ y = [2429452, 2494168, 2477458, 2478749, 2449449, 2500981, 2502287, 2562759, 2496651, 2430151, 2560112, 2606626, 2634113, 2640481, 2645275, 2618829, 2661871, 2658854, 2682970, 2718674, 2779662, 2794314, 2729822, 2699623, 2725175, 2743336, 2821990, 2785486, 2765954, 2826344, 2853410, 2856705, 2799279, 2805779, 2788130, 2807895, 2854486, 2838321, 2827827, 2792143, 2761968, 2824908, 2871214, 2936779, 2979588, 2937286, 2881566, 2872539, 2951418, 2997326, 2939249, 2971598, 2965685, 2980468, 2972008, 2943783, 2931880, 2943978, 2977686, 2984538, 2930083, 3027245, 3066103, 3045363, 3044740, 3025966, 3009221, 3011453, 2996236, 3090751, 3123794, 3126973, 3126802, 3150218, 3151057, 3162623, 3112717, 3174817, 3200489, 3154547, 3139394, 3118806, 3059929, 3104579, 3083106, 3031085, 3073038, 3067983, 3096916, 3106943, 3161054, 3195398, 3183774, 3123434]
16103C123434l6010R1748N9465m7068l281j18119O9964K1514j6148P334L4550
16092C187383k6915l0799J07285P726N6637m569p6815l1772K476P4081l6432k4993
16080C203293M6380l8090m1108M8034P985J3419j525P920M8441J8498n5434L8610
16068C296423q7421J913O7881K8501m4368r5776P7665Q6755n960n6300q4548J6235
16056C201000P5157M3099P5876k0540l8262j02990l570L6703q607l5200K0868
16045C243534N182m832O1539J5686J0881m7457L7403N6411p7368m3379M9879O3590
16033C371069n0816k2884o2624j8807J14077j173j1755k3465o5756P7301L0093
16022C335260O3982L8798j12433m7444n7791M1130J8910k3672N1089n9807J9236
$$ y = [3123434, 3087424, 3179172, 3238637, 3191569, 3188288, 3070169, 3140133, 3161647, 3145499, 3152833, 3187383, 3160468, 3129669, 3236954, 3244680, 3301317, 3296748, 3219933, 3188161, 3190637, 3264718, 3228286, 3203293, 3249673, 3211583, 3170475, 3218509, 3226494, 3239913, 3238388, 3246308, 3294749, 3313247, 3257813, 3296423, 3209002, 3210915, 3278796, 3307297, 3262929, 3167153, 3244818, 3331573, 3325613, 3269313, 3184765, 3201000, 3276157, 3319256, 3395132, 3374592, 3336330, 3233340, 3229770, 3266473, 3257866, 3222666, 3243534, 3248716, 3243884, 3305423, 3321109, 3331990, 3284533, 3321936, 3378347, 3300979, 3257600, 3307479, 3371069, 3320253, 3297369, 3234745, 3215938, 3330015, 3328842, 3317087, 3293622, 3227866, 3305167, 3335260, 3399242, 3438040, 3325607, 3278163, 3220372, 3261502, 3280412, 3256740, 3307829, 3248022, 3267258]
16011C267258N3723j2191K341M6625J3966p2451m5247P8730K7012j07890L5320
16000C287196J5698n9928J6220L2186L276J181L1867L4050K3371J8517L9853l1102
15988C412385r1808n2969o786N5164J9896K827R054k8470j8654O4467M814p5528
15976C294392j7251P3912K5806J9217p7008j0827Q739k0119O1688l2839n9532
15965C266178M6086k0087J8248o817j8173Q1612J6300j1183l4446j977O2622l8773
15953C359590Q4485j11088k621p571O5329n655p0286O0189k5604n9802j5993J16537
15941C387510q1611j5071m0145J6083N1178K5715k4496K6272O7764J5711n3494
15930C375416K2747r8514j9863k0983L6566j5437j0899J22288J7157q0364k2261
$$ y = [3267258, 3320981, 3308790, 3311131, 3357756, 3371722, 3299271, 3254024, 3332754, 3359766, 3251876, 3287196, 3302894, 3242966, 3259186, 3291372, 3294648, 3295829, 3327696, 3361746, 3385117, 3403634, 3443487, 3412385, 3320577, 3267608, 3260822, 3315986, 3335882, 3338709, 3347763, 3319293, 3300639, 3365106, 3369920, 3294392, 3277141, 3351053, 3376859, 3396076, 3319068, 3308241, 3316980, 3296861, 3358549, 3325710, 3266178, 3312264, 3292177, 3310425, 3303608, 3285435, 3367047, 3383347, 3372164, 3337718, 3335741, 3398363, 3359590, 3444075, 3332987, 3330366, 3322795, 3388124, 3382469, 3312183, 3372372, 3346768, 3286966, 3270973, 3387510, 3305899, 3290828, 3250683, 3266766, 3317944, 3343659, 3319163, 3345435, 3413199, 3428910, 3375416, 3398163, 3299649, 3279786, 3258803, 3295369, 3279932, 3269033, 3391321, 3408478, 3328114, 3305853]
15919C305853L2707L3605j6987n3876Q189m1143R051N345J7866Q5700k8056p890
15907C350364J1846o4270j5546N9393L9282o6103M0801m1308K262J16028o7408
15896C365341n2883J624K1916N3542K3632J2929r261K3329r1065p6304P2188k9161
15884C315827m7875M1081L0623n3750k6349J908K8918K9359j5746k8172Q0832
15873C356656K9090J8268K5376n2330p6778N0650l9825M9552N1059r982L8173
15862C439909j3186l8813J9005m8361K3727J9901J8077k2046m5820Q8504r451
15851C431446N0528l1208r9529M2503P6189j00381k0303R0236Q3029j12645j0227
15840C399638Q678J7543l4105K176P875j24242P4415K889M0012l1427j3288O4080
$$ y = [3305853, 3338560, 3372165, 3355178, 3301302, 3309491, 3268348, 3277399, 3282744, 3300610, 3386310, 3358254, 3350364, 3362210, 3297940, 3282394, 3341787, 3381069, 3314966, 3355767, 3314459, 3316721, 3432749, 3365341, 3312458, 3314082, 3335998, 3389540, 3413172, 3426101, 3416840, 3440169, 3349104, 3272800, 3344988, 3315827, 3267952, 3309033, 3339656, 3285906, 3259557, 3261465, 3290383, 3319742, 3303996, 3275824, 3356656, 3385746, 3404014, 3429390, 3377060, 3300282, 3350932, 3311107, 3360659, 3411718, 3401736, 3439909, 3426723, 3387910, 3406915, 3358554, 3382281, 3402182, 3420259, 3398213, 3352393, 3440897, 3431446, 3481974, 3450766, 3351237, 3393740, 3469929, 3369548, 3349245, 3439481, 3522510, 3409865, 3399638, 3408316, 3425859, 3391754, 3393930, 3401805, 3277563, 3351978, 3354867, 3394879, 3363452, 3350164, 3414244]
15828C414244j3376j3654j8732R7662P760K710q285l3636l3420l9568N2923J9803
15816C434431J9667l9424j04168j7119Q0908M5833J2480p6251L7648K5712l9038
15805C380679K5173m2457N2428m1716l253j8860k2023N9108q926P306O5603N327
15793C458389p0844J4662J1860l2412M1457n6031J2985J2400O1884l3082j5803
15782C405465M05J0807l7024J3107o4081L326J61L6217O7245n442Q164k3734K3759
15769C438375k0157o3699J5976j3056K2693Q1114N0201R512m5816l5616p3480
15758C366047O147m7131J5067L4717L2092n1622k2531J06004p4402m9406K5420
$$ y = [3414244, 3400868, 3387214, 3368482, 3466144, 3473904, 3476614, 3468329, 3434693, 3401273, 3361705, 3414628, 3434431, 3454098, 3414674, 3310506, 3293387, 3374295, 3420128, 3432608, 3356357, 3394005, 3419717, 3380679, 3405852, 3363395, 3415823, 3374107, 3370854, 3351994, 3329971, 3389079, 3380153, 3387459, 3453062, 3458389, 3387545, 3402207, 3414067, 3381655, 3423112, 3367081, 3380066, 3392466, 3454350, 3421268, 3405465, 3405870, 3416677, 3379653, 3392760, 3328679, 3332005, 3332166, 3368383, 3435628, 3430186, 3438350, 3414616, 3438375, 3418218, 3354519, 3370495, 3357439, 3380132, 3461246, 3511447, 3520959, 3475143, 3439527, 3366047, 3372194, 3325063, 3340130, 3374847, 3406939, 3355317, 3332786, 3438790, 3364388, 3314982, 3340402]
$$ [...]
##END NTUPLES=NMR SPECTRUM
##END=
