##TITLE=1H_CA-8887-7
 CDCl3, 8 sc, 
 5.07.2021
##JCAMPDX= 6.0         $$ Bruker NMR JCAMP-DX V2.0
##DATA TYPE= NMR SPECTRUM
##DATA CLASS= NTUPLES
##ORIGIN= UXNMR, Bruker Analytische Messtechnik GmbH
##OWNER= root
$$ XWIN-NMR		Version 3.5
$$ Mon Jul  5 11:49:44 2021 Russian Standard Time (UT+4h)  she@DPX200
##.OBSERVE FREQUENCY= 200.131506
##.OBSERVE NUCLEUS= ^1H
##.ACQUISITION MODE= SIMULTANEOUS
##.ACQUISITION SCHEME= undefined
##.AVERAGES= 8
##.DIGITISER RES= 18
##SPECTROMETER/DATA SYSTEM= spect
##.PULSE SEQUENCE= zg30
##.SOLVENT NAME= CDCl3
##.SHIFT REFERENCE= (INTERNAL, CDCl3, 0, 17.5069)
##AUDIT TRAIL= $$ (NUMBER, WHEN, WHO, WHERE, WHAT)
$$ ##TITLE= Audit trail, XWIN-NMR		Version 3.5
$$ ##JCAMPDX= 5.01
$$ ##ORIGIN= Bruker BioSpin GmbH
$$ ##OWNER= she
$$ F:/spectra/data/she/nmr/H-F/1/pdata/1/auditp.txt
$$ ##AUDIT TRAIL=  $$ (NUMBER, WHEN, WHO, WHERE, WHAT)
(   1,<2021-07-05 11:47:59.42 +0400>,<she>,<DPX200>,
      <created by zg, POWCHK disabled, PULCHK disabled
       configuration hash MD5:
       00 E9 B6 7A A2 85 ED C7 34 08 36 98 17 FE 4E 26
       data hash MD5: 16K
       EE CA 23 EC 92 2F 73 AD F0 C3 37 82 2E 23 6B 9C>)
(   2,<2021-07-05 11:48:26.10 +0400>,<she>,<DPX200>,
      <Start of raw data processing
       efp BC_mod = 2 LB = 0.24 FT_mod = 6 PKNL = 1 PHC0 = -12078.27 PHC1 = 20.40099 SI = 16K 
       data hash MD5: 16K
       84 6B 5A E5 6A 39 19 FD 91 C5 74 E3 23 EE D9 B2>)
(   3,<2021-07-05 11:48:44.20 +0400>,<she>,<DPX200>,
      <pk PHC0 = 2.900211 PHC1 = -4 
       data hash MD5: 16K
       E6 6E 53 E7 5F 7E 5D 3D 7B 56 FF D6 BF 77 83 E6>)
(   4,<2021-07-05 11:48:47.21 +0400>,<she>,<DPX200>,
      <abs ABSG = 5 
       data hash MD5: 16K
       5D FA 98 1E 3D AD 3F C2 08 C9 91 83 E8 32 14 14>)
$$ ##END=
$$ 
$$ hash MD5
$$ A7 8B 4A 60 26 DF B3 FA 2F AE A6 5E 4B C7 A3 8A
##$RELAX= 
##$RELAX= 
##$RELAX= 
##$RELAX= 
##$RELAX= 
##$RELAX= 
$$ Bruker specific parameters
$$ --------------------------
##$DU= <F:/spectra>
##$EXPNO= 1
##$NAME= <H-F>
##$PROCNO= 1
##$TYPE= <nmr>
##$USER= <she>
##$AMP= (0..31)
100 100 100 100 100 100 100 100 100 100 100 100 100 100 100 100 100 100 
100 100 100 100 100 100 100 100 100 100 100 100 100 100 
##$AQSEQ= 0
##$AQ_mod= 1
##$AUNM= <au_zg>
##$AUTOPOS= <>
##$BF1= 200.13
##$BF2= 200.13
##$BF3= 200.13
##$BF4= 200.13
##$BF5= 200.13
##$BF6= 200.13
##$BF7= 200.13
##$BF8= 200.13
##$BYTORDA= 1
##$CFDGTYP= 0
##$CFRGTYP= 5
##$CHEMSTR= <none>
##$CNST= (0..31)
1 1 145 1 1 1 1 1 1 1 1 1 1 1 1 1 1 1 1 1 1 1 1 1 1 1 1 1 1 1 1 1 
##$CPDPRG= <>
##$CPDPRG1= <>
##$CPDPRG2= <>
##$CPDPRG3= <>
##$CPDPRG4= <mlev>
##$CPDPRG5= <mlev>
##$CPDPRG6= <mlev>
##$CPDPRG7= <mlev>
##$CPDPRG8= <mlev>
##$CPDPRGB= <>
##$CPDPRGT= <>
##$D= (0..31)
0 1.2 0 0 0 0 0 0 0 0.06 0 0.03 0 0 0 0 0.0002 0 0 0 0 0 0 0 0 0 0 0 0 
0 0 0 
##$DATE= 1625471278
##$DBL= (0..7)
120 120 120 120 120 120 120 120 
##$DBP= (0..7)
150 150 150 150 150 150 150 150 
##$DBP07= 0
##$DBPNAM0= <>
##$DBPNAM1= <>
##$DBPNAM2= <>
##$DBPNAM3= <>
##$DBPNAM4= <>
$$ [...]
##$SUBNAM3= <"">
##$SUBNAM4= <"">
##$SUBNAM5= <"">
##$SUBNAM6= <"">
##$SUBNAM7= <"">
##$SUBNAM8= <"">
##$SUBNAM9= <"">
##$SW= 20.0188882624521
##$SWIBOX= (0..15)
0 0 2 0 0 0 0 0 0 0 0 0 0 0 0 0 
##$SW_h= 4006.41025641026
##$TD= 16384
##$TD0= 1
##$TE= 0
##$TE2= 300
##$TE3= 300
##$TEG= 300
##$TL= (0..7)
0 120 120 120 120 120 120 120 
##$TP= (0..7)
150 150 150 150 150 150 150 150 
##$TP07= 0
##$TPNAME0= <>
##$TPNAME1= <>
##$TPNAME2= <>
##$TPNAME3= <>
##$TPNAME4= <>
##$TPNAME5= <>
##$TPNAME6= <>
##$TPNAME7= <>
##$TPOAL= (0..7)
0.5 0.5 0.5 0.5 0.5 0.5 0.5 0.5 
##$TPOFFS= (0..7)
0 0 0 0 0 0 0 0 
##$TUNHIN= 0
##$TUNHOUT= 0
##$TUNXOUT= 0
##$USERA1= <user>
##$USERA2= <user>
##$USERA3= <user>
##$USERA4= <user>
##$USERA5= <user>
##$V9= 5
##$VALIST= <valist>
##$VCLIST= <CCCCCCCCCCCCCCC>
##$VD= 0
##$VDLIST= <DDDDDDDDDDDDDDD>
##$VPLIST= <PPPPPPPPPPPPPPP>
##$VTLIST= <TTTTTTTTTTTTTTT>
##$WBST= 1024
##$WBSW= 4
##$XGAIN= (0..3)
0 0 0 0 
##$XL= 0
##$YL= 0
##$YMAX_a= 201184
##$YMIN_a= -152130
##$ZGOPTNS= <>
##$ZL1= 120
##$ZL2= 120
##$ZL3= 120
##$ZL4= 120
##$ABSF1= 17.49711
##$ABSF2= -2.521927
##$ABSG= 5
##$ABSL= 3
##$ALPHA= 0
##$AQORDER= 0
##$ASSFAC= 0
##$ASSFACI= 0
##$ASSFACX= 0
##$ASSWID= 0
##$AUNMP= <proc_1d>
##$AZFE= 0.1
##$AZFW= 0.1
##$BCFW= 0
##$BC_mod= 2
##$BYTORDP= 0
##$COROFFS= 0
##$CY= -3
##$DATMOD= 1
##$DC= 0
##$DFILT= <>
##$DTYPP= 0
##$F1P= 0
##$F2P= 0
##$FCOR= 1
##$FTSIZE= 16384
##$FT_mod= 6
##$GAMMA= 0
##$GB= 0
##$INTBC= 1
##$INTSCL= 1.334414e-10
##$ISEN= 128
##$LB= 0.24
##$LEV0= 0
##$LPBIN= 0
##$MAXI= 10000
##$MC2= 0
##$MEAN= 0
##$ME_mod= 0
##$MI= 1.114404
##$NCOEF= 0
##$NC_proc= -8
##$NLEV= 6
##$NOISF1= 3.799351
##$NOISF2= 2.8
##$NSP= 0
##$NTH_PI= 0
##$NZP= 0
##$OFFSET= 17.50688
##$PC= 1
##$PHC0= -12075.37
##$PHC1= 16.40099
##$PH_mod= 1
##$PKNL= yes
##$PPARMOD= 0
##$PSCAL= 0
##$PSIGN= 0
##$REVERSE= no
##$SF= 200.130005552702
##$SI= 16384
##$SIGF1= 3
##$SIGF2= 2
##$SINO= 5.538805
##$SIOLD= 16384
##$SREGLST= <1H.CDCl3>
##$SSB= 0
##$STSI= 16384
##$STSR= 0
##$SW_p= 4006.41025641026
##$SYMM= 0
##$S_DEV= 0
##$TDeff= 16384
##$TDoff= 0
##$TI= <>
##$TILT= no
##$TM1= 0
##$TM2= 0
##$TOPLEV= 0
##$USERP1= <user>
##$USERP2= <user>
##$USERP3= <user>
##$USERP4= <user>
##$USERP5= <user>
##$WDW= 1
##$XDIM= 16384
##$YMAX_p= 309290618
##$YMIN_p= -356485
$$ End of Bruker specific parameters
$$ ---------------------------------
##NTUPLES= NMR SPECTRUM
##VAR_NAME=  FREQUENCY,     SPECTRUM/REAL,   SPECTRUM/IMAG
##SYMBOL=    X,             R,               I
##VAR_TYPE=  INDEPENDENT,   DEPENDENT,       DEPENDENT
##VAR_FORM=  AFFN,          ASDF,            ASDF
##VAR_DIM=   16384,         16384,           16384
##UNITS=     HZ,            ARBITRARY UNITS, ARBITRARY UNITS
##FACTOR=    0.24454680195387, 1,            1
##FIRST=     3503.65195288904, 0,            0
##LAST=      -502.758303521215, 0,           0
##MIN=       -502.758303521215, -356485,     0
##MAX=       3503.65195288904, 309290618,    0
$$ Real data points
##PAGE= N=1
##DATA TABLE= (X++(R..R)), XYDATA
$$ [...]
5479C634025O8850Q0009q0535l656N2013l7737L2823R1568l5563m9363P8549r4198
5467C736785j2019K43885J04405K09579m5759j24986l5633R1849J40446p595M940
5456D305897M5751R8434J16527j4991J00535J08866P9811J1836Q4734K9888j53305
5445D813983J70864Q3096N8580j15977o7941m632q5440K5520J28027J65312L5330
5434E206722M2446K14007J26667J7089K26342J13283o7239L0801K48067J52443
5424F310628M3702J62915J12594J74434L26107K91030N0157O9783J45922J77924
5414G865196J76293J38005J61190j8572j25821M2369n6757j2880j11838k16670
5404G840515M3946l6199k46857K00093l1360n7173Q8357J91539M0888J27554L0614
$$ plain form
5479 3634025 3702875 3782884 3702349 3698693 3750706 3712969 3745792 3837360 3801797 3752434 3830983 3736785
5467 3736785 3724766 3968651 4073056 4282635 4236876 4111890 4076257 4168106 4308552 4300957 4305897
5456 4305897 4351648 4450082 4566609 4551618 4652153 4761019 4840830 4852666 4937400 4967288 4813983
5445 4813983 4984847 5067943 5126523 5010546 4942605 4937973 4852533 4878053 5006080 5171392 5206722
5434 5206722 5249168 5463175 5589842 5606931 5833273 5946556 5879317 5910118 6158185 6310628
5424 6310628 6354330 6517245 6629839 6804273 7130380 7421410 7471567 7541350 7687272 7865196
5414 7865196 8041489 8179494 8340684 8322112 8196291 8238660 8181903 8169023 8057185 7840515
5404 7840515 7884461 7848262 7601405 7801498 7770138 7712965 7801322 7992861 8033749 8161303 8191917
5393H191917J06021R6699l3183J10198J38375J04098P3602J89811Q9631J39981
5383I207150L5273L4365J3718J07941K28648J34841J37684L04352K68887L26466
5373A0799325R5945K08539J46745M25682K13743K65879M36848j1828K17748L59946
5363A3158572L61764J22833K02627L98693M44790L35195L14922K87400O05327
5354A6232123L48383M93170O70522M52886L57477N65306N20413M75529M20356
5345B0536165M75173N17172O20117O98020M04009N12473M80480O58324P05829
5336B5607762O90152O73055P85661Q28483Q68104Q54073Q66126R23737Q15242
5327C2912395Q65616P75901Q60506O94523O14600N21018M51552M67940L69110
$$ plain form
5393 8191917 8297938 8394637 8361454 8471652 8610027 8714125 8787727 8977538 9067169 9207150
5383 9207150 9242423 9276788 9290506 9398447 9627095 9761936 9899620 10203972 10472859 10799325
5373 10799325 10895270 11103809 11250554 11676236 11889979 12155858 12592706 12580878 12798626 13158572
5363 13158572 13520336 13643169 13845796 14244489 14689279 15024474 15339396 15626796 16232123
5354 16232123 16580506 17073676 17744198 18197084 18554561 19119867 19640280 20115809 20536165
5345 20536165 21011338 21528510 22148627 22846647 23250656 23763129 24243609 24901933 25607762
5336 25607762 26297914 26970969 27756630 28585113 29453217 30307290 31173416 32097153 32912395
5327 32912395 33778011 34553912 35414418 36108941 36723541 37244559 37696111 38164051 38533161
5318C8533161K71127M10748N94881N28508N84198O31983R38199Q61805Q12533
5309D4167143R64122Q17096Q52782Q07890O88298N49598K08856K08893J85351
5300D9450029l33981o15352o00921p04550o72535q43272p52732o23682n00386
5291D3802618l08614m57455k01648k90071k16800j88638k90914l56094l36971
5282D1155413l23003n99938n06032p79678n67140n72201o01732n74486m01827
5273C6229376l64498m07471k34234k98902m86498j86740k99691j70541j67492
5264C3613309k17717k91945j48561j32848k59586k57029q6402j68980j72461p1685
5254C1806095l38722k25428k41774j47174k37764j33732k86950k73054k48955
$$ plain form
5318 38533161 38804288 39215036 39809917 40338425 40922623 41554606 42492805 43354610 44167143
5309 44167143 45131265 45948361 46801143 47609033 48297331 48846929 49055785 49264678 49450029
5300 49450029 49116048 48500696 47899775 47195225 46522690 45679418 44926686 44303004 43802618
5291 43802618 43494004 43036549 42834901 42544830 42328030 42139392 41848478 41492384 41155413
5282 41155413 40832410 40232472 39726440 38946762 38379622 37807421 37205689 36631203 36229376
5273 36229376 35864878 35457407 35223173 34924271 34437773 34251033 33951342 33780801 33613309
5264 33613309 33395592 33103647 32955086 32822238 32562652 32305623 32219221 32050241 31877780 31806095
5254 31806095 31467373 31241945 31000171 30852997 30615233 30481501 30194551 29921497 29672542
5245B9672542k96191l60154k47926k58819k57494k95268k17541k93978k43607
5236B7201564k48588l90091k95786j03322n8767l58707l37778j34539j90702p6479
5226B5006805l50578k83528l82238l03338m11537k97361k00794l46259j40976
5217B2290196k78711l1392l39746m62618l78439l27328k29232k16702l19925k22410
5207A9483693k92458k95115k46171j62081r9007k02509k87237l90294k73208j39306
5197A7096307l18305j71815k23632l54354j05347r4270j70007j98661q3310J3604
5187A5390210k62563l78118j64731P5072r8584k30170k08245j95135k6813k22195
5177A3678728k42787R289j23121j27868j94858p7250m822l3983n8533j94703q7464
$$ plain form
5245 29672542 29376351 29016197 28768271 28509452 28251958 27956690 27739149 27445171 27201564
5236 27201564 26952976 26562885 26267099 26163777 26105010 25746303 25408525 25273986 25083284 25006805
5226 25006805 24656227 24372699 23990461 23687123 23275586 22978225 22777431 22431172 22290196
5217 22290196 22011485 21980093 21640347 21177729 20799290 20471962 20242730 20026028 19706103 19483693
5207 19483693 19191235 18896120 18649949 18487868 18388861 18186352 17899115 17508821 17235613 17096307
5197 17096307 16778002 16606187 16382555 16028201 15922854 15828584 15658577 15459916 15376606 15390210
5187 15390210 15127647 14749529 14584798 14659870 14561286 14331116 14122871 13927736 13900923 13678728
5177 13678728 13435941 13445230 13322109 13194241 12999383 12922133 12917311 12883328 12824795 12630092 12542628
5166A2542628J8221J10242j01193M6290r8495j06959o7716o6848m2976r4456j04921
5155A2033817K4725J6773n8562j70556q3948J81509k04850j19218J28754N2038
5145A1800482n4188N007j81362q1100j8127J3237j78397N7051n172q0800j8581
5134A1258050k05449K6534j2868K25029k30738r7554o0788L0677k6632j98228
5124A0708033q9343l2685J70842j73087j1260J75876j34532o5397l7023P9907
5114A0591331j01122L1126j2360r3394K7814j38373N9809k1882j751j46305J10687
5103A0305580p8897l5700j0570p1919K6616R5469k4776O147q0294n0887J44581
5092A0225350p8653R7558j5767L4171q9405P1032j1114L6828K712l6911O6205
$$ plain form
5166 12542628 12560849 12671091 12569898 12616188 12517693 12410734 12343018 12276170 12233194 12138738 12033817
5155 12033817 12058542 12075315 12016753 11846197 11762249 11943758 11738908 11619690 11748444 11800482
5145 11800482 11746294 11751301 11569939 11488839 11470712 11483949 11305552 11362603 11357431 11276631 11258050
5134 11258050 11052601 11079135 11066267 11291296 11060558 10963004 10902216 10932893 10906261 10708033
5124 10708033 10618690 10586005 10756847 10583760 10572500 10748376 10613844 10548447 10511424 10591331
5114 10591331 10490209 10521335 10508975 10415581 10443395 10305022 10364831 10342949 10341198 10194893 10305580
5103 10305580 10226683 10190983 10180413 10108494 10135110 10230579 10205803 10211950 10131656 10080769 10225350
5092 10225350 10146697 10244255 10228488 10262659 10173254 10244286 10233172 10270000 10272712 10235801 10302006
5081A0302006O3521J9732P8401j02203n9677M906J19239R0273r8892O1306J39276
5070A0617888k1354J05792N4995Q2758P2128P9695k1967J797M0548L3805j0099
5059A1035986J1195P3514Q3339K77999j04828M6260j50046K1905J84621R2031
5049A1571976K5773M5332P9117J65912J56020K35654J08763Q3997K24195P7241
5039A2773980J78742L7503q7067J09484N8352r2164j96615j41989q183o1925r2406
5028A2477712m7302k43260l7885K40764J4819j34974o4755k373M7546k8295P3608
5017A2295605J59655J50798q3885M0909J00732K9124J07468J13082q9108K8362
5007A2852742J56390J58248K64521p1181j07477J01917M4146o1112J1477J41251
$$ plain form
5081 10302006 10365527 10385259 10463660 10361457 10301780 10306686 10425925 10516198 10417306 10478612 10617888
5070 10617888 10596534 10702326 10757321 10840079 10912207 10991902 10969935 10971732 11012280 11046085 11035986
5059 11035986 11047181 11120695 11204034 11482033 11377205 11423465 11273419 11295324 11479945 11571976
5049 11571976 11597749 11643081 11722198 11888110 12044130 12279784 12388547 12472544 12696739 12773980
5039 12773980 12952722 12990225 12903158 13012642 13070994 12978830 12782215 12640226 12632043 12570118 12477712
5028 12477712 12430410 12187150 12149265 12390029 12404848 12269874 12205119 12202746 12250292 12221997 12295605
5017 12295605 12455260 12606058 12522173 12563082 12663814 12692938 12800406 12913488 12824380 12852742
5007 12852742 13009132 13167380 13431901 13360720 13253243 13355160 13399306 13338194 13349671 13490922
4997A3490922m5949P0156M9818M3529k3339N4662L555n8454M402Q0214K29107
4986A3898623j20899p2908j7952J69749M5272j0143l9597J2839j6558R9181l4945
4975A3912662Q4747L8939J3123J79284k22877j01149p5841P815J6751Q5562L4050
4964A3973066q3391k7771j62033P9855q51j8025Q1043m3951j31477Q8327p219
4953A3747573r8650L8325K5618N0043K3866L259J23589j06j9739N7915K29027
4942A4180720J37838J02165P4943M2064K13258n4196J57708K24237Q7035J34927
4932A5300699P5076o1476J13680L59611J99662o8966O7464o2806J40624J25841
4922A6189409J55678q5098J43571K72651N2484k1462J41961J48052L1101P9964
$$ plain form
4997 13490922 13444973 13515129 13564947 13608476 13585137 13639799 13643354 13584900 13589302 13669516 13898623
4986 13898623 13777724 13704816 13686864 13856613 13901885 13891742 13852145 13864984 13848426 13947607 13912662
4975 13912662 13997409 14036348 14049471 14228755 14005878 13904729 13828888 13836703 13853454 13939016 13973066
4964 13973066 13889675 13861904 13699871 13779726 13778875 13760850 13841893 13797942 13666465 13754792 13747573
4953 13747573 13648923 13687248 13712866 13762909 13786775 13790034 13913623 13913517 13893778 13951693 14180720
4942 14180720 14318558 14420723 14495666 14537730 14750988 14696792 14854500 15078737 15165772 15300699
4932 15300699 15375775 15314299 15427979 15787590 15987252 15918286 15985750 15922944 16063568 16189409
4922 16189409 16345087 16259989 16403560 16676211 16728695 16707233 16849194 16997246 17028347 17108311
4912A7108311j22564N0119r9092J5071O3169n2841j77126j77457K0068q4369m30424
4901A6112865P5624j85221q3055J3931j15135k27649p8801k90683j88186P9301
4891A5112991k11268j77486m9677l20313k77604J01453j40645k87614l35925j74523
4881A3239389k36350j96437k43009n6078k43545l27079k76721j97873j89091n5438
4871A1217768j89226k56262j94504j39226r2811j74329p611k87072j22872j38657
4861I615198o4369j12685l31509j28611k31898j65761N2310l7354j36567j97335
4851H261419l324q726j65898j0607j11455m1031J2077j91467l10o9238p9688j96503
4839G395249o0145r0237k34862j1088j96110R612j85837N4295j17106j21188q2320
$$ plain form
4912 17108311 16985747 17035866 16936774 16951845 17015014 16962173 16785047 16607590 16627658 16543289 16112865
4901 16112865 16188489 16003268 15920213 15934144 15819009 15591360 15512559 15221876 15033690 15112991
4891 15112991 14901723 14724237 14674560 14354247 14076643 14178096 14037451 13749837 13413912 13239389
4881 13239389 13003039 12806602 12563593 12507515 12263970 11936891 11660170 11462297 11273206 11217768
4871 11217768 11028542 10772280 10577776 10438550 10345739 10171410 10163799 9876727 9753855 9615198
4861 9615198 9550829 9438144 9106635 8978024 8746126 8580365 8632675 8595321 8458754 8261419
4851 8261419 8258095 8249369 8083471 8072864 7961409 7920378 7932455 7740988 7740678 7671440 7591752 7395249
4839 7395249 7335104 7244867 7010005 6998917 6802807 6812419 6626582 6680877 6563771 6442583 6360263
4828F360263q441O8268k13141j42441j11413M3932j41599P8380P5214j12099j00833
4817E796090r2132j30194k9115n9263m6794l9279o1443K2021j52745R0018Q368
4806E305532q8873p9719j38681J24052n9530r8790J8783M3918J21402n1690k6238
4795E070166j30747n1444J38023O475p4817M649N5559k0344O190k7488k4956J20212
4783E071478l6953q2670O8801j34576j82002Q7679J2761N5448M3616r5882k3510
4772D784190k7883J44453o3010m7721p7484N2322R979r7793J58597j33477l2336
4761D669837J96867O6673q4404L3710L0462p8148n1609M0016P891m7011p6930
4750D707354n5222P4456L444M2791n6395n983j5623m3172p7104J11145n8058j79455
$$ plain form
4828 6360263 6351822 6420090 6206949 6064508 5953095 5997027 5855428 5933808 6009022 5896923 5796090
4817 5796090 5703958 5573764 5544649 5485386 5438592 5399313 5337870 5359891 5207146 5297164 5305532
4806 5305532 5216659 5136940 4998259 5122311 5062781 4963991 4982774 5026692 5148094 5096404 5070166
4795 5070166 4939419 4887975 5025998 5032473 4957656 4962305 5017864 4997520 5003710 4976222 4951266 5071478
4783 5071478 5034525 4951855 5020656 4886080 4704078 4791757 4804518 4859966 4903582 4807700 4784190
4772 4784190 4756307 4900760 4837750 4790029 4712545 4764867 4774846 4677053 4835650 4702173 4669837
4761 4669837 4866704 4933377 4848973 4882683 4913145 4834997 4783388 4823404 4831295 4784284 4707354
4750 4707354 4652132 4726588 4730032 4772823 4716428 4710445 4694822 4651650 4574546 4685691 4627633 4448178
4738D448178j23805n3794p7609R1766J39624p3656J46068K04205p4951p2994J12991
4727D666023l17156k6864k1822J5106l5916j47733K7579k5234m4646p5120j8076
4716C996141J20771r3034P9628p536K612O3448j24088J49690J54254k07812r8508
4705D035566J27012j20972L5565J26978j20524R5590K17177l8538P956J56637
4695D522447M4774N574J07787J30558R0363J86214J31112j1107J48907Q8311l7461
4684E407479M0185K1369O1412J4178k4565j37523j00446q0857j31699j97769j91454
4673D680310J14501m6303j57969j38170j09649j3909k7964p5227O1600j55109
4663D132111o3263M0216P4600j09411l2804J01857r90r4387r4403j2384m9335
$$ plain form
4738 4448178 4324373 4270579 4192970 4284736 4424360 4350704 4496772 4700977 4626026 4553032 4666023
4727 4666023 4348867 4322003 4300181 4315287 4279371 4131638 4159217 4133983 4089337 4014217 3996141
4716 3996141 4116912 4023878 4103506 4095970 4098582 4162030 4037942 4187632 4341886 4134074 4035566
4705 4035566 4162578 4041606 4077171 4204149 4083625 4179215 4396392 4357854 4365810 4522447
4695 4522447 4567221 4572795 4680582 4811140 4901503 5087717 5218829 5207722 5356629 5444940 5407479
4684 5407479 5447664 5469033 5530445 5544623 5520058 5382535 5282089 5201232 5069533 4871764 4680310
4673 4680310 4794811 4748508 4590539 4452369 4342720 4328811 4300847 4225620 4287220 4132111
4663 4132111 4068848 4109064 4183664 4074253 4041449 4143306 4142316 4047929 3953526 3941142 3891807
4652C891807P3279R292o1969L5830r6026R0219J4858j05880p1114J20075o2193
4641C838178K3880K1533K506J42117N6287M927j07168K01991O9986k4926l4064
4630D195247J08415p2157K3772J62256R1126Q5476R3669K07596j4633Q9733J40651
4619E111151K7251J71228J18092J28549N3250J25464J67644J86819K55756J32875
4609F478079J60863J48737J11390J81161K49119M1083N7843J47762k7397j1914
4599G536726J17689m21q420n5131L2369k0720J06973r8916m5644Q8567n3076p1912
4587G528084j85617n9279m9187q8296j54863q3212j77023k63934l4748n2420j57762
4576F221743j12816Q9046P886p154j01744j51124P4130j52492Q4382P7648r225
$$ plain form
4652 3891807 3965086 3974378 3912409 3948239 3852213 3942432 3957290 3851410 3780296 3900371 3838178
4641 3838178 3862058 3883591 3886097 4028214 4084501 4089428 3982260 4184251 4254237 4229311 4195247
4630 4195247 4303662 4231505 4255277 4417533 4508659 4594135 4687804 4895400 4880767 4970500 5111151
4619 5111151 5138402 5309630 5427722 5556271 5609521 5734985 5902629 6089448 6345204 6478079
4609 6478079 6638942 6787679 6899069 7080230 7329349 7370432 7428275 7576037 7548640 7536726
4599 7536726 7654415 7653994 7645574 7590443 7622812 7602092 7709065 7610149 7564505 7653072 7599996 7528084
4587 7528084 7342467 7283188 7234001 7145705 6990842 6907630 6730607 6466673 6431925 6379505 6221743
4576 6221743 6108927 6197973 6205859 6198705 6096961 5945837 6019967 5867475 5951857 6029505 6020280
4565F020280J5398P8025j24492K537J43474o780L4249K94597J22908K92477J30526
4554G003199N136L24200J48055L616L09654K61444K47041K7515K17781L04062
4544H851703J54699J31950R6596J04032M735K37063k3879o9916O2257M3942j93874
4533I399308j75490j24079j22836k5200j4043L630j49027l02332q9838j29842
4523H270251k42589k61879j68472j29409k05774k33055k13828o8331k05827j66973
4513F374114k12784M7411j26641k34156p2738k11018j6292J26085j27354k57822
4503E288805k6603O5762k2942k29594N8828m216m5776k1497l3670R2915k3118
4492E098894j7659J29180j14763Q5147o0628O8419J46075q479j67986j24527J40210
$$ plain form
4565 6020280 6035678 6113703 5989211 5991748 6135222 6128442 6162691 6457288 6580196 6872673 7003199
4554 7003199 7008335 7332535 7480590 7484206 7793860 8055304 8302345 8329860 8547641 8851703
4544 8851703 9006402 9138352 9234948 9338980 9343715 9580778 9556899 9486983 9549240 9593182 9399308
4533 9399308 9223818 9099739 8976903 8951703 8937660 8941290 8792263 8489931 8400093 8270251
4523 8270251 8027662 7765783 7597311 7467902 7262128 7029073 6815245 6746914 6541087 6374114
4513 6374114 6161330 6208741 6082100 5847944 5775206 5564188 5547896 5673981 5546627 5288805
4503 5288805 5262202 5327964 5305022 5075428 5134256 5130040 5084264 5062767 5029097 5122012 5098894
4492 5098894 5081235 5210415 5095652 5180799 5120171 5188590 5334665 5326186 5158200 5033673 5173883
4481E173883o8977J17282N8193O0492N3361M8601j945J0918M4391P3449K9219
4470E598867j3518J14927L7737Q3384J0724j2855R2393K86761J97921L3722K24226
4459F654289K08265L37063K96664L40244M28859K44174M87921L27214K83298L85029
4449I993020M00472J05005j81875l57258m97623n29294m94385k76447l11720k65175
4439G584720j76912k39578j48428j77311m9260l1809m7425k9961j06940K7941
4429F605037K12313o0873R5016J35543j2057r552J7964J36286J47291P374L5101
4418G309443J73719k0276P819J11449K18610J88761L0180J57655K16967L22067
4408H716394K61671J08462J73342J14212M32095K55920M59876N60795M71457M33309
$$ plain form
4481 5173883 5104906 5222188 5280381 5340873 5394234 5442835 5440890 5451808 5496199 5569648 5598867
4470 5598867 5585349 5700276 5738013 5821397 5832121 5819266 5911659 6198420 6396341 6430063 6654289
4459 6654289 6862554 7199617 7496281 7836525 8265384 8509558 8997479 9324693 9607991 9993020
4449 9993020 10393492 10498497 10316622 9959364 9461741 8932447 8438062 8161615 7849895 7584720
4439 7584720 7407808 7168230 7019802 6842491 6793231 6761422 6713997 6684036 6577096 6605037
4429 6605037 6817350 6756477 6851493 6987036 6974979 6965427 6983391 7119677 7266968 7274342 7309443
4418 7309443 7483162 7462886 7470705 7582154 7800764 7989525 8019705 8177360 8394327 8716394
4408 8716394 8978065 9086527 9259869 9374081 9806176 10062096 10521972 11082767 11554224 11987533
4398A1987533N53391K29448M12157M69434J79616R4468k16836l77356m26506l18035
4388A2587314k68757k51561l11491k74080j56094j23205n6813M1488J753K0859
4378A1209413j6360N5503L2659J17457n7983J18795L16271k8177J02073J35830
4368A1985481J81558K55728K13034K00454J47700j2612J18539Q5649K42647J99970
4358A3618148k3286K07528K90421J93224K81602J30164J56804K07664J94152K51055
4348A5507476K49918J93075J07675L39513K35199J58705P9841J23509J68671P4758
4338A7238340J67636L36174k1891J57459J27866m1067J01563k16780K365j736
4328A7849929j62695j25477j84769j06398m5110o9994p5266j00024m7267j15306
$$ plain form
4398 11987533 12540924 12770372 13182529 13651963 13831579 13926047 13709211 13331855 12905349 12587314
4388 12587314 12318557 12066996 11755505 11481425 11325331 11202126 11145313 11186801 11188554 11209413
4378 11209413 11193053 11248556 11281215 11398672 11340689 11459484 11775755 11747578 11849651 11985481
4368 11985481 12167039 12422767 12635801 12836255 12983955 12971343 13089882 13175531 13418178 13618148
4358 13618148 13594862 13802390 14092811 14286035 14567637 14697801 14854605 15062269 15256421 15507476
4348 15507476 15757394 15950469 16058144 16397657 16632856 16791561 16871402 16994911 17163582 17238340
4338 17238340 17405976 17742150 17720259 17877718 18005584 17964517 18066080 17849300 17851665 17849929
4328 17849929 17687234 17561757 17376988 17270590 17225480 17155486 17080220 16980196 16932929 16817623
4318A6817623J2202j8477K1121J17798j7044J9351l3075K46429J80079K11026
4308A7557033J55541l624p8001R0212K4570K59610J10199J82477J20080K01562
4298A8619659Q423P4731M0664j07781P0007k6226j32418j55386j21527j13634
4288A8156512r261j14135j66347m43791m0013k83602k02602j46619l02833q5389
4278A6361920k15918j60395j78702j56652j88999k83671L3346n5761k38344m2760
4268A4874064p6568j01031R8435j6313J34857J96904J99692J89492J56192M7489
4258A5703213R0169p0247m2194J5388P4488j63320l0400J56033j67531k23236
4248A5342363n9426j82233j36455k0789N8027J6802K69550N5870k8938K05601
$$ plain form
4318 16817623 16829825 16811348 16832469 16950267 16933223 16952574 16919499 17165928 17346007 17557033
4308 17557033 17712574 17708950 17630949 17721161 17745731 18005341 18115540 18298017 18418097 18619659
4298 18619659 18628082 18702813 18743477 18635696 18705703 18679477 18547059 18391673 18270146 18156512
4288 18156512 18147251 18033116 17866769 17422978 17382965 17099363 16896761 16750142 16447309 16361920
4278 16361920 16146002 15985607 15806905 15650253 15461254 15177583 15210929 15155168 14916824 14874064
4268 14874064 14797496 14696465 14794900 14778587 14913444 15110348 15310040 15499532 15655724 15703213
4258 15703213 15793382 15723135 15680941 15696329 15770817 15607497 15577097 15733130 15565599 15342363
4248 15342363 15282937 15100704 14964249 14943460 15001487 15018289 15287839 15343709 15314771 15520372
4238A5520372Q2544K84035K12387P7711K03384K86942L30071K14298K81964L99168
4228A7892876M49670R5257R6050N04389K91475J80558J27241J34688J61421J67324
4218B0100949m620J35691N5538K04146J53729J10368J38856N8456K71407K50093
4208B1474613K83865K85128K66772L68799K26535M66578N97851N39289O12297
4199B5121727O98772Q06028R63957P55210P51688P83185P99930R46524O10479
4190C2237500K96927m0887m05544j84043k22992j79138k3774Q8880N7640K23838
4180C1848407O9410q2760k9868m2734k6269J64800J05367o8686N8177k53125j36934
4169C1605785j0739k66168k86307j20196k061j89257k35579j62466j20754l31756
$$ plain form
4238 15520372 15602916 15886951 16099338 16177049 16380433 16667375 16997446 17211744 17493708 17892876
4228 17892876 18342546 18437803 18533853 19038242 19329717 19510275 19637516 19772204 19933625 20100949
4218 20100949 20096329 20232020 20287558 20491704 20645433 20755801 20894657 20953113 21224520 21474613
4208 21474613 21758478 22043606 22310378 22679177 22905712 23372290 23970141 24509430 25121727
4199 25121727 25820499 26626527 27590484 28345694 29097382 29880567 30680497 31627021 32237500
4190 32237500 32534427 32493540 32087996 31903953 31680961 31501823 31478049 31566929 31624569 31848407
4180 31848407 31917817 31835057 31805189 31762455 31736186 31900986 32006353 31937667 31995844 31742719 31605785
4169 31605785 31595046 31328878 31042571 30922375 30920314 30731057 30495478 30333012 30212258 29880502
4159B9880502m19948k75969k86851l34463l74240m82112n26985l85584n39893
4150B6254457n21296m11952m36423m81361l05352k72687n03001l43926m41830
4141B2536629k70747k56184j22737k09801k21100k45653k87583n6536k9566Q4235
4131B0920957j32075P510L1331l5034k9523J22951j4307m8698J10713P7282m1274
4120B0969833J27148Q7040L0395J04124J18183J64989J58324n2042j07480Q3585
4110B1684099j1458n6831r5448q6681p9521o2833L7035K6506k0043j187l9097
4099B1294541M3859K68411N5332R2728K34099K81745N6484K85140L26743J10006
4089B3049088M2763J65544K3749r5385o4942m3694j519q5089j3860m1179O7411
$$ plain form
4159 29880502 29460554 29184585 28897734 28563271 28189031 27706919 27179934 26794350 26254457
4150 26254457 25733161 25321209 24884786 24403425 24098073 23825386 23322385 22978459 22536629
4141 22536629 22265882 22009698 21886961 21677160 21456060 21210407 20922824 20866288 20836722 20920957
4131 20920957 20788882 20796392 20827723 20792689 20763166 20886117 20871810 20823112 20933825 21011107 20969833
4120 20969833 21096981 21184021 21214416 21318540 21436723 21601712 21760036 21707994 21600514 21684099
4110 21684099 21672641 21615810 21520362 21433681 21354160 21291327 21328362 21354868 21334825 21333638 21294541
4099 21294541 21338400 21606811 21662143 21754871 21988970 22270715 22327199 22612339 22939082 23049088
4089 23049088 23091851 23257395 23281144 23185759 23120817 23077123 23075604 22990515 22976655 22935476 23002887
4078B3002887J05837j69709N1263j30461n4565O5116l2348r4351q8761J56338
4068B2811246j59915k10411m8343n5336M5181O5151n0786r0132r1607J90209p7257
4057B2328000M5544J12026j2604K91786P2474k8842m6754N3194J07823N7098n0797
4046B2928948J27789R5816J70934J55999J26293Q8385K66341K63360M55328L61374
4036B5040567M15792P45347N26638O05222L77219M10324N78896N05581L42307
4027B9547893q7340l89167o24948q35454o13197m46205l69104m20017m07274m42027
4017B4913160j09123l69631r9419r4938m4194k20489m7619q8017J22368L18807
4007B4280905N9614n4037l6048K06454J48950q8391L0071l1777J5265K23364J56310
$$ plain form
4078 23002887 23108724 22939015 22990278 22859817 22805252 22870368 22838020 22743669 22654908 22811246
4068 22811246 22651331 22440920 22392577 22337241 22382422 22447573 22396787 22306655 22215048 22405257 22328000
4057 22328000 22373544 22485570 22472966 22764752 22837226 22808384 22761630 22814824 22922647 22979745 22928948
4046 22928948 23056737 23152553 23323487 23479486 23605779 23694164 23960505 24223865 24679193 25040567
4036 25040567 25456359 26201706 26728344 27333566 27710785 28121109 28700005 29205586 29547893
4027 29547893 29460553 29071386 28446438 27610984 26997787 26551582 26182478 25762461 25355187 24913160
4017 24913160 24804037 24434406 24334987 24240049 24195855 23975366 23927747 23839730 23962098 24280905
4007 24280905 24340519 24286482 24250434 24456888 24605838 24517447 24547518 24515741 24531006 24754370 24910680
3996B4910680J52927M29448K83549K76939K36196L20459M23404M02526M58134
3987B7894262M99774M66053M64583K15047K80089M74100R3518q5130o14588o40042
3977B9047666p17218o41538n63309o33391m87781k23925l71433k39727n2747O6715
3967B5183312K29484J23770J00329K81892R7380K96095M18916K80578L28769L90652
3957B7731177L99491L52526L82913M63545M62059N45309K95717M92489M81213
3948C1606439L21450L85002M90781N49024N22428N98467O34027P70753P19388
3939C6597759O83883R61243J093793J062385J087035J013349J234182J526371
3931D5260000J338328J493376J814744J851429J975432K073835K234030K552859
$$ plain form
3996 24910680 25063607 25493055 25776604 26053543 26289739 26610198 27033602 27436128 27894262
3987 27894262 28394036 28860089 29324672 29539719 29819808 30293908 30387426 30302296 29687708 29047666
3977 29047666 28330448 27688910 27125601 26492210 26004429 25780504 25409071 25169344 25116597 25183312
3967 25183312 25412796 25536566 25636895 25918787 26016167 26312262 26731178 27011756 27340525 27731177
3957 27731177 28130668 28483194 28866107 29329652 29791711 30337020 30632737 31125226 31606439
3948 31606439 31927889 32312891 32803672 33352696 33875124 34473591 35107618 35878371 36597759
3939 36597759 37281642 38242885 39336678 40399063 41486098 42499447 43733629 45260000
3931 45260000 46598328 48091704 49906448 51757877 53733309 55807144 58041174 60594033
3923F0594033K686567K680769L142060L434377L549774L662568M045939M451457
3915H8247544M826043N443803N818774O631364P234562Q179339R238692J0001350
3907A45621471J0021398R602777Q926905Q327901P589135N916358L344364j65188
3899A99185121l421275o288281q542501j0130579j0615822j0409409r706804q828774
3891A31241676q220352p481848o855121o060311n250539m762695m294769l988037
3883H4328004l577313l056981k840984k499700k064953j983750j741802j444805
3875F5117716j547549j275062r79112q69936p52910p59316n80882n31357n19121
3866E7302471o72541n11610o88778q09002p66989q96164q30944q01841r36345
$$ plain form
3923 60594033 63280600 65961369 69103429 72537806 76087580 79750148 83796087 88247544
3915 88247544 93073587 98517390 104336164 110967528 118202090 126381429 135620121 145621471
3907 145621471 155642869 165245646 174172551 182500452 190089587 196005945 199350309 199185121
3899 199185121 195763846 189475565 180933064 170802485 160186663 149777254 140070450 131241676
3891 131241676 123021324 115539476 108684355 102624044 97373505 92610810 88316041 84328004
3883 84328004 80750691 77693710 74852726 72353026 70288073 68304323 66562521 65117716
3875 65117716 63570167 62295105 61315993 60446057 59693147 58933831 58352949 57821592 57302471
3866 57302471 56629930 56118320 55429542 54620540 53853551 52957387 52126443 51324602 50388257
3857E0388257q31674p59272p86543m60468m29751m34182k65957P579j9818J76026
3847D6584197K41195L33531P26045P28467Q69131J058913J428015J514207J522137
3838E5005838J714234J901780J765588J754527J870530J856838J899224J888753
3830F9657312J770768J532913J181352O02120N593k05296k52304q57468j508302
3821G1926688k582931l248360l023857k699658k415410j888201j504569j604102
3813E2959600j421708j108595q22805q58964o25513o35718k09506j91816k09481
3804D6875494l5052l1800j4106J08776K18159N09236M24196M82530O58795O02715
3794D9798943O44772O82613O70559O46250O35994L76324L59125Q7457P6195k28845
$$ plain form
3857 50388257 49556583 48797311 48010768 47550300 47120549 46686367 46420410 46427989 46408171 46584197
3847 46584197 46825392 47158923 47884968 48613435 49482566 50541479 51969494 53483701 55005838
3838 55005838 56720072 58621852 60387440 62141967 64012497 65869335 67768559 69657312
3830 69657312 71428080 72960993 74142345 74744465 74750058 74544762 74292458 73434990 71926688
3821 71926688 69343757 66095397 63071540 60371882 57956472 56068271 54563702 52959600
3813 52959600 51537892 50429297 49606492 48747528 48122015 47486297 47276791 47084975 46875494
3804 46875494 46840442 46808642 46794536 46903312 47121471 47630707 48054903 48537433 49196228 49798943
3794 49798943 50443715 51126328 51796887 52443137 53079131 53455455 53814580 53902037 53978232 53749387
3784E3749387l12239n93674p00337n93610m29669j07853l18112k71444m6603Q4483
3774E0460329J28595R431K98489N15913M96708L82563N77659N93566O80734Q51075
3764E4995062P09594N33974R82832J030988J037815J127776J104139J343733J591644
3755F4457557J655762J704681J884746K250840K134915K093559K135699J927446
3747H0245205J602362J276379Q70091N68237k15741j079055j798554k361865k474007
3738G6633052k672590k648735k827141k457892k322886k130968j957334k016104
3730E7599402j619619j559930j309133j242947j323009r06187j049138r69675
3722D7619764j165008r42942q61709o09914q61574r62732m55347o99997p72075
$$ plain form
3784 53749387 53437148 52843474 52143137 51549527 51119858 51012005 50693893 50422449 50375846 50460329
3774 50460329 50588924 50598355 50896844 51412757 51909465 52292028 52869687 53463253 54143987 54995062
3764 54995062 55704656 56238630 57221462 58252450 59290265 60418041 61522180 62865913 64457557
3755 64457557 66113319 67818000 69702746 71953586 74088501 76182060 78317759 80245205
3747 80245205 81847567 83123946 83994037 84562274 84346533 83267478 81468924 79107059 76633052
3738 76633052 73960462 71311727 68484586 66026694 63703808 61572840 59615506 57599402
3730 57599402 55979783 54419853 53110720 51867773 50544764 49638577 48589439 47619764
3722 47619764 46454756 45511814 44650105 44040191 43178617 42215885 41760538 41060541 40288466
3713D0288466q04664p01742p32354o33765o06935p33985p52804o73320p78723
3704C3870174p37351p32852p97418m27692o38452p17537n77496m13493n51792
3695B8276091n59712m15851o49266n81546m45124o51339o88910n39189o51717
3686B3093437m95404o67641q15917m47329k48900o85239n53440m77297m20161
3677A8282109l56149n02681l37562m04709l15959k47245m21196k74342k59997
3668A5162269m01989k36346k10160l18954l74951k30723k90689l28137q9372j69390
3658A2511558k45797j47226k79358j98027j07674p1771l31468o740P2451l09059
3648A0886889q1118r9515q7673P427q5128j81536J10074N480q0995n4970o6614
$$ plain form
3713 40288466 39483802 38782060 38049706 37415941 36809006 36075021 35322217 34648897 33870174
3704 33870174 33132823 32399971 31602553 31174861 30536409 29818872 29241376 28827883 28276091
3695 28276091 27716379 27300528 26651262 26069716 25624592 24973253 24284343 23745154 23093437
3686 23093437 22598033 21930392 21114475 20667146 20418246 19733007 19179567 18702270 18282109
3677 18282109 17925960 17423279 17085717 16681008 16365049 16117804 15696608 15422266 15162269
3668 15162269 14760280 14523934 14313774 13994820 13619869 13389146 13098457 12770320 12680948 12511558
3658 12511558 12265761 12118535 11839177 11641150 11533476 11461705 11130237 11123497 11195948 10886889
3648 10886889 10805771 10706256 10618583 10626010 10540882 10359346 10469420 10474900 10393905 10338935 10272321
3637A0272321j34889j64858j27189l41089k77074j41229j56340j78383Q0418j66604
3627H665084k65440K0462K9206j68078M4717j52658P8326m9017k30019j9922n8220
3616G894441p3086j64891J90810J46255J102P0411Q8599P3385L0740K83008J97748
3605H738522K73520K79714K69080L11645L40434K16562K36209J23843j13406J60189
3595A0836312j86753k26983k43819l74957m60750l74427l22774j96187l03797
3586H145865n5981j32961j38538k18158j35090k5103j5134n2643j32397j74808
3576G065052M1042K6940l47332j35558N0689j73841j50628O8820Q3008l28654
3566F199538m4835j3151j88148M2551N6230J5724j0689j17909j12677Q1741M7182
$$ plain form
3637 10272321 10137432 9972574 9845385 9504296 9227222 9085993 8929653 8751270 8831688 8665084
3627 8665084 8399644 8420106 8449312 8281234 8325951 8173293 8251619 8202602 7972583 7952661 7894441
3616 7894441 7821355 7656464 7847274 7993529 7994631 8065042 8153641 8227026 8257766 8540774 8738522
3605 8738522 9012042 9291756 9560836 9872481 10212915 10429477 10665686 10789529 10676123 10836312
3595 10836312 10649559 10422576 10178757 9803800 9343050 8968623 8645849 8449662 8145865
3586 8145865 8089884 7956923 7818385 7600227 7465137 7440034 7424900 7372257 7239860 7065052
3576 7065052 7106094 7133034 6785702 6650144 6700833 6526992 6376364 6445184 6528192 6199538
3566 6199538 6154703 6141552 5953404 5995955 6052185 6067909 6057220 5939311 5826634 5908375 5955557
3555E955557m9062j8389k0234j64536q906j15804O0574J20548p2027p205J12198
3544E792714Q8986k47547n5823J49576o1360J85656m0450j06347m4779O2472p387
3533E715711p5737L9090j73556j18976P9923q2093o3019j5181M5212n2377J7742
3522E316739Q54p2153m0845j21734K3130n881J19665m3849J6859q5431k7619L4707
3510E114442j49481J9544J75657n7437j11382J42624p2772j12413J84268K18255
3500E351305M4253j3421o5359J13242M1864J3875O7422j14737j14424j54093P6048
3489E245975R979k15903j06193M2566R7903p051l6503l5378R203j23515l2412
3478D848671j55611R0344Q0879k3178r5561Q7135M227l0436M9280k7095n0818
$$ plain form
3555 5955557 5906495 5888106 5867872 5703336 5694430 5578626 5639200 5759748 5687721 5680516 5792714
3544 5792714 5881700 5634153 5578330 5727906 5666546 5852202 5811752 5705405 5660626 5723098 5715711
3533 5715711 5639974 5679064 5505508 5386532 5466455 5384362 5321343 5306162 5351374 5298997 5316739
3522 5316739 5317593 5245440 5204595 5082861 5105991 5100110 5219775 5175926 5192785 5107354 5079735 5114442
3510 5114442 4964961 4984505 5160162 5102725 4991343 5133967 5061195 4948782 5133050 5351305
3500 5351305 5395558 5382137 5316778 5430020 5471884 5485759 5553181 5438444 5324020 5169927 5245975
3489 5245975 5255954 5040051 4933858 4976424 5074327 5067276 5030773 4995395 5004598 4881083 4848671
3478 4848671 4693060 4783404 4864283 4841105 4745544 4832679 4836906 4806470 4855750 4828655 4777837
3467D777837k6232q9390M0362K5149p5580k7187J31214P4622P2625n4253P3070
3456D922237j2000r6419K2022R571K25437K2299k0663J22201M4697K8145J87796
3445E455323n4050J17174J63684R0929j0983J45373J81588K02653J10148J22028
3435F523867J01380j37648j67205p5059o622o0698N101J6405K7180J34543q8235
3424F273009L1775q2546J23568O1403L5457J51676J66087j7290k506J54518Q8005
3413F983156J32871N4894n7939j7843J95210J61833M1290J09516J61175N5989
3403G820152J07291J89232J47259q5149K11626M7294R0019L10075o7208O3929
3393H834520J72171J49803j00150q5075J90475p1024J08280K4514l2476k8558
$$ plain form
3467 4777837 4751605 4662215 4702577 4727726 4652146 4624959 4756173 4830795 4903420 4849167 4922237
3456 4922237 4910237 4813818 4835840 4845411 5070848 5093147 5072484 5194685 5239382 5267527 5455323
3445 5455323 5401273 5518447 5682131 5773060 5762077 5907450 6089038 6291691 6401839 6523867
3435 6523867 6625247 6487599 6320394 6245335 6238713 6178015 6183116 6199521 6226701 6361244 6273009
3424 6273009 6304784 6222238 6345806 6407209 6442666 6594342 6760429 6743139 6740633 6895151 6983156
3413 6983156 7116027 7170921 7112982 7095139 7290349 7452182 7493472 7602988 7764163 7820152
3403 7820152 7927443 8116675 8263934 8178785 8390411 8437705 8527724 8837799 8770591 8834520
3393 8834520 9006691 9156494 9056344 8971269 9161744 9090720 9199000 9223514 9191038 9162480
3383I162480O6145J71844m0827J4929J904R3559o0498m4057J91379k18935j59774
3372I178149M603o3311K04676j56337L6013K616K42752j30045o4569J66533N4451
3361I475531J26566M4567m0614J90377j18330O7158J93533L020M7443n8355J55010
3350A0085906Q8219K69981m3670k2412J72819K77613O3232J31957J10447J05278
3340A1239370j36586K47457K90213K16664Q7041M3209J6523O2264J52134K09905
3330A2428194K74001J16367N5530N2002K69835J20964J99895K51793J06190L05698
3320A4180469J93231L7142K08886R4769J62175J74362K34905J81311J18775Q1047
3310A5667072K59354K14745K86321J54137J0667L17417Q6807K41100J71777J48067
$$ plain form
3383 9162480 9228625 9400469 9359642 9374571 9376475 9470034 9409536 9365479 9556858 9337923 9178149
3372 9178149 9182752 9119441 9324117 9167780 9203793 9206409 9449161 9319116 9254547 9421080 9475531
3361 9475531 9602097 9646664 9606050 9796427 9678097 9745255 9938788 9941808 9989251 9930896 10085906
3350 10085906 10174125 10444106 10400436 10378024 10550843 10828456 10891688 11023645 11134092 11239370
3340 11239370 11102784 11350241 11640454 11857118 11944159 11987368 12003891 12066155 12218289 12428194
3330 12428194 12702195 12818562 12874092 12926094 13195929 13316893 13516788 13768581 13874771 14180469
3320 14180469 14373700 14410842 14619728 14714497 14876672 15051034 15285939 15467250 15586025 15667072
3310 15667072 15926426 16141171 16427492 16581629 16592296 16909713 16996520 17237620 17409397 17557464
3300A7557464L706J33833K19475P6775J67032L18652K68768O9623K45933K25773
3290A9287034J9819O6605L36884M13522n8J81008K51705M7474J26571K82209K93395
3279B1306168K3906L9014K28240J23259J1167J74199J90566K20537K05083K14064
3269B2736203N15690J52620O9479L26780L04603L59790M36920K37125M88423M00923
3259B6028556L37601M67130M65585M79713M84998M26877M32082N61385M90019
3250C0173946M29501N58778N53288N46460M59872M16623N31756L80510M21464
3241C4472198J91283L68273L83530L41741K51019L89757K06152K19475K69053
3232C7092481L94037K94820J94790J82131M16323K06631J45338L21228L12932
$$ plain form
3300 17557464 17561170 17695003 17914478 17991253 18158285 18476937 18745705 18815328 19061261 19287034
3290 19287034 19306853 19373458 19710342 20123864 20123806 20304814 20556519 20603993 20730564 21012773 21306168
3279 21306168 21330074 21369088 21597328 21720587 21731754 21905953 22096519 22317056 22522139 22736203
3269 22736203 23251893 23404513 23473992 23800772 24105375 24465165 24902085 25139210 25627633 26028556
3259 26028556 26366157 26833287 27298872 27778585 28263583 28690460 29122542 29683927 30173946
3250 30173946 30603447 31162225 31715513 32261973 32721845 33138468 33670224 34050734 34472198
3241 34472198 34663481 35031754 35415284 35757025 36008044 36397801 36603953 36823428 37092481
3232 37092481 37486518 37781338 37976128 38158259 38574582 38781213 38926551 39247779 39560711
3223C9560711K13046K40623J86538J55767K26109K62224L19515L18911K96532
3214D1779976L32982J53494M62751K60906K38715M20902N27083O06254N08472
3205D5291535N27279N82546N78587M99635P64816R71003O12644N67223O59434
3196E1054702Q47686Q82178J006876R36561Q41555J022763J032268J126955R64429
3187E9715973J135190R47913J046531J221019J121476P20015Q53344N93943M63848
3178F7819252L05899K93212K21897O5954K8883j48503l50877j6767l94783n50186
3168F7273981m93070q44602n52366o71561q99453p40253p32780r80570q82234
3159F0477092o54917r72681r52386o57381q06848q31694o04065n08435m82461
$$ plain form
3223 39560711 39773757 40014380 40200918 40356685 40582794 40845018 41164533 41483444 41779976
3214 41779976 42112958 42266452 42729203 42990109 43228824 43649726 44176809 44783063 45291535
3205 45291535 45818814 46401360 46979947 47479582 48244398 49215401 49828045 50395268 51054702
3196 51054702 51902388 52784566 53791442 54728003 55569558 56592321 57624589 58751544 59715973
3187 59715973 60851163 61799076 62845607 64066626 65188102 65908117 66761461 67355404 67819252
3178 67819252 68125151 68418363 68640260 68706214 68735097 68586594 68235717 68218950 67824167 67273981
3168 67273981 66780911 65936309 65383943 64712382 63812929 63072676 62339896 61359326 60477092
3159 60477092 59822175 58849494 57897108 57239727 56432879 55601185 54997120 54488685 54006224
3150E4006224n43148l58271m10408l65663l44866n253j15865o4814J55171j15951
3140E1837156J3892K74768K45693L03079K74878K31879K80010L28697N53781P58051
3130E5101884O36403O24998O38405P29232O79878R35649Q26854Q83101R64675
3121F2021079J008751J150383J174907J115440J215342J233557J158019J466680
3113G1544158J432190J514728J380631J534037J647264J626102J541802J674795
3105H3895707J793438J697636J652691J788221J831779J900165J574315J751940
3097I7885892J834452J741589J833863J958656J768045K027471J890725J944721
3089A12885414J918514J909493J938606K049336J913917K117315K016547K009912
$$ plain form
3150 54006224 53463076 53104805 52694397 52328734 51983868 51978615 51862750 51797936 51953107 51837156
3140 51837156 51851048 52125816 52371509 52674588 52949466 53181345 53461355 53790052 54343833 55101884
3130 55101884 55738287 56363285 57001690 57730922 58410800 59346449 60173303 61056404 62021079
3121 62021079 63029830 64180213 65355120 66470560 67685902 68919459 70077478 71544158
3113 71544158 72976348 74491076 75871707 77405744 79053008 80679110 82220912 83895707
3105 83895707 85689145 87386781 89039472 90827693 92659472 94559637 96133952 97885892
3097 97885892 99720344 101461933 103295796 105254452 107022497 109049968 110940693 112885414
3089 112885414 114803928 116713421 118652027 120701363 122615280 124732595 126749142 128759054
3081A28759054J853012K000148K038648J938477K140495K069704K321028K385499
3073A45506065K514018K425660K676204K805192K909844K885746K771985K978260
3065A67472974L016409L183928L350625L179491L219020L114159L336148L170459
3057A93043213K868747K854079K991187K708346K190888K146691K030641J845225
3049B12679017J567087J318568J045724O57194N05791M71902M5305J4459m36475
3040B17868572m82559l93973p77477p19119q78520q26298j117082j093476r80947
3031B10599121j059743j327102j170460j230958j363249j384252j436614j572216
3023B00054527j592272j802607j557091j744509k027353j988435k168204k121661
$$ plain form
3081 128759054 130612066 132612214 134650862 136589339 138729834 140799538 143120566 145506065
3073 145506065 148020083 150445743 153121947 155927139 158836983 161722729 164494714 167472974
3065 167472974 170489383 173673311 177023936 180203427 183422447 186536606 189872754 193043213
3057 193043213 195911960 198766039 201757226 204465572 206656460 208803151 210833792 212679017
3049 212679017 214246104 215564672 216610396 217267590 217773381 218245283 218290588 218305047 217868572
3040 217868572 217386013 216992040 216214563 215495444 214616924 213790626 212673544 211580068 210599121
3031 210599121 209539378 208212276 207041816 205810858 204447609 203063357 201626743 200054527
3023 200054527 198462255 196659648 195102557 193358048 191330695 189342260 187174056 185052395
3015A85052395k510937k343656k372638k597365k627271k591233k684687k636797
3007A64687811k640035k689202k854554k831775k665186k940258k911282k942760
2999A42212759k883391k727802k664707k598878k668935k330331k243649k169675
2991A21925391k077813j975675j706558j684351j505461j434424j291220j433698
2983A08816191j291041j309449j266045j109848q41580q91600q80168j000301
2975A00226159j091262q02622p52805r29992j060724q52149p99548j142673r18384
2966I1876000r48071q59850p92974j058510j106617j079561r13966q30274p21498
2957H3564679p69798p14551n35770m46422m89096l86064l64546o2165n7337K43451
$$ plain form
3015 185052395 182541458 180197802 177825164 175227799 172600528 170009295 167324608 164687811
3007 164687811 162047776 159358574 156504020 153672245 151007059 148066801 145155519 142212759
2999 142212759 139329368 136601566 133936859 131337981 128669046 126338715 124095066 121925391
2991 121925391 119847578 117871903 116165345 114480994 112975533 111541109 110249889 108816191
2983 108816191 107525150 106215701 104949656 103839808 102998228 102106628 101226460 100226159
2975 100226159 99134897 98332275 97579470 96649478 95588754 94736605 93937057 92794384 91876000
2966 91876000 90927929 90068079 89275105 88216595 87109978 86030417 85116451 84286177 83564679
2957 83564679 82794881 82080330 81544560 81098138 80609042 80222978 79858432 79796267 79738930 79982381
2947G9982381J08175J31777L11457L15304L57983M97119N89100P50955P72619
2938H3816870P12857P63640Q67678P06693J012978R27195J005391Q18091R36033
2929I1567426Q45956O31253O56516N19911M13901L06101L19220J713p3817k11306
2919I4976874l17661n59281o25167q75586r16832j087274j150068j245747j377691
2910H6821567j367437j295628j520112j371361j616790j312499j302056j090540
2902G5945144j069485j229588r17318r03409o68144m73458o42195p41263m89748
2893F8810536l39289j95663m22453k60321j3076l47031k19806k61224j28191j81635
2883F6441847l56636k40235k98922m62092n26550n41405n07729m59256p45011
$$ plain form
2947 79982381 80090556 80222333 80533790 80849094 81207077 81704196 82293296 83044251 83816870
2938 83816870 84529727 85293367 86161045 86867738 87880716 88807911 89813302 90631393 91567426
2929 91567426 92413382 93044635 93701151 94221062 94634963 94941064 95260284 95261997 95188180 94976874
2919 94976874 94659213 94099932 93474765 92599179 91682347 90595073 89445005 88199258 86821567
2910 86821567 85454130 84158502 82638390 81267029 79650239 78337740 77035684 75945144
2902 75945144 74875659 73646071 72728753 71825344 71157200 70683742 70041547 69300284 68810536
2893 68810536 68471247 68275584 67853131 67592810 67579734 67232703 67012897 66751673 66623482 66441847
2883 66441847 66085211 65844976 65546054 65083962 64557412 64016007 63508278 63049022 62304011
2874F2304011m70011o57720q51655o55370o67751q10770o85399q96169o67090
2865E5942076p32687q73572q53778r29564r99516q66694p66122o48375q72292
2856D8399476q62997q89955r25663o10988o15361o79074o30451o10608n90105
2847D1984274n53346m64447l87891k67897m11748j91508k799m13833l22949l06009
2837C8661847k27410k41063m5102k94730k80869k62556k33044j42435k67141k65076
2827C6402421l22305j69958k87704l31946j18264k54312l22871k66147k94848
2818C4034066j74386l7631l38536k61263q1239k83893k29431l41486m6198j59924
2808C2080079k63501l79668m62750k04129j76401j93232j70610r3223k70059j66047
$$ plain form
2874 62304011 61834000 61176280 60324625 59669255 59001504 58190734 57505335 56609166 55942076
2865 55942076 55209389 54335817 53482039 52552475 51552959 50686265 49920143 49271768 48399476
2856 48399476 47536479 46646524 45720861 45109873 44494512 43815438 43184987 42574379 41984274
2847 41984274 41430928 40966481 40578590 40310693 39898945 39707437 39704638 39290805 38967856 38661847
2837 38661847 38434437 38193374 38148272 37853542 37572673 37310117 37077073 36934638 36667497 36402421
2827 36402421 36080116 35910158 35622454 35290508 35172244 34917932 34595061 34328914 34034066
2818 34034066 33859680 33822049 33483513 33222250 33141011 32857118 32627687 32286201 32240003 32080079
2808 32080079 31816578 31436910 30974160 30770031 30593630 30400398 30229788 30136565 29866506 29700459
2798B9700459j96163j32040o6899k02148N2146J03942j15906O1795J12046J33115
2788B9450347J54608K92490J83696K76132M26862K74906M74194L78484L99183
2779C2310902N10016M14591L46004N90382N67717L63881N70289L18904L84582
2770C6377268N95388N58262O58322R26876Q12453R23084J039675J282189J221534
2761D4395051J328989J324385J572698J631024J518006J800738J851570K053121
2753E7475582K026183K084771K248578K261005K044016J916689J885075K088629
2745G4030528J631543J477335J332152J262372J103852J088053J278066J471461
2737H4675362J624711J692027K079200K315801K549665K832842L155556L571538
$$ plain form
2798 29700459 29504296 29372256 29305357 29103209 29155355 29259297 29143391 29205186 29317232 29450347
2788 29450347 29604955 29897445 30081141 30357273 30784135 31059041 31533235 31911719 32310902
2779 32310902 32820918 33235509 33581513 34171895 34739612 35103493 35673782 35992686 36377268
2770 36377268 36972656 37530918 38189240 39116116 39928569 40851653 41891328 43173517 44395051
2761 44395051 45724040 47048425 48621123 50252147 51770153 53570891 55422461 57475582
2753 57475582 59501765 61586536 63835114 66096119 68140135 70056824 71941899 74030528
2745 74030528 75662071 77139406 78471558 79733930 80837782 81925835 83203901 84675362
2737 84675362 86300073 87992100 90071300 92387101 94936766 97769608 100925164 104496702
2729A04496702L684004L938769M219626M403610M632980N087455N343650N212570
2721A41019366N356347N388853N470046N628973N808347N880433O043292N955986
2713A86551643O165594O321098O532889P252584P509658Q071295Q456109R007329
2705B45868199R161044Q959753Q891724Q143290P535614O703822N554394M334313
2697C05152153K946039J192426q6667j095902j880844k542808l241894l472591
2689B96969912l867173m329111n076631o105095p141238q461576r257418r879754
2681B42851916j0658849j0820258j1031103j1066770j0490614j0037309r643057
2674A69103956q964858q268594p581981o975091o615436n894086n330508m977301
$$ plain form
2729 104496702 108180706 112119475 116339101 120742711 125375691 130463146 135806796 141019366
2721 141019366 146375713 151764566 157234612 162863585 168671932 174552365 180595657 186551643
2713 186551643 192717237 199038335 205571224 212823808 220333466 228404761 236860870 245868199
2705 245868199 255029243 263988996 272880720 281024010 288559624 295263446 300817840 305152153
2697 305152153 308098192 309290618 309203951 308108049 306227205 303684397 300442503 296969912
2689 296969912 293102739 288773628 283696997 277591902 270450664 261989088 252731670 242851916
2681 242851916 232193067 221372809 210341706 199274936 188784322 178747013 169103956
2674 169103956 160139098 151870504 144288523 137313432 130697996 124803910 119473402 114496101
2666A14496101m525241m069690l772701l526002l025991k843955k707618k431901
2658H7593002k209712k204263j968536k025942j821792j795959j841703j753288
2650G1971807j793053j863879j815537k065145k004813k007257k040141j924284
2642E6457698j874234j863633j970263j917329j548070j536755j684065j282613
2634D2780736j471333j032530j259395j131053r25107j062523q09407p67313r31282
2625C3390793r69940p33319q37475m52386p30739r90790n23548o87103p05043
2616B6760450o46899o79428p64631n78569n03624n15118l60776o70160o58931
2607B1382314m18661l76097l12859k68349n36258o16686k72590l27650l68342
$$ plain form
2666 114496101 109970860 105901170 102128469 98602467 95576476 92732521 90024903 87593002
2658 87593002 85383290 83179027 81210491 79184549 77362757 75566798 73725095 71971807
2650 71971807 70178754 68314875 66499338 64434193 62429380 60422123 58381982 56457698
2642 56457698 54583464 52719831 50749568 48832239 47284169 45747414 44063349 42780736
2634 42780736 41309403 40276873 39017478 37886425 36961318 35898795 35089388 34322075 33390793
2625 33390793 32420853 31687534 30850059 30397673 29666934 28676144 28152596 27465493 26760450
2616 26760450 26113551 25434123 24669492 24090923 23587299 23072181 22711405 22041245 21382314
2607 21382314 20963653 20587556 20274697 20006348 19470090 18853404 18580814 18253164 17884822
2598A7884822k79937l08278l00081n35598l15920l34622j02197l27851k48037
2589A5132301k44572m95358k24451j80817k39473k84299j65102l21460r2471l49435
2579A2534863j10193l7197j73899l68927j20263r7289k82949j29712k45761l44109
2569A0624564j8232k6012q9245k08415l80141L5390j57787j01983j62139p2718
2559I443282k1327M3356l12951l07089L0115p9857k07294j73917j93216j46970
2549H074132j19295k13632L1465p8527j66417P4288j5030j06163N1741j80350
2539G352212j27775j26321r5891N1788j18557k11126j20882k1137r5115m3355
2529F443841r388K0823K5817j80571K6469j20945k1516n7941j23011m8798r5311
$$ plain form
2598 17884822 17604885 17296607 16996526 16460928 16145008 15810386 15708189 15380338 15132301
2589 15132301 14887729 14392371 14167920 13987103 13747630 13463331 13298229 12976769 12884298 12534863
2579 12534863 12424670 12387473 12213574 11844647 11724384 11627095 11344146 11214434 10968673 10624564
2569 10624564 10606332 10580320 10491075 10282660 9902519 9937909 9780122 9678139 9516000 9443282
2559 9443282 9421955 9465311 9152360 8845271 8875386 8795529 8588235 8414318 8221102 8074132
2549 8074132 7954837 7741205 7772670 7694143 7527726 7602014 7586984 7480821 7532562 7352212
2539 7352212 7224437 7098116 7002225 7054013 6935456 6724330 6603448 6582311 6487196 6443841
2529 6443841 6434453 6455276 6481093 6300522 6326991 6206046 6184530 6126589 6003578 5954780 5859469
2518E859469P877j92241M3585j20972M6510n8182l34454M7843Q2606l7625n0321
2507E294095p2560r946j56106p6274L8621n3860j1623L9664o2013n4520j42928
2496D732550N421J44496j29961j00366O5444N7181o2673l0810q8803l6423j10230
2485D445826M7240M0205J90384L0234j58850k12458N8789k18675q2474J96967
2475D337188k1554Q282J3194M2303o4281O1471L0563q0358j6495N5741J07797
2464D473851k6800r7180j5061O176J68994Q2521j1613j31941k9069M1805J43773
2453D605456K7396j92886k0361J40182n3599o946J28715k9834M204j12685J79079
2442D668721l1540n4002J6184k03795k8632L1264J60604m6633q8662j03075M6437
$$ plain form
2518 5859469 5867346 5675105 5718690 5597718 5644228 5586046 5251592 5299435 5382041 5344416 5294095
2507 5294095 5221535 5211589 5055483 4979209 5017830 4963970 4952347 4992011 4929998 4875478 4732550
2496 4732550 4737971 4882467 4752506 4652140 4717584 4774765 4712092 4681282 4592479 4556056 4445826
2485 4445826 4493066 4533271 4723655 4753889 4595039 4382581 4441370 4222695 4140221 4337188
2475 4337188 4315634 4323916 4337110 4379413 4315132 4376603 4407166 4326808 4310313 4366054 4473851
2464 4473851 4447051 4349871 4334810 4340986 4509980 4592501 4580888 4448947 4419878 4461683 4605456
2453 4605456 4632852 4439966 4419605 4559787 4506188 4499242 4627957 4598123 4602327 4489642 4668721
2442 4668721 4637181 4583179 4599363 4395568 4366936 4398200 4558804 4512171 4423509 4320434 4366871
2431D366871l8458l7681j0542j05919k09668l2437J33113j89681k8702q8852j97136
2420C560908K1335N325j23549j75609m1829l7782O2043q1222K0662P2192r4882
2409C187592k32708J35715j93919J1533K73243k45514j46337N0437j32209r5226
2399B612607J45677J78531j81178M0606J12791k18958J27046J12543j71208j76787
2389B581670k1698P997l6024O8421q3864p421j25769J836N7549j60813K4299M8704
2377B354887p7530k57243n057J05826k5287O740m4567Q3654O4910j03882q2887
2366B019564P3487J62324j0373j08287l736m7454p5807L2361M7978O5631j28797
2355B026891l2299j1017M3213r5348r2446p2351J46232p0626j47773k8116j1197
$$ plain form
2431 4366871 4328413 4290732 4280190 4174271 3964603 3932166 4065279 3875598 3846896 3758044 3560908
2420 3560908 3582243 3587568 3464019 3288410 3246581 3208799 3270842 3189620 3210282 3282474 3187592
2409 3187592 2954884 3090599 2896680 2908213 3181456 2935942 2789605 2840042 2707833 2612607
2399 2612607 2758284 2936815 2755637 2796243 2909034 2690076 2817122 2929665 2758457 2581670
2389 2581670 2559972 2567969 2531945 2600366 2516502 2509081 2383312 2385148 2442697 2281884 2306183 2354887
2377 2354887 2277357 2020114 2015057 2120883 2095596 2102336 2057769 2141423 2206333 2102451 2019564
2366 2019564 2093051 2255375 2245002 2136715 2132979 2085525 2009718 2042079 2090057 2155688 2026891
2355 2026891 1994592 1983575 2026788 1931440 1838994 1766643 1912875 1842249 1694476 1666360 1655163
2344A655163Q0022p2670Q3704q7874m2204J98201j26572j29309N861L01281K6847
2333A892450j07785j04217J3939K3313L8939j18518J09756j8963r3587l8453J9242
2322A616116M738J0652N9635q1794O7682O2379q7008L0003j5017o8555r1691J29526
2310A636666P8009j82754p3841J30675p0093M8954J43399l19618M7072O2482O671
2299A507622O414J5247n5259q989J08734N7722k06610j11529o550N0039K6635
2288A383476R5394j73037j99744K00752j1183J37508N4304j72275o6905m9964
2278A198326K50897M0783q8183K543j16057j32913J61067o850r6289j9663J40382
2267A334043q5192o5466J8324l2971L2517p0146O5995j68452r3912J84390J3103
$$ plain form
2344 1655163 1735185 1662515 1746219 1658345 1616141 1814342 1687770 1558461 1564322 1865603 1892450
2333 1892450 1784665 1680448 1694387 1717700 1756639 1638121 1747877 1728914 1635327 1596874 1616116
2322 1616116 1620854 1631506 1691141 1609347 1677029 1739408 1652400 1682403 1667386 1598831 1507140 1636666
2310 1636666 1714675 1531921 1458080 1588755 1518662 1567616 1711015 1391397 1438469 1500951 1507622
2299 1507622 1514036 1529283 1474024 1465035 1573769 1631491 1424881 1313352 1306802 1356841 1383476
2288 1383476 1478870 1305833 1106089 1306841 1295658 1433166 1487470 1315195 1248290 1198326
2278 1198326 1449223 1490006 1401823 1404366 1288309 1155396 1316463 1309613 1213324 1193661 1334043
2267 1334043 1248851 1183385 1201709 1168738 1201255 1131109 1197104 1028652 934740 1119130 1132233
2256A132233M5599q4674j1568P640r619K1692N2079K6723K4325L0564k63440J89066
2244A160620l7307n8706L0167o1154j4142o4691Q4061j31397p8129j7488J56155
2233I67989J69321j09505K2820O4912n9499j23162j7742K5545K02251L2230j37892
2222A037268P1618r7874j155j34584j64732N4380J55918n2492J45368L8633Q0899
2211A133247J06444k29590j7862n9723M8268j49381n6174J07109k4412m3705K1988
2200H36209J08335K3948J36212m3576p1460O6966q3659k00918J08745J34266l2746
2189I82322Q9190m5751j7690k4613q3143l9290J9401J31685P3998J45965j71659
2178A060415j7o4975M2563m2642k2127o9501m7713O4768q6058J7231O2610p388
$$ plain form
2256 1132233 1177832 1093158 1081590 1089230 1079611 1101303 1153382 1180105 1204430 1234994 971554 1160620
2244 1160620 1123313 1064607 1094774 1033620 1019478 954787 1038848 907451 829322 811834 967989
2233 967989 1137310 1027805 1050625 1115537 1056038 932876 915134 940679 1142930 1175160 1037268
2222 1037268 1108886 1011012 1009857 875273 710541 764921 920839 868347 1013715 1052348 1133247
2211 1133247 1239691 1010101 992239 932516 980784 831403 775229 882338 857926 814221 836209
2200 836209 944544 968492 1104704 1061128 989668 1056634 972975 772057 880802 1015068 982322
2189 982322 1071512 1025761 1008071 983458 900315 861025 880426 1012111 1086109 1232074 1060415
2178 1060415 1060398 995423 1037986 995344 973217 903716 856003 920771 834713 851944 914554 907166
2166I07166q3237O0122k3800K42720j12930j21047n8737R98J34224K8191k106
2155I71564m2840O4181o0564k5509L8852j7836J78474j60289J86312J0495n7285
2144A085555j23949O5281J04048M7542k8769Q7980k8259k10920J68167J675Q958
2133A177309k82521L6805K74510L6153J7645q2652p8340K1003r9097m2101K50505
2122A229219P8848j48080O8916J1630q694m2209j5163L8361j9051Q6880N7640
2111A338297j1154Q1870j00932O0372j5222o1290N0026J07930J23654l0797M7483
2100A590237r6196J38616Q1654J44019k6510N037J204L8907J65127K4896M7213
2089B114204K16424K5115J2433J75707K01684K14900J84542K29339J65833J23261
$$ plain form
2166 907166 823929 884051 860251 1102971 990041 868994 810257 811255 945479 973670 971564
2155 971564 928724 992905 932341 906832 945684 927848 1106322 946033 1132345 1142840 1085555
2144 1085555 961606 1026887 1130935 1178477 1149708 1237688 1209429 998509 1166676 1168351 1177309
2133 1177309 894788 931593 1206103 1242256 1259901 1177249 1098909 1119912 1020815 978714 1229219
2122 1229219 1308067 1159987 1228903 1240533 1231839 1189630 1174467 1212828 1193777 1280657 1338297
2111 1338297 1327143 1409013 1308081 1368453 1353231 1291941 1341967 1449897 1573551 1542754 1590237
2100 1590237 1494041 1632657 1714311 1858330 1831820 1836857 1838061 1876968 2042095 2066991 2114204
2089 2114204 2330628 2355743 2368176 2543883 2745567 2960467 3145009 3374348 3540181 3663442
2079C663442J51180K57000J25367J56821L86405N52407L50288M50206M19954Q27810
2069G340880O80847P13069R89690R15477J408285J554001J786951K027219K551590
2060A9968009J892070N83659J253829J804631K180229K29258l065455l100289
2052B1745941k910713k485847j861144j443348j100584j430745j222484q76240
2044H414836q75191n83454o46780m50850l39793l96575j62092k90038l45205j91341
2034D133517O5855j60674k08671k82697j86728K5886n046k42163M1974j84413
2024B996840k19428m8560l8789j55660q5678k7439j0586j30888l5390j9712r0402
2013B134308r6541k52954j529J90424j97869o8437L9131p9495O5553q0053k9101
$$ plain form
2079 3663442 3814622 4071622 4196989 4353810 4740215 5292622 5642910 6093116 6513070 7340880
2069 7340880 8021727 8734796 9724486 10639963 12048248 13602249 15389200 17416419 19968009
2060 19968009 21860079 22443738 23697567 25502198 27682427 27911685 24846230 21745941
2052 21745941 18835228 16349381 14488237 13044889 11944305 10513560 9291076 8414836
2044 8414836 7539645 6956191 6309411 5858561 5518768 5122193 4960101 4670063 4324858 4133517
2034 4133517 4199372 4038698 3830027 3547330 3360602 3386488 3381442 3139279 3181253 2996840
2024 2996840 2777412 2728852 2690063 2534403 2448725 2421286 2410700 2279812 2244422 2224710 2134308
2013 2134308 2037767 1784813 1783284 1973708 1775839 1707402 1746533 1667038 1732591 1652538 1623437
2002A623437r2984j18098n7174J77027n4337j91782m2561q060p314j07997R8268
1991A218425K4257o0195o3340L8245J60211k0566j48076j42664L6394m6414O1582
1980A057859J2975j33922K8493o4291q6508M3551j10432n7501l8381J38748M0202
1969H30793N4363P1295K8874r2145j56503n1089J36591M3339j13342J5984j26914
1958F41246O0976M1411j0115M7053m6333K4015R2664J00768k26120L8669P0428
1947H34662p8542j57099M9292L7001r1050o6420J5209M1287l3191J2047O1870
1936F25066K6158j57301M3767O1066k6739j937N9549j12215N4354K8742o7738
1925E32772r7841Q9698j9523n1567k3480N5466j5121r2522J07235k8648m53O1548
$$ plain form
2002 1623437 1530453 1412355 1355181 1532208 1477871 1286089 1243528 1235468 1228154 1120157 1218425
1991 1218425 1242682 1182487 1119147 1157392 1317603 1297037 1148961 1006297 1042691 996277 1057859
1980 1057859 1070834 936912 965405 901114 814606 858157 747725 690224 651843 790591 830793
1969 830793 885156 956451 985325 893180 736677 685588 822179 865518 752176 768160 641246
1958 641246 702222 743633 733518 780571 734238 758253 850917 951685 725565 764234 834662
1947 834662 756120 599021 648313 685314 594264 527844 543053 584340 551149 563196 625066
1936 625066 651224 493923 537690 598756 572017 570080 629629 517414 571768 600510 532772
1925 532772 434931 524629 505106 453539 430059 485525 470404 377882 485117 456469 456016 517564
1913E17564o0692j23350J34377N0836O2347Q6601q483k4086l5797L434j79089
1902D23662k1756J12543o4599n912M352j04914M8283O3578o8394j6168m4815q028
1890C17832K31354l8961m5709M4056j02734Q2261M0681j47605l8862m1732Q1413
1879C81994J61631m4077P3605L608m349q4718j4382m1664n351m601k23887j9550
1867A78259K19913J18342R534l4480j07823K6788k0740o1145J12928j1851k62
1856D29463K7918P6523q8937j65j53742p2144J64372J11282K2513j9201j54153
1845C43729j07827Q8974Q4408r302r499n6820r0696R9653Q054J16021j62630O8322
1833C72387P3965n6315m9475J8178J38918j28575M3429q8328J70266j13233j87442
$$ plain form
1913 517564 456872 333522 467899 518735 581082 667683 659200 635114 599317 602751 423662
1902 423662 401906 514449 449850 443938 448290 343376 391659 455237 386843 370675 325860 317832
1890 317832 549186 510225 464516 508572 405838 488099 528780 381175 342313 300581 381994
1879 381994 543625 499548 573153 576761 572412 487694 473312 431648 426297 421696 197809 178259
1867 178259 398172 516514 526048 491568 383745 410533 389793 328648 441576 429725 429463
1856 429463 457381 533904 444967 444802 291060 218916 383288 494570 517083 497882 343729
1845 343729 235902 324876 409284 399982 390483 333663 242967 342620 350674 466695 304065 372387
1833 372387 446352 390037 340562 358740 497658 369083 412512 324184 494450 381217 193775
1822A93775L28976Q9741n3084k23794j9200J18291J9389P3750m0657m4693R4127
1811E36621J6125m9883K335q4054j7100P624r0839P2825k5785n1665j08303J32695
1799C40596o3054q8390Q6698K5763P1916q6216k3298N7101O806O3246N2079M7696
1787D90943j05042q3312k5915L0220J4325M0896J9210j39650J2680L8148p8189
1776B14314j43068J69917j8623j74317Q2452P8833m2383J26078Q854k84597J82656
1765B00116j0761k411O1811k1708o5652n348N885J28137l420p9452N5532p7478
1753A85251j61210J91429m5843Q9120J16792N2741r4634n0019l2415N0843J34859
1742D36914r2202n3852k01361R1743M0840L0334O6342J51992j81079J8208M1799
$$ plain form
1822 193775 522751 612492 559408 335614 316414 434705 454094 527844 487187 442494 536621
1811 536621 552746 502863 505198 421144 404044 411668 320829 393654 367869 316204 207901 340596
1799 340596 277542 189152 275850 301613 373529 287313 264015 321116 327922 391168 443247 490943
1787 490943 385901 302589 276674 306894 321219 362115 381325 241675 254355 292503 214314
1776 214314 71246 241163 222540 48223 130675 209508 167125 293203 302057 17460 200116
1765 200116 189355 186944 248755 227047 161395 156047 161932 290069 286649 207197 262729 185251
1753 185251 24041 215470 169627 258747 375539 428280 333646 283627 251212 302055 436914
1742 436914 344712 290860 89499 181242 222082 252416 318758 470750 289671 307879 349678
1731C49678n0480k9640O6109j39752M2216O9995n1221m5764K15350p4041j09094
1720B43356P7278J1195o2214R4610n2588o6058P9335L6664R236j71214m1146o645
1708A51809k4410o2480J44460n5101j5397N0081l7931J03487K6929K07788m8995
1697D40240j87482l0468M0903J85035j00062m3441p9053r6952J54961J05345J1666
1686D00692j23181Q0472j23763N1360J5999o6833R206r6210J14867j3784o6248
1675A82577k2138L3524l4801K78007j2350l02074L8370M3316L9966j24428J18126
1664B38095L9488N7705n1596m1653L5339J3424n2805J0979n4098L7038K06846
1653D38762p2405q4658k05482J22282q8369n7688K04926J9670M9843J15054q9047
$$ plain form
1731 349678 299198 269558 335667 195915 238131 308126 256905 211141 426491 352450 243356
1720 243356 320634 331829 269615 364225 311637 245579 324914 361578 370814 199600 158454 151809
1708 151809 127399 64919 209379 154278 138881 188962 151031 254518 281447 489235 440240
1697 440240 252758 222290 263193 448228 348166 304725 225672 128720 283681 389026 400692
1686 400692 277511 357983 234220 285580 301579 234746 243952 147742 262609 248825 182577
1675 182577 160439 193963 159162 437169 424819 122745 161115 204431 244397 119969 238095
1664 238095 277583 335288 283692 242039 277378 290802 237997 248976 194878 231916 438762
1653 438762 366357 281699 76217 198499 110130 52442 257368 277038 326881 441935 352888
1642C52888N4441p2299r0290k4980R0508j67417R3986P8045j2322K4561q9200
1631B37921o2710N7323m9441l9928M9272J0715O2253o3424q2959p0516K7652K46006
1619C22164R087l4802p8337o5974j68106K42973J88102j32446q7645k8894j08640
1608E7482k555J31442o8102P4804J03885k13155q3062J23375p3283j0861K479
1597D2449K12182q9814o4159M4426o6162p2230J28483j6012J36456k35678N30
1586B0471O6070j20358k6022J45358J01423M7962Q8959p9896R235j29288j53640
1575b9726J41936J05980j00018P915k106o9984k349J75348m5643k2262j02942
1564E6149J3997Q5425P5168K2154o480j00286p1842O2737J01M6977J4258M114
$$ plain form
1642 352888 407329 335030 244740 219760 310268 142851 236837 314882 302560 327121 237921
1631 237921 175211 232534 183093 143165 192437 203152 265405 201981 119022 48506 76158 322164
1619 322164 331251 296449 218112 152138 -15968 227005 415107 282661 195016 166122 57482
1608 57482 54927 186369 118267 193071 296956 83801 739 124114 50831 39970 42449
1597 42449 254631 164817 100658 145084 78922 6692 135175 119163 255619 19941 20471
1586 20471 86541 -33817 -59839 85519 186942 234904 323863 243967 253202 123914 -29726
1575 -29726 112210 218190 118172 126087 123981 53997 51648 226996 181353 159091 56149
1564 56149 70146 155571 230739 252893 246413 146127 74285 137022 137123 184100 198358 202472
1552B02472L660K3721K2656N6315o6531j33258o129J76282p9825k12528Q2514
1541F9349O0623q0069K5520L5623J16833j61169j19362J88988K05803j51502j6552
1530A74085J74443o8609K741o4953n7106k6666k350J37394L4078j77630Q810M8431
1518A82668J14819O8639p9906j89607j6864R810r3457J92394J00944O0111k10267
1507A39284K4892k916k6380P5502k8611m2520q9882J55078p1973l8720J04870
1496A98624o3139J49367J00054j20815l3309K6775q810j82493l9485P6495P8408
1485A81672k2827q1856J2527J08242M0041j00148Q681K3544J32323k67633j05902
1474g1336J72609J01348M7365n0762N8668r190j14622j37400K16436p6088J16962
$$ plain form
1552 202472 206132 229853 252509 308824 242293 109035 102906 279188 199363 -13165 69349
1541 69349 129972 49903 75423 111046 227879 66710 -52652 136336 342139 190637 174085
1530 174085 348528 279919 282660 217707 160601 133935 131585 268979 303057 125427 134237 182668
1518 182668 297487 366126 286220 96613 79749 89559 -3898 188496 289440 349551 139284
1507 139284 164176 161260 134880 210382 181771 139251 49369 204447 132474 93754 198624
1496 198624 135485 284852 384906 264091 230782 257557 248747 66254 26769 103264 181672
1485 181672 158845 76989 89516 197758 237799 137651 146332 169876 302199 34566 -71336
1474 -71336 101273 202621 249986 199224 257892 248702 134080 -3320 213116 137028 253990
1463B53990j00110j57031j3421J79109N2623j07711L5152q4778M4656J62296o6598
1452A98177j667m2935q270k00024O7838O1778J5102l8969j35126J10377N060P8162
1440A09503p8902m921O1193j06508Q530J67963j0042o4031p694O7911K7969r9706
1428G1265K208M1861q931L0093N2320P5003r7073K4227j38871N5803Q8639o2921
1416A33623o2089J42324j06208N2255q7112J2336k2891M6024j27881L0282P5120
1405H5783n5206N7501l5166R0452q4169M3611o8365m0110K07550j16106j24626
1394c8851J68940O5650o4591r5167k4401L0290P1350J8005l6861L518p1571P0110
1382I6421N7165l12983J83937L245j12385Q3245k5955J04360K78642k79579m0331
$$ plain form
1463 253990 153880 -3151 -16572 162537 215160 107449 142601 57823 102479 264775 198177
1452 198177 196510 153575 145305 -54719 13119 74897 89999 51030 -84096 26281 31341 109503
1440 109503 30601 25680 86873 -19635 -11105 156858 146816 82785 75091 143002 170971 71265
1428 71265 73473 115334 106403 136496 188816 263819 166746 190973 52102 107905 196544 133623
1416 133623 71534 213858 107650 159905 72793 85129 62238 108262 -19619 10663 85783
1405 85783 30577 88078 52912 143364 59195 102806 34441 -5669 201881 85775 -38851
1394 -38851 130089 195739 131148 35981 11580 41870 113220 131225 94364 97882 26311 96421
1382 96421 153586 -159397 24540 27785 -84600 -1355 -27310 77050 355692 76113 35782
1371C5782R3797j8881m3720J288j1634m6994J22646K19211m3135j46577R7022
1360B58805j42360k46218K39045J05915j08231P8524j3008j14771J03357j4558
1350A46500L0952j1476p7936p2103J08679J49484j67006n6985p8845J34491L4806
1339A40561J40649J12344q5844j42007p5077j92484J9976J52039j0576M416j10250
1328d6253J22256J74147m5772L61j32632j49588J1420R9558P7804J508M3403k5884
1316A30328j33847r8211N163J05282K5362J95055M2549p919j78037Q787K3112
1305A17624k5290L3354k1145M2302j43142o4949O8270L4079N7636q8125j18151
1294a07537J12867n3375Q5172K6738l2741J27257n7767o8254P7981l9923o8286
$$ plain form
1371 35782 129579 110698 66978 68266 56632 9638 132284 351495 308360 161783 258805
1360 258805 116445 -129773 109272 215187 106956 185480 172472 57701 161058 146500
1350 146500 177452 165976 88040 15937 124616 274100 107094 50109 -28736 105755 140561
1339 140561 281210 393554 307710 165703 90626 -101858 -81882 70157 59581 63997 -46253
1328 -46253 76003 250150 204378 204739 72107 -77481 -66061 33497 111301 112809 156212 130328
1316 130328 -3519 -101730 -96567 8715 34077 229132 271681 263762 85725 94512 117624
1305 117624 92334 125688 104543 146845 3703 -61246 7024 41103 98739 10614 -107537
1294 -107537 5330 -48045 37127 63865 31124 158381 100614 32360 110341 70418 2132
1283B132J1903J11756j0236k5637O4618j40143R3659p4382P6986k6496J1152j08031
1271a2719r4993Q2586M2438J34982j2421o5459J1264r33o469J52145k7532j50841
1259E2048j4285N0344O2112j55686J34981o0615p9012J62757P9022l472k26248
1248A946J20717L9971Q0912k58350P435O6877J8441o4789o056R1036R9850j51622
1236D6368j04002J27203q1069Q7454N6890n9176L6357J4603n2813n6847P0158
1225H5126l027r9138k0158Q5606k2661L2810j33990J63802j11673P0038m0949
1214E786j9180p34O4167O7788n5436L2007p6626k4968J29286o8270J3327p6402
1202i255j24967O7091j01921K33721j12452K37786p2293J3853j2362J56556L842
$$ plain form
1283 2132 14035 125791 115555 89918 154536 14393 108052 33670 110656 84160 95312 -12719
1271 -12719 -107712 -25126 17312 152294 139873 74414 85678 84745 78276 230421 202889 52048
1259 52048 37763 88107 150219 -5467 129514 68899 -10113 152644 231666 228194 1946
1248 1946 122663 162634 243546 -14804 -7369 59508 77949 13160 7104 98140 197990 46368
1236 46368 -57634 69569 -11500 75954 132844 73668 110025 124628 71815 14968 85126
1225 85126 82099 -17039 -37197 48409 25748 58558 -75432 88370 -23303 46735 5786
1214 5786 -13394 -14128 50039 117827 62391 94398 17772 -7196 122090 53820 67147 -9255
1202 -9255 -134222 -67131 -169052 64669 -47783 190003 117710 131563 119201 275757 279599
1191B79599q3809o2618J18669P1928r4609j99979J9225N3323J2263j7611k2417
1180G3964J5701j34631J31012j6911j60386o8513N4372J10111J22988j52455J30255
1169A05507p8770P2033r5826k6011m8603K3650J32048q5661K04174m0614l7965
1158A23962J2475q7265P2459q7282j30790J67157m8060m1241O0874n1695P7098
1147F7692m5788j79916L1092J43038R3547j6005n8268j02645J26916N1433j32806
1136b1710r6809J69213m7134M5347o7364k34701J53044N4159j19093L4498r288
1125a39838O5858J42243n4821j57524m6677M8974R3601K9196J5686O078j12166
1114a09390Q1092j1349J09240q9285Q442J44227j78158J83152N4690j26448Q0096
$$ plain form
1191 279599 195790 133172 251841 323769 229160 29181 48406 101729 113992 96381 73964
1180 73964 89665 -44966 86046 69135 -91251 -159764 -105392 4719 127707 -24748 105507
1169 105507 26737 98770 2944 -23067 -71670 -48020 84028 -1633 202541 161927 123962
1158 123962 136437 49172 121631 34349 -96441 70716 22656 -18585 42289 -9406 67692
1147 67692 21904 -158012 -126920 16118 109665 93660 35392 -67253 59663 111096 -21710
1136 -21710 -118519 50694 3560 48907 -18457 -253158 -100114 -45955 -165048 -130550 -139838
1125 -139838 -73980 68263 13442 -144082 -190759 -141785 -48184 -18988 -3302 2776 -109390
1114 -109390 -28298 -39647 69593 -19692 -11250 132977 -45181 137971 192661 66213 146309
1103A46309j70058L2109J93212k3532Q3117k39845L9851q9526j29736k8991R4902
1092i2188P0003J11492M7288n7244M9875K4677k8347p3894p1586k6722o0786l1627
1080a39059N3104K2759K9549J49135m2459O5176P483j3248m0930k4913L4209j90345
1068h9539j8466o6819N0346J5180J39641L9427R7775j12360p987j08258q4929
1057a45989N6487Q4781j39088N1494P4674J0372j5404p8068J7805J03846R0699
1046A11609r1801R675N6112k8339J8261j51016N6005J11349p3457j5623N2732
1035E5507m7922p5069j17463Q0095n87J96327L0186j35959j06684N5814R3755
1024B8000j6861j37245O2910o309r847l1872Q0047Q7372M9028m7854p1064l6499
$$ plain form
1103 146309 -23749 8360 201572 178040 261157 21312 61163 -28363 -158099 -187090 -92188
1092 -92188 -22185 89307 136595 79351 129226 153903 125556 51662 -19924 -46646 -107432 -139059
1080 -139059 -85955 -63196 -33647 115488 73029 138205 145688 132440 91510 66597 100806 -89539
1068 -89539 -108005 -174824 -124478 -109298 30343 69770 167545 55185 47198 -61060 -145989
1057 -145989 -89502 -4721 -143809 -92315 -17641 -7269 -22673 -100741 -82936 20910 111609
1046 111609 19808 29483 85595 57256 75517 -75499 -19494 91855 18398 2775 55507
1035 55507 7585 -67484 -184947 -104852 -105439 90888 121074 -14885 -121569 -65755 28000
1024 28000 11139 -126106 -63196 -69505 -79352 -111224 -31177 56195 105223 57369 -13695 -50194
1012e0194l8504L13157j64619j2463n200M3692M8242r8830j34504m0406J92995
1001E3366m0544j03054N9530J62606O482p6379j00985q0356J34574J25069m0787
990I9522k7838r0662q0173J0675n6736L9595N1464J66603o8573k6332k99792K14695
978f7552N0472k1679J50417o6874n1084j00792Q6733K4378j01427n5841p8518
967b31767K73000O1830m8068j54507n7447p74L6136l1256J47141m7763N2809n6420
955e7086L0311p0429P6586O1525Q0316M4439r4022n6732n4226N4673n9923j26011
943a70579q0881L09260K0260j2101j40229R8495J34403j34800j45477J16312K0665
932A5328n0200j8382N3103p9147J27481o2703j27742J4428N601N0221R2201l0587
$$ plain form
1012 -50194 -88698 224459 59840 47377 42177 85869 134111 35281 -99223 -139629 53366
1001 53366 12822 -90232 -30702 131904 138386 62007 -38978 -119334 15240 140309 99522
990 99522 71684 -18978 -99151 -88476 -145212 -105617 -54153 112450 43877 17545 -282247 -67552
978 -67552 -17080 -38759 111658 44784 -6300 -107092 -20359 4019 -97408 -153249 -231767
967 -231767 41233 103063 54995 -99512 -156959 -157733 -121597 -152853 -5712 -53475 -666 -57086
955 -57086 -26775 -97204 -20618 40907 121223 165662 71640 14908 -39318 15355 -44568 -170579
943 -170579 -251460 57800 78060 65959 -74270 24225 158628 23828 -121649 -5337 15328
932 15328 -34872 -53254 -151 -79298 48183 -14520 -142262 -127834 -122233 -72012 20189 -10398
920a0398J4656K1597j1593j70818j9519N6105J20475N0207o7382k0504j60695
909a97869J03707J5811M2267o7750m8364J21323j0660o5512J94597j7197j66955
898i6602J49936j15415L9335j79103m3144M3494P0274J02767L8681J0220m1066
887b0623M4285P204M263j4938n6908j2017J71906K2296p5401P3121k63638M0062
875h0388l0021R5210R0192O301p934n3354j52565O2253J41115p0913M9588K8921
863G8405L8259k15525R4199L6189l7712k31491L9802J81145M9172k16650J75119
852i088M5693j09644K0595q4846O5609J45327k9662j64607o2866J28294L0482
841b4713j43292M8397K3422L9410J17471k41103N80K32828K8300p5837j47547
$$ plain form
920 -10398 4258 25855 14262 -156556 -176075 -119970 505 50712 -16670 -37174 -197869
909 -197869 -94162 -78351 -36084 -103834 -152198 -30875 -41535 -107047 87550 70353 -96602
898 -96602 53334 -62081 -22746 -201849 -244993 -201499 -131225 -28458 10223 20443 -20623
887 -20623 23662 30866 35129 20191 -36717 -48734 123172 145468 70067 143188 -120450 -80388
875 -80388 -110409 -15199 74993 81294 73360 20006 -132559 -70306 70809 -104 49484 78405
863 78405 116664 -98861 -4662 31527 -6185 -237676 -197874 -16729 32443 -184207 -9088
852 -9088 36605 -73039 -52444 -137290 -71681 73646 43984 -120623 -183489 -55195 -24713
841 -24713 -168005 -119608 -96186 -56776 60695 -180408 -179828 53000 81300 5463 -142084
830a42084k0159L6895J05581j73475P6770Q2664J73268j64996j68167J8736J34916
819d0051J24283m5814m3182R2766r2399n634M0342j42610P9622J6300p1303j6225
807a03905J01915J07351N5331k25585R1363l6148N5299P5204q1049q522p8746
796d7492p33j1138q1010Q6056l5151k9163j19189K50193J2660o9979j16482J61998
784E70L941j69726J48912j21920J3084J29578l4922R612R4403p4741k02544J9763
772a83990K11393L60j18154j09004J48579j5169j7135J44072r2772J04708q0694
761g806O777P7604r8498M7724j87500M9266J05152L302J8132R6374m8602j44985
749h3060R2489N4236k3358K542j22225j9709k664J22670n1883J43182j6388l896
$$ plain form
830 -142084 -162243 -125348 -19767 -193242 -116472 -33808 139460 -25536 -193703 -174967 -40051
819 -40051 84232 38418 -4764 88002 -4397 -10031 30311 -112299 -32677 -16377 -87680 -103905
807 -103905 -1990 105361 160692 -64893 26470 -9678 45621 120825 39776 31254 -47492
796 -47492 -48225 -59363 -140373 -54317 -89468 -118631 -237820 12373 25033 -44946 -161428 570
784 570 4511 -165215 -16303 -138223 -125139 4439 -30483 -20871 73532 -1209 -203753 -183990
772 -183990 27403 27763 -90391 -199395 -50816 -65985 -83120 60952 -31820 72888 -7806
761 -7806 -1029 76575 -21923 25801 -161699 -112433 -7281 -3979 14153 110527 61925 -83060
749 -83060 9429 63665 40307 42849 -79376 -99085 -101749 20921 -30962 112220 95832 91936
737I1936j86660O0274M0213O5147j8960m4547K9686m8291p5408n5921L6573N037
725a00921R0880K1794L7464O2411j53678J0221R894l4834J9202P474K6614j35467
713a38946K2717j57404n3509K12311R8140k9273J75904j08247o818N6599j40000
702f8526o0725J4711O6947j9092J58529J5563k6722O2046k8332q5301j63926K560
690a32268P4676M5277L2030k2410m3234l9993j47668n7110J19171J43327L2191
679C989M6299M8396q3734m7541O785N344R1965j62351J5717Q4788O3999j46838
667g3182R2330n5977o644m4502k1895j75225J97094K3314p7521R4351j6445O3271
655a031J3622r7485M0550m0810j16015M3315k9116J35171k1239j4625J27428J6053
$$ plain form
737 91936 -94724 -34450 5763 70910 51950 7403 37089 -11202 -86610 -142531 -105958 -100921
725 -100921 -10041 11753 49217 111628 -42050 -31829 -21935 -56769 -37567 -30093 -3479 -138946
713 -138946 -116229 -273633 -327142 -114831 -16691 -45964 129940 21693 14875 71474 -68526
702 -68526 -129251 -114540 -47593 -66685 91844 107407 80685 142731 114399 29098 -134828 -132268
690 -132268 -57592 -12315 19715 -2695 -45929 -85922 -233590 -290700 -171529 -28202 3989
679 3989 50288 98684 14950 -32591 -25806 -20462 71503 -90848 -75131 9657 73656 -73182
667 -73182 19148 -36829 -43473 -87975 -109870 -285095 -88001 -64687 -142208 -47857 -64302 -1031
655 -1031 12591 -84894 -44344 -85154 -201169 -157854 -186970 -51799 -73038 -87663 39765 55818
643E5818j11207j42168K2516L8582Q7246k982q2046n8411J35528l2085n9700J72588
631B3679j93398O834l419J31876j29350O9924J14150J29901k07869j67377O9573
620a55476J71755p2529n8778K3836k9151N4337M747j95408J69115R6413j07109
609i8248Q0598L251n1776l6298J15059k7445K4922K9157l5815J05775n8375j32830
597h2025k9940J1167J13685j12842m6753Q6175j9989k7467J8244K8386l9436N8270
585d2525l5571n7639j37882J12098Q4395L2859j19435Q5117j9108N1347j3778
574f0122L2659p8045j04907N5937J15430r304J14667j00913k47541L20058p2744
563c4825q9345r8009R0948R2866n1866l2842J27381j05036q2060K9243L6788q4500
$$ plain form
643 55818 -55389 -197557 -175041 -136459 -49213 -52195 -134241 -192652 -57124 -89209 -148909 23679
631 23679 -169719 -162885 -166304 -34428 -163778 -93854 20296 150197 -57672 -225049 -155476
620 -155476 16279 -56250 -115028 -91192 -120343 -66006 -61259 -256667 -87552 8861 -98248
609 -98248 -17650 -14399 -66175 -102473 12586 -14859 10063 39220 3405 109180 50805 -82025
597 -82025 -111965 -100798 12887 -99955 -146708 -60533 -80522 -107989 -89745 -61359 -100795 -42525
585 -42525 -78096 -135735 -273617 -161519 -77124 -44265 -163700 -78583 -97691 -46344 -60122
574 -60122 -27463 -105508 -210415 -154478 -39048 -48352 66315 -34598 -282139 37919 -34825
563 -34825 -124170 -222179 -131231 -38365 -90231 -123073 4308 -100728 -182788 -153545 -116757 -201257
551b01257Q0029l8509K723k6700n4591L2464J81800n0259Q7696r8972m6858K0631
539a11803J9713k1709j9115j4585M4872j18559J2615J4132m2007o9284Q3092n3318
527b75956N7245Q5258J5531j06156j2385k4081M7882J04827k47598J09216r1550
516c37767O8335L1893J32539K634N6875m567J07816j14088j64199j33391K1211
505c32709k3776J04211N335M2709N3833j4769L9747J72871L3658O353M1874p6651
493E2686k02920n1518Q5676n2549J21260j6970P661p1609j12798N9901P5848j17655
481b22987l705N6160l2742J00553M0217N6802O795j62128k5808l1376J71599m6050
469i2670k4528N5483j00540O1405m0840K02015L8916j68994m5705P9306P4534
$$ plain form
551 -201257 -121228 -159737 -157014 -183714 -238305 -205841 -24041 -74300 13396 -85576 -132434 -111803
539 -111803 -92090 -113799 -132914 -147499 -102627 -221186 -208571 -194439 -236446 -305730 -222638 -275956
527 -275956 -218711 -133453 -117922 -224078 -236463 -260544 -212662 -107835 -355433 -246217 -337767
516 -337767 -269432 -237539 -105000 -102366 -45491 -50058 57758 -56330 -220529 -353920 -332709
505 -332709 -356485 -252274 -246939 -204230 -150397 -165166 -125419 47452 81110 87463 129337 52686
493 52686 -150234 -201752 -116076 -168625 -47365 -64335 -56674 -128283 -241081 -181180 -105332 -222987
481 -222987 -226692 -170532 -203274 -102721 -62504 -5702 1093 -161035 -186843 -218219 -46620 -92670
469 -92670 -117198 -61715 -162255 -100850 -141690 60325 99241 -69753 -115458 -36152 38382
458C8382j25460Q3607j19739O5273J17145K2857j08975J0106j28457J17208p6879
447a04932p3292l5488L2835R5283j34750M0322p042q0451N4332N6605n1795k2708
435b31081J01648m5362l7793J70735o8724R7882j23952O9564J1539o1192j3416
424a30152N5970o392Q1749j53229J79133K3610k04759j0371j90j49269N1720N0817
412b11363N8502m4627N4087O6926j38721j4356M5133l1443j223k0817j09778R0726
400b56954j0081J4373J5785k1123J37979O5525m9790m2764r1703n4710J13558
389a79905J24307j38903J28503P501o1818q7237r5793J40420L8044k38645J51195
378b12331Q8364N2231j54938N890j2959o017J23006k22442R9131J23668l3054
$$ plain form
458 38382 -87078 -3471 -123210 -57937 59208 82065 -26910 -16804 -145261 -28053 -104932
447 -104932 -178224 -213712 -180877 -85594 -220344 -180022 -187064 -267515 -213183 -156578 -208373 -231081
435 -231081 -129433 -174795 -212588 -41853 -110577 -12695 -136647 -67083 -55544 -116736 -130152
424 -130152 -74182 -80574 1175 -152054 27079 50689 -154070 -164441 -164631 -313900 -262180 -211363
412 -211363 -152861 -197488 -143401 -76475 -215196 -229552 -184419 -215862 -217085 -237902 -347680 -256954
400 -256954 -267035 -252662 -236877 -258000 -120021 -54496 -104286 -147050 -238753 -293463 -179905
389 -179905 -55598 -194501 -65998 -58497 -120315 -207552 -303345 -162925 -124881 -363526 -212331
378 -212331 -123967 -71736 -226674 -220784 -233743 -239760 -116754 -339196 -240065 -116397 -149451
367a49451n122j50426K4207M7884o7516J7589l3k7971J07504o5069J02042O9520
355i6842q3140K4989j23093p367k9718J08477J12424P8514q4906j09208J12471
344i7399R30j38689J2708j1005j55052j8704J29082K6850r9612J66092K4778n306
332a65327j07411N3730p3124k5718J20465J8223j2085N7814k9621j1671k4959
321a99684J1043p6729k1211M4226j15354J27681R3606r6948q0332J6070M1052
310b56580J51271j40973l1459R9190l1995L4761o9072k0368K46955r5398j35165
299b48833p4964N5034J56444j2901p1967J35613l6018j25729j62398Q4651N762
288b95306J21458M1919m0405j71872N9388J63534j14832l6437L0602j02338l5426
$$ plain form
367 -149451 -154573 -304999 -280792 -232908 -300424 -282835 -282868 -310839 -203335 -268404 -166362 -96842
355 -96842 -179982 -154993 -278086 -285453 -315171 -206694 -94270 -15756 -100662 -209870 -97399
344 -97399 -96469 -235158 -222450 -233455 -388507 -407211 -278129 -251279 -350891 -184799 -160021 -165327
332 -165327 -272738 -219008 -292132 -317850 -197385 -179162 -191247 -133433 -163054 -174725 -199684
321 -199684 -188641 -265370 -286581 -242355 -357709 -230028 -136422 -233370 -313702 -297632 -256580
310 -256580 -105309 -246282 -277741 -178551 -210546 -175785 -244857 -265225 -18270 -113668 -248833
299 -248833 -323797 -268763 -112319 -125220 -197187 -61574 -97592 -223321 -385719 -301068 -295306
288 -295306 -173848 -131929 -172334 -344206 -284818 -121284 -236116 -272553 -241951 -344289 -379715
277c79715R8546J18098k0387k05250J39112J2478J65459M8512k14063l6986q3018
266c57214o7440J94493J05319l6945J02149j77249J5075J953Q0080P171j15015
255b47623n8578j9196K0791O3442q7756m6573k265O886J15104J3638J23107j5351
243a34374j22577j43773K71498k7093j24329j49907M7334Q8204l1860j10538N2619
232c84796P5215r2116L9663K06084j83930M8369j9418j13955J52592K8978L9799
221b03515n2931J3225o7069J20409Q6669r9376q0456j5893m8261p907J22303J2579
209b20223o257J72917P284p5706j8303J02180j68529q4585k6165o1257P6046K35248
197f7350o2111j32746J35410J9549J32718j41313j33643N6993J57389r4561q9325
$$ plain form
277 -379715 -281169 -163071 -183458 -388708 -249596 -237118 -71659 -23147 -237210 -274196 -357214
266 -357214 -424654 -230161 -124842 -161787 -59638 -236887 -221812 -219859 -139779 -132608 -247623
255 -247623 -306201 -325397 -304606 -241164 -328920 -375493 -377758 -370872 -255768 -242130 -119023 -134374
243 -134374 -256951 -400724 -129226 -156319 -280648 -430555 -383221 -295017 -326877 -437415 -384796
232 -384796 -309581 -401697 -362034 -155950 -339880 -291511 -310929 -424884 -272292 -243314 -203515
221 -203515 -256446 -243221 -310290 -189881 -103212 -202588 -283044 -298937 -347198 -355105 -232802 -220223
209 -220223 -226480 -53563 -46279 -121985 -140288 -38108 -206637 -291222 -317387 -378644 -302598 -67350
197 -67350 -129461 -262207 -126797 -107248 25470 -115843 -249486 -192493 -35104 -129665 -218990
186b18990p9824J8676J21745n8918k09808r5874J17885J01074O4332o5996o5136
175c70834N2522o5066n9147j781O5338k6683k3716Q8094N5025J2686L5264j00131
163c38429L2798J00519l2182l5786R9721j35791k0486L5980p1890r3945r8147
152e57638J61282O5462K2693n969k9455j044Q0570M0608L4969q7277J6415k4919
140b84303J29352R735j38136J9331O7389r5858o468r2011J36390R3167j05802
129b67214R2113m6583k7317L7530J00125j53940l185P9201k4652p9540l4738n2311
117c80511l3708R5109L3408l2340J23225N414o1872k5382R3666Q1811j14523j16233
105c31936N9756K8730m3377r4276q6405O8508n5257J93547l7435m5783q0758P7
$$ plain form
186 -218990 -298814 -280138 -158393 -217311 -427119 -522993 -405108 -304034 -239702 -305698 -370834
175 -370834 -318312 -383378 -442525 -444306 -378968 -405651 -429367 -341273 -286248 -273562 -238298 -338429
163 -338429 -305631 -205112 -237294 -273080 -173359 -309150 -329636 -293656 -365546 -459491 -557638
152 -557638 -396356 -330894 -308201 -314170 -343625 -344669 -264099 -223491 -188522 -275799 -259384 -284303
140 -284303 -154951 -145216 -283352 -264021 -196632 -292490 -298958 -390969 -254579 -161412 -267214
129 -267214 -175101 -221684 -249001 -211471 -111346 -265286 -268471 -189270 -213922 -293462 -328200 -380511
117 -380511 -414219 -319110 -285702 -318042 -194817 -189403 -251275 -276657 -182991 -101180 -215703 -331936
105 -331936 -272180 -243450 -286827 -381103 -467508 -399000 -454257 -260710 -298145 -343928 -424686 -424609
93d24609O6229J07285r8783L5512k5821N8738J04569n004j38152N6994J33632
82a29410j09371m576o6656Q2066o0408o3390o5101p18m1426N8068Q1715l6097
70c55304j4598m7189O3030L670l519K1792N7832k9962m531R587r7725o4970N1932
57d09955R6533Q3412r1858K5035R0636J5488j35348J8847Q6303r1391L6611k2897
45b98584j6817J15734k3405q2547j1722k7j22032O3727J05565j13484R6827J8654
33b68111n7253r0491j6714J17936Q9546n0688k6705o9041O3768J9720m6877k1421
21c56331J8353p8317n035R4288N5111j11893j9974P2578O5961N8395p5219p5648
9c57731N6314k8028J1806q2123R5995M7956m765j00722o0296
$$ plain form
93 -424609 -358380 -251095 -349878 -314366 -340187 -281449 -176880 -181884 -320036 -263042 -129410
82 -129410 -238781 -243357 -310013 -227947 -288355 -351745 -416846 -417564 -458990 -400922 -319207 -355304
70 -355304 -369902 -417091 -354061 -350391 -353910 -332118 -274286 -304248 -308779 -299192 -396917 -461887 -409955
57 -409955 -313422 -230010 -321868 -296833 -206197 -190709 -326057 -307210 -220907 -312298 -275687 -298584
45 -298584 -315401 -199667 -223072 -305619 -317341 -317368 -439400 -375673 -270108 -383592 -286765 -268111
33 -268111 -325364 -415855 -432569 -314633 -225087 -275775 -302480 -371521 -307753 -288033 -334910 -356331
21 -356331 -337978 -416295 -421330 -327042 -271931 -383824 -403798 -331220 -265259 -206864 -282083 -357731
9 -357731 -301417 -329445 -317639 -399762 -303767 -255811 -260576 -361298 -421594
0d21594
$$ plain form
0 -421594
$$ Imaginary data points
##PAGE= N=2
##DATA TABLE= (X++(I..I)), XYDATA
16383c564881P9285P1370l289M6799k1386m8633J36672O5514L7970J40325P9997
16372b980257R2069L3223M6935J11141l8396J08141K4383n287Q6614N5088K5824
16361b440522N1630J45213L5808N429r4736j0448N6070r118K5567R5717J92079
16350a947311Q7842P5061K0875K5046m2329J51192M7517M108L3469O2206R7777
16339a384547N4836J8106Q4017j20470J6164O7951J28991J55923j13872J4540
16329a078361N2713P0590k0155N6153K10276N8095n5892M1279J01407m9278J12303
16318e00870k1591J31464L5618O9650J06209j7511j7848M5239K2988J36477K5548
16307A5373k4687K5132Q3393Q7674K3387K3579N1812M4995R8431J5571j7327O5340
$$ plain form
16383 -3564881 -3485596 -3414226 -3417515 -3370716 -3392102 -3440735 -3304063 -3238549 -3200579 -3060254 -2980257
16372 -2980257 -2888188 -2854965 -2808030 -2696889 -2735285 -2627144 -2602761 -2608048 -2521434 -2466346 -2440522
16361 -2440522 -2388892 -2243679 -2207871 -2202442 -2297178 -2307626 -2251556 -2260674 -2235107 -2139390 -1947311
16350 -1947311 -1859469 -1784408 -1763533 -1738487 -1780816 -1629624 -1582107 -1577999 -1544530 -1482324 -1384547
16339 -1384547 -1329711 -1311605 -1227588 -1348058 -1331894 -1263943 -1134952 -979029 -1092901 -1078361
16329 -1078361 -1025648 -955058 -975213 -919060 -708784 -650689 -706581 -665302 -563895 -613173 -500870
16318 -500870 -522461 -390997 -355379 -285729 -179520 -197031 -214879 -169640 -146652 -10175 15373
16307 15373 -9314 15818 99211 186885 210272 233851 285663 330658 429089 444660 427333 492673
16295D92673M8461Q1729P4155j4134n8305J15179K3005J1172k0326J03530J5957
16284H73096K7525L053K18931j02126N0257O4523N6415o6653m9972J06160l2755
16273A148454J22588P6705j6191J40973M1089J9450j12640N728L9551J15911M5408
16262A627026P4242O1225k6745p8701M4290J02399O5471j31742K693J75297p8
16251A915377J10201K1924l7803O2660o3426K9504J44411o8796O781P5542O5834
16240B262209q3773L5171J07387n2319j01764J10884J31588l8286O4689J19070
16230B554856P0187k3566j30752J47502o535Q5073Q4438k4441N317J67131j61449
16219B767761K419k9033O3759Q1312o3667K04106r4885m6542K65043O778j45222
$$ plain form
16295 492673 541134 622863 697018 682884 624579 739758 762763 773935 753609 857139 873096
16284 873096 900621 903674 1122605 1020479 1070736 1135259 1191674 1125021 1075049 1181209 1148454
16273 1148454 1271042 1347747 1331556 1472529 1513618 1533068 1420428 1426156 1465707 1581618 1627026
16262 1627026 1701268 1762493 1735748 1657047 1701337 1803736 1869207 1737465 1740158 1915455 1915377
16251 1915377 2025578 2047502 2009699 2072359 2008933 2038437 2182848 2114052 2120833 2196375 2262209
16240 2262209 2178436 2213607 2320994 2268675 2166911 2277795 2409383 2371097 2435786 2554856
16230 2554856 2625043 2601477 2470725 2618227 2611692 2696765 2781203 2756762 2762079 2929210 2767761
16219 2767761 2770180 2741147 2804906 2886218 2822551 3026657 2931772 2885230 3150273 3157051 3011829
16208C011829j02572n1960K1345J45126o69j12531J19102J46227o9788p0039o517
16197C029553j68951J63494J68144O9871k4745P1286J81605j30580p3378J58550
16187C444849L2966j4935l5318R450O346r8291J47713o8968k0685J16824o5526
16176C454425Q6685P4457k7964p0511j68953J27930m7718r5553J20175p500L2224
16165C477697N9456m9884L9927J47735O6782m7722j08387J38489j56522M7304
16155C614875M3347j8213R6216O1988K3155k6525j79021k2776J01186Q7731J3922
16144C795885r6045J42385Q9124j05779n0282j2904O2809P0288k341r5857J47464
16133C944747j42903n6486J14666J8095J19127N2285m6671M0283l9941J90678
$$ plain form
16208 3011829 2909257 2857297 2878642 3023768 3023099 2910568 3029670 3175897 3106109 3036070 3029553
16197 3029553 2860602 3024096 3192240 3262111 3237366 3308652 3490257 3359677 3286299 3444849
16187 3444849 3477815 3462880 3427562 3437012 3443358 3345067 3492780 3423812 3403127 3519951 3454425
16176 3454425 3541110 3615567 3587603 3517092 3348139 3476069 3428351 3332798 3452973 3445473 3477697
16165 3477697 3537153 3487269 3527196 3674931 3741713 3693991 3585604 3724093 3567571 3614875
16155 3614875 3658222 3640009 3736225 3798213 3821368 3794843 3615822 3593046 3694232 3781963 3795885
16144 3795885 3699840 3842225 3931349 3825570 3775288 3762384 3825193 3895481 3893140 3797283 3944747
16133 3944747 3801844 3745358 3860024 3878119 3997246 4049531 4002860 4043143 4003202 4193880
16123D193880o48k27976m9462J80093O7955j31533M8303K8558q6637J9681M9099
16112D091313o8616r6961q3848m6844P2676K15644L3535q2373q2527N9929j54489
16101C857439l5039O2721J95673J02428o1482q1684J6776J32136J45581n6507
16091D278042k4551p4308p5217J79976J25722k70143p0744K11720j7974j47991
16081D114532J13809p8433j6321k7601J13079K03037q3959j12931j28515Q5908
16071D182605Q0096n1711Q6945p4471N9591j34048O2821J30046k34442q109j31033
16060C968290p7510J56070Q4735M5536J12640k2266j41077R1871m7257J9021n9067
16049D130986p8135K4945L3606M395J6206K4023r1009j11824J10406J71433K8313
$$ plain form
16123 4193880 4193232 3965256 3915794 4095887 4163842 4032309 4080612 4109170 4022533 4042214 4091313
16112 4091313 4022697 3925736 3841888 3795044 3867720 4083364 4116899 4034526 3951999 4011928 3857439
16101 3857439 3822400 3885121 4080794 4183222 4121740 4040056 4056832 4188968 4334549 4278042
16091 4278042 4253491 4179183 4103966 4283942 4409664 4139521 4068777 4280497 4262523 4114532
16081 4114532 4228341 4149908 4133587 4105986 4219065 4422102 4338143 4225212 4096697 4182605
16071 4182605 4262701 4210990 4297935 4223464 4283055 4149007 4211828 4341874 4107432 4099323 3968290
16060 3968290 3890780 4046850 4131585 4177121 4289761 4267495 4126418 4218289 4171032 4190053 4130986
16049 4130986 4052851 4077796 4111402 4115797 4132003 4156026 4065017 3953193 4063599 4235032 4263345
16038D263345L9859J355L4809M1533p4934k2909p39n9195K9953q3588J14416N8611
16026D342516j2467n4393M9191q9532o8590m8347O821J31063J7714Q08j00803
16015D173981J2895J15587l0408r0952m5845K27168J41819r6793m1507p4695k7004
16004D264246J25638l4951n4079j09988J49918j39110N6518Q335l0756Q8972J3331
15993D338074j4456k1296j22280M932J21602o7141j5430J0389p6884O6187J0294
$$ plain form
16038 4263345 4303204 4304559 4339368 4380901 4305967 4283058 4282319 4223124 4253077 4169489 4283905 4342516
16026 4342516 4330049 4275656 4324847 4235315 4166725 4118378 4125199 4256262 4273976 4274784 4173981
16015 4173981 4186876 4302463 4272055 4181103 4135258 4362426 4504245 4407452 4365945 4291250 4264246
16004 4264246 4389884 4354933 4300854 4190866 4340784 4201674 4258192 4266527 4235771 4324743 4338074
15993 4338074 4323618 4302322 4180042 4184974 4306576 4239435 4224005 4234394 4157510 4223697 4233991
$$ [...]
##END NTUPLES=NMR SPECTRUM
##END=
