##TITLE=1H_CA-8887-6
 CDCl3, 8 sc, 
 2.07.2021
##JCAMPDX= 6.0         $$ Bruker NMR JCAMP-DX V2.0
##DATA TYPE= NMR SPECTRUM
##DATA CLASS= NTUPLES
##ORIGIN= UXNMR, Bruker Analytische Messtechnik GmbH
##OWNER= root
$$ XWIN-NMR		Version 3.5
$$ Fri Jul  2 12:00:51 2021 Russian Standard Time (UT+4h)  she@DPX200
##.OBSERVE FREQUENCY= 200.131506
##.OBSERVE NUCLEUS= ^1H
##.ACQUISITION MODE= SIMULTANEOUS
##.ACQUISITION SCHEME= undefined
##.AVERAGES= 8
##.DIGITISER RES= 18
##SPECTROMETER/DATA SYSTEM= spect
##.PULSE SEQUENCE= zg30
##.SOLVENT NAME= CDCl3
##.SHIFT REFERENCE= (INTERNAL, CDCl3, 0, 17.5301)
##AUDIT TRAIL= $$ (NUMBER, WHEN, WHO, WHERE, WHAT)
$$ ##TITLE= Audit trail, XWIN-NMR		Version 3.5
$$ ##JCAMPDX= 5.01
$$ ##ORIGIN= Bruker BioSpin GmbH
$$ ##OWNER= she
$$ F:/spectra/data/she/nmr/H-F/1/pdata/1/auditp.txt
$$ ##AUDIT TRAIL=  $$ (NUMBER, WHEN, WHO, WHERE, WHAT)
(   1,<2021-07-02 11:59:32.28 +0400>,<she>,<DPX200>,
      <created by zg, POWCHK disabled, PULCHK disabled
       configuration hash MD5:
       00 E9 B6 7A A2 85 ED C7 34 08 36 98 17 FE 4E 26
       data hash MD5: 16K
       F3 96 AF 46 FD 66 29 60 60 56 69 71 AB 94 7B 97>)
(   2,<2021-07-02 11:59:35.92 +0400>,<she>,<DPX200>,
      <Start of raw data processing
       efp BC_mod = 2 LB = 0.24 FT_mod = 6 PKNL = 1 PHC0 = -11913 PHC1 = 11.80099 SI = 16K 
       data hash MD5: 16K
       C7 B6 3B 3A 31 67 75 15 1D 2A BC DC 04 2A 45 24>)
(   3,<2021-07-02 12:00:03.90 +0400>,<she>,<DPX200>,
      <pk PHC0 = -160.2243 PHC1 = 3.000001 
       data hash MD5: 16K
       6A 07 50 FC 7C 57 39 96 10 BD 94 C4 25 5F 05 A0>)
(   4,<2021-07-02 12:00:07.06 +0400>,<she>,<DPX200>,
      <abs ABSG = 5 
       data hash MD5: 16K
       B9 9C 3A C2 B4 D2 E5 A4 28 21 66 D9 DF 67 56 51>)
$$ ##END=
$$ 
$$ hash MD5
$$ 3D 5F 5B 12 9B 84 C9 AD D3 E1 A2 DC A0 84 68 74
##$RELAX= 
##$RELAX= 
##$RELAX= 
##$RELAX= 
##$RELAX= 
##$RELAX= 
$$ Bruker specific parameters
$$ --------------------------
##$DU= <F:/spectra>
##$EXPNO= 1
##$NAME= <H-F>
##$PROCNO= 1
##$TYPE= <nmr>
##$USER= <she>
##$AMP= (0..31)
100 100 100 100 100 100 100 100 100 100 100 100 100 100 100 100 100 100 
100 100 100 100 100 100 100 100 100 100 100 100 100 100 
##$AQSEQ= 0
##$AQ_mod= 1
##$AUNM= <au_zg>
##$AUTOPOS= <>
##$BF1= 200.13
##$BF2= 200.13
##$BF3= 200.13
##$BF4= 200.13
##$BF5= 200.13
##$BF6= 200.13
##$BF7= 200.13
##$BF8= 200.13
##$BYTORDA= 1
##$CFDGTYP= 0
##$CFRGTYP= 5
##$CHEMSTR= <none>
##$CNST= (0..31)
1 1 145 1 1 1 1 1 1 1 1 1 1 1 1 1 1 1 1 1 1 1 1 1 1 1 1 1 1 1 1 1 
##$CPDPRG= <>
##$CPDPRG1= <>
##$CPDPRG2= <>
##$CPDPRG3= <>
##$CPDPRG4= <mlev>
##$CPDPRG5= <mlev>
##$CPDPRG6= <mlev>
##$CPDPRG7= <mlev>
##$CPDPRG8= <mlev>
##$CPDPRGB= <>
##$CPDPRGT= <>
##$D= (0..31)
0 1.2 0 0 0 0 0 0 0 0.06 0 0.03 0 0 0 0 0.0002 0 0 0 0 0 0 0 0 0 0 0 0 
0 0 0 
##$DATE= 1625212771
##$DBL= (0..7)
120 120 120 120 120 120 120 120 
##$DBP= (0..7)
150 150 150 150 150 150 150 150 
##$DBP07= 0
##$DBPNAM0= <>
##$DBPNAM1= <>
##$DBPNAM2= <>
##$DBPNAM3= <>
##$DBPNAM4= <>
$$ [...]
##$SUBNAM3= <"">
##$SUBNAM4= <"">
##$SUBNAM5= <"">
##$SUBNAM6= <"">
##$SUBNAM7= <"">
##$SUBNAM8= <"">
##$SUBNAM9= <"">
##$SW= 20.0188882624521
##$SWIBOX= (0..15)
0 0 2 0 0 0 0 0 0 0 0 0 0 0 0 0 
##$SW_h= 4006.41025641026
##$TD= 16384
##$TD0= 1
##$TE= 0
##$TE2= 300
##$TE3= 300
##$TEG= 300
##$TL= (0..7)
0 120 120 120 120 120 120 120 
##$TP= (0..7)
150 150 150 150 150 150 150 150 
##$TP07= 0
##$TPNAME0= <>
##$TPNAME1= <>
##$TPNAME2= <>
##$TPNAME3= <>
##$TPNAME4= <>
##$TPNAME5= <>
##$TPNAME6= <>
##$TPNAME7= <>
##$TPOAL= (0..7)
0.5 0.5 0.5 0.5 0.5 0.5 0.5 0.5 
##$TPOFFS= (0..7)
0 0 0 0 0 0 0 0 
##$TUNHIN= 0
##$TUNHOUT= 0
##$TUNXOUT= 0
##$USERA1= <user>
##$USERA2= <user>
##$USERA3= <user>
##$USERA4= <user>
##$USERA5= <user>
##$V9= 5
##$VALIST= <valist>
##$VCLIST= <CCCCCCCCCCCCCCC>
##$VD= 0
##$VDLIST= <DDDDDDDDDDDDDDD>
##$VPLIST= <PPPPPPPPPPPPPPP>
##$VTLIST= <TTTTTTTTTTTTTTT>
##$WBST= 1024
##$WBSW= 4
##$XGAIN= (0..3)
0 0 0 0 
##$XL= 0
##$YL= 0
##$YMAX_a= 458595
##$YMIN_a= -336482
##$ZGOPTNS= <>
##$ZL1= 120
##$ZL2= 120
##$ZL3= 120
##$ZL4= 120
##$ABSF1= 17.49589
##$ABSF2= -2.523148
##$ABSG= 5
##$ABSL= 3
##$ALPHA= 0
##$AQORDER= 0
##$ASSFAC= 0
##$ASSFACI= 0
##$ASSFACX= 0
##$ASSWID= 0
##$AUNMP= <proc_1d>
##$AZFE= 0.1
##$AZFW= 0.1
##$BCFW= 0
##$BC_mod= 2
##$BYTORDP= 0
##$COROFFS= 0
##$CY= -3
##$DATMOD= 1
##$DC= 0
##$DFILT= <>
##$DTYPP= 0
##$F1P= 0
##$F2P= 0
##$FCOR= 1
##$FTSIZE= 16384
##$FT_mod= 6
##$GAMMA= 0
##$GB= 0
##$INTBC= 1
##$INTSCL= 1.334414e-10
##$ISEN= 128
##$LB= 0.24
##$LEV0= 0
##$LPBIN= 0
##$MAXI= 10000
##$MC2= 0
##$MEAN= 0
##$ME_mod= 0
##$MI= 1.114404
##$NCOEF= 0
##$NC_proc= -7
##$NLEV= 6
##$NOISF1= 3.799351
##$NOISF2= 2.8
##$NSP= 0
##$NTH_PI= 0
##$NZP= 0
##$OFFSET= 17.5301
##$PC= 1
##$PHC0= -12073.22
##$PHC1= 14.80099
##$PH_mod= 1
##$PKNL= yes
##$PPARMOD= 0
##$PSCAL= 0
##$PSIGN= 0
##$REVERSE= no
##$SF= 200.130000906895
##$SI= 16384
##$SIGF1= 3
##$SIGF2= 2
##$SINO= 5.538805
##$SIOLD= 16384
##$SREGLST= <1H.CDCl3>
##$SSB= 0
##$STSI= 16384
##$STSR= 0
##$SW_p= 4006.41025641026
##$SYMM= 0
##$S_DEV= 0
##$TDeff= 16384
##$TDoff= 0
##$TI= <>
##$TILT= no
##$TM1= 0
##$TM2= 0
##$TOPLEV= 0
##$USERP1= <user>
##$USERP2= <user>
##$USERP3= <user>
##$USERP4= <user>
##$USERP5= <user>
##$WDW= 1
##$XDIM= 16384
##$YMAX_p= 580633519
##$YMIN_p= -288846
$$ End of Bruker specific parameters
$$ ---------------------------------
##NTUPLES= NMR SPECTRUM
##VAR_NAME=  FREQUENCY,     SPECTRUM/REAL,   SPECTRUM/IMAG
##SYMBOL=    X,             R,               I
##VAR_TYPE=  INDEPENDENT,   DEPENDENT,       DEPENDENT
##VAR_FORM=  AFFN,          ASDF,            ASDF
##VAR_DIM=   16384,         16384,           16384
##UNITS=     HZ,            ARBITRARY UNITS, ARBITRARY UNITS
##FACTOR=    0.24454680195387, 1,            1
##FIRST=     3508.29890263578, 0,            0
##LAST=      -498.111353774477, 0,           0
##MIN=       -498.111353774477, -288846,     0
##MAX=       3508.29890263578, 580633519,    0
$$ Real data points
##PAGE= N=1
##DATA TABLE= (X++(R..R)), XYDATA
$$ [...]
$$ plain form
5422 4144836 4160573 4179159 4253647 4356791 4326621 4366368 4404321 4401987 4523682 4580344 4643750
5411 4643750 4616174 4646989 4787575 4747924 4763167 4778901 4836712 4971886 5061727 5118444 5256532
5400 5256532 5315780 5396482 5543641 5709731 5802909 5971158 6052012 6174547 6400629 6473576
5390 6473576 6524189 6727591 6931629 7055789 7292436 7437342 7587423 7797130 8024524 8256785
5380 8256785 8499546 8647434 8882678 9129423 9436672 9779482 10054971 10352568 10604197 10907660
5370 10907660 11249612 11600784 11901122 12280401 12605316 12818726 13141392 13533968 13807292
5361 13807292 14156857 14488590 14778601 15034804 15311924 15645234 15985693 16369181 16797918
5352 16797918 17248560 17717984 18174862 18679161 19249336 19834737 20429492 21026633 21721512
$$ packed form
5422D144836J5737J8586P4488J03144l0170L9747L7953k334J21695N6662O3406
5411D643750k7576L0815J40586l9651J5243J5734N7811J35174Q9841N6717J38088
5400E256532N9248Q0702J47159J66090R3178J68249Q0854J22535K26082P2947
5390F473576N0613K03402K04038J24160K36647J44906J50081K09707K27394K32261
5380H256785K42761J47888K35244K46745L07249L42810K75489K97597K51629L03463
5370A0907660L41952L51172L00338L79279L24915K13410L22666L92576K73324
5361A3807292L49565L31733K90011K56203K77120L33310L40459L83488M28737
5352A6797918M50642M69424M56878N04299N70175N85401N94755N97141O94879
$$ plain form
5343 21721512 22425728 23223796 23977346 24800829 25734229 26584263 27582251 28697789 29872935
5334 29872935 31011185 32270513 33723761 35218239 36828545 38561656 40421248 42366139
5326 42366139 44562808 46879914 49368901 52082693 54919271 57855756 61046960 64344679
5318 64344679 67545038 70765554 73943429 76969781 79848582 82557778 85106398 87461912
5310 87461912 89624091 91718912 93847034 96009078 98343366 100817318 103484488 106687012
5302 106687012 110345201 114167453 118274438 122549980 126654696 130383128 133419400 135766670
5294 135766670 136914297 136543774 134572371 131067130 126086911 120136908 113771773 107538531
5286 107538531 101559217 96162692 91278415 87068165 83465070 80199639 77385520 74947287
$$ packed form
5343B1721512P04216P98068P53550Q23483R33400Q50034R97988J115538J175146
5334B9872935J138250J259328J453248J494478J610306J733111J859592J944891
5326D2366139K196669K317106K488987K713792K836578K936485L191204L297719
5318F4344679L200359L220516L177875L026352K878801K709196K548620K355514
5310H7461912K162179K094821K128122K162044K334288K473952K667170L202524
5302A06687012L658189L822252M106985M275542M104716L728432L036272K347270
5294A35766670J147627l70523j971403l505241m980219n950003o365135o233242
5286A07538531n979314n396525m884277m210250l603095l265431k814119k438233
$$ plain form
5278 74947287 72847411 70799856 68953245 67261125 65695697 64146953 62805187 61676214
5270 61676214 60560107 59652643 58938117 58277150 57715654 57301470 56982766 56548886 56160157
5261 56160157 55802540 55298277 54781577 54195601 53584129 53011245 52519945 51967907 51592879
5252 51592879 51291820 51095061 50991883 50877674 50867617 50798959 50721536 50533681 50339553 49955210
5242 49955210 49357763 48682805 47958691 47166456 46361374 45622489 44911907 44142492 43412605
5233 43412605 42665192 42020983 41318935 40607997 39879066 39146747 38434828 37653549 36803113
5224 36803113 35863546 35020170 34203442 33256132 32373150 31512154 30687905 29946834 29206951
5215 29206951 28572671 27875877 27222036 26602404 26149678 25586995 25105834 24692336 24216228
$$ packed form
5278G4947287k099876k047555j846611j692120j565428j548744j341766j128973
5270F1676214j116107r07464p14526o60967n61496m14184l18704m33880l88729
5261E6160157l57617n04263n16700n85976o11472n72884m91300n52038l75028
5252E1592879l01059j96759j03178j14209j0057o8658p7423j87855j94128l84343
5242D9955210n97447o74958p24114p92235q05082p38885p10582p69415p29887
5233D3412605p47413o44209p02048p10938p28931p32319p11919p81279q50436
5224C6803113r39567q43376q16728r47310q82982q60996q24249p41071p39883
5215B9206951o34280o96794o53841o19632m52726n62683m81161m13498m76108
$$ plain form
5206 24216228 23743430 23363897 22927263 22446313 21877073 21397538 20971250 20408228 19998986
5197 19998986 19498268 19046172 18494512 18081336 17693938 17418364 17029101 16666991 16317912
5188 16317912 15973820 15695989 15409357 15082867 14753446 14449250 14179508 13940099 13639617
5179 13639617 13435325 13099966 12830673 12657595 12471320 12268708 12089506 11882837 11751544
5170 11751544 11671777 11463726 11293001 11175937 10997884 10900389 10712251 10570764 10450488 10381191
5160 10381191 10245159 10131051 10050326 9912536 9798013 9817543 9790172 9713358 9638247 9534634
5150 9534634 9522984 9467975 9369033 9247718 9192820 9125225 9059625 8975220 8968952 8871421 8804040
5139 8804040 8729658 8654545 8618582 8519108 8507981 8545778 8488974 8417912 8421201 8341562 8344056 8298569
$$ packed form
5206B4216228m72798l79533m36634m80950n69240m79535m26288n63022m09242
5197A9998986n00718m52096n51660m13176l87398k75574l89263l62110l49079
5188A6317912l44092k77831k86632l26490l29421l04196k69742k39409l00482
5179A3639617k04292l35359k69293j73078j86275k02612j79202k06669j31293
5170A1751544p9767k08051j70725j17064j78053r7495j88138j41487j20276o9297
5160A0381191j36032j14108q0725j37790j14523J9530k7371p6814p5111j03613
5150I534634j1650n5009r8942j21315n4898o7595o5600q4405o268r7531o7381
5139H804040p4382p5113l5963r9474j1127L7797n6804p1062L289p9639K494m5487
$$ plain form
5127 8298569 8323295 8253712 8266427 8209285 8111943 8109020 8017799 8055117 8009841 8017501 8023718 7963215
5115 7963215 7999449 7986126 7912690 7978356 7925536 7934124 7969639 7962516 7991250 7923968 7878398 8005174
5103 8005174 7955199 7884544 7838590 7869305 7889508 7864812 7880069 7827034 7811870 7780420 7818144
5092 7818144 7808269 7825476 7773447 7703697 7641795 7702086 7710742 7658847 7636057 7495738 7440279 7488325
5080 7488325 7491673 7458903 7518684 7550586 7465350 7459046 7410047 7334057 7329755 7304442 7363100 7296110
5068 7296110 7290708 7192254 7202842 7293506 7382047 7344073 7237464 7236064 7366421 7382914 7272530
5057 7272530 7206368 7120624 7181903 7193962 7190565 7127569 7158825 7137369 7159263 7218263 7241895 7148094
5045 7148094 7070293 7061080 7108293 7076707 7001527 6989103 6956859 6934490 6847158 6855360 6868285 6779229
$$ packed form
5127H298569K4726o9583J2715n7142r7342k923r1221L7318m5276P660O217o0503
5115G963215L6234j3323p3436O5666n2820Q588L5515p123K8734o7282m5570J26776
5103H005174m9975p0655m5954L0715K0203k4696J5257n3035j5164l1450L7724
5092G818144r875J7207n2029o9750o1902O0291Q656n1895k2790j40319n5459M8046
5080G488325L348l2770N9781L1902q5236o304m8999p5990m302k5313N8658o6990
5068G296110n402r8454J0588R0664Q8541l7974j06609j400J30357J6493j10384
5057G272530o6162q5744O1279J2059l397o2996L1256k1456K1894N9000K3632r3801
5045G148094p7801r213M7213l1586p5180j2424l2244k2369q7332Q202J2925q9056
$$ plain form
5033 6779229 6761648 6758012 6748191 6733801 6776504 6796562 6836014 6833345 6840467 6859616 6766789 6800448
5021 6800448 6884904 6909867 6946798 7070702 7085560 7083098 7154199 7172688 7290931 7367176 7460872
5010 7460872 7425364 7441524 7503176 7603260 7689880 7646129 7644727 7693816 7730119 7738462 7755596 7731678
4998 7731678 7620686 7571918 7544125 7483360 7432794 7351043 7354439 7413416 7344201 7411853 7389623
4987 7389623 7337263 7376066 7353742 7382010 7335147 7387596 7377091 7396992 7481048 7502397 7457123
4976 7457123 7410016 7427672 7549934 7580754 7653982 7691265 7730361 7758986 7709105 7719620 7740095
4965 7740095 7810473 7816867 7778464 7856059 7861927 7991168 7996414 7937988 7970449 7994749 7964652 7947017
4953 7947017 7957342 8011893 7944887 7972015 8054803 8107082 8185660 8221204 8246212 8307870 8302527 8280984
$$ packed form
5033F779229j7581l636r821j4390M2703K0058L9452k669P122J9149r2827L3659
5021F800448Q4456K4963L6931J23904J4858k462P1101J8489J18243P6245R3696
5010G460872l5508J6160O1652J00084Q6620m3751j402M9089L6303Q343J7134k3918
4998G731678j10992m8768k7793o0765n0566q1751L396N8977o9215O7652k2230
4987G389623n2360L8803k2324K8268m6863N2449j0505J9901Q4056K1349m5274
4976G457123m7107J7656J22262L0820P3228L7283L9096K8625m9881J0515K0475
4965G740095P0378O394l8403P7595N868J29241N246n8426L2461K4300l0097j7635
4953G947017J0325N4551o7006K7128Q2788N2279P8578L5544K5008O1658n343k1543
$$ plain form
4941 8280984 8222927 8305260 8426330 8437642 8449566 8490668 8546194 8578417 8640938 8565754 8725319
4930 8725319 8804960 8782587 8763697 8751975 8761378 8753940 8811629 8823773 8792208 8837429 8899080 8961299
4918 8961299 8951273 8873425 8917904 8923582 8838547 8964070 9048056 8992867 8946608 8963815 8997002
4907 8997002 8950487 8911975 9028624 9184553 9211739 9260222 9332975 9459010 9556434 9669436 9722685
4896 9722685 9870369 10146276 10290475 10453145 10630003 10777423 10877702 11111714 11387854 11548858
4886 11548858 11723400 11928531 12106791 12284597 12425047 12673577 12729996 12853660 12880355 12825971
4876 12825971 12746668 12570204 12338718 12080560 11914037 11740781 11515832 11346551 11218889 11059788
4866 11059788 10944098 10834650 10849108 10709750 10578347 10565877 10479390 10418153 10313696 10176921
$$ packed form
4941H280984n8057Q2333J21070J1312J1924M1102N5526L2223O2521p5184J59565
4930H725319P9641k2373j8890j1722R403p438N7689J2144l1565M5221O1651O2219
4918H961299j0026p7848M4479N678q5035J25523Q3986n5189m6259J7207L3187
4907H997002m6515l8512J16649J55929K7186M8483P2753J26035R7424J13002N3249
4896I722685J47684K75907J44199J62670J76858J47420J00279K34012K76140J61004
4886A1548858J74542K05131J78260J77806J40450K48530N6419J23664K6695n4384
4876A2825971p9303j76464k31486k58158j66523j73256k24949j69281j27662j59101
4866A1059788j15690j09448J4458j39358j31403j2470q6487o1237j04457j36775
$$ plain form
4856 10176921 10047504 9910891 9799649 9548502 9335341 9096928 8790837 8573599 8379552
4847 8379552 8129548 7859695 7616153 7385521 7237607 7081251 6972107 6816078 6682426 6594098
4837 6594098 6475684 6399467 6257231 6146325 6138124 6063938 5981025 5908301 5739654 5659969 5573090
4826 5573090 5492061 5431089 5250814 5123147 4955561 4799243 4779305 4673286 4621113 4526300
4816 4526300 4529791 4457685 4422595 4342673 4337990 4258255 4212530 4247691 4207481 4122248 4149089 4093354
4804 4093354 4101141 4095679 3986575 3815213 3684082 3743920 3675341 3592422 3460017 3455475 3385261
4793 3385261 3324634 3202120 3277259 3330510 3240975 3169809 3269322 3266511 3158472 3159479 3099254
4782 3099254 3050642 3080127 3006542 2981761 2954258 2897799 2859659 2852774 2768148 2741302 2665126 2671187
$$ packed form
4856A0176921j29417j36613j11242k51147k13161k38413l06091k17238j94047
4847H379552k50004k69853k43542k30632j47914j56356j09144j56029j33652q8328
4837F594098j18414p6217j42236j10906q201p4186q2913p2724j68647p9685q6879
4826E573090q1029o0972j80275j27667j67586j56318j9938j06019n2173r4813
4816D526300L491p2106l5090p9922m683p9735m5725L5161m0210q5233K6841n5735
4804D093354P787n462j09104j71362j31131N9838o8579q2919j32405m542p0214
4793C385261o0627j22514P5139N3251q9535p1166R9513k811j08039J007o0225
4782C099254m8612K9485p3585k4781k7503n6459l8140o885q4626k6846p6176O061
$$ plain form
4770 2671187 2721817 2660124 2651260 2648597 2658503 2670630 2610442 2681633 2677788 2577164 2462746 2393355
4758 2393355 2320247 2310083 2256530 2269421 2221476 2062302 2074291 2141436 2197150 2086877 2061232
4747 2061232 2038676 2065616 2107795 2182686 2179962 2067220 2004522 1942545 1920647 1943578 1938591 2002941
4735 2002941 2011078 2025905 2011028 2046813 2097152 2075676 2014473 1993057 1930579 2016860 2083352 2028224
4723 2028224 2087153 2103873 2003181 2026613 2072221 2115272 2023244 2037211 1999920 2045065 2070632
4712 2070632 2035400 2060283 2066820 2021019 2017464 1998921 2083280 2128790 2064913 2118273 2121312 2150580
4700 2150580 2162823 2186632 2209461 2215300 2266779 2300320 2251997 2323651 2386027 2407427 2427294 2495657
4688 2495657 2559962 2533377 2652799 2766450 2825266 2860197 2959384 3065731 3140353 3220592 3285947
$$ packed form
4770B671187N0630o1693q864k663R906J2127o0188P1191l845j00624j14418o9391
4758B393355p3108j0164n3553J2891m7945j59174J1989O7145N5714j10273k5645
4747B061232k2556K6940M2179P4891k724j12742o2698o1977k1898K2931m987O4350
4735B002941Q137J4827j4877L5785N0339k1476o1203k1416o2478Q6281O6492n5128
4723B028224N8929J6720j00692K3432M5608M3051r2028J3967l7291M5145K5567
4712B070632l5232K4883O537m5801l555j8543Q4359M5510o3877N3360L039K9268
4700B150580J2243K3809K2829N839N1479L3541m8323P1654O2376K1400J9867O8363
4688B495657O4305k6585J19422J13651N8816L4931R9187J06347P4622Q0239O5355
$$ plain form
4677 3285947 3339287 3345223 3390556 3483417 3547109 3505034 3490047 3561889 3513080 3458222 3392372 3327279
4665 3327279 3290323 3229834 3205881 3123489 3098065 3020702 2986602 2973247 2991604 2907839 2851949
4654 2851949 2903121 2764620 2665716 2726989 2752948 2783934 2721356 2680750 2633024 2653607 2738172
4643 2738172 2762181 2698021 2722074 2790547 2770416 2817833 2876085 2874296 2921575 2993510 3084088 3192382
4631 3192382 3224013 3283271 3331834 3369340 3486599 3449157 3546083 3685871 3786656 3703377 3815580
4620 3815580 3906079 3919277 4038661 4137623 4137794 4149474 4183347 4234336 4195379 4190588 4125203 4128223
4608 4128223 4083212 4048979 4064297 4050685 4008986 3994935 3911071 3803745 3776470 3753269 3697684
4597 3697684 3603791 3513351 3395513 3384174 3380344 3333303 3274896 3194791 3185767 3188669 3133811 3126804
$$ packed form
4677C285947N3340N936M5333R2861O3692m2075j4987P1842m8809n4858o5850o5093
4665C327279l6956o0489k3953q2392k5424p7363l4100j3355J8357q3765n5890
4654B851949N1172j38501r8904O1273K5959L0986o2578m0606m7726K0583Q4565
4643B738172K4009o4160K4053O8473k0131M7417N8252j789M7279P1935R0578J08294
4631C192382L1631N9258M8563L7506J17259l7442R6926J39788J00785q3279J12203
4620C815580R0499J3198J19384R8962J71J1680L3873N0989l8957m791o5385L020
4608D128223m5011l4233J5318j3612m1699j4051q3864j07326k7275k3201n5585
4597C697684r3893r0440j17838j1339l830m7041n8407q0105r024K902n4858p007
$$ plain form
4585 3126804 3043786 3056124 2982565 2947671 3084055 3143654 3034530 3112196 3002218 3004504 3061413
4574 3061413 3142587 3133085 3218057 3316940 3326624 3334275 3410051 3418875 3547596 3696148 3784369 3783515
4562 3783515 3899860 3978075 4063234 4109361 4215076 4193042 4199353 4334858 4369004 4390660 4336910
4551 4336910 4276061 4226647 4191160 4104266 4125015 4034937 3984075 3872058 3759238 3736982 3710939
4540 3710939 3593572 3432024 3335793 3348072 3335803 3273781 3184667 3169253 3100241 2999924 2948698
4529 2948698 2968454 2938087 2949690 2895409 2864918 2800310 2752092 2694387 2652185 2694969 2707064
4518 2707064 2646021 2580508 2580344 2583834 2624508 2566755 2553356 2553808 2647199 2592290 2668757 2599356
4506 2599356 2624945 2613532 2582066 2601051 2582065 2645452 2644493 2671128 2741341 2755242 2765732 2811368
$$ packed form
4585C126804q3018J2338p3559l4894J36384N9599j09124P7666j09978K286N6909
4574C061413Q1174r502Q4972R8883R684P651P5776Q824J28721J48552Q8221q54
4562C783515J16345P8215Q5159M6127J05715k2034O311J35505L4146K1656n3750
4551D336910o0849m9414l5487q6894K0749r0078n0862j12017j12820k2256k6043
4540C710939j17367j61548r6231J2279j2269o2022q9114j5414o9012j00317n1226
4529B948698J9756l0367J1603n4281l0491o4608m8218n7705m2202M2784J2095
4518B707064o1043o5513j64L490M0674n7753j3399M52R3391n4909P6467o9401
4506B599356K5589j1413l1466J8985j8986O3387r59K6635P0213J3901J0490M5636
$$ plain form
4494 2811368 2802151 2921957 2897347 2899427 2933843 2979807 2950186 3006799 3085812 3062919 3006746 3056883
4482 3056883 3164457 3230415 3233999 3346774 3435077 3398387 3335186 3358142 3322625 3389247 3416405
4471 3416405 3396976 3394151 3317399 3408072 3471965 3489504 3553169 3611068 3593399 3569750 3587947 3662718
4459 3662718 3722524 3731929 3751726 3813177 3891959 3857680 3874188 3938943 4030864 4206662 4253112
4448 4253112 4183257 4216164 4385824 4492168 4519877 4614175 4669579 4784022 4909001 5040903
4438 5040903 5157668 5349253 5620025 5742141 5776618 5926334 6153799 6281584 6318785 6403787
4428 6403787 6494701 6683930 6930509 7018919 7259078 7563837 7740618 7939261 8179869 8475026
4418 8475026 8915301 9312238 9697151 10099390 10572326 11092450 11632269 12340684 13113682 13967555
$$ packed form
4494B811368r217J19806k4610K080L4416M5964k9621N6613P9013k2893n6173N0137
4482C056883J07574O5958L584J12775Q8303l6690o3201K2956l5517O6622K7158
4471C416405j9429k825p6752R0673O3893J7539O3665N7899j7669k3649J8197P4771
4459C662718N9806R405J9797O1451P8782l4279J6508O4755R1921J75798M6450
4448D253112o9855L2907J69660J06344K7709R4298N5404J14443J24979J31902
4438E040903J16765J91585K70772J22116L4477J49716K27465J27785L7201Q5002
4428F403787R0914J89229K46579Q8410K40159L04759J76781J98643K40608K95157
4418H475026M40275L96937L84913M02239M72936N20124N39819P08415P72998Q53873
$$ plain form
4408 13967555 14893230 15948462 17338081 18899906 20609132 22553569 24878585 27563539
4400 27563539 30526754 33692678 36713842 39209256 41397558 43784838 46450485 48037865
4392 48037865 46766056 42423332 36116969 29906193 25038210 21747229 19529491 18086661
4384 18086661 17090133 16320542 15636638 15201378 14814247 14455364 14281908 14047560 13889994
4375 13889994 13828969 13861371 13956680 14150184 14265600 14403691 14717059 15070007 15503990 16124729
4365 16124729 16880479 17605415 18333230 19323815 20395461 21837593 23421383 25148553 27188426
4356 27188426 29760845 32619840 35712009 38751399 41522042 44159320 46801432 49534533
4348 49534533 51259293 50958513 48685274 44554558 38830710 33204597 29046782 26464629
$$ packed form
4408A3967555R25675J055232J389619J561825J709226J944437K325016K684954
4400B7563539K963215L165924L021164K495414K188302K387280K665647J587380
4392D8037865j271809m342724o306363o210776m867983l290981k217738j442830
4384A8086661r96528p69591o83904m35260l87131l58883j73456k34348j57566
4375A3889994o1025L2402R5309J93504J15416J38091L13368L52948M33983O20739
4365A6124729P55750P24936P27815R90585J071646J442132J583790J727170K039873
4356B7188426K572419K858995L092169L039390K770643K637278K642112K733101
4348D9534533J724760l00780k273239m130716n723848n626113m157815k582153
$$ plain form
4340 26464629 24841615 23895991 23323054 22948111 22748615 22659912 22705414 22890893 23099468 23295440
4330 23295440 23566741 23958122 24391949 24886497 25355968 25800074 26250403 26694714 27046934
4321 27046934 27336524 27437814 27405142 27335754 27223338 27147756 27025528 27013708 27071150 27186928
4311 27186928 27272301 27476785 27583529 27590128 27524753 27342613 27143026 26685215 26185201 25689558
4301 25689558 25056409 24490269 24060853 23777984 23593554 23624893 23729527 23901393 24123427 24504620
4291 24504620 24932649 25470013 26172048 26915673 27775385 28738850 29829727 30961633 32266307
4282 32266307 33735647 35264832 36953151 38547264 40154116 41834252 43476022 44936459
4274 44936459 46265580 47439948 48281137 48817449 49140991 49337064 49241957 48837281 48360080
$$ packed form
4340B6464629j623014r45624n72937l74943j99496q8703M5502J85479K08575J95972
4330B3295440K71301L91381M33827M94548M69471M44106M50329M44311L52220
4321B7046934K89590J01290l2672o9388j12416p5582j22228j1820N7442J15778
4311B7186928Q5373K04484J06744O599o5375j82140j99587m57811n00014m95643
4301B5689558o33149n66140m29416k82869j84430L1339J04634J71866K22034L81193
4291B4504620M28029N37364P02035P43625Q59712R63465J090877J131906J304674
4282C2266307J469340J529185J688319J594113J606852J680136J641770J460437
4274D4936459J329121J174368Q41189N36312L23542J96073r5107m04676m77201
$$ plain form
4265 48360080 47889800 47373895 46887595 46261621 45591450 44890869 44033352 42975437 41691525
4256 41691525 40219286 38760915 37213829 35592445 34123843 32646989 31364929 30332778
4248 30332778 29434190 28642049 28025144 27601324 27243950 27022965 26876974 26906185 26984198 27264414
4238 27264414 27670456 28090150 28716794 29387235 30201841 31130051 31945170 32932901 34070176
4229 34070176 35155595 36157663 37078705 37810067 38419107 38741867 38915238 38724384 38216408
4220 38216408 37371110 36365703 35217154 34149860 33181414 32195203 31367090 30757338 30276022
4211 30276022 29878638 29704885 29616538 29631928 29719836 29939885 30313833 30787014 31401143 32174399
4201 32174399 32916971 33679841 34654667 35616324 36522484 37383245 38138652 38748316 39177768
$$ packed form
4265D8360080m70280n15905m86300o25974o70171p00581q57517j057915j283912
4256D1691525j472239j458371j547086j621384j468602j476854j282060j032151
4248C0332778q98588p92141o16905m23820l57374k20985j45991K9211P8013K80216
4238B7264414M06042M19694O26644O70441Q14606R28210Q15119R87731J137275
4229C4070176J085419J002068R21042P31362O09040L22760J73371j90854n07976
4220C8216408q45298j005407j148549j067294r68446r86211q28113o09752m81316
4211C0276022l97384j73753q8347J5390Q7908K20049L73948M73181O14129P73256
4201C2174399P42572P62870R74826R61657R06160Q60761P55407O09664M29452
$$ plain form
4192 39177768 39282782 39182454 38739343 38005867 37045854 35988058 34910502 33817614 32884235
4183 32884235 32142844 31560705 30945502 30584495 30325714 30166573 30001992 29848154 29522421
4174 29522421 29115667 28701617 28235094 27618587 27002480 26491995 25836690 25138479 24614658
4165 24614658 24102405 23696282 23345598 23090486 22840650 22747248 22654837 22635990 22624625 22659404
4155 22659404 22759253 22842956 23037711 23197024 23372919 23594425 23860359 24152945 24255312 24325265
4145 24325265 24362997 24280405 24036223 23783514 23365641 22784374 22083949 21308813 20618534 19847519
4135 19847519 19089988 18321256 17680600 17075368 16555552 16060450 15544494 15085481 14772017
4126 14772017 14547785 14306975 14073112 13767100 13541794 13499689 13351323 13177477 13025076 13017403
$$ packed form
4192C9177768J05014j00328m43111p33476r60013j057796j077556j092888r33379
4183C2884235p41391n82139o15203l61007k58781j59141j64581j53838l25733
4174B9522421m06754m14050m66523o16507o16107n10485o55305o98211n23821
4165B4614658n12253m06123l50684k55112k49836r3402r2411j8847j1365L4779
4155B2659404R9849Q3703J94755J59313J75895K21506K65934K92586J02367O9953
4145B4325265L7732q2592k44182k52709m17873n81267p00425p75136o90279p71015
4135A9847519p57531p68732o40656o05232n19816m95102n15956m59013l13464
4126A4772017k24232k40810k33863l06012k25306m2105j48366j73846j52401p673
$$ plain form
4116 13017403 12883709 12873399 12786370 12692332 12643513 12709105 12618293 12501148 12523417 12483784 12356046
4105 12356046 12221195 12249708 12095257 12003459 11955681 11971384 11866246 11864757 11677334 11502664
4095 11502664 11426936 11276866 11232793 11143414 11068803 10949744 10830069 10697108 10595327 10553521
4085 10553521 10477565 10414656 10402659 10377284 10385238 10265448 10207980 10245781 10265435 10167547 10130314
4074 10130314 10121381 10111919 10153417 10184337 10243731 10340096 10404112 10462557 10562918 10681016 10686122
4063 10686122 10711929 10798060 10840866 10823152 10782145 10855490 10857619 10865298 10999058 11005481 11095153 11178251
4051 11178251 11180239 11214903 11240714 11338171 11402754 11474014 11607092 11738490 11786037 11834114 11845065
4040 11845065 11947090 12034578 12084794 12042364 12124389 12136439 12029947 11919239 11902363 11980111 12043964
$$ packed form
4116A3017403j33694j0310q7029r4038m8819O5592r0812j17145K2269l9633j27738
4105A2356046j34851K8513j54451r1798m7778J5703j05138j489j87423j74670
4095A1502664p5728j50070m4073q9379p4611j19059j19675j32961j01781m1806
4085A0553521p5956o2909j1997k5375P954j19790n7468L7801J9654r7888l7233
4074A0130314q933r462M1498L0920N9394R6365O4016N8445J00361J18098N106
4063A0686122K5807Q6131M2806j7714m1007P3345K129P679J33760O423Q9672Q3098
4051A1178251J988L4664K5811R7457O4583P1260J33078J31398M7547M8077J0951
4040A1845065J02025Q7488N0216m2430Q2025J2050j06492j10708j6876P7748O3853
$$ plain form
4029 12043964 12024128 12065182 12073115 12107714 12223088 12227501 12239608 12364692 12486287 12616378 12662204
4018 12662204 12771215 12941819 13049761 13121352 13285055 13452306 13499435 13577087 13716523 13878135
4008 13878135 13900722 13873646 13909757 13980411 14020916 14048014 14044985 14011772 14033799 14017443 14028483
3997 14028483 13959950 13806582 13628487 13542680 13486925 13316238 13131392 13040513 13011029 13084130
3987 13084130 13118947 13091421 13225930 13384900 13525270 13628641 13719122 13757078 13875733 13895300
3977 13895300 14010016 14024112 14002722 13992097 14036946 13983950 14009231 14106294 14203323 14403140 14671954
3966 14671954 14945070 15272475 15643799 16040108 16402694 16732843 17026203 17273255 17633934
3957 17633934 17889744 18093751 18439631 18727291 19100292 19400708 19673128 20038267 20254311
$$ packed form
4029A2043964j9836M1054P933L4599J15374M413J2107J25084J21595J30091M5826
4018A2662204J09011J70604J07942P1591J63703J67251M7129P7652J39436J61612
4008A3878135K2587k7076L6111P0654M0505K7098l029l3213K2027j6356J1040
3997A4028483o8533j53368j78095q5807n5755j70687j84846r0879k9484P3101
3987A3084130L4817k7526J34509J58970J40370J03371R0481L7956J18655J9567
3977A3895300J14716J4096k1390j0625M4849n2996K5281R7063R7029J99817K68814
3966A4671954K73116L27405L71324L96309L62586L30149K93360K47052L60679
3957A7633934K55810K04007L45880K87660L73001L00416K72420L65139K16044
$$ plain form
3948 20254311 20559947 20926352 21230707 21649363 21914231 22185946 22454408 22725167 23041694
3939 23041694 23340218 23630703 24077872 24526526 24962249 25459536 26000655 26646896 27365359
3930 27365359 28166009 28925177 29690321 30480448 31402748 32401275 33378161 34383526 35488871
3921 35488871 36622770 37874233 39105831 40440288 41605484 42730845 43827668 45030090
3913 45030090 46254546 47508168 48978123 50563529 52158525 54005977 55882857 57966372
3905 57966372 60227907 62680658 65428887 68467008 71924723 75740405 79876400 84436119
3897 84436119 89607414 95545035 102259037 109712503 117893473 127028123 137380655 149154092
3889 149154092 162424316 177233941 193706580 211741536 231643691 253145085 275091316
$$ packed form
3948B0254311L05636L66405L04355M18656K64868K71715K68462K70759L16527
3939B3041694K98524K90485M47169M48654M35723M97287N41119O46241P18463
3930B7365359Q00650P59168P65144P90127R22300R98527R76886J005365J105345
3921C5488871J133899J251463J231598J334457J165196J125361J096823J202422
3913D5030090J224456J253622J469955J585406J594996J847452J876880K083515
3905E7966372K261535K452751K748229L038121L457715L815682M135995M559719
3897H4436119N171295N937621O714002P453466Q180970R134650J0352532J1773437
3889A49154092J3270224J4809625J6472639J8034956J9902155K1501394K1946231
$$ plain form
3882 275091316 295479449 313127804 328723131 343148604 354939989 357711968 344834410
3875 344834410 316997210 282366748 249529906 221898174 199547639 180853837 164802096
3868 164802096 150490376 138030484 127364866 118267410 110557655 103881613 98128495 92991699
3860 92991699 88487670 84423733 80928241 77763338 74666680 71723889 69233748 67048164
3852 67048164 65207934 63599399 62069966 60641946 59241702 58004729 56883453 55852296
3844 55852296 54941125 54109095 53459602 52823673 52243051 51900233 51355252 50961752 50613069
3835 50613069 50310440 50322601 50305296 50364057 50502472 50680187 50856998 51092319 51430794 51835172
3825 51835172 52334301 52875212 53414152 53925568 54222674 54326361 53946070 53188524 52334865
$$ packed form
3882B75091316K0388133J7648355J5595327J4425473J1791385K771979j2877558
3875C44834410k7837200l4630462l2836842k7631732k2350535j8693802j6051741
3868A64802096j4311720j2459892j0665618r097456p709755o676042n753118n136796
3860I2991699m504029m063937l495492l164903l096658k942791k490141k185584
3852F7048164j840230j608535j529433j428020j400244j236973j121276j031157
3844E5852296r11171q32030o49493o35929n80622l42818n44981l93500l48683
3835E0613069l02629J2161j7305N8761J38415J77715J76811K35321L38475M04378
3825E1835172M99129N40911N38940N11416K97106J03687l80291p57546q53659
$$ plain form
3816 52334865 51324598 50028592 48487722 46957410 45554776 44226099 43133373 42232488
3808 42232488 41300720 40490447 39769819 39142696 38807526 38548111 38336362 38310100 38470261 38743021
3798 38743021 39112897 39612019 40181914 40872869 41736923 42675520 43772214 44916661 45998154
3789 45998154 46991794 48005120 49023204 49836486 50174290 49914474 49212635 48487873 48109635
3780 48109635 48025810 48326370 48941409 49785923 50655225 51592081 52585755 53525305 54410490 55194510
3770 55194510 55895012 56313682 56600666 56937215 57454246 58011266 58736653 59704066 60726980
3761 60726980 61866282 63028379 64186247 65260870 66111334 66790542 67236503 67473050 67430885
3752 67430885 67193056 66939053 66691065 66559220 66564539 66698697 66810420 67004649 67262853 67485666
$$ packed form
3816E2334865j010267j296006j540870j530312j402634j328677j092726r00885
3808D2232488r31768q10273p20628o27123l35170k59415k11749k6262J60161K72760
3798C8743021L69876M99122N69895O90955Q64054R38597J096694J144447J081493
3789D5998154R93640J013326J018084Q13282L37804k59816p01839p24762l78238
3780D8109635q3825L00560O15039Q44514Q69302R36856R93674R39550Q85185P84020
3770E5194510P00502M18670K86984L36549N17031N57020P25387R67413J022914
3761F0726980J139302J162097J157868J074623Q50464O79208M45961K36547m2165
3752F7430885k37829k54003k47988j31845N319J34158J11723J94229K58204K22813
$$ plain form
3742 67485666 67715808 67869248 68019611 68199071 68312539 68443086 68392787 68322013 68230869 67933122
3732 67933122 67516572 67028424 66202377 65378705 64381122 63300269 62235930 61114888 60009928
3723 60009928 58902422 57740489 56581800 55335260 54026025 52651042 51261984 49773863
3715 49773863 48235054 46714164 45132988 43593756 42129143 40767504 39437253 38099895
3707 38099895 36841421 35599511 34361742 33141992 31917240 30808289 29744613 28631736
3699 28631736 27631102 26652209 25759052 24933640 24107473 23434597 22756374 22156550 21531407
3690 21531407 20870512 20309388 19843729 19377346 18897667 18500449 18029082 17596335 17157080
3681 17157080 16753985 16389768 16079711 15798533 15484011 15293096 15072835 14812802 14595311
$$ packed form
3742F7485666K30142J53440J50363J79460J13468J30547n0299p0774r1144k97747
3732F7933122m16550m88148q26047q23672r97583j080853j064339j121042j104960
3723F0009928j107506j161933j158689j246540j309235j374983j389058j488121
3715D9773863j538809j520890j581176j539232j464613j361639j330251j337358
3707C8099895j258474j241910j237769j219750j224752j108951j063676j112877
3699B8631736j000634r78893q93157q25412q26167o72876o78223n99824o25143
3690B1531407o60895n61124m65659m66383m79679l97218m71367m32747m39255
3681A7157080m03095l64217l10057k81178l14522j90915k20261k60033k17491
$$ plain form
3672 14595311 14382781 14212368 13995839 13842135 13692641 13455130 13098698 12632785 12301329
3663 12301329 11789234 11416222 11184327 10886567 10524083 10254563 9986043 9772731 9507229
3654 9507229 9397012 9303849 9064757 8930960 8818543 8652907 8519422 8321553 8187877 8059334
3644 8059334 7938177 7838409 7783644 7722279 7637036 7503348 7392293 7323730 7246043 7101767 7005930
3633 7005930 6966510 6945216 6848780 6752690 6678463 6696486 6715789 6669392 6648669 6646952 6684139 6702559
3621 6702559 6794378 6862870 6805365 6765951 6720866 6696869 6617437 6512538 6345428 6123916 5896591
3610 5896591 5764249 5636028 5437713 5361812 5244222 5204577 5147221 5122686 5108375 5147789 5114129
3599 5114129 5044582 5072221 5018030 4980252 5082237 5144250 5112338 5164285 5195962 5263081 5451608
$$ packed form
3672A4595311k12530j70413k16529j53704j49494k37511l56432m65913l31456
3663A2301329n12095l73012k31895k97760l62484k69520k68520k13312k65502
3654I507229j10217r3163k39092j33797j12417j65636j33485j97869j33676j28543
3644H059334j21157r9768n4765o1365q5243j33688j11055o8563p7687j44276r5837
3633G005930l9420k1294r6436r6090p4227J8023J9303m6397k0723j717L7187J8420
3621F702559R1819O8492n7505l9414m5085k3997p9432j04899j67110k21512k27325
3610E896591j32342j28221j98315p5901j17590l9645n7356k4535j4311L9414l3660
3599E114129o9547K7639n4191l7778J01985O2013l1912N1947L1677O7119J88527
$$ plain form
3588 5451608 5512326 5473965 5545317 5567428 5509189 5427231 5318792 5122080 4799842 4591169 4484463
3577 4484463 4321617 4186215 4167988 4031463 3958385 3849632 3697139 3644540 3626123 3583338
3567 3583338 3554840 3454804 3337220 3248926 3208674 3131063 3103561 3094842 2992665 2966867 3003233
3556 3003233 2907476 2836357 2790959 2748419 2723856 2618574 2538373 2593040 2523130 2435611 2455223
3545 2455223 2494100 2387958 2352852 2402267 2446737 2434857 2416718 2400392 2489051 2519207 2512613
3534 2512613 2510455 2482969 2451976 2495083 2491975 2364772 2493811 2587600 2585366 2583879 2544251 2515784
3522 2515784 2609268 2598834 2551251 2580855 2621870 2577849 2559372 2486649 2425789 2461827 2398233
3511 2398233 2335151 2266257 2244931 2219747 2135355 2144976 2133277 1978418 2013407 2065076 2037403
$$ packed form
3588E451608O0718l8361P1352K2111n8239q1958j08439j96712l22238k08673j06706
3577D484463j62846j35402j8227j36525p3078j08753j52493n2599j8417m2785
3567C583338k8498j00036j17584q8294m0252p7611k7502q719j02177k5798L6366
3556C003233r5757p1119m5398m2540k4563j05282q0201N4667o9910q7519J9612
3545B455223L8877j06142l5106M9415M4470j1880j8139j6326Q8659L0156o594
3534B512613k158k7486l0993M3107l108j27203J29039R3789k234j487l9628k8467
3522B515784R3484j0434m7583K9604M1015m4021j8477p2723o0860L6038o3594
3511B398233o3082o8894k1326k5184q4392R621j1699j54859L4989N1669k7673
$$ plain form
3500 2037403 2019661 1990025 2046354 2052737 2065849 2122737 2105520 2121463 2086401 2087096 2098279 2053214
3488 2053214 2109919 2143920 2180815 2192701 2217494 2177273 2218899 2134451 2194992 2237306 2189552
3477 2189552 2277447 2239463 2235050 2222465 2234126 2319551 2340913 2287111 2269453 2247705 2282530 2335852
3465 2335852 2322563 2305227 2340441 2318120 2322310 2406774 2431835 2398949 2392425 2373842 2423219 2400855
3453 2400855 2459928 2512190 2481587 2486082 2485057 2514109 2499316 2637111 2673232 2769778 2765957 2823996
3441 2823996 2907368 2949247 2995268 3083039 3128680 3142656 3247892 3333682 3362570 3491440 3577303
3430 3577303 3567811 3613046 3708837 3755067 3797755 3848331 3885785 3946094 3971804 3936429 3933749 4016947
3418 4016947 3948129 3977077 4072349 4102358 4156447 4174931 4145555 4154888 4187956 4217839 4238250 4225228
$$ packed form
3500B037403j7742k9636N6329O383J3112N6888j7217J5943l5062O95J1183m5065
3488B053214N6705L4001L6895J1886K4793m0221M1626q4448O0541M2314m7754
3477B189552Q7895l7984m413j2585J1661Q5425K1362n3802j7658k1748L4825N3322
3465B335852j3289j7336L5214k2321M190Q4464K5061l2886o524j8583M9377k2364
3453B400855N9073N2262l0603M495j025K9052j4793J37795L6121R6546l821N8039
3441B823996Q3372M1879M6021Q7771M5641J3976J05236Q5790K8888J28870Q5863
3430C577303r492M5235R5791M6230M2688N0576L7454O0309K5710l5375k680Q3198
3418D016947o8818K8948R5272L0009N4089J8484k9376R333L3068K9883K0411j3022
$$ plain form
3406 4225228 4257558 4228691 4281679 4324820 4373131 4385469 4421200 4422022 4429008 4585984 4589170 4670222
3394 4670222 4742688 4702714 4700061 4775778 4759938 4785453 4865511 4900232 4960983 4992243 4941108 4916689
3382 4916689 4936954 4997255 5010318 4974095 4981783 4891983 4935464 4945881 4864155 4852791 4827363 4813085
3370 4813085 4782541 4857378 4819733 4786848 4844746 4820781 4826459 4841565 4782204 4731710 4741277 4841268
3358 4841268 4804857 4814713 4804326 4814591 4883178 4966044 4985588 4938264 5010121 5109262 5154276 5270348
3346 5270348 5338303 5353061 5420969 5483431 5561479 5647258 5710302 5770051 5863755 5797817 5838720
3335 5838720 5957505 6148120 6120517 6205181 6293803 6271346 6357356 6374079 6486732 6634261 6780499
3324 6780499 6887012 7087113 7245105 7301799 7351302 7442943 7575328 7676849 7820117 8035040
$$ packed form
3406D225228L2330k8867N2988M3141M8311J2338L5731Q22O986J56976L186Q1052
3394D670222P2466l9974k653P5717j5840K5515Q0058L4721O0751L1260n1135k4419
3382D916689K0265O0301J3063l6223P688q9800M3481J0417q1726j1364k5428j4278
3370D813085l0544P4837l7645l2885N7898k3965N678J5106n9361n0494R567R9991
3358D841268l6411R856j0387J0265O8587Q2866J9544m7324P1857R9141M5014J16072
3346E270348O7955J4758O7908O2462P8048Q5779O3044N9749R3704o5938M0903
3335E838720J18785J90615k7603Q4664Q8622k2457Q6010J6723J12653J47529J46238
3324F780499J06513K00101J57992N6694M9503R1641J32385J01521J43268K14923
$$ plain form
3314 8035040 8145361 8189977 8275228 8418075 8510215 8625208 8774884 8933594 9037197 9191610
3304 9191610 9287041 9480574 9637853 9740441 9910578 10021499 10100623 10254496 10353310 10457157
3294 10457157 10540831 10627617 10687893 10855983 10937854 10975288 11102961 11128779 11116982 11179438 11320413
3283 11320413 11391554 11416025 11447128 11572047 11625664 11707451 11821688 11968700 12093723 12220115
3273 12220115 12390025 12529923 12687372 12864565 13021336 13154093 13295212 13564957 13878323
3264 13878323 14122600 14347416 14558924 14797031 15014858 15292535 15547037 15800885 16066694
3255 16066694 16314616 16564174 16814875 17063331 17242253 17537011 17718717 17978016 18280368
3246 18280368 18611596 18849491 19138345 19401089 19689047 20050001 20393035 20659436 21035232
$$ packed form
3314H035040J10321M4616Q5251J42847R2140J14993J49676J58710J03603J54413
3304I191610R5431J93533J57279J02588J70137J10921P9124J53873R8814J03847
3294A0457157Q3674Q6786O0276J68090Q1871L7434J27673K5818j1797O2456J40975
3283A1320413P1141K4471L1103J24919N3617Q1787J14237J47012J25023J26392
3273A2220115J69910J39898J57449J77193J56771J32757J41119K69745L13366
3264A3878323K44277K24816K11508K38107K17827K77677K54502K53848K65809
3255A6066694K47922K49558K50701K48456J78922K94758J81706K59299L02352
3246A8280368L31228K37895K88854K62744K87958L60954L43034K66401L75796
$$ plain form
3237 21035232 21413442 21841679 22173594 22610033 22961189 23408288 23868581 24301617 24746035
3228 24746035 25228410 25771332 26209004 26707723 27200556 27725549 28189630 28716857 29220947
3219 29220947 29730052 30232630 30758108 31160649 31657244 32082256 32430722 32895023 33270008
3210 33270008 33619767 34153356 34595213 35016753 35508317 35960589 36355939 36833228 37340047
3201 37340047 37922764 38417681 38992457 39602618 40318948 41056413 41754999 42577927 43572886
3192 43572886 44566931 45566412 46721841 47960358 49335129 50771683 52342727 54056366
3184 54056366 55923519 57940493 60178811 62470812 65043969 67816416 70741469 73878548
3176 73878548 77093468 80500077 84068174 87716447 91330860 94932744 98453979 101757218
$$ packed form
3237B1035232L78210M28237L31915M36439L51156M47099M60293M33036M44418
3228B4746035M82375N42922M37672M98719M92833N24993M64081N27227N04090
3219B9220947N09105N02578N25478M02541M96595M25012L48466M64301L74985
3210C3270008L49759N33589M41857M21540M91564M52272L95350M77289N06819
3201C7340047N82717M94917N74776O10161P16330P37465O98586Q22928R94959
3192D3572886R94045R99481J155429J238517J374771J436554J571044J713639
3184E4056366J867153K016974K238318K292001K573157K772447K925053L137079
3176G3878548L214920L406609L568097L648273L614413L601884L521235L303239
$$ plain form
3168 101757218 104804321 107570841 109973198 111883911 113424924 114511713 115146023 115424121
3160 115424121 115298144 114920054 114162745 113161249 111877635 110436165 108783561 106806466
3152 106806466 104533447 101977896 99161616 96032779 92691821 89162382 85549412 81985742
3144 81985742 78548109 75129200 71894267 68965420 66221899 63738377 61514292 59573879
3136 59573879 57917380 56420163 55210714 54036950 53111237 52351825 51717280 51189715 50743476
3127 50743476 50492510 50281071 50208139 50211086 50349596 50514413 50744592 51046243 51364494 51809218
3117 51809218 52263888 52796437 53304306 53801417 54438830 55118048 55782242 56494967 57203421
3108 57203421 57974110 58851459 59832161 60828955 61873297 62846113 63854916 64929365 66073021
$$ packed form
3168A01757218L047103K766520K402357J910713J541013J086789O34310K78098
3160A15424121j25977l78090p57309j001496j283614j441470j652604j977095
3152A06806466k273019k555551k816280l128837l340958l529439l612970l563670
3144H1985742l437633l418909l234933k928847k743521k483522k224085j940413
3136E9573879j656499j497217j209449j173764r25713p59412o34545n27565m46239
3127E0743476k50966k11439p2932K947J38510J64817K30179L01651L18251M44724
3117E1809218M54670N32549N07869M97111O37413O79218O64194P12725P08454
3108E7203421P70689Q77349R80702R96794J044342R72816J008803J074449J143656
$$ plain form
3099 66073021 67218954 68348664 69534002 70671128 71935307 73196785 74490251 75841444
3091 75841444 77212688 78638962 80164206 81717139 83359458 85067765 86839932 88640923
3083 88640923 90589423 92567114 94737742 97065399 99531583 102046734 104710162 107537919
3075 107537919 110516106 113655238 116965063 120534975 124316461 128357238 132707154 137336438
3067 137336438 142265313 147481024 153000477 158907138 165273155 171996134 179122479 186753685
3059 186753685 194854197 203308758 212103680 221132584 230301018 239550060 248663203 257540979
3051 257540979 266001695 273955922 281134907 287488926 292900281 297267061 300700843 303092450
3043 303092450 304503462 305140244 304972830 304150102 302591614 300393394 297595705 294258766
$$ packed form
3099F6073021J145933J129710J185338J137126J264179J261478J293466J351193
3091G5841444J371244J426274J525244J552933J642319J708307J772167J800991
3083H8640923J948500J977691K170628K327657K466184K515151K663428K827757
3075A07537919K978187L139132L309825L569912L781486M040777M349916M629284
3067A37336438M928875N215711N519453N906661O366017O722979P126345P631206
3059A86753685Q100512Q454561Q794922R028904R168434R249042R113143Q877776
3051B57540979Q460716P954227P178985O354019N411355M366780L433782K391607
3043C03092450J411012O36782j67414q22728j558488k198220k797689l336939
$$ plain form
3035 294258766 290252255 285562435 280418722 274655797 268317585 261683704 254671832 247617590
3027 247617590 240572163 233562121 226886703 220516064 214686349 209417072 204767122 200818311
3019 200818311 197382874 194590017 192419418 190748750 189630564 189057831 188976252 189284755 190102260
3010 190102260 191372781 193080344 195039501 197294546 199815768 202542133 205559047 208570138
3002 208570138 211782081 215115675 218345332 221515726 224696934 227796714 230643381 233233895
2994 233233895 235565189 237493403 239002979 239958406 240267410 239859346 238727087 236810136
2986 236810136 234192356 230780032 226768341 222224314 217406046 212286138 207021804 201882382
2978 201882382 196706162 191646645 186879077 182394646 178002167 173794242 169738279 165790024
$$ packed form
3035B94258766m006511m689820n143713n762925o338212o633881p011872p054242
3027B47617590p045427p010042o675418o370639n829715n269277m649950l948811
3019B00818311l435437k792857k170599j670668j118186n72733q1579L08503Q17505
3010A90102260J270521J707563J959157K255045K521222K726365L016914L011091
3002B08570138L211943L333594L229657L170394L181208L099780K846667K590514
2994B33233895K331294J928214J509576R55427L09004m08064j132259j916951
2986B36810136k617780l412324m011691m544027m818268n119908n264334n139422
2978B01882382n176220n059517m767568m484431m392479m207925m055963l948255
$$ plain form
2970 165790024 161831088 157807914 153787048 149853445 145916540 141959300 138066521 134238024
2962 134238024 130503612 126884816 123390818 120046502 116747495 113747500 110924802 108157125
2954 108157125 105738832 103442969 101417202 99667960 98075814 96666775 95519545 94535020
2946 94535020 93689496 93143829 92635531 92311574 92085796 91922586 91956405 91958374 92075516 92291723
2936 92291723 92369981 92608532 92989014 93540452 94139367 94916669 95789195 96738420 97857481
2927 97857481 99168521 100590490 102076381 103559078 105181124 106847433 108665319 110543876
2919 110543876 112483714 114374169 116231443 117976401 119723809 121136815 122217515 123082206
2911 123082206 123418377 123398752 122786011 121785892 120279157 118380240 116211886 113798923 111281737
$$ packed form
2970A65790024l958936m023174m020866l933603l936905l957240l892779l828497
2962A34238024l734412l618796l493998l344316l299007k999995k822698k767677
2954A08157125k418293k295863k025767j749242j592146j409039j147230r84525
2946I4535020q45524n45667n08298l23957k25778j63210L3819J969J17142K16207
2936I2291723P8258K38551L80482N51438N98915P77302Q72526R49225J119061
2927I7857481J311040J421969J485891J482697J622046J666309J817886J878557
2919A10543876J939838J890455J857274J744958J747408J413006J080700Q64691
2911A23082206L36171j9625o12741j000119j506735j898917k168354k412963k517186
$$ plain form
2902 111281737 108827718 106432501 104248302 102274994 100624349 99226907 98006614 97149358
2894 97149358 96657897 96216745 96187999 96323776 96674043 97180027 97713194 98436387 99112427 99814813
2884 99814813 100384994 100809182 100879736 100639343 100145334 99139090 97791680 96049272 93856958
2875 93856958 91372961 88631190 85726832 82643137 79596523 76650304 73687320 70933620
2867 70933620 68300424 65838196 63558437 61476780 59600916 57860800 56284176 54820337
2859 54820337 53475235 52173144 51038809 50010536 49075565 48277697 47559026 46890282 46219304
2850 46219304 45619051 45122893 44683361 44373998 44031035 43787456 43550269 43306645 43193133
2841 43193133 43030299 42972019 43021099 43090872 43183519 43271137 43436519 43571136 43715584 43724044 43668639
$$ packed form
2902A11281737k454019k395217k184199j973308j650645j397442j220293q57256
2894I7149358m91461m41152k8746J35777L50267N05984N33167P23193O76040P02386
2884I9814813N70181M24188P0554k40393m94009j006244j347410j742408k192314
2875I3856958k483997k741771k904358l083695l046614k946219k962984k753700
2867G0933620k633196k462228k279759k081657j875864j740116j576624j463839
2859E4820337j345102j302091j134335j028273r34971p97868p18671o68744o70978
2850D6219304o00253m96158m39532l09363l42963k43579k37187k43624j13512
2841D3193133j62834n8280M9080O9773R2647Q7618J65382J34617J44448Q460n5405
$$ plain form
2830 43668639 43583120 43357339 43017389 42686380 42139276 41410014 40642469 39841652 39026429 38224106
2820 38224106 37440056 36506299 35695418 34896792 34140701 33441733 32803398 32134646 31566304
2811 31566304 31098000 30573866 30029695 29566703 29153660 28849630 28499912 28168200 27935262
2802 27935262 27643514 27373777 27138894 26856210 26674378 26488117 26231083 26083305 25990363 25968651
2792 25968651 25914240 25866975 25777658 25715403 25744946 25646340 25600853 25530912 25486975 25458985 25435184
2781 25435184 25365377 25369807 25588910 25820640 26089257 26298819 26613017 26981486 27382101 27829972
2771 27829972 28256248 28762758 29189139 29637625 30137717 30547617 31054321 31546479 32096033
2762 32096033 32745002 33460071 34129632 34959790 35766099 36657430 37608882 38501597 39469738
$$ packed form
2830D3668639q5519k25781l39950l31009n47104p29262p67545q00817q15223q02323
2820C8224106p84050r33757q10881p98626p56091o98968o38335o68752n68342
2811C1566304m68304n24134n44171m62992m13043l04030l49718l31712k32938
2802B7935262k91748k69737k34883k82684j81832j86261k57034j47778r2942k1712
2792B5968651n4411m7265q9317o2255K9543r8606m5487o9941m3937k7990k3801
2781B5435184o9807M430K19103K31730K68617K09562L14198L68469M00615M47871
2771B7829972M26276N06510M26381M48486N00092M09900N06704M92158N49554
2762C2096033O48969P15069O69561Q30158Q06309Q91331R51452Q92715R68141
$$ plain form
2753 39469738 40501578 41556140 42615259 43717630 44815851 45984033 47273092 48503034
2745 48503034 49780524 51196170 52628134 54070235 55480393 56930897 58328744 59836450
2737 59836450 61419338 63173757 65119935 67197996 69451853 71835648 74386500 77062291
2729 77062291 79852135 82820081 85961895 89041458 92249545 95477541 98830254 102258074
2721 102258074 105787120 109336986 113067551 117088592 121199282 125399299 129622222 134049676
2713 134049676 138758299 143922713 149683739 156105209 163284847 171288652 180158286 190118885
2705 190118885 201127885 213454655 227142704 242360198 259112811 277675717 298073585
2698 298073585 320307426 344505489 370373557 397810130 426414974 455627071 484538326
$$ packed form
2753C9469738J031840J054562J059119J102371J098221J168182J289059J229942
2745D8503034J277490J415646J431964J442101J410158J450504J397847J507706
2737E9836450J582888J754419J946178K078061K253857K383795K550852K675791
2729G7062291K789844K967946L141814L079563L208087L227996L352713L427820
2721A02258074L529046L549866L730565M021041M110690M200017M222923M427454
2713A34049676M708623N164414N761026O421470P179638Q003805Q869634R960599
2705A90118885J1009000J2326770J3688049J5217494J6752613J8562906K0397868
2698B98073585K2233841K4198063K5868068K7436573K8604844K9212097K8911255
$$ plain form
2691 484538326 511740406 535924644 555746875 570585833 579518951 580633519 571332130
2684 571332130 549732098 517150334 477911000 436899776 398066861 363458487 333608424
2677 333608424 308216840 286517149 267806725 251307855 236730949 223702299 211931205
2670 211931205 201201881 191392535 182369323 174106880 166515423 159653993 153376304 147589485
2662 147589485 142263761 137386660 132700394 128192264 123857836 119414108 114922227 110479159
2654 110479159 106111970 101798786 97553933 93334687 89330184 85580194 82086427 78826441
2646 78826441 75925116 73279267 70821868 68727764 66750933 64904696 63353482 61826653
2638 61826653 60505677 59253557 58081628 56974670 55988194 55108964 54202448 53412927 52541178
$$ packed form
2691D84538326K7202080K4184238J9822231J4838958Q933118J114568r301389
2684E71332130k1600032l2581764l9239334m1011224l8832915l4608374k9850063
2677C33608424k5391584k1699691j8710424j6498870j4576906j3028650j1771094
2670B11931205j0729324r809346r023212q262443p591457o861430o277689n786819
2662A47589485n325724m877101m686266m508130m334428m443728m491881m443068
2654A10479159m367189m313184m244853m219246m004503l749990l493767l259986
2646G8826441k901325k645849k457399k094104j976831j846237j551214j526829
2638F1826653j320976j252120j171929j106958r86476q79230r06516p89521q71749
$$ plain form
2629 52541178 51740971 50862636 49781934 48748444 47684686 46684501 45608730 44466719
2621 44466719 43385539 42244017 41202713 40130256 39100184 38144794 37224458 36370349 35528265
2612 35528265 34748426 33943769 33276000 32690032 32133427 31706776 31252224 30859305 30614263
2603 30614263 30289197 30005403 29800570 29608052 29414056 29322300 29183254 28953869 28705261 28260113
2593 28260113 27652498 26946614 26223029 25439009 24726613 24093336 23440747 22838273 22318265
2584 22318265 21856912 21480560 21077749 20628365 20263135 19963278 19590667 19210272 18788234
2575 18788234 18417675 18068560 17612645 17112385 16688294 16365561 15980236 15604965 15287568
2566 15287568 14946894 14561549 14233605 13919955 13581603 13281879 13016404 12762528 12549688
$$ packed form
2629E2541178q00207q78335j080702j033490j063758j000185j075771j142011
2621D4466719j081180j141522j041304j072457j030072r55390r20336q54109q42084
2612C5528265p79839q04657o67769n85968n56605m26651m54552l92919k45042
2603C0614263l25066k83794k04833j92518j93996r1756j39046k29385k48608m45148
2593B8260113o07615p05884p23585p84020p12396o33277o52589o02474n20008
2584B2318265m61353l76352m02811m49384l65230k99857l72611l80395m22038
2575A8788234l70559l49115m55915n00260m24091l22733l85325l75271l17397
2566A5287568l40674l85345l27944l13650l38352k99724k65475k53876k12840
$$ plain form
2557 12549688 12332944 12205797 12037974 11896342 11852425 11699069 11664401 11615406 11516084 11425868
2547 11425868 11326145 11238858 11133757 10988218 10878611 10724935 10658428 10517435 10403328 10240341
2537 10240341 10034802 9828831 9716593 9499937 9395020 9309638 9174532 9016909 8828706 8789986
2527 8789986 8713170 8618817 8473013 8367175 8289011 8290064 8283515 8217506 8192207 8039655 8001889
2516 8001889 7982176 7902612 7815164 7687188 7652130 7649766 7574719 7476544 7425003 7375674 7331880
2505 7331880 7322660 7239632 7263527 7327080 7214659 7159781 7179589 7179055 7105612 7141468 7161190 7131087
2493 7131087 7094110 7142008 7073863 7029912 6990594 6870256 6859416 6850905 6807299 6728933 6730851 6662197
2481 6662197 6625812 6559519 6417118 6270357 6188879 6198551 6064678 6008615 5827978 5754920 5721728
$$ packed form
2557A2549688k16744j27147j67823j41632m3917j53356l4668m8995r9322r0216
2547A1425868r9723q7287j05101j45539j09607j53676o6507j40993j14107j62987
2537A0240341k05539k05971j12238k16656j04917q5382j35106j57623j88203l8720
2527H789986p6816r4353j45804j05838p8164J053o549o6009k5299j52552l7766
2516H001889j9713p9564q7448j27976l5058k364p5047r8175n1541m9329m3794
2505G331880r220q3028K3895O3553j12421n4878J9808n34p3443L5856J9722l0103
2493G131087l6977M7898o8145m3951l9318j20338j0840q511m3606p8366J918o8654
2481F662197l6385o6293j42401j46761q1478R672j33873n6063j80637p3058l3192
$$ plain form
2470 5721728 5582252 5478182 5389672 5224108 5250858 5226163 5228241 5072277 5040491 5000284 4997116
2459 4997116 4940076 4932769 4996258 4967797 4940416 5014994 5069738 5101075 5133273 5157141 5247871 5300081
2447 5300081 5248725 5300337 5315782 5310044 5384346 5447345 5500245 5577051 5752631 5786655 5831286
2436 5831286 5903182 5915732 6014189 6021345 5914030 5924480 5894211 5746009 5616875 5438293 5285008
2425 5285008 5192281 4870566 4636147 4478325 4354677 4211300 4070478 3946575 3846558 3796212
2415 3796212 3776915 3644430 3510893 3478049 3477054 3437200 3493093 3446372 3373763 3231306 3164772
2404 3164772 3226610 3210127 3112723 3105309 2994835 2927408 2871619 2874059 2861374 2861888 2834290 2770798
2392 2770798 2792828 2855545 2741162 2740660 2777186 2700565 2719437 2690794 2650437 2682767 2639417 2618531
$$ packed form
2470E721728j39476j04070q8510j65564K6750k4695K078j55964l1786m0207l168
2459D997116n7040p307O3489k8461k7381P4578N4744L1337L2198K3868R0730N2210
2447E300081n1356N1612J5445n738P4302O2999N2900P6806J75580L4024M4631
2436E831286P1896J2550R8457P156j07315J0450l0269j48202j29134j78582j53285
2425E285008r2727l21715k34419j57822j23648j43377j40822j23903j00017n0346
2415C796212j9297j32485j33537l2844r95l9854N5893m6721p2609j42457o6534
2404C164772O1838j6483r7404p414j10474o7427n5789K440j2685N14k7598o3492
2392B770798K2030O2717j14383n02L6526p6621J8872k8643m0357L2330m3350k0886
$$ plain form
2380 2618531 2622938 2590233 2532704 2481401 2478014 2443691 2400641 2370386 2321934 2323605 2327803 2240848
2368 2240848 2214166 2158447 2158564 2208475 2165570 2150637 2181548 2155510 2140191 2175321 2098833 2138054
2356 2138054 2079938 2104830 2124962 2108384 2075487 2081019 2076164 2060099 2116571 2172479 2254988 2232404
2344 2232404 2208502 2182150 2209081 2261251 2260122 2252543 2279169 2229877 2211526 2226031 2227614 2230641
2332 2230641 2226098 2203402 2229371 2277830 2312236 2203628 2292171 2246387 2168246 2087908 2080653 2079649
2320 2079649 2087785 2059792 2087672 1995943 2003654 2051761 1986890 2002454 1974790 1896161 1845808 1862614
2308 1862614 1871768 1995571 2015235 1933567 1985021 2057489 1978278 1937481 1903274 1898515 1934994 1922760
2296 1922760 1894771 1877245 1771380 1728234 1806134 1855099 1862402 1861791 1844721 1888936 1852748 1764610
$$ packed form
2380B618531M407l2705n7529n1303l387l4323m3050l0255m8452J671M198q6955
2368B240848k6682n5719J17M9911m2905j4933L0911k6038j5319L5130p6488L9221
2356B138054n8116K4892K0132j6578l2897N532m855j6065N6472N5908Q2509k2584
2344B232404k3902k6352K6931N2170j129p579K6626m9292j8351J4505J583L027
2332B230641m543k2696K5969M8459L4406j08608Q8543m5784p8141q0338p255j004
2320B079649Q136k7993K7880r1729P711M8107o4871J5564k7664p8629n0353J6806
2308A862614R154J23803J9664q1668N1454P2468p9211m0797l4207m759L6479j2234
2296A922760k7989j7526j05865m3146P7900M8965P303o11j7070M4215l6188q8138
$$ plain form
2284 1764610 1768374 1788435 1713690 1658740 1675801 1712459 1750034 1783707 1798560 1704635 1630118 1603196
2272 1603196 1672610 1614419 1586176 1592525 1569620 1561766 1498536 1491632 1499309 1498605 1559586 1449915
2260 1449915 1357096 1334877 1416617 1327851 1375868 1361711 1321004 1326312 1318018 1412412 1454457 1505575
2248 1505575 1425839 1419132 1404333 1416744 1405740 1410073 1413920 1383993 1463969 1490674 1447159 1431503
2236 1431503 1452853 1497241 1569669 1638037 1554123 1463494 1492778 1555993 1623578 1611224 1589664
2225 1589664 1563516 1581787 1602875 1554133 1571757 1567510 1580862 1605271 1543212 1508461 1618495
2214 1618495 1573319 1551388 1542582 1577443 1521154 1481827 1500770 1529286 1463949 1456874 1435204 1387742
2202 1387742 1462158 1378674 1320485 1358487 1423822 1436829 1446634 1506316 1432263 1387172 1404434 1464123
$$ packed form
2284A764610L764K0061p4745n4950J7061L6658L7575L3673J4853r3925p4517k6922
2272A603196O9414n8191k8243O349k2905p854o3230o904P677p04O0981j09671
2260A449915r2819k2219Q1740q8766M8017j4157m0707N308q294R4394M2045N1118
2248A505575p9736o707j4799J2411j1004M333L847k9927P9976K6705m3515j5656
2236A431503K1350M4388P2428O8368q3914r0629K9284O3215O7585j2354k1560
2225A589664k6148J8271K1088m8742J7624m247J3352K4409o2059l4751J10034
2214A618495m5176k1931q806L4861n6289l9327J8943K8516o5337p075k1670m7462
2202A387742P4416q3484n8189L8002O5335J3007R805N9682p4053m5091J7262N9689
$$ plain form
2190 1464123 1362913 1378333 1389703 1394367 1385001 1400006 1373876 1334562 1402277 1486376 1442229 1412826
2178 1412826 1377585 1378010 1378175 1310972 1335851 1329942 1322372 1275767 1203647 1237010 1167474 1154617 1208961
2165 1208961 1188525 1092160 1030613 1117818 1100169 1045943 1014560 1049705 1073932 1093207 1015914
2154 1015914 1013220 1004721 974025 981794 1003480 940266 968996 996783 958970 918399 953323 994641
2142 994641 1002454 902366 913746 904300 854241 1000286 996968 914804 981794 1004710 1028934 914868
2130 914868 931582 944289 960522 986440 968605 1028582 1132666 1108991 1129562 1082884 1018224
2119 1018224 1005015 1043568 1059756 1107260 1110135 1053264 1191037 1187913 1132118 1103320 1179364 1202925
2107 1202925 1172624 1125096 1138896 1112902 1235197 1249678 1274227 1301514 1266223 1156774 1231087
$$ packed form
2190A464123j01210J5420J1370M664r366J5005k6130l9314O7715Q4099m4147k9403
2178A412826l5241M25J65o7203K4879n909p570m6605p2120L3363o9536j2857N4344
2165A208961k0436r6365o1547Q7205j7649n4226l1383L5145K4227J9275p7293
2154A015914k694q499l0696P769K1686o3214K8730K7787l7813m0571L4924M1318
2142I94641P813j00088J1380r446n0059J46045l318q2164O6990K2916K4224j14066
2130I14868J6714J2707J6233K5918j7835N9977J04084k3675K0571m6678o4660
2119A018224j3209L8553J6188M7504K875n6871J37773l124n5795k8798P6044K3561
2107A202925l0301m7528J3800k5994J22295J4481K4549K7287l5291j09449P4313
$$ plain form
2096 1231087 1268391 1274156 1265509 1267618 1268636 1242062 1282659 1409695 1459662 1407701 1456573 1375342
2084 1375342 1459737 1532745 1492732 1483581 1515058 1556820 1538374 1537014 1628703 1617416 1602272 1593553
2072 1593553 1677981 1805755 1801358 1814096 1860218 1910456 1983144 2013880 2042122 2147041 2221191
2061 2221191 2323539 2469987 2582843 2723426 2906366 3136896 3302334 3557471 3832802 4176505
2051 4176505 4624577 5009801 5405876 5946846 6644714 7377365 8388787 9583105 10541494
2042 10541494 11170017 11597331 12342573 13546547 14604455 13710046 11097139 8532063 6688879
2033 6688879 5435413 4644661 4208846 3887897 3650368 3385737 3266703 3098463 2967236
2024 2967236 2831513 2697868 2540517 2317503 2107152 2066865 1957837 1855930 1796156 1805574
$$ packed form
2096A231087L7304N765q647K109J018k6574M0597J27036M9967n1961M8872q1231
2084A375342Q4395P3008m0013r151L1477M1762j8446j360R1689j1287j5144q719
2072A593553Q4428J27774m397J2738M6122N0238P2688L0736K8242J04919P4150
2061B221191J02348J46448J12856J40583J82940K30530J65438K55137K75331L43703
2051D176505M48072L85224L96075N40970O97868P32651J011422J194318R58389
2042A0541494O28523M27314P45242J203974J057908q94409k612907k565076j843184
2033F688879j253466p90752m35815l20949k37529k64631j19034j68240j31227
2024B967236j35723j33645j57351k23014k10351m0287j09028j01907n9774R418
$$ plain form
2014 1805574 1795313 1687234 1705538 1691714 1603081 1536396 1500782 1449288 1369923 1354432 1397517
2003 1397517 1334679 1380986 1331131 1289305 1243193 1151977 1086619 1163063 1177977 1131154 1144204
1992 1144204 1172896 1139917 1159430 1085200 1012177 1030590 1090399 1077759 1036685 987958 919367
1981 919367 962138 1022519 1003495 956864 939380 927905 916201 878751 883291 918154 981389 888941
1969 888941 926003 845632 855341 905842 888045 887025 908683 862815 899584 851129 820058 817366
1957 817366 722718 754805 828750 813744 774685 800083 834190 809144 779389 825693 786084 761241
1945 761241 743468 695736 678470 675947 700972 661954 671963 594180 598071 646400 591301 557292
1933 557292 616039 579738 570624 643481 659314 656508 680086 769961 730167 659285 662617 640525
$$ packed form
2014A805574j0261j08079J8304j3824q8633o6685l5614n1494p9365j5491M3085
2003A397517o2838M6307m9855m1826m6112r1216o5358P6444J4914m6823J3050
1992A144204K8692l2979J9513p4230p3023J8413N9809j2640m1074m8727o8591
1981I19367M2771O0381j9024m6631j7484j1475j1704l7450M540L4863O3235r2448
1969H88941L7062q0371R709N0501j7797j020K1658m5868L6769m8455l1071k692
1957H17366r4648L2087P3945j5006l9059K5398L4107k5046k9755M6304l9609k4843
1945G61241j7773m7732j7266k523K5025l9018J0009p7783L891M8329n5099l4009
1933E57292N8747l6301r114P2857J5833k806K3578Q9875l9794p0882L332k2092
$$ plain form
1921 640525 579509 604651 544613 575249 606716 651931 627221 681533 624330 547365 502161 530692
1909 530692 536764 572854 635430 581027 576682 581498 608528 501154 610367 658139 645080 665663
1897 665663 558891 585411 601973 600525 605735 573848 596148 539880 566902 496475 553660 567127
1885 567127 544130 564789 534757 570357 545567 577896 595885 555342 537695 592500 523144 551672
1873 551672 632063 594205 592998 647581 609532 609115 673857 661918 587492 580012 571119 545879 582163
1860 582163 593948 607530 624303 601442 582500 585916 602961 647685 653657 636436 663389 593389
1848 593389 606798 532157 507694 558152 560251 554123 548494 484373 489752 541896 509953 592491
1836 592491 499664 509068 604685 567489 494552 511245 589539 573774 618404 595775 467201 516922
$$ packed form
1921F40525o1016K5142o0038L0636L1467M5215k4710N4312n7203p6965m5204K8531
1909E30692O072L6090O2576n4403m345M816K7030j07374J09213M7772j3059K0583
1897F65663j06772K6520J6562j448N210l1887K2300n6268K7022p0427N7185J3467
1885E67127k2997K0659l0032L5600k4790L2329J7989m0543j7647N4805o9356K8528
1873E51672Q0391l7858j207N4583l8049m17O4742j1939p4426p480q893k5240L6284
1860E82163J1785J3582J6773k2861j8942L416J7045M4724N972j7221K6953p0000
1848E93389J3409p4641k4463N0458K099o128n629o4121N379N2144l1943Q2538
1836E92491r2827R404R5617l7196p2937J6693P8294j5765M4630k2629j28574M9721
$$ plain form
1824 516922 565483 520581 548982 565469 546021 511150 446210 478904 448950 448868 466168 493558
1812 493558 467608 471328 517205 576171 563952 442133 454223 560443 576983 569093 553230 540877
1800 540877 647991 654253 600247 646433 615799 546838 497157 539040 538949 475252 524305 483750
1788 483750 452133 443604 463464 444613 492769 399338 493287 490540 419593 475871 453573 373328
1776 373328 373724 461059 476076 447535 471646 407679 329726 386157 424007 436196 384829 387468
1764 387468 397560 338236 326643 389538 399510 311017 298859 380478 372548 365521 344590 402765
1752 402765 368857 406187 432967 467923 451107 412855 346520 335895 428818 349631 345591 436787
1740 436787 466411 436067 428071 407419 426639 427626 447693 384521 390662 402162 377195 389865
$$ packed form
1824E16922M8561m4902K8401J6487j9448l4871o4940L2694k9954q2J7300K7390
1812D93558k5950L720M5877N8966j2219j21819J2090J06220J6540p890j5863j2353
1800E40877J07114O262n4006M6186l0634o8961m9681M1883r1o3697M9053m0555
1788D83750l1617q529J9860j8851M8156r3431R3949k747p0947N6278k2298q0245
1776C73328L96Q7335J5017k8541K4111o3967p7953N6431L7850J2189n1367K639
1764C87468J0092n9324j1593O2895R972q8493j2158Q1619p930p027k0931N8175
1752D02765l3908L7330K6780L4956j6816l8252o6335j0625R2923p9187m040R1196
1740D36787K9624l0344p996k0652J9220R87K0067o3172O141J1500k4967J2670
$$ plain form
1728 389865 418600 427321 326186 364017 441068 409772 372924 376790 391503 406349 414848 380701
1716 380701 494951 439642 377730 355684 387857 421117 385565 447918 333574 400155 418735
1705 418735 401396 356888 346364 370985 421436 346846 363585 402239 431997 356065 380466 342543
1693 342543 348575 355113 371367 341330 380663 406690 334565 446742 433124 396825 294640 357452
1681 357452 376981 318454 299136 366336 389730 328756 330785 367391 348156 294140 326254 398765
1669 398765 352179 287956 282561 295221 302040 359916 401156 382158 360082 388425 382194 360376
1657 360376 352310 360533 345897 319939 325467 336314 267227 289375 279292 326620 280586 374216
1645 374216 401855 408100 404110 273247 258207 286813 299089 280692 371797 350654 381273 290509
$$ packed form
1728C89865K8735Q721j01135L7831P7051l1296l6848L866J4713J4846Q499l4147
1716C80701J14250n5309o1912k2046L2173L3260l5552O2353j14344O6581J8580
1705D18735j7339m4508j0524K4621N0451p4590J6739L8654K9758p5932K4401l7923
1693C42543O032O538J6254l0037L9333K6027p2125J12177j3618l6299j02185O2812
1681C57452J9529n8527j9318O7200K3394o0974K029L6606j9235n4016L2114P2511
1669C98765m6586o4223n395J2660O819N7876M1240j8998k2076K8343o231k1818
1657C60376q066Q223j4636k5958N528J0847o9087K2148j0083M7328m6034R3630
1645C74216K7639O245l990j30863j5040K8606J2276j8397R1105k1143L0619r0764
$$ plain form
1633 290509 275063 321176 284309 335412 298758 287972 311891 297745 366696 415517 361271 378850
1621 378850 352139 306737 358482 366779 383286 405915 413213 353323 393892 371826 312179 355204
1609 355204 266510 209598 283845 266066 295093 380819 305746 278382 301113 292807 273208 283747
1597 283747 305994 328888 261635 297217 339650 281304 303575 385662 400978 349980 293179 222694
1585 222694 249032 310990 259235 251132 302067 303075 281347 225980 188095 280157 316872 309520
1573 309520 288338 238761 255895 268024 286571 290501 259512 327107 366930 335807 344739 331599
1561 331599 334840 305329 278818 337570 325669 272054 228126 243133 149082 156919 165204 216811
1549 216811 319752 254829 185963 146604 254676 279901 281494 242691 261677 208467 204801 231918
$$ packed form
1633B90509j5446M6113l6867N1103l6654j0786K3919j4146O8951M8821n4246J7579
1621C78850k6711m5402N1745Q297J6507K2629P298n9890M0569k2066n9647M3025
1609C55204q8694n6912P4247j7779K9027Q5726p5073k7364K2731q306j9599J0539
1597B83747K2247K2894o7253L5582M2433n8346K2271Q2087J5316n0998n6801p0485
1585B22694K6338O1958n1755q103N0935J008k1728n5367l7885R2062L6715p352
1573C09520k1182m9577J7134J2129J8547L930l0989O7595L9823l1123Q932j3140
1561C31599L241k9511k6511N8752j1901n3615m3928J5007r4051P837Q285N1607
1549B16811J02941o4923o8866l9359J08072K5225J593l8803J8986n3210l666K7117
$$ plain form
1537 231918 238181 214924 216302 221698 296626 251737 173612 155153 116443 267748 290850 299060
1525 299060 253667 222573 199440 244733 279341 223347 198033 207034 168969 160630 280147 296248
1513 296248 187531 165577 236226 190662 173134 237771 252454 312054 290029 306605 375222
1502 375222 403365 384184 342591 349286 302872 293777 308533 398803 360224 273499 242145 302272
1490 302272 247101 287104 275608 220780 272305 237119 177601 206263 245166 217878 80741
1479 80741 48340 99753 220860 225047 210048 246338 196017 179575 219726 249092 250918 263274
1467 263274 223180 221554 205806 233068 280854 159776 159104 234811 216107 172252 193121 255822
1455 255822 291154 296175 234933 176947 179547 172685 176026 210743 220603 244097 205943 251401 247027
$$ packed form
1537B31918O263k3257J378N396P4928m4889p8125j8459l8710J51305K3102Q210
1525B99060m5393l1094k3133M5293L4608n5994k5314R001l8065q339J19517J6101
1513B96248j08717k1954P0649m5564j7528O4637J4683N9600k2025J6576O8617
1502C75222K8143j9181m1593O695m6414r095J4756R0270l8579q6725l1354O0127
1490C02272n5171M0003j1496n4828N1525l5186n9518K8662L8903k7288j37137
1479H0741l2401N1413J21107M187j4999L6290n0321j6442M0151K9366J826J2356
1467B63274m0094j626j5748K7262M7786j21078o72P5707j8704m3855K0869O2701
1455B55822L5332N021o1242n7986K600o862L341L4717R860K3494l8154M5458m374
$$ plain form
1442 247027 304414 211587 190425 182529 208193 141080 130351 192250 236802 181896 155165 234760
1430 234760 233947 125688 160947 194163 244559 184687 183810 175310 129733 200473 163136 262438
1418 262438 263931 208175 217612 173610 133352 143709 150459 213017 198611 163845 189235 238168
1406 238168 234708 247464 195765 221046 260112 183185 115063 111065 188948 207502 184047 210467
1394 210467 194008 139951 135982 205804 142762 192574 230494 134148 155488 232398 204630 172456
1382 172456 183154 228286 181122 156143 241979 243933 238670 204768 170186 218969 303974 204820
1370 204820 167029 203062 207425 175613 129683 84228 147153 101047 123299 210542 136665 136918
1358 136918 122604 131207 136673 135959 153777 143749 142882 148960 189698 180512 162484 199287 179502
$$ packed form
1442B47027N7387r2827k1162p896K5664o7113j0729O1899M4552n4906k6731P9595
1430B34760q13j08259L5259L3216N0396n9872q77q500m5577P0740l7337R9302
1418B62438J493n5756R437m4002m0258J0357O750O2558j4406l4766K5390M8933
1406B38168l460J2756n1699K5281L9066p6927o8122l998P7883J8554k3455K6420
1394B10467j6459n4057l969O9822o3042M9812L7920r6346K1340P6910k7768l2174
1382A72456J0698M5132m7164k4979Q5836J954n263l3902l4582M8783Q5005r9154
1370B04820l7791L6033M363l1812m5930m5455O2925m6106K2252Q7243p3877K53
1358A36918j4314Q603N466p14J7818j0028q67O078M0738r186j8028L6803j9785
$$ plain form
1345 179502 158328 103290 166820 176557 157135 138677 183441 121537 152396 193288 209138 164511
1333 164511 152493 191425 217007 142658 176539 230121 198708 139447 165294 136873 194475 211206
1321 211206 167249 184842 60527 99985 144460 202295 215759 179361 119877 116872 117057 109161
1309 109161 129327 195070 144819 163526 140271 154106 147062 191530 153975 187080 179147 171660
1297 171660 200063 155629 166927 196423 173461 172793 198274 283052 203976 106387 189985 249493
1285 249493 169699 233383 198066 173243 178757 161502 170896 148047 177936 153356 157569 177973
1273 177973 155194 137601 151299 97725 88212 104850 164930 124278 92280 120628 164724 212260
1261 212260 137577 108739 229932 237623 137728 97758 133004 205441 224134 149484 80628 25221
$$ packed form
1345A79502k1174n5038O3530R737j9422j8458M4764o1904L0859M0892J5850m4627
1333A64511j2018L8932K5582p4349L3881N3582l1413n9261K5847k8421N7602J6731
1321B11206m3957J7593j24315L9458M4475N7835J3464l6398n9484l005J85p896
1309A09161K0166O5743n0251J8707k3255J3835p044M4468l7555L3105p933p487
1297A71660K8403m4434J1298K9496k2962o68K5481Q4778p9076r7589Q3598N9508
1285B49493p9794O3684l5317k4823N514j7255R394k2849K9889k4580M213K0404
1273A77973k2779j7593J3698n3574r513J6638O0080m0652l1998K8348M4096M7536
1261B12260p4683k8838J21193P691r9895l9970L5246P2437J8693p4650o8856n5407
$$ plain form
1249 25221 94823 128911 142100 175596 222593 169733 154284 162750 167303 160903 89141 165322
1237 165322 150768 120861 118278 67555 112447 117998 272937 145624 82917 218116 213238 161038
1225 161038 68177 100701 182486 140016 128615 13179 128294 173978 105148 93624 114897
1214 114897 159312 152564 87332 114499 114180 82809 119173 74712 88785 94560 131041 142506
1202 142506 162108 181774 98844 52763 7078 -54980 55016 71495 59677 95084 110636
1191 110636 34875 39001 98923 111701 49032 76061 136224 124798 132515 205867 175618 155180
1179 155180 189635 163690 69089 -2634 77089 98533 84954 101392 179427 138420 127187 127171
1167 127171 109378 109500 179231 140124 88749 202926 112929 70532 93447 127825 116800 85206
$$ packed form
1249B5221O9602L4088J3189L3496M6997n2860j5449Q466M553o400p1762P6181
1237A65322j4554k9907k583n0723M4892N551J54939j27313o2707J35199m878n2200
1225A61038r2861L2524Q1785m2470j1401j15436J15115M5684o8830j1524K1273
1214A14897M4415o748o5232K7167l19l1371L6364m4461J4073N775L6481J1465
1202A42506J9602J9666q2930m6081m5685o2058J09996J6479j1818L5407J5552
1191A10636p5761M126N9922J2778o2669K7029O0163j1426P717P3352l0249k0438
1179A55180L4455k5945r4601p1723P9723K1444j3579J6438P8035m1007j1233j6
1167A27171j7793J22O9731l9107n1375J14177q9997m2397K2915L4378j1025l1594
$$ plain form
1155 85206 -18081 52647 71706 63236 156712 194318 114810 120408 65833 99002 89244 77691
1143 77691 15211 -10673 49423 77801 94543 151391 125879 61535 63592 -2081 54047 78264
1131 78264 38519 20490 93589 174821 155639 85041 84993 102246 102908 103057 80211 111851 142413
1118 142413 139719 146878 123318 157032 180171 201946 163994 159041 154675 96328 126544 162818
1106 162818 119693 121301 73745 31173 30489 35481 69786 50156 40826 60707 51855 141912 129700
1093 129700 95021 106507 148858 131371 97629 106791 125429 48082 83711 115311 96406 115923
1081 115923 112095 110231 87468 80911 137039 113917 62454 105252 86315 150693 88563 53917
1069 53917 80827 35684 -7053 50920 69926 48434 51656 15693 68353 101020 101653 71588
$$ packed form
1155H5206j03287P0728J9059q470R3476L7606p9508N598n4575L3169r758j1553
1143G7691o2480k5884O0096K8378J6742N6848k5512o4344K057o5673N6128K4217
1131G8264l9745j8029P3099Q1232j9182p0598m8J7253O62J49k2846L1640L0562
1118A42413k694P159k3560L3714K3139K1775l7952m953m366n8347L0216L6274
1106A62818m3125J608m7556m2572o84M992L4305j9630r330J9881q852R0057j2212
1093A29700l4679J1486M2351j7487l3742R162J8638p7347L5629L1600j8905J9517
1081A15923l828j864k2763o557N6128k3122n1463M2798j8937O4378o2130l4646
1069E3917K6910m5143m2737N7973J9006k1492L222l5963N2660L2667O33l0065
$$ plain form
1057 71588 122736 87587 55885 73546 57912 32302 25029 36793 89559 55654 60113 100981
1045 100981 16463 100304 167670 153636 127023 172489 108327 44902 67600 74352 54486 65096
1033 65096 31290 85331 72679 34964 88836 150803 89560 109092 111961 39399 65576 122018
1021 122018 76843 -51090 -16553 -8708 27898 33375 100189 60319 53512 26994 46034 88714
1009 88714 77832 48177 73637 44633 92010 124002 94255 62712 59692 31247 74559 68962
997 68962 -10784 6969 -12768 -47700 23108 61600 25972 43506 124366 147523 90837 38785
985 38785 80249 144437 88507 104383 43622 71274 100698 66025 -4148 34743 54058 69707
973 69707 125973 70934 -3086 55827 86407 14162 42571 31535 -5023 40753 92000 57028
$$ packed form
1057G1588N1148l5149l1702J7661j5634k5610p273J1764N2766l3905M459M0868
1045A00981q4518Q3841O7366j4034k6613M5466o4162o3425K2698O752j9866J0610
1033F5096l3806N4041j2652l7715N3872O1967o1243J9532K869p2562K6177N6442
1021A22018m5175j27933L4537P845L6606N477O6814l9870o807k6518J9040M2680
1009H8714j0882k9655K5460k9004M7377L1992k9747l1543l020k8445M3312n597
997F8962p9746J7753j9737l4932P0808L8492l5628J7534Q0860K3157n6686n2052
985C8785M1464O4188n5930J5876o0761K7652K9424l4673p0173L8891J9315J5649
973F9707N6266n5039p4020N8913L0580p2245K8409j1036l6558M5776N1247l4972
$$ plain form
961 57028 146964 113882 29802 17971 17978 66288 25635 37813 9989 78184 79479 82174 74530
948 74530 58399 123313 135602 117638 62645 47063 27482 46288 56230 39228 17273 -38376
936 -38376 58433 34599 52321 -21860 -10888 24554 19282 16037 -16884 13145 76946 14324
924 14324 -6324 -55192 -34524 7569 15635 -19323 -19123 1985 -44353 16169 36805 47758 102869
911 102869 129828 88778 81521 48163 -3608 44795 35448 -46037 -12145 -8018 94991 57285
899 57285 57925 78727 117510 77187 133961 53977 -1989 19393 1459 -29599 54524 67274
887 67274 4993 39024 78192 72015 -42494 6570 32537 -385 -27297 -46480 -77076 -32126
875 -32126 -43091 -17110 20676 64976 69340 43586 27858 38194 28344 62879 87755 67798
$$ packed form
961E7028Q9936l3082q4080j1831PM8310m0653J2178k7824O8195J295K695p644
948G4530j6131O4914J2289j7964n4993j5582j9581J8806R942j7002k1955n5649
936c8376R6809k3834J7722p4181J0972L5442n272l245l2921L0029O3801o2622
924A4324k0648m8868K0668M2093Q066l4958K00K1108m6338O0522K0636J0953N5111
911A02869K6959m1050p257l3358n1771M8403r347q1485L3892M127J03009l7706
899E7285O40K0802L8783m0323N6774p9984n5966K1382j7934l1058Q4123J2750
887F7274o2281L4031L9168o177j14509M9064K5967l2922k6912j9183l0596M4950
875c2126j0965K5981L7786M4300M364k5754j5728J0336r850L4535K4876j9957
$$ plain form
863 67798 45973 9276 14217 -2746 27695 -33014 -63765 -40673 4537 28721 40014 25220
851 25220 -5127 45156 -11303 808 -12397 -17670 41796 105854 59907 18439 5240 19160
839 19160 109233 33036 18190 -4719 235 24244 90039 52814 35769 62545 85271 86095 41103
826 41103 11301 -42609 -76084 -46412 -41472 -26846 -32184 37383 71931 -4949 68788 5863
814 5863 -9210 52030 137235 -3043 -42936 -13315 -16583 53160 68858 72621 38180 28650 -2771
801 -2771 5865 -11438 -30150 -55352 4065 23819 52588 20547 -590 -12018 35640 6707
789 6707 56803 12386 26718 31728 -14181 -41274 -85492 -55508 -48751 -96039 -57316 20049 -25016
776 -25016 12754 31014 -40604 -50709 -98226 -65509 15402 39490 -3814 -10121 18835 -21646
$$ packed form
863F7798k1825l6697M941j6963L0441o0709l0751K3092M5210K4184J1293j4794
851B5220l0347N0283n6459J2111j3205n273N9466O4058m5947m1468j3199J3920
839A9160R0073p6197j4846k2909M954K4009O5795l7225j7045K6776K2726Q24m4992
826D1103k9802n3910l3475K9672M940J4626n338O9567L4548p6880P3737o2925
814E863j5073O1240Q5205j40278l9893K9621l268O9743J5698L763l4441r530l1421
801b771Q636j7303j8712k5202N9417J9754K8769l2041k1137j1428M7658k8933
789F707N0096m4417J4332N010m5909k7093m4218K9984O757m7288L8723P7365m5065
776b5016L7770J8260p1618j0105m7517L2717Q0911K4088m3304o307K8956m0481
$$ plain form
764 -21646 -27975 -21718 53819 86785 42253 12672 41398 55835 121438 87648 28715 -42753
752 -42753 34609 75424 -23456 -73233 -402 -29159 -83134 -71599 -41548 -20871 37840 11188
740 11188 -22590 19239 33707 -8384 -924 -73985 -78060 -6118 -13277 -42811 -38566 -10629 -49691
727 -49691 -87207 4573 -31395 -29283 -18592 -16473 6855 -84187 -116108 -55114 -1805 -96500
715 -96500 -144005 -143798 -119149 5627 -6223 -72247 -38546 12713 9599 40521 -11065 -27540
703 -27540 -34427 -34518 40312 39603 40441 24744 -59329 -49376 -65848 -70899 -93532 -55156 -6838 51756
689 51756 30516 18953 13195 -76783 -74444 -27594 -19613 -34297 -80778 -130313 -107451 -36962 27467
676 27467 -13422 -14521 -51330 9814 20082 -36450 -47450 -24785 32032 11460 -15778 38620
$$ packed form
764b1646o329O257P5537L2966m4532k9581K8726J4437O5603l3790n8933p1468
752d2753P7362M0815r8880m9777P2831k8757n3975J1535L0051K0677N8711k6652
740A1188l3778M1829J4468m2091P460p3061m075P1942p159k9534M245K7937l9062
727d9691l7516R1780l5968K112J0691K119K3328r1042l1921O0994N3309r4695
715i6500m7505K07K4649J24776j1850o6024L3701N1259l114L0922n1586j6475
703b7540o887r1P4830p09Q38j5697q4073R953j6472n051k2633L8376M8318N8594
689E1756k1240j1563n758q9978K339M6850P981j4684m6481m9535K2862P0489O4429
676B7467m0889j099l6809O1144J0268n6532j1000K2665N6817k0572k7238N4398
$$ plain form
664 38620 -22755 -26638 -67682 11084 72397 22284 -31141 -18107 -2098 26804 32058 33475 -99446
651 -99446 -52186 -15111 -7652 -3197 -37927 -78481 -70868 -81108 -3885 11631 44588 51573 -47506
638 -47506 -41657 5078 17916 80871 93966 26075 -240 5889 113692 55728 -7160 -314
626 -314 2587 -5082 -82873 -12284 -42059 -113088 -84220 2087 14277 20168 15096 -12957 -27622
613 -27622 -102354 -80113 -88008 -51303 -91199 -56410 -82461 -91472 -118156 -87337 15837 -59164
601 -59164 -8518 3107 -77652 -51786 -58759 -48245 -93278 -78675 -132075 -117327 -102838 -127428
589 -127428 -131359 -98268 -26573 11068 2689 -21011 -82385 -51115 2488 -46237 -61732 -69397
577 -69397 -84549 8319 37817 -57984 -75836 -46689 -62799 -37524 -107239 -43943 -72327 -59453
$$ packed form
664C8620o1375l883m1044P8766O1313n0113n3425J3034J6009K8902N254J417j32921
651i9446M7260L7075P459M455l4730m0554P613j0240P7223J5516L2957O985r9079
638d7506N849M6735J2838O2955J3095o7891k6315O129J07803n7964o2888O846
626c14K901p669p7791P0589k9775p1029K8868Q6307J2190N891n072k8053j4665
613b7622p4732K2241p895L6705l9896L4789k6051r011k6684L0819J03174p5001
601e9164N0646J1625q0759K5866o973J0514m5033J4603n3400J4748J4489k4590
589a27428l931L3091P1695L7641q379k3700o1374L1270N3603m8725j5495p665
577f9397j5152R2868K9498r5801j7852K9147j6110K5275o9715O3296k8384J2874
$$ plain form
565 -59453 -80779 -98617 -56673 -58272 -64191 -87365 -82328 -100901 -93930 -108299 -80885 -66593 -15945
552 -15945 -13473 23906 -26733 -26381 -20572 -20276 -16392 21392 -9362 -92924 -122150 -31680 9326
539 9326 -11854 -45849 -114794 -89329 -45510 -22738 -12858 -52812 -76143 -130809 -138870 -115958 -107439
526 -107439 -77306 -74232 -67126 -98881 -136256 -121327 -123814 -145875 -91020 -140821 -156682 -69465
514 -69465 -113485 -129277 2267 -90936 -92579 -30386 2625 -26924 -42638 -53416 -25701 -118127
502 -118127 -109253 -36231 -151381 -129232 -121696 -138600 -61222 -40435 -35352 -82362 -93985 -154941
490 -154941 -106567 -31931 -81587 -37534 -117749 -136338 -74966 -105562 -117323 -75579 -92542 -48057
478 -48057 -135443 -110682 -152709 -189591 -146955 -75840 -115044 -131405 -97790 -82209 -89173 -62665
$$ packed form
565e9453k1326j7838M1944j599n919k3174N037j8573O971j4369K7414J4292N0648
552a5945K472L7379n0639L52N809K96L884L7784l0754q3562k9226R0470M1006
539I326k1180l3995o8945K5465M3819K2772R880l9954k3331n4666q061K2912Q519
526a07439L0133L074P106l1755l7375J4929k487k2061N4855m9801j5861Q7217
514f9465m4020j5792J31544r3203j643O2193L3011k9549j5714j0778K7715r2426
502a18127Q874P3022j15150K2149P536j6904P7378K0787N083m7010j1623o0956
490a54941M8374P4636m9656M4053q0215j8589O1372l0596j1761M1744j6963M4485
478d8057q7386K4761m2027l6882M2636P1115l9204j6361L3615J5581o964K6508
$$ plain form
466 -62665 -34021 -88115 -129824 -103548 -69149 -76130 -64962 -72910 -82683 -113968 -120141 -147422 -103152
453 -103152 -85618 -92872 -70749 -79071 -70873 -93345 -71203 -97864 -46425 -18931 8998 -671 -67553
440 -67553 -116129 -121476 -60708 -59520 -40037 -75517 -97787 -47490 -21734 -97510 -90514 -119926 -106942
427 -106942 -52194 -119742 -59810 -59580 -122599 -98904 -104763 -105650 -131103 -88484 -47773 -27987 -43382
414 -43382 -138712 -193026 -104114 -37862 -9153 -8847 -31826 -28495 -78132 -89484 -58687 -75605 -132593
401 -132593 -121833 -38927 -58822 -168329 -181603 -145422 -150220 -131185 -109008 -77663 -111904 -148337
389 -148337 -21871 -55098 1139 4148 -78073 -124751 -99137 -104010 -146595 -77928 -90342 -114850
377 -114850 -131758 -124737 -110991 -110830 -121533 -88758 -62775 -42381 -86449 -137638 -156268 -57166
$$ packed form
466f2665K8644n4094m1709K6276L4399o981J1168p948r773l1285o173k7281M4270
453a03152J7534p254K2123q322Q198k2472K2142k6661N1439K7494K7929r669o6882
440f7553m8576n347O0768J188J9483l5480k2270N0297K5756p5776O996k9412J2984
427a06942N4748o7548N9932K30o3019K3695n859q87k5453M2619M0711J9786j5395
414d3382r5330n4314Q8912O6252K8709L06k2979L331m9637j1352L0797j6918n6988
401a32593J0760Q2906j9895j09507j3274L6181m798J9035K2177L1345l4241l6433
389a48337J26466l3227N6237L009q2221m6678K5614m873m2585O8667j2414k4508
377a14850j6908P021J3746J61j0703L2775K5983K0394m4068n1189j8630R9102
$$ plain form
365 -57166 -76991 -94474 -118792 -169631 -146604 -56055 -80368 -94330 -51443 -114409 -127295 -184903
353 -184903 -142996 -98466 -59874 -43203 -46591 -54030 -73653 -51101 -31378 -38999 -72965 -90271
341 -90271 -117454 -113821 -97773 -97106 -82754 -103537 -90430 -124985 -204691 -187082 -163307 -113974 -40584
328 -40584 -135992 -158243 -109011 -125253 -153243 -166518 -191382 -115006 -73935 -179951 -100570 -114424
316 -114424 -125049 -144012 -159108 -180146 -197396 -113786 -112184 -63144 -42593 -123478 -78825 -70152
304 -70152 -94087 -128033 -103901 -103592 -26743 -35317 -95980 -62654 -114353 -90600 -69185 -108527 -127346
291 -127346 -144748 -87702 -86690 -138401 -124098 -160762 -187081 -93419 -70298 -65396 -106734 -91642
279 -91642 -75710 -111491 -58381 -80112 -73489 -132592 -125055 -55264 -92144 -148046 -127934 -136420 -144930
$$ packed form
365e7166j9825j7483k4318n0839K3027R0549k4313j3962M2887o2966j2886n7608
353a84903M1907M4530L8592J6671l388p439j9623K2552J9723p621l3966j7306
341i0271k7183L633J6048O67J4352k0783J3107l4555p9706J7609K3775M9333P3390
328d0584r5408k2251M9232j6242k7990j3275k4864P6376M1071j06016P9381j3854
316a14424j0625j8963j5096k1038j7250Q3610J602M9040K0551q0885M4653Q673
304g0152k3935l3946K4132L09P6849q574o0663L3326n1699K3753K1415l9342j8819
291a27346j7402N7046J012n1711J4303l6664k6319R3662K3121M902m1338J5092
279i1642J5932l5781N3110k1731O623n9103P537O9791l6880n5902K0112q486q510
$$ plain form
266 -144930 -130372 -50544 -211944 -231174 -126004 -142497 -77860 -76849 -117197 -113463 -152596 -94778
254 -94778 -25358 -32564 -77460 -157404 -97039 -102572 -111777 -197210 -205319 -151534 -151946 -170645 -168334
241 -168334 -188764 -167421 -197016 -203779 -174218 -150012 -80594 -86680 -88122 -63751 -95695 -177946
229 -177946 -144919 -133892 -114041 -141646 -233466 -216570 -96251 -148955 -177425 -192640 -145979 -107720
217 -107720 -107630 -167054 -135722 -189243 -82708 -150914 -183990 -157874 -135354 -153806 -218043 -79106
205 -79106 -159499 -132237 -135148 -214719 -215565 -216131 -206445 -172301 -192979 -190094 -230399 -161487 -155986 -147848
191 -147848 -108728 -133314 -144782 -161285 -116394 -84656 -152181 -120877 -137811 -99804 -26977 -28856
179 -28856 -26134 -79641 -78869 -95978 -131898 -98724 -141738 -102941 -122444 -185368 -130787 -80018 -134866
$$ packed form
266a44930J4558P9828j61400j9230J05170j6493O4637J011m0348L734l9133N7818
254i4778O9420p206m4896p9944O0365n533r205q5433q109N3785m12j8699K311
241a68334k0430K1343k9595o763K9561K4206O9418o086j442K4371l1944q2251
229a77946L3027J1027J9851k7605r1820J6896J20319n2704k8470j5215M6661L8259
217a07720R0n9424L1332n3521J06535o8206l3076K6116K2520j8452o4237J38937
205g9106q0393K7262k911p9571q46n66R686L4144k0678K885m0305O8912N501Q138
191a47848L9120k4586j1468j6503M4891L1738o7525L1304j6934L8007P2827j879
179b8856K722n3507P72j7109l5920L3174m3014L8797j9503o2924N4581N0769n4848
$$ plain form
166 -134866 -139600 -77907 -165995 -167213 -151008 -158092 -186946 -239298 -148327 -196632 -202086 -131688 -141973
153 -141973 -143803 -131359 -153678 -172627 -92359 -104621 -77904 -114668 -152942 -154114 -146151 -164662
141 -164662 -186912 -119374 -94197 -185341 -240639 -257848 -197707 -198659 -189937 -221985 -239869 -139010
129 -139010 -180354 -152531 -111553 -148374 -106911 -121522 -135314 -153653 -203586 -169945 -163518 -118860
117 -118860 -140273 -141330 -142887 -174964 -213036 -187533 -184307 -218602 -138466 -169040 -183127 -150876
105 -150876 -149187 -119741 -137289 -203943 -213307 -155407 -199228 -205098 -231024 -189683 -226835 -221239 -227314
92 -227314 -205418 -231950 -176673 -88829 -124311 -157996 -181280 -221134 -180534 -168301 -176175 -143600
80 -143600 -189512 -166028 -171582 -130116 -133145 -150970 -176244 -201422 -169572 -203846 -133096 -123881 -99507
$$ packed form
166a34866m734O1693q8088j218J6205p084k8854n2352R0971m8305n454P0398j0285
153a41973j830J2444k2319j8949Q0268j2262K6717l6764l8274j172P963j8511
141a64662k2250O7538K5177r1144n5298j7209O0141r52Q722l2048j7884J00859
129a39010m1344K7823M0978l6821M1463j4611j3792j8339m9933L3641O427M4658
117a18860k1413j057j557l2077l8072K5503L226l4295Q0136l0574j4087L2251
105a50876J689K9446j7548o6654r364N7900m3821n870k5926M1341l7152N596o075
92b27314K1896k6532N5277Q7844l5482l3685k3284l9854M0600J2233p874L2575
80a43600m5912K3484n554M1466l029j7825k5274k5178L1850l4274P0750R215K4374
$$ plain form
67 -99507 -105771 -138977 -152619 -122076 -183066 -215393 -235210 -250070 -183294 -179313 -166554 -206911 -197077
54 -197077 -188647 -103548 -79412 -150705 -209913 -196687 -213815 -222819 -224447 -159015 -207446 -221126 -172179
41 -172179 -172335 -136471 -124066 -199840 -230773 -194489 -157421 -168377 -196087 -217005 -171641 -195727
29 -195727 -192657 -214703 -189976 -143527 -149787 -164362 -196049 -198444 -179398 -191783 -202308 -199785 -170630
16 -170630 -196835 -177539 -225953 -200266 -173982 -215593 -192642 -211419 -221170 -251702 -208373 -234298
4 -234298 -199860 -153246 -158262 -135658
0 -135658
$$ packed form
67i9507o264l3206j3642L0543o0990l2327j9817j4860O6776L981J2759m0357R834
54a97077Q430Q5099K4136p1293n9208J3226j7128r004j628O5432m8431j3680M8947
41a72179j56L5864J2405p5774l0933L6284L7068j0956k7710k0918M5364k4086
29a95727L070k2046K4727M6449o260j4575l1687k395J9046j2385j0525K523K9155
16a70630k6205J9296m8414K5687K6284m1611K2951j8777r751l0532M3329k5925
4b34298L4438M6614n016K2604
0a35658
$$ Imaginary data points
##PAGE= N=2
##DATA TABLE= (X++(I..I)), XYDATA
$$ plain form
16383 -4123415 -4032310 -4012024 -3947197 -3880461 -3813073 -3763824 -3724920 -3666564 -3581277 -3534501 -3513799
16372 -3513799 -3451259 -3363524 -3313724 -3217363 -3174312 -3144004 -3055296 -2998374 -2949006 -2887897 -2915884
16361 -2915884 -2812011 -2784552 -2762511 -2695307 -2539873 -2506911 -2497702 -2437007 -2361754 -2261200 -2208671
16350 -2208671 -2139496 -2117420 -2057207 -2047561 -2000241 -1946777 -1885533 -1817862 -1776173 -1712279 -1678953
16339 -1678953 -1584934 -1515652 -1488549 -1477099 -1489996 -1364066 -1262620 -1273891 -1187828 -1095583 -1131440
16328 -1131440 -1096339 -991723 -907375 -942961 -926692 -824940 -753324 -710048 -719296 -673502 -546978
16317 -546978 -477933 -459143 -379570 -419138 -393518 -255901 -206338 -171004 -152657 -118649 -24807
16306 -24807 28398 77297 137609 183368 180650 234198 289337 341610 356255 428448 462290 493730
$$ packed form
16383d123415R1105K0286O4827O6736O7388M9249L8904N8356Q5287M6776K0702
16372c513799O2540Q7735M9800R6361M3051L0308Q8708N6922M9368O1109k7987
16361b915884J03873K7459K2041O7204J55434L2962R209O0695P5253J00554N2529
16350b208671O9175K2076O0213R646M7320N3464O1244O7671M1689O3894L3326
16339a678953R4019O9282K7103J1450j2897J25930J01446j1271Q6063R2245l5857
16328a131440L5101J04616Q4348l5586J6269J01752P1616M3276r248M5794J26524
16317e46978O9045J8790P9573l9568K5620J37617M9563L5334J8347L4008R3842
16306b4807N3205M8899O0312M5759k718N3548N5139N2273J4645P2193L3842L1440
$$ plain form
16294 493730 563145 626881 697903 719069 745186 809896 830486 897188 950748 927908 980364
16283 980364 1067395 1055850 1084223 1164208 1146677 1155640 1222701 1240729 1305278 1378681 1385402 1460745
16271 1460745 1474167 1477219 1551141 1638297 1620039 1599918 1642149 1713552 1743738 1802135 1852127
16260 1852127 1917129 1849330 1873269 1902590 1961325 2004019 2016722 2036185 2081614 2112369 2185055
16249 2185055 2168019 2179521 2233242 2294758 2297747 2333644 2387819 2437378 2515756 2497875 2503304 2579268
16237 2579268 2641416 2620819 2680400 2702685 2669063 2657355 2740823 2762811 2820649 2832885 2870806
16226 2870806 2919949 2986161 2959178 3003213 3059987 3031344 3046643 3089582 3151223 3154410 3172331
16215 3172331 3218459 3270151 3281805 3294920 3323213 3351067 3331056 3374827 3404027 3411324 3377659
$$ packed form
16294D93730O9415O3736P1022K1166K6117O4710K0590O6702N3560k2840N2456
16283I80364Q7031j1545K8373P9985j7531Q963O7061J8028O4549P3403O721P5343
16271A460745J3422L052P3922Q7156j8258k0121M2231P1403L0186N8397M9992
16260A852127O5002o7799K3939K9321N8735M2694J2703J9463M5429L0755P2686
16249B185055j7036J1502N3721O1516K989L5897N4175M9559P8378j7881N429P5964
16237B579268O2148k0597N9581K2285l3622j1708Q3468K1988N7838J2236L7921
16226B870806M9143O6212k6983M4035N6774k8643J5299M2939O1641L187J7921
16215C172331M6128N1692J1654J3115K8293K7854k0011M3771K9200P297l3665
$$ plain form
16204 3377659 3464070 3407964 3449270 3568230 3585115 3570346 3537733 3546403 3600075 3618684 3649798
16193 3649798 3696581 3719815 3685704 3648013 3689467 3693834 3759949 3817423 3823714 3748634 3802353 3816076
16181 3816076 3840850 3805274 3815246 3934843 3922798 3971305 3974174 3973288 3961756 3965700 3987500 4037590
16169 4037590 4003931 4012495 4072269 4022040 4031460 4065051 4138041 4152848 4154017 4097729 4184699 4151920
16157 4151920 4176459 4233864 4278657 4291696 4197155 4131066 4109450 4293985 4267998 4331500 4331879
16146 4331879 4311663 4341385 4298487 4369417 4379624 4396100 4353056 4300410 4284181 4380918 4433373
16135 4433373 4349449 4405857 4531472 4545610 4516285 4397899 4343330 4379611 4400024 4430749 4426929
16124 4426929 4442079 4530066 4495544 4516763 4436050 4431712 4492045 4540778 4519040 4552776 4543940 4524998
$$ packed form
16204C377659Q6411n6106M1306J18960J6885j4769l2613Q670N3672J8609L1114
16193C649798M6783K3234l4111l7691M1454M367O6115N7474O291p5080N3719J3723
16181C816076K4774l5576R972J19597j2045M8507K869q86j1532L944K1800N0090
16169D037590l3659Q564N9774n0229R420L3591P2990J4807J169n6288Q6970l2779
16157D151920K4539N7405M4793J3039r4541o6089k1616J84535k5987O3502L79
16146D331879k0216K9722m2898P0930J0207J6476m3044n2646j6229R6737N2455
16135D433373q3924N6408J25615J4138k9325j18386n4569L6281K0413L0725l820
16124D426929J5150Q7987l4522K1219q0713m338O0333M8733k1738L3736q836j8942
$$ plain form
16112 4524998 4541582 4519782 4495601 4534792 4559874 4557732 4490289 4477932 4463060 4467331 4556939 4582558
16100 4582558 4573805 4544558 4596629 4565691 4568560 4574886 4560193 4586804 4647618 4618479 4652519 4619557
16088 4619557 4589306 4575376 4646270 4687476 4684826 4715196 4679997 4693619 4676121 4600874 4638555
16077 4638555 4730006 4641651 4553657 4602637 4652935 4624954 4675097 4692446 4667620 4651305 4688763
16066 4688763 4723224 4748078 4757596 4683684 4737364 4721696 4718237 4699781 4698250 4662931 4705183 4705311
16054 4705311 4672039 4583149 4575884 4691908 4753067 4737661 4743526 4734953 4749403 4737956 4816831 4786851
16042 4786851 4704048 4748796 4778546 4722460 4663612 4636213 4664500 4716143 4734837 4708344 4681135
16031 4681135 4688920 4684078 4714734 4740794 4785857 4799804 4786902 4730420 4745140 4682421 4701302 4736767
$$ packed form
16112D524998J6584k1800k4181L9191K5082k142o7443j2357j4872M271Q9608K5619
16100D582558q753k9247N2071l0938K869O326j4693K6611O0814k9139L4040l2962
16088D619557l0251j3930P0894M1206k650L0370l5199J3622j7498p5247L7681
16077D638555R1451q8355q7994M8980N0298k7981N0143J7349k4826j6315L7458
16066D688763L4461K4854R518p3912N3680j5668l459j8456j531l5319M2252J28
16054D705311l3272q8890p265J16024O1159j5406N865q573J4450j1447P8875k9980
16042D786851q2803M4748K9750n6086n8848k7399K8287N1643J8694k6493k7209
16031D681135P785m842L0656K6060M5063J3947j2902n6482J4720o2719J8881L5465
$$ plain form
16019 4736767 4719874 4755509 4750841 4736392 4804004 4815496 4777012 4719137 4738244 4718249 4731635
16008 4731635 4652338 4679972 4701558 4743997 4763597 4788522 4748164 4675081 4785629 4782951 4791363
15997 4791363 4814014 4807676 4781577 4786322 4772211 4787255 4782377 4738675 4758686 4775468 4808441 4784055
15985 4784055 4739232 4826637 4769914 4821564 4829820 4889779 4816311 4796514 4803915 4811567 4796967 4762965
15973 4762965 4704001 4640624 4745104 4770388 4791299 4792715 4826597 4845504 4854029 4855321 4864423 4814647
15961 4814647 4745414 4744326 4754613 4746464 4745771 4705389 4699354 4743143 4832632 4761476 4768323 4801576
15949 4801576 4783535 4847265 4792296 4824726 4765456 4760036 4819535 4760663 4804871 4747891 4747373 4846345
15937 4846345 4809821 4821361 4806463 4784584 4852725 4857885 4869334 4858196 4871502 4802219 4814337
$$ packed form
16019D736767j6893L5635m668j4449O7612J1492l8484n7875J9107j9995J3386
16008D731635p9297K7634K1586M2439J9600K4925m0358p3083J10548k678Q412
15997D791363K2651o338k6099M745j4111J5044m878m3702K0011J6782L2973k4386
15985D784055m4823Q7405n6723N1650Q256N9959p3468j9797P401P652j4600l4002
15973D762965n8964o3377J04480K5284K0911J416L3882J8907Q525J292R102m9776
15961D814647o9233j088J0287q149o93m0382o035M3789Q9489p1156O847L3253
15949D801576j8041O3730n4969L2430n9270n420N9499n8872M4208n6980n18R8972
15937D846345l6524J1540j4898k1879O8141N160J1449j1138J3306o9283J2118
$$ plain form
15926 4814337 4806929 4926788 4871970 4875414 4900763 4814427 4743320 4774259 4789167 4774016 4761570
15915 4761570 4768944 4826997 4719396 4790056 4760401 4759821 4806937 4786086 4756469 4712757 4718139 4801290
15903 4801290 4908729 4811696 4726396 4725466 4683385 4797724 4885544 4831278 4838697 4861054 4818397
15892 4818397 4926225 4876206 4786017 4812206 4797551 4847697 4823838 4856201 4842392 4787186 4858209
15881 4858209 4772310 4770831 4846374 4823888 4813148 4817178 4781283 4750378 4884529 4890780 4735709
15870 4735709 4807359 4815919 4802472 4806078 4900597 4869402 4790311 4795696 4801623 4813527 4793883 4783532
15858 4783532 4833370 4851390 4835573 4861962 4853919 4903224 4905396 4787632 4776850 4832914 4760036
15847 4760036 4757164 4731944 4828185 4854073 4872825 4806961 4691821 4706094 4766202 4773094 4840692
$$ packed form
15926D814337p408J19859n4818L444K5349q6336p1107L0939J4908j5151j2446
15915D761570P374N8053j07601P0660k9655n80M7116k0851k9617m3712N382Q3151
15903D801290J07439r7033q5300r30m2081J14339Q7820n4266P419K2357m2657
15892D818397J07828n0019r0189K6189j4655N0146k3859L2363j3809n5206P1023
15881D858209q5899j479P5543k2486j0740M030l5895l0905J34151O251j55071
15870D735709P1650Q560j3447L606R4519l1195p9091N385N927J1904j9644j0351
15858D783532M9838J8020j5817K6389q043M9305K172j17764j0782N6064p2878
15847D760036k872k5220R6241K5888J8752o5864j15140J4273O0108O892O7598
$$ plain form
15836 4840692 4863129 4842130 4914477 4875383 4859307 4924249 4987945 4952573 4879252 4882439 4807082
15825 4807082 4811333 4835077 4873855 4890109 4849048 4819908 4858958 4812120 4845404 4861518 4816315
$$ packed form
15836D840692K2437k0999P2347l9094j6076O4942O3696l5372p3321L187p5357
15825D807082M251K3744L8778J6254m1061k9140L9050m6838L3284J6114m5203
$$ [...]
##END NTUPLES=NMR SPECTRUM
##END=
