##TITLE=1H_CA-8887-5
 CDCl3, 8 sc, 
 2.07.2021
##JCAMPDX= 6.0         $$ Bruker NMR JCAMP-DX V2.0
##DATA TYPE= NMR SPECTRUM
##DATA CLASS= NTUPLES
##ORIGIN= UXNMR, Bruker Analytische Messtechnik GmbH
##OWNER= root
$$ XWIN-NMR		Version 3.5
$$ Fri Jul  2 11:54:23 2021 Russian Standard Time (UT+4h)  she@DPX200
##.OBSERVE FREQUENCY= 200.131506
##.OBSERVE NUCLEUS= ^1H
##.ACQUISITION MODE= SIMULTANEOUS
##.ACQUISITION SCHEME= undefined
##.AVERAGES= 8
##.DIGITISER RES= 18
##SPECTROMETER/DATA SYSTEM= spect
##.PULSE SEQUENCE= zg30
##.SOLVENT NAME= CDCl3
##.SHIFT REFERENCE= (INTERNAL, CDCl3, 0, 17.4959)
##AUDIT TRAIL= $$ (NUMBER, WHEN, WHO, WHERE, WHAT)
$$ ##TITLE= Audit trail, XWIN-NMR		Version 3.5
$$ ##JCAMPDX= 5.01
$$ ##ORIGIN= Bruker BioSpin GmbH
$$ ##OWNER= she
$$ F:/spectra/data/she/nmr/H-F/1/pdata/1/auditp.txt
$$ ##AUDIT TRAIL=  $$ (NUMBER, WHEN, WHO, WHERE, WHAT)
(   1,<2021-07-02 11:53:14.04 +0400>,<she>,<DPX200>,
      <created by zg, POWCHK disabled, PULCHK disabled
       configuration hash MD5:
       00 E9 B6 7A A2 85 ED C7 34 08 36 98 17 FE 4E 26
       data hash MD5: 16K
       81 C7 FF DB 16 93 EA E5 A9 FB 8C 00 DC B4 B9 AE>)
(   2,<2021-07-02 11:53:16.51 +0400>,<she>,<DPX200>,
      <Start of raw data processing
       efp BC_mod = 2 LB = 0.24 FT_mod = 6 PKNL = 1 PHC0 = -11914.34 PHC1 = 13.00099 SI = 16K 
       data hash MD5: 16K
       04 CF 80 5B 59 93 0A 68 26 5F 27 7B 4D 6B 82 D5>)
(   3,<2021-07-02 11:53:34.79 +0400>,<she>,<DPX200>,
      <pk PHC0 = 1.341435 PHC1 = -1.2 
       data hash MD5: 16K
       BE 83 F6 70 08 64 D1 F4 0C A3 2A 0A 11 B7 17 DC>)
(   4,<2021-07-02 11:53:38.21 +0400>,<she>,<DPX200>,
      <abs ABSG = 5 
       data hash MD5: 16K
       A5 14 A9 72 B2 47 86 04 95 A1 3B 3F CB 8D 74 A1>)
$$ ##END=
$$ 
$$ hash MD5
$$ CF 92 7B 19 94 74 EB 5D E9 0F 7F 6B 88 5E F2 0A
##$RELAX= 
##$RELAX= 
##$RELAX= 
##$RELAX= 
##$RELAX= 
##$RELAX= 
$$ Bruker specific parameters
$$ --------------------------
##$DU= <F:/spectra>
##$EXPNO= 1
##$NAME= <H-F>
##$PROCNO= 1
##$TYPE= <nmr>
##$USER= <she>
##$AMP= (0..31)
100 100 100 100 100 100 100 100 100 100 100 100 100 100 100 100 100 100 
100 100 100 100 100 100 100 100 100 100 100 100 100 100 
##$AQSEQ= 0
##$AQ_mod= 1
##$AUNM= <au_zg>
##$AUTOPOS= <>
##$BF1= 200.13
##$BF2= 200.13
##$BF3= 200.13
##$BF4= 200.13
##$BF5= 200.13
##$BF6= 200.13
##$BF7= 200.13
##$BF8= 200.13
##$BYTORDA= 1
##$CFDGTYP= 0
##$CFRGTYP= 5
##$CHEMSTR= <none>
##$CNST= (0..31)
1 1 145 1 1 1 1 1 1 1 1 1 1 1 1 1 1 1 1 1 1 1 1 1 1 1 1 1 1 1 1 1 
##$CPDPRG= <>
##$CPDPRG1= <>
##$CPDPRG2= <>
##$CPDPRG3= <>
##$CPDPRG4= <mlev>
##$CPDPRG5= <mlev>
##$CPDPRG6= <mlev>
##$CPDPRG7= <mlev>
##$CPDPRG8= <mlev>
##$CPDPRGB= <>
##$CPDPRGT= <>
##$D= (0..31)
0 1.2 0 0 0 0 0 0 0 0.06 0 0.03 0 0 0 0 0.0002 0 0 0 0 0 0 0 0 0 0 0 0 
0 0 0 
##$DATE= 1625212393
##$DBL= (0..7)
120 120 120 120 120 120 120 120 
##$DBP= (0..7)
150 150 150 150 150 150 150 150 
##$DBP07= 0
##$DBPNAM0= <>
##$DBPNAM1= <>
##$DBPNAM2= <>
##$DBPNAM3= <>
##$DBPNAM4= <>
$$ [...]
##$SUBNAM3= <"">
##$SUBNAM4= <"">
##$SUBNAM5= <"">
##$SUBNAM6= <"">
##$SUBNAM7= <"">
##$SUBNAM8= <"">
##$SUBNAM9= <"">
##$SW= 20.0188882624521
##$SWIBOX= (0..15)
0 0 2 0 0 0 0 0 0 0 0 0 0 0 0 0 
##$SW_h= 4006.41025641026
##$TD= 16384
##$TD0= 1
##$TE= 0
##$TE2= 300
##$TE3= 300
##$TEG= 300
##$TL= (0..7)
0 120 120 120 120 120 120 120 
##$TP= (0..7)
150 150 150 150 150 150 150 150 
##$TP07= 0
##$TPNAME0= <>
##$TPNAME1= <>
##$TPNAME2= <>
##$TPNAME3= <>
##$TPNAME4= <>
##$TPNAME5= <>
##$TPNAME6= <>
##$TPNAME7= <>
##$TPOAL= (0..7)
0.5 0.5 0.5 0.5 0.5 0.5 0.5 0.5 
##$TPOFFS= (0..7)
0 0 0 0 0 0 0 0 
##$TUNHIN= 0
##$TUNHOUT= 0
##$TUNXOUT= 0
##$USERA1= <user>
##$USERA2= <user>
##$USERA3= <user>
##$USERA4= <user>
##$USERA5= <user>
##$V9= 5
##$VALIST= <valist>
##$VCLIST= <CCCCCCCCCCCCCCC>
##$VD= 0
##$VDLIST= <DDDDDDDDDDDDDDD>
##$VPLIST= <PPPPPPPPPPPPPPP>
##$VTLIST= <TTTTTTTTTTTTTTT>
##$WBST= 1024
##$WBSW= 4
##$XGAIN= (0..3)
0 0 0 0 
##$XL= 0
##$YL= 0
##$YMAX_a= 110143
##$YMIN_a= -146985
##$ZGOPTNS= <>
##$ZL1= 120
##$ZL2= 120
##$ZL3= 120
##$ZL4= 120
##$ABSF1= 17.51177
##$ABSF2= -2.507269
##$ABSG= 5
##$ABSL= 3
##$ALPHA= 0
##$AQORDER= 0
##$ASSFAC= 0
##$ASSFACI= 0
##$ASSFACX= 0
##$ASSWID= 0
##$AUNMP= <proc_1d>
##$AZFE= 0.1
##$AZFW= 0.1
##$BCFW= 0
##$BC_mod= 2
##$BYTORDP= 0
##$COROFFS= 0
##$CY= -3
##$DATMOD= 1
##$DC= 0
##$DFILT= <>
##$DTYPP= 0
##$F1P= 0
##$F2P= 0
##$FCOR= 1
##$FTSIZE= 16384
##$FT_mod= 6
##$GAMMA= 0
##$GB= 0
##$INTBC= 1
##$INTSCL= 1.334414e-10
##$ISEN= 128
##$LB= 0.24
##$LEV0= 0
##$LPBIN= 0
##$MAXI= 10000
##$MC2= 0
##$MEAN= 0
##$ME_mod= 0
##$MI= 1.114404
##$NCOEF= 0
##$NC_proc= -8
##$NLEV= 6
##$NOISF1= 3.799351
##$NOISF2= 2.8
##$NSP= 0
##$NTH_PI= 0
##$NZP= 0
##$OFFSET= 17.49589
##$PC= 1
##$PHC0= -11913
##$PHC1= 11.80099
##$PH_mod= 1
##$PKNL= yes
##$PPARMOD= 0
##$PSCAL= 0
##$PSIGN= 0
##$REVERSE= no
##$SF= 200.130007753186
##$SI= 16384
##$SIGF1= 3
##$SIGF2= 2
##$SINO= 5.538805
##$SIOLD= 16384
##$SREGLST= <1H.CDCl3>
##$SSB= 0
##$STSI= 16384
##$STSR= 0
##$SW_p= 4006.41025641026
##$SYMM= 0
##$S_DEV= 0
##$TDeff= 16384
##$TDoff= 0
##$TI= <>
##$TILT= no
##$TM1= 0
##$TM2= 0
##$TOPLEV= 0
##$USERP1= <user>
##$USERP2= <user>
##$USERP3= <user>
##$USERP4= <user>
##$USERP5= <user>
##$WDW= 1
##$XDIM= 16384
##$YMAX_p= 513602792
##$YMIN_p= -1141992
$$ End of Bruker specific parameters
$$ ---------------------------------
##NTUPLES= NMR SPECTRUM
##VAR_NAME=  FREQUENCY,     SPECTRUM/REAL,   SPECTRUM/IMAG
##SYMBOL=    X,             R,               I
##VAR_TYPE=  INDEPENDENT,   DEPENDENT,       DEPENDENT
##VAR_FORM=  AFFN,          ASDF,            ASDF
##VAR_DIM=   16384,         16384,           16384
##UNITS=     HZ,            ARBITRARY UNITS, ARBITRARY UNITS
##FACTOR=    0.24454680195387, 1,            1
##FIRST=     3501.45253404443, 0,            0
##LAST=      -504.957722365835, 0,           0
##MIN=       -504.957722365835, -1141992,    0
##MAX=       3501.45253404443, 513602792,    0
$$ Real data points
##PAGE= N=1
##DATA TABLE= (X++(R..R)), XYDATA
$$ [...]
$$ plain form
6727 29102 -207439 -129026 -191984 788 217910 161865 -26836 -38930 301527 443790 303352
6716 303352 389186 274263 266272 5465 -99673 -244395 350368 44118 35538 -110316 -133940
6705 -133940 92856 106789 219298 181847 250821 303197 -357791 -465418 -211177 -222134 -114446
6694 -114446 -231414 -1530 164012 228634 39937 115970 6711 25321 602128 259425
6684 259425 -339322 -279925 -116650 324722 486886 342940 264173 241533 98102 -11415
6674 -11415 466333 550239 171992 -170069 21637 184818 -257896 18175 417239 312132
6664 312132 -225787 -43308 47776 -227447 32232 300627 234842 158667 270467 580754
6654 580754 548012 384639 313041 486438 491032 444509 600195 491552 750481 689253 770282
$$ packed form
6727B9102k36541P8413o2958J92772K17122n6045j88701j2094L40457J42263j40438
6716C03352Q5834j14923p991k60807j05138j44722N94763l06250q580j45854k3624
6705a33940K26796J3933J12509l7451O8974N2376o60988j07627K54241j0957J07688
6694a14446j16968K29884J65542O4622j88697P6033j09259J8610N76807l42703
6684B59425n98747N9397J63275M41372J62164j43946p8767k2640j43431j09517
6674a1415M77748Q3906l78247l42061J91706J63181m42714K76071L99064j05107
6664C12132n37919J82479R1084k75223K59679K68395o5785p6175J11800L10287
6654E80754l2742j63373p1598J73397M594m6523J55686j08643K58929o1228Q1029
$$ plain form
6643 770282 483507 736621 849573 905278 1174806 1407352 1342828 1047258 796215 680472
6633 680472 990735 1069949 1260562 1635969 1494292 1502358 1942805 1642812 1451674 1722346
6623 1722346 1635566 1590949 2060915 1947948 2030316 2199719 2594648 2767305 2771878 3052285
6613 3052285 4018083 4375748 3905286 3977980 4299572 4668033 5209745 5249713 5044272 5341875
6603 5341875 5185749 5331140 5577168 6061639 6208690 6354636 6968843 7344690 7955761 8639797
6593 8639797 8521629 8839035 8836958 8230088 7155528 7171398 7197416 7005880 7378420 7299566
6583 7299566 7472347 7605222 8085280 8502827 8805992 9212359 9906654 10562227 11534576 12570502
6573 12570502 13938490 15388039 16833781 18367685 19879378 21294932 22582811 23853289
$$ packed form
6643G70282k86775K53114J12952N5705K69528K32546o4524k95570k51043j15743
6633F80472L10263P9214J90613L75407j41677Q066M40447k99993j91138K70672
6623A722346q6780m4617M69966j12967Q2368J69403L94929J72657M573K80407
6613C052285R65798L57665m70462P2694L21592L68461N41712L9968k05441K97603
6603E341875j56126J45391K46028M84471J47051J45946O14207L75847O11071O84036
6593H639797j18168L17406k077o06870j074560J5870K6018j91536L72540p8854
6583G299566J72781J32875M80058M17547L03165M06367O94295O55573R72349J035926
6573A2570502J367988J449549J445742J533904J511693J415554J287879J270478
$$ plain form
6565 23853289 24979649 25062168 25018395 25206658 25276807 25220440 25338015 25207657 25294724 24950534
6555 24950534 24376006 23249401 22255705 21166349 19104341 16928228 15254866 13784117
6547 13784117 12178554 10879974 10504491 9646541 8777366 8272856 7517677 6358364 6637463
6538 6637463 6642819 6173533 5764035 5294591 5782671 5062241 4620938 4153224 3649694 3795091
6528 3795091 3568117 3609969 3786081 2989405 2816841 3058858 3088071 3010900 2984471 2678854
6518 2678854 2292691 2406864 2432925 1938365 1620388 1791401 2037230 1686767 1817884 2258943
6508 2258943 1671769 1389052 1231319 1444056 1448189 1361792 1667566 1205673 1097340 1215899
6498 1215899 1227078 1165605 814878 1089956 1191986 870202 1102630 637721 873222 889982
$$ packed form
6565B3853289J126360Q2519m3773J88263P0149n6367J17575j30358Q7067l44190
6555B4950534n74528j126605r93696j089356k062008k176113j673362j470749
6547A3784117j605563j298580l75483q57950q69175n04510p55179j159313K79099
6538F637463N356m69286m09498m69444M88080p20430m41303m67714n03530J45397
6528C795091k26974M1852J76112p96676j72564K42017K9213p7171k6429l05617
6518B678854l86163J14173K6061m94560l17977J71013K45829l50463J31117M41059
6508B258943n87174k82717j57733K12737M133q6397L05774m61893j08333J18559
6498A215899J1179o1473l50727K75078J02030l21784K32428m64909K35501J6760
$$ plain form
6488 889982 728287 348351 169379 544921 696841 580823 798514 1145265 1259297 898377
6478 898377 712454 766397 904149 315974 613576 186522 543941 431267 45824 368081
6468 368081 350544 349721 480263 479783 266290 447300 5134 201874 373995 253782 26461
6457 26461 427921 456653 393003 237574 -259862 126791 350605 -97254 286976 228145
6447 228145 267155 270317 590364 563912 817770 395962 409971 527484 584945 296070 88535
6436 88535 5166 -103814 225589 43006 -41618 -317019 -76852 -131264 40776 35830 85289
6425 85289 137842 41035 165917 48936 -288775 -90531 233483 297665 548121 201533
6415 201533 -3310 464224 31742 27180 252670 -60537 400084 515536 675966 304899
$$ packed form
6488H89982j61695l79936j78972L75542J51920j16018K17691L46751J14032l60920
6478H98377j85923N3943J37752n88175K97602m27054L57419j12674l85443L22257
6468C68081j7537q23J30542m80k13493J81010m42166J96740J72121j20213k27321
6457B6461M01460K8732o3650j55429m97436L86653K23814m47859L84230n8831
6447B28145L9010L162L20047k6452K53858m21808J4009J17513N7461k88875k07535
6436H8535q3369j08980L29403j82583q4624k75401K40167n4412J72040m946M9459
6425H5289N2553r6807J24882j16981l37711J98244L24014O4182K50456l46588
6415B01533k04843M67534m32482m562K25490l13207M60621J15452J60430l71067
$$ plain form
6405 304899 105937 241811 309617 356322 224187 368380 -282340 -40407 -292824 -393979
6395 -393979 -165191 -233011 233314 161806 -226940 -480915 -108100 74588 -127480 -371032
6385 -371032 -290082 -261918 -271854 -83539 128573 -182675 -172414 600172 43751 -307198 436564
6374 436564 688827 207274 -76812 241821 -219878 -294276 -112722 -338945 -396748 -553565
6364 -553565 -340799 -42675 -49269 -143030 -651559 -563428 -432763 52978 -113869 -568856
6354 -568856 34962 313983 78118 396314 156469 461278 1126274 106828 -75903 -145001
6344 -145001 117280 234611 283184 332606 315076 -4661 -387413 -404732 -270568 255086
6334 255086 329838 -83810 -301540 472389 489116 229207 131478 -3050 112523 -73214
$$ packed form
6405C04899j98962J35874O7806M6705j32135J44193o50720K41933k52417j01155
6395c93979K28788o7820M66325p1508l88746k53975L72815J82688k02068k43552
6385c71032Q0950K8164r936J88315K12112l11248J0261P72586n56421l50949P43762
6374D36564K52263m81553k84086L18633m61699p4398J81554k26223n7803j56817
6364e53565K12766K98124o594r3761n08529Q8131J30665M85741j66847m54987
6354e68856O03818K79021k35865L18196k39845L04809O64996j019446j82731o9098
6344a45001K62281J17331M8573M9422j7530l19737l82752j7319J34164N25654
6334B55086P4752m13648k17730P73929J6727k59909r7729j34528J15573j85737
$$ plain form
6324 -73214 321477 521082 322453 496384 540988 789094 267485 559682 357343 244425
6314 244425 634950 624553 1012407 583535 454607 93452 35942 404881 -160141 -251044
6304 -251044 308258 36751 -409925 150724 531923 142352 -110693 336356 -362894 -457148
6294 -457148 -432725 -86383 65441 -143920 124336 126664 -25547 -261123 -257205 156619 15510
6283 15510 -98378 400599 -252544 -138261 -128527 87297 -50256 57930 167105 189142
6273 189142 426301 668052 224692 224337 -82462 -273821 -3915 212718 38907 172059
6263 172059 -224761 -338111 -201095 185251 228156 -38815 -363516 -738023 -598029 -276737
6253 -276737 590873 759774 11461 48766 117511 230214 480919 773213 512406 117304
$$ packed form
6324g3214L94691J99605j98629J73931M4604K48106n21609K92197k02339j12918
6314B44425L90525j0397L87854m28872j28928l61155n7510L68939n65022r0903
6304b51044N59302k71507m46676N60649L81199l89571k53045M47049o99250r4254
6294d57148K4423L46342J51824k09361K68256K328j52211k35576L918M13824j41109
6283A5510j13888M98977o53143J14283R734K15824j37553J08186J09175K2037
6273A89142K37159K41751m43360l55l06799j91359K69906K16633j73811J33152
6263A72059l96820j13350J37016L86346M2905k66971l24701l74507J39994L21292
6253b76737Q67610J68901p48313L7305O8745J12703K50705K92294k60807l95102
$$ plain form
6243 117304 357300 201643 -22193 61952 -85187 -2167 65511 -199115 325371 -34077
6233 -34077 631514 245168 -122340 468404 817143 481928 445358 111534 123958 234971
6223 234971 -91941 77144 -168286 -266469 6057 378296 -98844 -243674 -642814 -270481
6213 -270481 155081 28250 183756 105350 175823 221849 352740 232626 448613 304680
6203 304680 118307 36857 -217323 495386 681170 469781 978466 723942 734199 191736
6193 191736 83484 212219 -155211 -136591 -302070 -209828 139528 122103 81035 -4474 -79991
6182 -79991 -27904 10367 51872 197981 377560 -14917 -331915 -248923 32057 26359 74975
6171 74975 175085 440319 125235 113941 379100 32827 336457 387460 540623 486892
$$ packed form
6243A17304K39996j55657k23836Q4145j47139Q3020O7678k64626N24486l59448
6233c4077O65591l86346l67508N90744L48739l35215l6570l33824J2424J11013
6223B34971l26912J69085k45430r8183K72526L72239m77140j44830l99140L72333
6213b70481M25562j26831J55506p8406P0473M6026J30891j20114K15987j43933
6203C04680j86373q1450k54180P12709J85784k11389N08685k54524J0257n42463
6193A91736j08252J28735l67430J8620j65479R2242L49356j7425m1068q5509p5517
6182g9991N2087L8271M1505J46109J79579l92477l16998Q2992K80980n698M8616
6171G4975J00110K65234l15084j1294K65159l46273L03630N1003J53163n3731
$$ plain form
6161 486892 29709 55637 447000 247796 108565 -6691 -193271 129770 185412 -165875
6151 -165875 -149631 -231830 -589960 -111805 336601 77463 37222 -205522 -287305 -397594
6141 -397594 84234 243215 470442 622343 511985 348444 197722 521755 294633 413233
6131 413233 -256252 47269 -156195 -375483 412339 470883 284716 -245086 -298871 -158793
6121 -158793 -69695 -186829 -313941 47325 296178 251573 84979 133546 1654 422100
6111 422100 -194409 11539 281074 172302 4250 -106407 -93228 101084 262668 -293061
6101 -293061 -210252 172160 628036 615715 55363 16118 225730 22635 -120998 168791
6091 168791 285903 103644 34986 295080 369477 430225 535348 297101 173533 -73544
$$ packed form
6161D86892m57183K5928L91363j99204j39231j15256j86580L23041N5642l51287
6151a65875J6244q2199l58130M78155M48406k59138m0241k42744q1783j10289
6141c97594M81828J58981K27227J51901j10358j63541j50722L24033k27122J18600
6131D13233o69485L03521k03464k19288P87822N8544j86167n29802n3785J40078
6121a58793Q9098j17134j27112L61266K48853m4605j66594M8567j31892M20446
6111D22100o16509K05948K69535j08772j68052j10657J3179J94312J61584n55729
6101b93061Q2809L82412M55876j2321n60352l9245K09612k03095j43633K89789
6091A68791J17112j82259o8658K60094P4397O0748J05123k38247j23568k47077
$$ plain form
6081 -73544 57771 -58451 413005 500525 95967 -136887 -81081 138970 327454 487424
6071 487424 528455 321367 101333 69191 236578 436106 365976 -143633 202796 54110
6061 54110 280470 -288709 -54299 3166 -87761 205262 -410594 -151878 -215261 -278562 63875
6050 63875 -357493 123495 239661 173252 86127 -311338 -428765 -86300 19661 23429 126755
6039 126755 -172925 -146813 -3336 127168 151004 324241 -348596 -274526 -121670 443882
6029 443882 -70726 -176495 -410421 -204579 144097 177349 187033 399703 363090 454224 93592
6018 93592 -298262 -267748 189182 159452 -161522 -538566 -302283 -410749 -395827 -293469
6008 -293469 -289100 -196413 -25710 151551 28236 45470 191404 498141 528601 97806 197676
$$ packed form
6081g3544J31315j16222M71456Q7520m04558k32854N5806K20051J88484J59970
6071D87424M1031k07088k20034l2142J67387J99528p0130n09609L46429j48686
6061E4110K26360n69179K34410N7465r0927K93023o15856K58716o3383o3301L42437
6050F3875m21368M80988J16166o6409q7125l97465j17427L42465J05961L768J03326
6039A26755k99680K6112J43477J30504K3836J73237o72837P4070J52856N65552
6029D43882n14608j05769k33926K05842L48676L3252R684K12670l6613R1134l60632
6018I3592l91854L0514M56930k9730l20974l77044K36283j08466J4922J02358
6008b93469M369R2687J70703J77261j23315J7234J45934L06737L0460m30795R9870
$$ plain form
5997 197676 246642 39972 191691 162050 -8893 43803 -37093 -130690 372217 137614 199659
5986 199659 117215 10339 155875 98166 -122199 -341366 -392508 112636 243855 306822
5976 306822 19919 205548 42664 59870 232645 75193 159438 28808 -395546 -305137
5966 -305137 -241479 -393924 -450486 -142619 -3597 398815 157925 177212 10084 -259973
5956 -259973 -200940 114941 9418 94716 72260 54541 -289192 -503084 166532 -73271
5946 -73271 335216 417036 -90854 -411862 -217369 -505190 -447299 -397625 -16747 23404 -49467
5935 -49467 217244 103534 -192091 -5476 -137413 -58981 287571 294903 284920 121533 207580
5924 207580 -54592 132334 113766 263377 485129 272314 243405 227728 -470147 -197369
$$ packed form
5997A97676M8966k06670J51719k9641j70943N2696q0896r3597N02907k34603O2045
5986A99659q2444j06876J45536n7709k20365k19167n1142N05144J31219O2967
5976C06822k86903J85629j62884J7206J72775j57452Q4245j30630m24354R0409
5966c05137O3658j52445n6562L07867J39022M02412k40890J9287j67128k70057
5956b59973N9033L15881j05523Q5298k2456j7719l43733k13892O69616k39803
5946g3271M08487Q1820n07890l21008J94493k87821N7891M9674L80878M0151p2871
5935d9467K66711j13710k95625J86615j31937P8432L46552P332r983j63387Q6047
5924B07580k62172J86926j8568J49611K21752k12815k8909j5677o97875K72778
$$ plain form
5914 -197369 359164 360519 -161497 -169494 320149 826722 278548 -2877 43681 207150 230503
5903 230503 348815 267066 123447 359683 423882 113899 71649 273448 157166 75860
5893 75860 244815 16996 -185944 26818 115267 52768 -558448 -535531 -111840 419911
5883 419911 453521 168828 -164952 151657 261035 438740 539545 574928 586036 233541
5873 233541 249246 762918 134349 -272572 115411 233950 201680 234240 246802 135378
5863 135378 7766 409935 348106 223386 247109 632219 239457 -169121 -410867 83522
5853 83522 247963 448188 367983 60504 393028 48864 -103218 -31004 -95037 201232
5843 201232 5191 260681 1173281 586378 326213 100373 203625 386495 16201 96391
$$ packed form
5914a97369N56533J355n22016p997M89643N06573n48174k81425M6558J63469K3353
5903B30503J18312q1749j43619K36236O4199l09983m2250K01799j16282q1306
5893G5860J68955k27819k02940K12762Q8449o2499o11216K2917M23691N31751
5883D19911L3610k84693l33780L16609J09378J77705J00805L5383J1108l52495
5873B33541J5705N13672o28569m06921L87983J18539l2270L2560J2562j11424
5863A35378j27612M02169o1829j24720K3723L85110l92762m08578k41746M94389
5853H3522J64441K00225q0205l07479L32524l44164j52082P2214o4033K96269
5843B01232j96041K55490R12600n86903k60165k25840J03252J82870l70294Q0190
$$ plain form
5833 96391 7281 567887 774367 663574 840980 511807 268254 164556 75149 414251
5823 414251 220142 280309 440709 16633 -282500 -385065 -194082 -119169 209427 -215815
5813 -215815 -153290 204828 374629 685626 869711 602678 646151 575339 535177 177411
5803 177411 188282 382842 -13392 298793 574837 169951 99895 133441 35949 235931
5793 235931 269472 250438 65110 182725 308966 -126608 175572 249967 186975 413961
5783 413961 624748 434878 100521 58672 -197786 -136196 -46592 115195 -225841 -580253
5773 -580253 -661590 -570651 -12094 63637 -179104 110332 161257 299714 228447 64121 529005
5762 529005 356372 35509 257870 453280 2176 25161 364946 189399 122586 -179142
$$ packed form
5833I6391q9110N60606K06480j10793J77406l29173k43553j03698q9407L39102
5823D14251j94109O0167J60400m24076k99133j02565J90983P4913L28596m25242
5813b15815O2525L58118J69801L10997J84085k67033M3473p0812m0162l57766
5803A77411J0871J94560l96234L12185K76044m04886p0056L3546r7492J99982
5793B35931L3541j9034j85328J17615J26241m35574L02180P4395o2992K26986
5783D13961K10787j89870l34357m1849k56458O1590Q9604J61787l41036l54412
5773e80253q1337R0939N58557P5731k42741K89436N0925J38457p1267j64326M64884
5762E29005j72633l20863K22361J95410m51104K2985L39785j75547o6813l01728
$$ plain form
5752 -179142 307663 503122 456552 383097 -63717 119872 -174457 306546 484952 483305
5742 483305 581378 508567 377847 175910 -30204 -259173 296366 535011 642077 794482
5732 794482 534089 418485 78165 185210 354000 -128335 143102 444786 317972 147766
5722 147766 422134 260343 51624 862439 324953 -229395 192867 533762 384507 349986
5712 349986 457222 405582 729422 688357 728358 334268 307257 471529 537485 527463 643544
5701 643544 564595 237807 644006 968090 643088 134134 157584 419707 367487 248232
5691 248232 480864 464797 405059 637976 160044 -41565 72619 105955 682559 779883
5681 779883 253196 133463 377394 255162 194916 69131 190830 -2096 446409 498787
$$ packed form
5752a79142M86805J95459m6570p3455m46814J83589k94329M81003J78406j647
5742D83305R8073p2811j30720k01937k06114k28969N55539K38645J07066J52405
5732G94482k60393j15604l40320J07045J68790m82335K71437L01684j26814j70206
5722A47766K74368j61791k08719Q10815n37486n54348M22262L40895j49255l4521
5712C49986J07236n1640L23840m1065M0001l94090k7011J64272O5956j0022J16081
5701F43544p8949l26788M06199L24084l25002n08954K3450K62123n2220j19255
5691B48232K32632j6067n9738K32917m77932k01609J14184L3336N76604R7324
5681G79883n26687j19733K43931j22232o0246j25785J21699j92926M48505N2378
$$ plain form
5671 498787 543283 260951 689293 521427 580744 1111044 886997 981328 1302452 1152357
5661 1152357 491426 448073 2157 585579 544411 764945 1034335 1488893 1420307 783747
5651 783747 695355 806277 627148 911113 985291 638834 868192 574167 757465 578779
5641 578779 469311 487956 495638 810875 624635 831102 225329 402466 739487 417652
5631 417652 546998 701727 599447 765909 1032260 931224 495039 781627 1143570 543754
5621 543754 764173 911472 586550 579496 468929 564612 545282 446395 443836 318483 474167
5610 474167 394608 296039 828150 713584 1064712 967569 556014 906883 340513 405179
5600 405179 838070 1073353 537062 765655 406003 827114 1202619 1054744 599363 236397
$$ packed form
5671D98787M4496k82332M28342j67866N9317N30300k24047R4331L21124j50095
5661A152357o60931m3353m45916N83422m1168K20534K69390M54558o8586o36560
5651G83747q8392J10922j79129K83965P4178l46457K29358k94025J83298j78686
5641E78779j09468J8645P682L15237j86240K06467o05773J77137L37021l21835
5631D17652J29346J54729j02280J66462K66351j01036m36185K86588L61943n99816
5621E43754K20419J47299l24922p054j10567R5683j9330r8887k559j25353J55684
5610D74167p9559r8569N32111j14566L51128r7143m11555L50869n66370O4666
5600D05179M32891K35283n36291K28593l59652M21111L75505j47875m55381l62966
$$ plain form
5590 236397 906899 1204518 1127506 1152597 1286537 1030190 1119175 1165014 1142199 844070 1228338
5579 1228338 1322691 1009267 936769 1201971 1219951 1154269 672242 1049342 1263061 1136489
5569 1136489 1420623 1728788 991178 976115 1391298 1147025 1511935 1691647 1680867 2072053
5559 2072053 1755709 1343884 1257113 1320349 1751378 1951778 1811456 1816050 1967671 1854743
5549 1854743 1861330 2300925 2130731 1746504 1936125 1634829 1944997 2324591 2593197 2462704
5539 2462704 2375474 2647054 2774335 2934326 2953851 3031811 2630420 2326734 2482897 2706175
5529 2706175 2602477 2790693 2746966 3082351 3145431 2863121 2908318 2902989 3738708 3780027 3837603
5518 3837603 3680251 3607690 3458467 3514349 3928280 4024441 4277558 4881281 4690304 4886748
$$ packed form
5590B36397O70502K97619p7012K5091J33940k56347Q8985M5839k2815k98129L84268
5579A228338R4353l13424p2498K65202J7980o5682m82027L77100K13719j26572
5569A136489K84134L08165p37610j5063M15183k44273L64910J79712j0780L91186
5559B072053l16344m11825q6771O3236M31029K00400j40322M594J51621j12928
5549A854743O587M39595j70194l84227J89621l01296L10168L79594K68606j30493
5539B462704q7230K71580J27281J59991J9525P7960m01391l03686J56163K23278
5529B706175j03698J88216m3727L35385O3080k82310M5197n329Q35719M1319N7576
5518C837603j57352p2561j49223N5882M13931R6161K53117O03723j90977J96444
$$ plain form
5508 4886748 4530989 4762837 4768080 4591593 5554552 6128898 6131209 6239415 6353855 7200508
5498 7200508 7819364 8350391 8912386 9449453 10269666 10506475 11227450 11832751 12299206 12287333
5488 12287333 12266072 11953773 11101158 10527541 10264805 9946422 8714800 8329455 8185449
5479 8185449 7633259 7323692 6534470 6401262 6246037 6211490 6462052 6299306 5906511 5591295
5469 5591295 5849364 5620366 5586351 5208788 5275730 5267028 5232310 4697637 4444333 4122664
5459 4122664 3798297 4291580 3934746 4164707 4124360 4425963 4292967 4458000 4539730 4594138
5449 4594138 4215042 3902484 4246406 4111412 3999422 4042969 4272425 4112860 4242555 4542975
5439 4542975 4191343 4549957 4444247 4109749 4508973 4521324 4476728 4719098 5008885 4802290
$$ packed form
5508D886748l55759K31848N243j76487R62959N74346K311J08206J14440Q46653
5498G200508O18856N31027N61995N37067Q20213K36809P20975O05301M66455j1873
5488A2287333k1261l12299q52615n73617k62736l18383j231622l85345j44006
5479H185449n52190l09567p89222j33208j55225l4547K50562j62746l92795l15216
5469E591295K58069k28998l4015l77563O6942q702l4718n34673k53304l21669
5459D122664l24367M93283l56834K29961m0347L01603j32996J65033Q1730N4408
5449D594138l79096l12558L43922j34994j11990M3547K29456j59565J29695L00420
5439D542975l51632L58614j05710l34498L99224J2351m4596K42370K89787k06595
$$ plain form
5429 4802290 5080401 5312252 5205834 5401964 5567391 6103045 5830836 5821523 5683106 5802981
5419 5802981 5796117 6176155 6202845 6180197 6131800 6222348 6365120 6770830 7540812 7314870 7188552
5408 7188552 7673881 7843572 7958190 8322341 8617288 8802837 8660008 8883606 8850830 9225955
5398 9225955 9898984 10083994 10524271 11047639 11752494 12874918 13281720 14143922 15202995
5389 15202995 15818758 16639167 17818827 18712448 19227457 20058181 20663912 21174675 21777422
5380 21777422 22084558 22682051 23517811 23789850 23983112 24464894 24902738 25375811 26483031
5371 26483031 27429186 28842388 30395630 31606042 33423422 34266844 35169920 35970162 36634486
5362 36634486 37226192 37502517 37000992 36133834 34912253 32966399 31457532 30382442 29480101
$$ packed form
5429D802290K78111K31851j06418J96130J65427N35654k72209r313j38417J19875
5419E802981o864L80038K6690k2648m8397R0548J42772M05710P69982k25942j26318
5408G188552M85329J69691J14618L64151K94947J85549j42829K23598l2776L75125
5398I225955O73029J85010M40277N23368P04855J122424M06802Q62202J059073
5389A5202995O15763Q20409J179660Q93621N15009Q30724O05731N10763O02747
5380B1777422L07136N97493Q35760K72039J93262M81782M37844M73073J107220
5371B6483031R46155J413202J553242J210412J817380Q43422R03076Q00242O64324
5362C6634486N91706K76325n01525q67158j221581j945854j508867j075090r02341
$$ plain form
5353 29480101 28442102 27527733 26746925 26257981 26032604 26311323 26716741 26732047 26760376 27085768
5343 27085768 26862915 26513290 26541905 26756510 25966781 24502933 23114795 22088370 21279682
5334 21279682 20483252 19816055 19196162 19147089 19043021 18491362 18248134 18374454 17932518 17469315
5324 17469315 17647052 17496502 16683989 16730144 16525298 15957288 15756623 15653087 14945678 14536620
5314 14536620 14993814 15232114 15053526 15558195 16042116 16093489 15917794 15537528 15237834 15688048
5304 15688048 15443296 15216123 15113365 14973022 14618419 14329399 14322170 13869047 13317923 13593385
5294 13593385 13459909 13276279 13171871 12676676 12414857 12354740 12354914 12106355 12253378 12038610
5284 12038610 11980551 11393365 11625709 11436579 11006565 10715447 10559684 10036004 10077556 10056621
$$ packed form
5353B9480101j037999r14369p80808m88944k25377K78719M05418J5306K8329L25392
5343B7085768k22853l49625K8615K14605p89729j463848j388138j026425q08688
5334B1279682p96430o67197o19893m9073j04068n51659k43228J26320m41936m63203
5324A7469315J77737j50550q12513M6155k04846n68010k00665j03536p07409m09058
5314A4536620M57194K38300j78588N04669M83921N1373j75695l80266k99694M50214
5304A5688048k44752k27173j02758j40343l54603k89020p229m53123n51124K75462
5294A3593385j33476j83630j04408m95195k61819o0117J74k48559J47023k14768
5284A2038610n8059n87186K32344j89130m30014k91118j55763n23680M1552k0935
$$ plain form
5274 10056621 9796331 9818525 10066619 10024693 10115837 10065483 9502322 9656718 9452562 9315091
5264 9315091 9351265 8894105 8500368 8586335 8215662 7605342 7724435 7081317 6828436 7509391
5254 7509391 7723125 7466733 7024509 7364027 7648462 7713793 7287214 6898082 6652201 6670530
5244 6670530 6471028 6455432 6537048 6359648 5981742 5444616 5170567 5204469 5176303 5406069
5234 5406069 4987402 4630786 4335916 4555499 4933700 5225797 4969516 4951017 4963795 4437159
5224 4437159 4464461 4666995 4393527 3805074 3518610 3817314 3911156 4367389 4338588 3910358
5214 3910358 3965485 4293206 4381997 4455259 4293385 4065174 4141949 4442254 4396789 4347145 4616720
5203 4616720 4004597 3803012 3700045 4226725 4418306 4613301 4350212 4281064 4306160 4547083
$$ packed form
5274A0056621k60290K2194K48094m1926R1144n0354n63161J54396k04156j37471
5264I315091L6174m57160l93737Q5967l70673o10320J19093o43118k52881O80955
5254G509391K13734k56392m42224L39518K84435O5331m26579l89132k45881J8329
5244F670530j99502j5596Q1616j77400l77906n37126k74049L3902k8166K29766
5234E406069m18667l56616k94870K19583L78201K92097k56281j8499J2778n26636
5224D437159K7302K02534k73468n88453k86464K98704R3842M56233k8801m28230
5214C910358N5127L27721Q8791P3262j61874k28211P6775L00305m5465m9644K69575
5203D616720o12123k01585j02967N26680J91581J94995k63089o9148K5096K40923
$$ plain form
5193 4547083 4850334 4994212 5073108 5281233 4414237 4795697 4567115 4321166 4551469 4675725
5183 4675725 4901011 4814100 5060634 4846228 4576976 4835685 5242593 5293239 5050992 5425659
5173 5425659 5372203 5298511 5395116 5179077 4814776 4383409 5016408 4709745 5156121 5096686
5163 5096686 5175457 5180319 5348213 5626159 5161168 5376796 4959452 4951524 5582762 5221345
5153 5221345 5000170 5538434 5896947 5792802 5770339 4930166 4851293 4914587 4941372 4824121
5143 4824121 4921254 4823112 4676405 5110494 5003796 4840238 4618726 4812111 4919808 4894639
5133 4894639 4415540 4789087 4726851 4780712 4830023 4851516 4963681 4405848 4224411 4498232
5123 4498232 5130948 4951572 5037942 5240264 4848690 4976788 4718856 4850748 4865664 4726304
$$ packed form
5193D547083L03251J43878P8896K08125q66996L81460k28582k45949K30303J24256
5183D675725K25286q6911K46534k14406k69252K58709M06908N0646k42247L74667
5173E425659n3456p3692R6605k16039l64301m31367O32999l06663M46376n9435
5163E096686P8771M862J67894K77946m64991K15628m17344p928O31238l61417
5153E221345k21175N38264L58513j04145k2463q40173p8873O3294K6785j17251
5143D824121R7133r8142j46707M34089j06698j63558k21512J93385J07697k5169
5133D894639m79099L73547o2236N3861M9311K1493J12165n57833j81437K73821
5123D498232O32716j79376Q6370K02322l91574J28098k57932J31892J4916j39360
$$ plain form
5113 4726304 4345837 4338396 4409238 4121263 4247194 4519346 4486547 4200624 4328561 4424208
5103 4424208 4231986 4529924 4726965 4659481 4611401 4322406 4570520 4668556 4974687 5336141
5093 5336141 5756709 5534354 5643532 5833482 5708575 5709309 5687122 5777160 6199137 6857757
5083 6857757 7355442 8043822 7532491 7200009 7210998 7557654 8232124 7849427 7372210 7990205
5073 7990205 7952986 7540771 7717904 7963685 8005265 8473437 8960714 8985241 8855257 8958365
5063 8958365 9377607 9181027 8600320 8367863 8157202 7510285 7750607 7313978 6976756 7072934
5053 7072934 6991574 6958437 6715771 6662376 6515253 6514605 6489748 6142320 5933751 5785186 6255009
5042 6255009 6102448 6449872 6606565 6090900 6167149 6860109 6728863 6579052 6615570 6582808
$$ packed form
5113D726304l80467p441P0842k87975J25931K72152l2799k85923J27937R5647
5103D424208j92222K97938J97041o7484m8080k88995K48114R8036L06131L61454
5093E336141M20568k22355J09178J89950j24907P34k2187R0038M21977O58620
5083F857757M97685O88380n11331l32482J0989L46656O74470l82697m77217O17995
5073G990205l7219m12215J77133K45781M1580M68172M87277K4527j29984J03108
5063H958365M19242j96580n80707k32457k10661o46917K40322m36629l37222R6178
5053G072934q1360l3137k42666n3395j47123o48k4857l47428k08569j48565M69823
5042F255009j52561L47424J56693n15665P6249O92960j31246j49811L6518l2762
$$ plain form
5032 6582808 6473022 6998513 6880899 6840634 6650447 6886178 6928507 6711421 6550613 6479742
5022 6479742 6475763 6569525 6827432 6609551 6531981 6562099 6572707 6566468 6879022 6940945 7295982
5011 7295982 7445096 7217415 7304278 7178332 6754013 7324659 7743465 7491358 7242268 7177592
5001 7177592 7201820 7964841 7860932 7527157 7175812 7382330 7439886 7568788 8270262 8029815
4991 8029815 8059614 8660544 8627418 8657768 8659036 8791907 9008509 9236361 9301442 9632008 9945759
4980 9945759 9518162 10243689 10586242 10414865 10915285 11046987 11284451 11593069 12121269 12599995
4970 12599995 12920647 13044742 13899586 14525890 14522428 15100878 15079678 15128090 15441523 15037531
4960 15037531 14810683 14331691 14735586 15437329 15719002 16238124 16367038 16810765 16976915
$$ packed form
5032F582808j09786N25491j17614m0265j90187K35731M2329k17086j60808p0871
5022F479742l979R3762K57907k17881p7570L0118J0608o239L12554O1923L55037
5011G295982J49114k27681Q6863j25946m24319N70646M18806k52107k49090o4676
5001G177592K4228P63021j03909l33775l51345K06518N7556J28902P01474k40447
4991H029815K9799O00930l3126L0350J268J32871K16602K27852O5081L30566L13751
4980I945759m27597P25527L42553j71377N00420J31702K37464L08618N28200M78726
4970A2599995L20652J24095Q54844O26304l462N78450k1200M8412L13433m03992
4960A5037531k26848m78992M03895P01743K81673N19122J28914M43727J66150
$$ plain form
4951 16976915 17544254 18334219 18489823 18625797 18414975 19058877 18851435 18635360 18335073
4942 18335073 18941235 19266893 19050668 18972943 19068853 19740968 19948616 20537118 20791850 21119011
4932 21119011 21768430 22332325 22638624 23069628 23559702 24161034 25109489 25343124 26055830
4923 26055830 26475552 27162696 27588386 28718876 29434864 30109307 30994672 32089397 33197629
4914 33197629 33821569 34985137 36471920 37820727 38626775 40149091 41528191 43172203
4906 43172203 45041255 46995695 48936014 50854578 53082525 55357586 57278273 59676529
4898 59676529 62318798 65250915 68407387 71268700 74353354 77719390 81067877 84892329
4890 84892329 88672898 92503418 96063342 100106944 103863845 107480440 110447110 112962538
$$ packed form
4951A6976915N67339P89965J55604J35974k10822O43902k07442k16075l00287
4942A8335073O06162L25658k16225p7725R5910O72115K07648N88502K54732L27161
4932B1119011O49419N63895L06299M31004M90074O01332R48455K33635P12706
4923B6055830M19722O87144M25690J130490P15988O74443Q85365J094725J108232
4914C3197629O23940J163568J486783J348807Q06048J522316J379100J644012
4906D3172203J869052J954440J940319J918564K227947K275061J920687K398256
4898E9676529K642269K932117L156472K861313L084654L366036L348487L824452
4890H4892329L780569L830520L559924M043602L756901L616595K966670K515428
$$ plain form
4882 112962538 115611328 117873626 119277479 120423543 120691611 120401090 119752747 118403965
4874 118403965 116427867 113656412 110930295 107850284 104358408 100635786 97152267 93075351
4866 93075351 89091485 85828065 82020622 78461081 75010389 71726867 68378521 65753463
4858 65753463 62968700 60773311 58074737 55965366 53599100 51477503 49285002 47611956
4850 47611956 46047241 44572947 42764800 40902198 39689941 38178308 36946612 35564279
4842 35564279 34889526 33580851 32038028 30939101 30118717 29198680 28329721 28177473 27371865
4833 27371865 26259254 25616111 24971123 24252538 23941920 23341238 22300666 21373922 21290702
4824 21290702 21369864 20784439 20513147 19604838 19158593 19107821 18796794 17882500 17513673 17621189
$$ packed form
4882A12962538K648790K262298J403853J146064K68068k90521o48343j348782
4874A18403965j976098k771455k726117l080011l491876l722622l483519m076916
4866I3075351l983866l263420l807443l559541l450692l283522l348346k625058
4858F5753463k784763k195389k698574k109371k366266k121597k192501j673046
4850D7611956j564715j474294j808147j862602j212257j511633j231696j382333
4842C5564279o74753j308675j542823j098927q20384r20037q68959j52248q05608
4833B7371865j112611o43143o44988p18585l10618o00682j040572r26744q3220
4824B1290702P9162n85425k71292r08309m46245n0772l11027r14294l68827J07516
$$ plain form
4814 17621189 17084281 17118445 16848005 16491620 16043660 15518978 15669687 14893257 14108759 14061582
4804 14061582 14021393 13819293 14021678 13224614 12857723 12474107 12630212 12701958 12407118 12437378
4794 12437378 12101487 11949340 11767546 11552469 10761140 10341930 10275856 10676073 10032100 10151094
4784 10151094 10205888 9687955 9820372 9919715 9961241 9679354 9701338 9400387 9391740 9172688
4774 9172688 9144245 9361893 9960648 9574042 9385121 8937230 8301528 8520642 8811333 8566859
4764 8566859 8256729 8389339 7936047 8003916 8288255 8310033 8420200 8375712 8432711 8033474
4754 8033474 7754096 8143629 7939049 7696838 8188262 7808551 7644167 7685174 7499767 7039981
4744 7039981 6949612 7044484 7232415 7160835 6988318 6913482 6880102 6608472 6369717 6335961 6149990
$$ packed form
4814A7621189n36908L4164k70440l56385m47960n24682J50709p76430p84498m7177
4804A4061582m0189k02100K02385p97064l66891l83616J56105P1746k94840L0260
4794A2437378l35891j52147j81794k15077p91329m19210o6074M00217o43973J18994
4784A0151094N4794n17933J32417R9343M1526k81887K1984l00951q647k19052
4774I172688k8443K17648N98755l86606j88921m47891o35702K19114K90691k44474
4764H566859l10130J32610m53292O7869K84339K1778J10167m4488N6999l99237
4754H033474k79378L89533k04580k42211M91424l79711j64384M1007j85407m59786
4744G039981r0369R4872J87931p1580j72517p4836l3380k71630k38755l3756j85971
$$ plain form
4733 6149990 5878238 6412593 6269422 6491038 6422992 6184613 6265573 6276789 6686883 6072088
4723 6072088 6419013 6356456 6139736 6293602 6519879 6816248 6630641 6640246 6153970 6128694
4713 6128694 6189167 5938741 6139941 6129980 6304299 6433945 5862803 5798342 6130670 6515835
4703 6515835 6154225 6344015 6532148 6487492 6205458 6274869 6227104 5471983 5097151 5353461
4693 5353461 5965090 5947787 5855767 5747080 5880706 5797595 5371218 5462714 5596252 5782598
4683 5782598 5912044 5713171 5450721 5318331 5860481 5597509 5402429 5486555 5904817 5684099
4673 5684099 5501773 5532534 5823274 5966521 5895086 5757159 5745566 5348030 5674695 5854132
4663 5854132 5829094 6072758 6034222 5702851 5754197 5594472 5138753 5428191 5686126 5421785
$$ packed form
4733F149990k71752N34355j43171K21616o8046k38379Q0960J1216M10094o14795
4723F072088L46925o2557k16720J53866K26277K96369j85607R605m86276k5276
4713F128694O0473k50426K01200r961J74319J29646n71142o4461L32328L85165
4703F515835l61610J89790J88133m4656k82034O9411m7765p55121l74832K56310
4693E353461O11629j7303r2020j08687J33626q3111m26377R1496J33538J86346
4683E782598J29446j98873k62450j32390N42150k62972j95080Q4126M18262k20718
4673E684099j82326L0761K90740J43247p1435j37927j1593l97536L26665J79437
4663E854132k5038K43664l8536l31371N1346j59725m55719K89438K57935k64341
$$ plain form
4653 5421785 6017098 5581702 5561857 5515043 5742081 6401101 6500371 5809013 5736738 5901705
4643 5901705 6126780 5674764 5926570 6414481 6563338 6386350 6595388 7118608 6266341 6169276
4633 6169276 6167608 6237066 6594007 6719563 6721662 6664533 6515719 6884845 7263751 7550381 7491058
4622 7491058 7671259 7703869 7128663 7183632 7380231 7639837 7630106 7322812 7454418 8016969
4612 8016969 7835123 7865114 7984868 7756460 7788325 7662979 7987235 8043369 8109912 8289202
4602 8289202 8224358 7586307 7708584 8102535 8339509 8404309 8414844 8488454 8537919 8805066
4592 8805066 8883790 9071792 9254395 9196471 9382822 9326008 9922404 9798011 9411415 9534922
4582 9534922 9524519 9394244 9946403 10424772 10989824 10681774 10884958 11296554 11120155 10287914
$$ packed form
4653E421785N95313m35396j9845m6814K27038O59020R9270o91358p2275J64967
4643E901705K25075m52016K51806M87911J48857j76988K09038N23220q52267r7065
4633F169276j668O9458L56941J25556K099n7129j48814L69126L78906K86630n9323
4622G491058J80201L2610n75206N4969J96599K59606r731l07294J31606N62551
4612H016969j81846K9991J19754k28408L1865j25346L24256N6134O6543J79290
4602H289202o4844o38051J22277L93951K36974O4800J0535P3610M9465K67147
4592H805066P8724J88002J82603n7924J86351n6814N96396j24393l86596J23507
4582I534922j0403j30275N52159M78369N65052l08050K03184M11596j76399q32241
$$ plain form
4572 10287914 10722243 10957389 10962579 11361188 11402712 11472475 11977066 11733588 11969440 12022056
4562 12022056 12024926 11752480 11727539 11719552 11398940 11577992 11333958 11374206 11437132 11739251 12183294
4551 12183294 11560595 11312149 11281669 11581418 11586464 11155453 11508142 11320445 11160610 11145249
4541 11145249 11566184 11592693 12015965 11764655 11719503 11906725 11956198 12021122 12524297 12858051
4531 12858051 12856136 12781859 12721951 12792259 13490088 13698853 13811277 14110232 14553297 14844512
4521 14844512 15138387 15456997 15113444 15640399 15916739 15794949 15996717 16636149 17139094
4512 17139094 17503789 17385734 17277650 17652067 18003121 18054572 18362993 18845098 19228187 19351684
4502 19351684 19311501 19724333 19871185 20364087 21196184 21251020 21194994 22070357 22335026 22509270
$$ packed form
4572A0287914M34329K35146N190L98609M1524O9763N04591k43478K35852N2616
4562A2022056K870k72446k4941p987l20612J79052k44034M0248O2926L02119M44043
4551A2183294o22699k48446l0480K99749N046m31011L52689j87697j59835j5361
4541A1145249M20935K6509M23272k51310m5152J87222M9473O4924N03175L33754
4531A2858051j915p4277n9908P0308O97829K08765J12424K98955M43065K91215
4521A4844512K93875L18610l43553N26955K76340j21790K01768O39432N02945
4512A7139094L64695j18055j08084L74417L51054N1451L08421M82105L83089J23497
4502A9351684m0183M12832J46852M92902Q32097N4836n6026Q75363K64669J74244
$$ plain form
4492 22509270 23447508 24786592 25881118 27508864 29044146 30535957 32633193 35484637
4484 35484637 38628852 42578412 47120486 51360748 55605362 60314268 64711481 67210892
4476 67210892 65830747 60936154 52878533 44516002 37972478 33577541 30893943 28984019
4468 28984019 28116550 26830355 25376165 24265387 23659305 23282300 23335760 22793862 22327925
4459 22327925 21826284 21570224 21932749 21305981 21851566 21752738 21656133 21649643 21559245 21959067
4449 21959067 22072710 22116460 22385223 22583133 22345183 22917499 23209541 23364996 23708308 24083987
4439 24083987 24569524 25629009 25829548 26411333 27014606 27807591 28791562 30087478 31398754
4430 31398754 33056767 35401341 37651855 40851398 44275224 48353275 52254646 56240353
$$ packed form
4492B2509270R38238J339084J094526J627746J535282J491811K097236K851444
4484C5484637L144215L949560M542074M240262M244614M708906M397213K499411
4476F7210892j380145m894593q057621q362531o543524m394937k683598j909924
4468B8984019q67469j286195j454190j110778o06082l77005N3460n41898m65937
4459B2327925n01641k56060L62525o26768N45585r8828r6605o490r0398L99822
4449B1959067J13643M3750K68763J97910k37950N72316K92042J55455L43312L75679
4439B4083987M85537J059485K00539N81785O03273P92985R83971J295916J311276
4430C1398754J658013K344574K250514L199543L423826M078051L901371L985707
$$ plain form
4422 56240353 60534593 65001415 68940213 69709474 67293431 63953947 57722257 49667631
4414 49667631 43881870 39530797 36490935 34384489 32914810 31415634 30741190 29638591
4406 29638591 28815873 27914147 27165653 27032401 26188092 25391652 24966361 24710182 24203189
4397 24203189 23745519 23741415 23803635 23478064 23351725 22873456 23245851 23296855 23074955 23119354
4387 23119354 23299803 23422132 23618473 23310863 23295569 23590879 23988383 23891004 24159344 24463471
4377 24463471 24781826 24794867 24406425 24639848 24833028 24465351 24146188 23645337 23339936 23267248
4367 23267248 23376010 23645021 23636069 23125545 23359201 23514700 23102440 22614570 22092179 21992849
4357 21992849 21470539 21291145 21509989 21246014 20671797 21081791 20750440 20290142 20043463
$$ packed form
4422E6240353M294240M466822L938798P69261k416043l339484o231690q054626
4414D9667631n785761m351073l039862k106446j469679j499176o74444j102599
4406B9638591q22718r01726p48494j33252q44309p96440m25291k56179n06993
4397B4203189m57670m104O2220l25571j26339m78269L72395N1004k21900M4399
4387B3119354J80449J22329J96341l07610j5294K95310L97504r7379K68340L04127
4377B4463471L18355J3041l88442K33423J93180l67677l19163n00851l05401p2688
4367B3267248J08762K69011q952n10524K33656J55499m12260m87870n22391r9330
4357B1992849n22310j79394K18844k63975n74217M09994l31351m60298k46679
$$ plain form
4348 20043463 19940592 19761224 19881245 19378350 19696773 19573038 19325148 18943105 19097956
4339 19097956 18832667 18507468 18360990 18208100 18380852 18491182 18368098 18087374 17991441 17923116
4329 17923116 17736328 17701366 17796665 17381420 17124057 16736679 16598183 16892408 16875226 16644252
4319 16644252 16800622 17260644 17622168 17657363 17564792 17499284 17587974 17584814 18297767 18237914 18340960
4308 18340960 18422972 18502822 18526984 18269937 18097829 17623443 16818632 16531504 16114111 15835212
4298 15835212 16049775 16243145 15503802 14954166 14734500 14521676 14745983 14204558 14227989 14329163
4288 14329163 14754097 14618326 14661514 14824771 15058680 15165385 15008173 15224042 15598600 16068130
4278 16068130 16357037 16091784 15939502 15775269 15406797 15592799 15244341 14648290 14423267
$$ packed form
4348B0043463j02871j79368J20021n02895L18423j23735k47890l82043J54851
4339A9097956k65289l25199j46478j52890J72752J10330j23084k80724r5933o8325
4329A7923116j86788l4962R5299m15245k57363l87378j38496K94225j7182k30974
4319A6644252J56370M60022L61524L5195r2571o5508Q8690l160P12953n9853J03046
4308A8340960Q2012P9850K4162k57047j72108m74386q04811k87128m17393k78899
4298A5835212K14563J93370p39343n49636k19666k12824K24307n41425K3431J01174
4288A4329163M24934j35771M3188J63257K33909J06705j57212K15869L74558M69530
4278A6068130K88907k65253j52282j64233l68472J86002l48458n96051k25023
$$ plain form
4269 14423267 14010022 13840621 13895290 13951735 13667889 13828323 13854087 13638884 13693308 13799926
4259 13799926 14351949 14435205 13688179 13658278 13973175 14060954 13862931 13656060 13397743 13020705
4249 13020705 13029448 12876656 12665256 12677714 13049740 12945281 12772775 12496868 12753445 12266484
4239 12266484 12265894 12982333 12497270 12237881 12918001 12497218 12484391 12262488 11869817 12116094
4229 12116094 12332984 12411502 12819746 12371632 12019198 11827952 11984595 11386905 11724802 11837375
4219 11837375 11626472 11792699 11686573 11740944 11360559 11440735 11835098 12340117 12325674 12587574
4209 12587574 13003068 13872549 13334186 12910026 12870509 12951949 12874105 12961466 12626183 12644510
4199 12644510 13058017 13378986 13269101 12788716 12692106 12980403 12304217 12048725 11982125 11872341
$$ packed form
4269A4423267m13245j69401N4669N6445k83846J60434K5764k15203N4424J06618
4259A3799926N52023Q3256p47026k9901L14897Q7779j98023k06871k58317l77038
4249A3020705Q743j52792k11400J2458L72026j04459j72506k75907K56577m86961
4239A2266484n90P16439m85063k59389O80120m20783j2827k21903l92671K46277
4229A2116094K16890P8518M08244m48114l52434j91246J56643n97690L37897J12573
4219A1837375k10903J66227j06126N4371l80385Q0176L94363N05019j4443K61900
4209A2587574M15494Q69481n38363m24160l9517Q1440p7844Q7361l35283J8327
4199A2644510M13507L20969j09885m80385r6610K88297o76186k55492o6600j09784
$$ plain form
4189 11872341 11748633 11558499 12098700 11995014 11601136 11900342 12037456 11505513 11382560
4180 11382560 11300500 11447097 11322716 11411996 11386245 11023772 10669861 10679363 10678754 10702930 10508921
4169 10508921 10412120 10232336 10057598 10754964 10973568 10892028 11346228 11311672 11945060 11875555
4159 11875555 11718110 11315842 11483993 11552803 10863471 10937874 11065445 10867053 11065816 10997911
4149 10997911 10636083 10303355 10818622 11401001 11048235 10969177 11004270 11438066 11315361 11404492
4139 11404492 11338853 11486702 11281228 11367071 11331720 11602044 10991300 10910872 11015910 10389444
4129 10389444 10112277 10636820 10662635 10914217 10939665 10810364 10692089 10066122 10314791 10048438
4119 10048438 9278965 8942430 8984854 9011729 8807670 8612113 8579297 8269618 8415797 8400005
$$ packed form
4189A1872341j23708j90134N40201j03686l93878K99206J37114n31943j22953
4180A1382560q2060J46597j24381Q9280k5751l62473l53911R502o09K4176j94009
4169A0508921r6801j79784j74738O97366K18604q1540M54200l4556O33388o9505
4159A1875555j57445m02268J68151O8810o89332P4403J27571j98392J98763o7905
4149A0997911l61828l32728N15267N82379l52766p9058L5093M33796j22705Q9131
4139A1404492o5639J47849k05474Q5843l5351K70324o10744q0428J05038o26466
4129A0389444k77167N24543K5815K51582K5448j29301j18275o25967K48669k66353
4119A0048438p69473l36535M2424K6875k04059j95557l2816l09679J46179j5792
$$ plain form
4109 8400005 8475891 8617427 8595048 8293630 8595210 9003081 8753919 8569667 8866369 8830749
4099 8830749 8484807 8812147 9158632 8782363 8765787 8810957 8179476 8283127 7928534 7983663
4089 7983663 8237156 7763813 7130620 7439286 7551654 7125443 6854308 6504912 6578063 6649613
4079 6649613 6569104 6477393 6747886 7222611 7102678 7130946 7164096 6704379 6651578 6840107
4069 6840107 7489047 7402064 7073747 7356306 7424730 7215912 7739715 7904484 7337797 7321483
4059 7321483 7495729 7580415 7878359 7991508 7914980 7717180 8192532 8118079 8054061 8246623
4049 8246623 8200243 8140619 8556740 9146849 8889488 8310565 8219117 8495411 8479248 8829192
4039 8829192 8365701 8456344 8376168 7844952 8134070 8030217 8108323 8200847 8368403 8604115
$$ packed form
4109H400005P5886J41536k2379l01418L01580M07871k49162j84252K96702l5620
4099H830749l45942L27340L46485l76269j6576M5170o31481J03651l54593N5129
4089G983663K53493m73343o33193L08666J12368m26211k71135l49396P3151P1550
4079F649613q0509r1711K70493M74725j19933K8268L3150m59717n2801J88529
4069F840107O48940q6983l28317K82559O8424k08818N23803J64769n66687j6314
4059G321483J74246Q4686K97944J13149p6528j97800M75352p4453o4018J92562
4049H246623m6380n9624M16121N90109k57361n78923r1448K76294j6163L49944
4039H829192m63491R0643q0176n31216K89118j03853P8106R2524J67556K35712
$$ plain form
4029 8604115 8673096 9095963 9672474 10443089 10629992 11269529 12013575 12318383 13163082 14272702
4019 14272702 15618896 17013254 18285876 19840980 21143998 22104891 23841682 25012637
4011 25012637 24393065 22167039 20078751 18024622 16342199 15226117 14461136 14044877 13382165
4002 13382165 13037309 13281598 13232934 12371470 12076843 11723225 11253189 11303669 11438776 11342013
3992 11342013 11164387 10964600 10829753 10992012 10898865 10571371 10487927 10501657 10323434 10933895
3982 10933895 11371205 11380568 11324693 11543965 11438314 11985339 12396827 12308297 12582026 13069801
3972 13069801 13787409 14304563 14310202 15136200 16235017 16518297 16415240 16815856 17360963 17406900
3962 17406900 17161401 17879806 18058827 17538594 18544779 18937800 19151001 19468267 20050910
$$ packed form
4029H604115O8981M22867N76511P70615J86903O39537P44046L04808Q44699J109620
4019A4272702J346194J394358J272622J555104J303018R60893J736791J170955
4011B5012637o19572k226026k088288k054129j682423j116082p64981m16259o62712
4002A3382165l44856K44289m8664q61464k94627l53618m70036N0480J35107r6763
3992A1342013j77626j99787j34847J62259r3147l27494q3444J3730j78223O10461
3982A0933895M37310R363n5875K19272j05651N47025M11488q8530K73729M87775
3972A3069801P17608N17154N639Q25998J098817K83280j03057M00616N45107M5937
3962A7406900k45499P18405J79021n20233J006185L93021K13201L17266N82643
$$ plain form
3953 20050910 21032449 21875793 22747019 23502206 24296658 25683612 25799661 26550972 28236158
3944 28236158 29222675 30537736 32061807 33170560 35348985 37638769 40194677 42517997
3936 42517997 45000919 47816807 51543098 55622712 60587418 66517741 72655694 80124461
3928 80124461 88077350 97608450 107525392 117651185 127168493 135261942 141042559 145916715
3920 145916715 148338904 147712703 142040310 131374240 118107336 104821244 94078747 85593796
3912 85593796 79559362 74585132 70773878 67357037 64576161 62038116 60191543 58812728
3904 58812728 57349086 56427794 55750368 55247714 55435962 55939659 55487488 55641942 56028186
3895 56028186 56147521 56668185 57596643 58286234 59562049 61473234 63638818 66355213 69146420
$$ packed form
3953B0050910R81539Q43344Q71226P55187P94452J386954J16049P51311J685186
3944B8236158R86517J315061J524071J108753K178425K289784K555908K323320
3936D2517997K482922K815888L726291M079614M964706N930323O137953P468767
3928H0124461P952889R531100R916942J0125793R517308Q093449N780617M874156
3920A45916715K422189o26201n672393j0666070j3266904j3286092j0742497q484951
3912H5593796o034434m974230l811254l416841k780876k538045j846573j378815
3904E8812728j463642r21292o77426n02654J88248N03697m52171J54454L86244
3895E6028186J19335N20664R28458O89591J275815J911185K165584K716395K791207
$$ plain form
3886 69146420 72014922 74910892 78455062 81522645 85689924 90576969 95718754 101285099
3878 101285099 107796831 115569781 124446046 135382871 148972946 164837455 183528660
3871 183528660 205007058 231129418 262449563 298934360 338573055 380984027 422637525
3864 422637525 459028352 489998007 513602792 506637388 454954316 383609017 314482207
3857 314482207 256744714 214467947 185173829 163812361 148468400 135951333 126255065
3850 126255065 118286962 111419694 105026186 100425334 96670280 92979724 90206675 87377138
3842 87377138 85009707 83543586 82542812 78264155 73187154 68154733 64235298 61564218
3834 61564218 59900521 58788097 57346985 56013271 54305229 53094734 51103228 49180391
$$ packed form
3886F9146420K868502K895970L544170L067583M167279M887045N141785N566345
3878A01285099O511732P772950Q876265J0936825J3590075J5864509J8691205
3871A83528660K1478398K6122360L1320145L6484797L9638695M2410972M1653498
3864D22637525L6390827L0969655K3604785o965404n1683072p1345299o9126810
3857C14482207n7737493m2276767k9294118k1361468j5343961j2517067r696268
3850A26255065p968103o867268o393508m600852l755054l690556k773049k829537
3842H7377138k367431j466121j000774m278657n077001n032421l919435k671080
3834F1564218j663697j112424j441112j333714j708042j210495j991506j922837
$$ plain form
3826 49180391 47479500 45724209 44423309 42920485 41673981 41333874 40334749 39587958 38902766
3817 38902766 38398077 37414720 36287860 35781589 35641992 35080958 34594340 34693279 34456386
3808 34456386 34456843 34326414 34267824 34156709 33266073 33203222 33018398 32911847 33015061 32527962
3798 32527962 32337311 31991192 31207980 30420369 30185281 29658770 29754302 29493045 29291253 28940626
3788 28940626 28366544 27910867 26831834 25853385 25281115 24673891 24818992 24094848 23361016
3779 23361016 23126988 22650418 21987502 21128470 20339311 19576810 19387875 19315257 19045704 18389746
3769 18389746 18087375 17859266 17716572 17157065 17276536 16664329 16478773 16184446 15521097
3760 15521097 15434142 14939482 14770727 14474234 14298702 14419241 14680977 15136807 15207039 15458456
$$ packed form
3826D9180391j700891j755291j300900j502824j246504l40107r99125p46791o85192
3817C8902766n04689r83357j126860n06271j39597n61034m86618R8939k36893
3808C4456386M57j30429n8590j11115q90636o2851j84824j06551J03214m87099
3798C2527962j90651l46119p83212p87611k35088n26511R5532k61257k01792l50627
3788B8940626n74082m55677j079033r78449n72270o07224J45101p24144p33832
3779B3361016k34028m76570o62916q59032p89159p62501j88935p2618k69553o55958
3769A8389746l02371k28109j42694n59507J19471o12207j85556k94327o63349
3760A5521097q6955m94660j68755k96493j75532J20539K61736M55830P0232K51417
$$ plain form
3750 15458456 16269329 16205484 15778254 16454054 16847968 16917219 17343090 17575127 18041602 17766991
3740 17766991 17967291 17706088 17170933 16342208 15086861 14544103 13473009 12603046 11578721
3731 11578721 11169973 10711826 10276901 9794492 9159667 8622456 8521134 8635280 7541449
3722 7541449 7326636 7632085 7046121 6792764 7104371 6893945 6532804 6364212 6504547 6542750
3712 6542750 6627751 6453614 5890647 5386932 6090727 5755406 5377266 5639332 5531483 5847612
3702 5847612 5594714 5575257 5727178 5705217 5352205 5293032 5509184 5169442 5088901 5267027
3692 5267027 5230039 5510710 5582091 4857303 4739248 4615026 4790947 5009600 4497213 3966419
3682 3966419 4105878 4032614 3937703 3893130 3718704 3547998 3783663 3722699 3855966 4639275
$$ packed form
3750A5458456Q10873o3845m27230O75800L93914O9251M25871K32037M66475k74611
3740A7766991K00300k61203n35155q28725j255347n42758j071094q69963j024325
3731A1578721m08748m58147m34925m82409o34825n37211j01322J14146j093831
3722G541449k14813L05449n85964k53357L11607k10426l61141j68592J40335L8203
3712F542750Q5001j74137n62967n03715P03795l35321l78140K62066j07849L16129
3702E847612k52898j9457J51921k1961l53012n9173K16152l39742q0541J78126
3692E267027l6988K80671P1381p24788j18055j24222J75921K18653n12387n30794
3682C966419J39459p3264r4911m4573j74426j70706K35665o0964J33267P83309
$$ plain form
3672 4639275 4439211 4440841 4382447 4558544 4167177 4604986 4773722 4662829 4651141 5126824
3662 5126824 4791426 4548423 4412657 4747173 4373018 4069946 4407629 4149023 3566617 4078494
3652 4078494 4207111 3866637 3723758 3523388 3939601 3752385 3992595 3645047 3892951 3303073
3642 3303073 3615539 3231443 3154263 3051752 3134384 3098666 3115575 2852682 2926304 3105499
3632 3105499 3290412 3097033 3057422 3302875 2852276 2927769 2902307 2913457 2679936 3069051
3622 3069051 3101172 3659702 3703799 3448188 3632096 3814883 3425740 3656739 4194202 3826600
3612 3826600 3818528 3315545 3248069 3660098 3839888 3709640 3912325 4625138 4437450 4275159
3602 4275159 4504950 4781013 5305383 5252520 4696116 5202919 5221073 5046986 5100586 4602935
$$ packed form
3672D639275k00064J630n8394J76097l91367M37809J68736j10893j1688M75683
3662E126824l35398k43003j35766L34516l74155l03072L37683k58606n82406N11877
3652D078494J28617l40474j42879k00370M16213j87216K40210l47548K47904n89878
3642C303073L12466l84096p7180j02511Q2632l5718J6909k62893P3622J79195
3632C105499J84913j93379l9611K45453m50599P5493k5462J1150k33521L89115
3622C069051L2121N58530M4097k55611J83908J82787l89143K30999N37463l67602
3612C826600q072n02983o7476M12029J79790j30248K02685P12813j87688j62291
3602D275159K29791K76063N24370n2863n56404N06803J8154j74087N3600m97651
$$ plain form
3592 4602935 4347433 4142863 3955352 4030257 3712179 3477909 3550922 3458653 3043571 3282216
3582 3282216 3322363 3596114 3011633 2778781 3112791 2774217 3229229 3585795 3091147 3373719
3572 3373719 3497530 2877549 3071949 2816759 2881478 2971168 3216518 2631889 2545240 2715091
3562 2715091 2321539 2353136 2467423 2433540 2359272 2592426 2478140 2339505 2608167 2483316
3552 2483316 2229404 2354369 2644378 2580868 2585123 2862620 2534213 2407523 2549011 2591122
3542 2591122 2477439 2322019 2213902 2089640 2207103 2456899 2424917 2537086 3085488 2206778
3532 2206778 1999397 2077815 2401375 2315476 2398864 2681879 2584785 2716321 2743110 2463486
3522 2463486 1873643 2335214 2976551 3116946 2384210 2099543 2647540 2886567 2658596 2924972
$$ packed form
3592D602935k55502k04570j87511P4905l18078k34270P3013r2269m15082K38645
3582C282216M0147K73751n84481k32852L34010l38574M55012L56566m94648K82572
3572C373719J23811o19981J94400k55190O4719Q9690K45350n84629q6649J69851
3562B715091l93552L1597J14287l3883p4268K33154j14286j38635K68662j24851
3552B483316k53912J24965K90009o3510M255K77497l28407j26690J41488M2111
3542B591122j13683j55420j08117j24262J17463K49796l1982J12169N48402q78710
3532B206778k07381P8418L23560q5899Q3388K83015r7094J31536K6789k79624
3522B463486n89843M61571O41337J40395p32736k84667N47997K39027k27971K66376
$$ plain form
3512 2924972 2669545 2851961 2982773 2544683 2712835 2574811 2834976 3116599 2982281 3118994
3502 3118994 3002950 3210808 3195428 3545133 3395323 3530142 3349669 3212693 2940515 3084362
3492 3084362 3500784 3429360 3606324 3307098 3076711 3278757 3148382 2868324 2963366 3340059
3482 3340059 2891796 2727800 3379283 3384070 3108087 2899522 3080797 3448538 3564475 3691974
3472 3691974 3442188 3527171 3573817 3561075 3355510 3347367 3403272 3386211 3274429 3524981 3634870
3461 3634870 3363932 3527038 3781035 3573726 3490407 3561788 3299444 3339510 3535790 3753230
3451 3753230 3888136 3972023 3851584 3854659 3465198 3292379 3231755 4000268 4217272 4636135
3441 4636135 4787454 4746058 4408360 4628944 4635461 5266517 5339751 5349782 5597489 5582703 6256990
$$ packed form
3512B924972k55427J82416J30812m38090J68152j38024K60165K81623j34318J36713
3502C118994j16044K07858j5380L49705j49810J34819j80473j36976k72178J43847
3492C084362M16422p1424J76964k99226k30387K02046j30375k80058R5042L76693
3482C340059m48263j63996O51483M787k75983k08565J81275L67741J15937J27499
3472C691974k49786Q4983M6646j2742k05565q143N5905j7061j11782K50552J09889
3461C634870k70938J63106K53997k07309q3319P1381k62344M0066J96280K17440
3451C753230J34906Q3887j20439L075l89461j72819o0624P68513K17004M18863
3441D636135J51319m1396l37698K20584O517O31056P3234J0031K47707j4786O74287
$$ plain form
3430 6256990 6080762 6430766 6568055 6753919 6177240 6078259 6829253 6682926 7299217 6776145
3420 6776145 6762783 6684862 6621370 6605645 6730764 6643051 6549575 6325033 7014495 7226620 6738907
3409 6738907 6966067 6739393 6731437 6442487 6315443 6670521 6810815 6684859 6675843 6387903
3399 6387903 6833523 6557112 6534106 6829877 6932162 6828738 6666664 7060699 7245282 7508039
3389 7508039 7528982 7182395 7606953 7903216 7822789 7782125 7843352 7959677 8297839 7750831
3379 7750831 7959818 8072711 8382958 8168718 8227047 8134970 8031137 8147173 8077664 8282866
3369 8282866 8161092 8246760 8530243 8797640 8298636 8034490 8093311 7699853 7624115 7813333
3359 7813333 8584110 8793440 8160443 8165022 7854721 8114676 8502053 8466950 8441399 8567895
$$ packed form
3430F256990j76228L50004J37289J85864n76679r8981P50994j46327O16291n23072
3420F776145j3362p7921o3492j5725J25119q7713r3476k24542O89462K12125m87713
3409F738907K27160k26674p956k88950j27044L55078J40294j25956r016k87940
3399F387903M45620k76411k3006K95771J02285j03424j62074L94035J84583K62757
3389G508039K0943l46587M24558K96263q0427m0664O1227J16325L38162n47008
3379G750831K08987J12893L10247k14240N8329r2077j03833J16036o9509K05202
3369H282866j21774Q5668K83483K67397m99004k64146N8821l93458p5738J89218
3359G813333P70777K09330o32997M579l10301K59955L87377l5103k5551J26496
$$ plain form
3349 8567895 8372602 8207244 8502056 8826851 8826883 8409271 8706708 8877933 8499649 8218823
3339 8218823 8420368 8976201 9278978 9318173 9355448 9972117 9902810 10272295 10582821 10562546
3329 10562546 10348407 10604129 10312286 9984364 10562257 10266379 10115369 10170085 10258288 10072053
3319 10072053 9860400 8974144 9238749 10229160 10439540 10583178 10244608 10441323 10415370 10434470
3309 10434470 10833186 11177242 10660958 10591595 10620350 10325846 10865009 11018692 10766799 10537698
3299 10537698 10677877 10742983 11131677 11132029 11624149 11844943 12200994 12323484 12327825 12674889
3289 12674889 12611290 13009552 13414734 13801259 13884162 14417989 14638473 14927689 14857093 14952413
3279 14952413 15625522 15897236 16073681 16534788 17076019 17443165 18208165 18663135 19228268
$$ packed form
3349H567895j95293j65358K94812L24795L2m17612K97437J71225l78284k80826
3339H218823K01545N55833L02777L9195L7275O16669o9307L69485L10526k0275
3329A0562546k14139K55722k91843l27922N77893k95878j51010N4716Q8203j86235
3319A0072053k11653q86256K64605R90411K10380J43638l38570J96715k5953J9100
3309A0434470L98716L44056n16284o9363K8755k94504N39163J53683k51893k29101
3299A0537698J40179O5106L88694L52M92120K20794L56051J22490M341L47064
3289A2674889o3599L98262M05182L86525Q2903N33827K20484K89216p0596R5320
3279A4952413O73109K71714J76445M61107N41231L67146P65000M54970N65133
$$ plain form
3270 19228268 19769358 20266437 20921002 21237169 21975656 22012451 22870659 23947009 24517419
3261 24517419 25495790 26007335 26576976 27169991 27684968 28510866 29428933 29375419 29619160 29923029
3251 29923029 30136141 30491436 30713968 30623346 30844666 30117477 29713737 29627174 29564129 29048124
3241 29048124 28173257 27518085 27370526 26644928 26164172 26070427 25764713 24925642 23988354 23842825
3231 23842825 23317659 22704595 21988392 21891490 21370691 20874852 20102717 20148343 19624019 19201701
3221 19201701 19596079 19357403 19377283 19363571 19165582 18944113 18969584 19329383 19140265 18941505
3211 18941505 19265805 19140863 19049857 19023149 18937703 18806637 18653123 18873605 18245614 18412535
3201 18412535 18567774 18692675 18774569 19223958 19121623 19035908 19336519 18952245 19209192 19663464
$$ packed form
3270A9228268N41090M97079O54565L16167P38487L6795Q58208J076350N70410
3261B4517419R78371N11545N69641N93015N14977Q25898R18067n3514K43741L03869
3251B9923029K13112L55295K22532r0622K21320p27189m03740q6563o3045n16005
3241B9048124q74867o55172j47559p25598m80756r3745l05714q39071r37288j45529
3231B3842825n25166o13064p16203r6902n20799m95839p72135M5626n24324m22318
3221A9201701L94378k38676J9880j3712j97989k21469K5471L59799j89118j98760
3211A8941505L24300j24942r1006k6708q5446j31066j53514K20482o27991J66921
3201A8412535J55239J24901Q1894M49389j02335q5715L00611l84274K56947M54272
$$ plain form
3191 19663464 19570047 19892970 19922918 19420818 19942483 19837600 19959039 20185713 20326644 20624301
3181 20624301 20506801 20597137 20955295 20680455 20704514 21205702 21399260 21334665 21727001 22272289
3171 22272289 22149176 22261637 22134871 22169552 22567311 22843835 23156500 23343209 23971443 24147192
3161 24147192 24026759 24388814 25388375 25471055 25312776 25972387 25901028 25945721 26231018 27013038
3151 27013038 26967061 27369826 28108069 28722154 29380087 29460475 30073223 30732930 30999882 31958547
3141 31958547 32725343 33244406 33435623 34060748 34834853 35590769 36351376 37407027 37294141
3132 37294141 38017313 38856145 39775288 40408860 41259595 42428751 43048182 44618388 45725309
3123 45725309 47294891 48567827 50455719 52043187 54078751 55706484 57586239 59303167
$$ packed form
3191A9663464r3417L22923K9948n02100N21665j04883J21439K26674J40931K97657
3181B0624301j17500R0336L58158k74840K4059N01188J93558o4595L92336N45288
3171B2272289j23113J12461j26766L4681L97759K76524L12665J86709O28234J75749
3161B4147192j20433L62055R99561Q2680j58279O59611p1359M4693K85297P82020
3151B7013038m5977M02765P38243O14085O57933Q0388O12748O59707K66952R58665
3141C1958547P66796N19063J91217O25125P74105P55916P60607J055651j12886
3132C7294141P23172Q38832R19143O33572Q50735J169156O19431J570206J106921
3123D5725309J569582J272936J887892J587468K035564J627733J879755J716928
$$ plain form
3115 59303167 61350366 63104418 65464825 68130103 70465475 73097263 76294233 78942767
3107 78942767 81982180 85522254 89292240 93090531 97265164 100984935 104335209 107423729
3099 107423729 110827942 114020107 117042422 119492054 122195167 124529279 125570596 126521620
3091 126521620 126645800 126480754 125312235 123893063 122148149 119727420 117740762 116165280
3083 116165280 114586126 112819671 110897255 109031188 107053776 105686581 103960632 102560921
3075 102560921 100630230 98981121 97072804 95162789 93401409 91227297 88794682 86698404
3067 86698404 84538688 82806374 80983381 78974757 76629578 73803049 71510180 69605994
3059 69605994 67324545 65343542 63543821 61402343 59471532 57838816 56210253 54771520
$$ packed form
3115E9303167K047199J754052K360407K665278K335372K631788L196970K648534
3107G8942767L039413L540074L769986L798291M174633L719771L350274L088520
3099A07423729L404213L192165L022315K449632K703113K334112J041317R51024
3091A26521620J24180j65046j168519j419172j744914k420729j986658j575482
3083A16165280j579154j766455j922416j866067j977412j367195j725949j399711
3075A02560921j930691j649109j908317j910015j761380k174112k432615k096278
3067H6698404k159716j732314j822993k008624k345179k826529k292869j904186
3059F9605994k281449j981003j799721k141478j930811j632716j628563j438733
$$ plain form
3051 54771520 53262020 52043093 50323844 48798789 47580279 45998157 45129975 43767761
3043 43767761 42903954 41929488 41863105 41392665 39822355 39075873 38222876 37467816 37031621
3034 37031621 36270232 35535210 35523966 34837602 34065400 34406779 33898228 33771901 32762656
3025 32762656 32236378 31806765 31486466 31348744 30930785 30879066 30360966 30437525 30587095 30015451
3015 30015451 28955084 28939632 29317677 29019485 28803149 28482943 28204112 27456049 26811692
3006 26811692 27138510 26532886 26122499 25194114 25272522 24906782 24109398 24259883 24384458 24410019
2996 24410019 24407958 24409705 24184922 23877603 23658009 23560379 23963576 24403718 24091918 23952878
2986 23952878 23342475 23055322 23584248 24004025 24171391 24101838 24281866 24307330 24811872 24945711
$$ packed form
3051E4771520j509500j218927j719249j525055j218510j582122q68182j362214
3043D3767761q63807r74466o6383m70440j570310p46482q52997p55060m36195
3034C7031621p61389p35022j1244o86364p72202L41379n08551j26327j009245
3025C2762656n26278m29613l20299j37722m17959n1719n18100P6559J49570n71644
3015C0015451j060367j5452L78045k98192k16336l20206k78831p48063o44357
3006B6811692L26818o05624m10387r28385P8408l65740p97384J50485J24575K5561
2996B4410019k061J747k24783l07319k19594r7630M03197M40142l11800j39040
2986B3952878o10403k87153N28926M19777J67366o9553J80028K5464N04542J33839
$$ plain form
2976 24945711 24974271 25560689 26086084 26160293 26071945 27260528 27691650 27999368 28657656 29346992
2966 29346992 30119680 30583122 30963681 31195664 31528991 31602761 30833751 30466428 30269180 30834372
2956 30834372 30258755 29504352 29194017 28674381 28784762 28387111 27737596 27216273 26953642
2947 26953642 26581902 26445939 26013309 26340211 26271542 26706832 26806541 26753124 26593604 27117961
2937 27117961 27132891 26773638 26842308 26760910 26571246 26385916 26519474 24971119 23876102 23193875
2927 23193875 22157081 21751870 21093828 20175114 19794919 19483788 18695563 18532954 17979599
2918 17979599 17450565 16871722 16865287 16755299 16271832 16386175 15687507 15624146 15406831 15651933
2908 15651933 15541484 15399352 14903522 14586847 14550551 14118141 13744844 13756695 13941799 13626073
$$ packed form
2976B4945711K8560N86418N25395P4209q8348J188583M31122L07718O58288O89336
2966B9346992P72688M63442L80559K31983L33327P3770p69010l67323j97248N65192
2956C0834372n75617p54403l10335n19636J10381l97651o49515n21323k62631
2947B6953642l71740j35963m32630L26902o8669M35290R9709n3417j59520N24357
2937B7117961J4930l59253O8670q1398j89664j85330J33558j548355j095017o82227
2927B3193875j036794m05211o58042r18714l80195l11131p88225j62609n53355
2918A7979599n29034n78843o435j09988m83467J14343o98668o3361k17315K45102
2908A5651933j10449j42132m95830l16675l6296m32410l73297J1851J85104l15726
$$ plain form
2898 13626073 13570071 13233298 13286175 12967873 12929859 13120531 12513015 12407936 12387371 12600800
2888 12600800 12777764 13099180 12794152 12392306 12408530 12766419 12821910 12562670 12323364 11704195
2878 11704195 11458215 11250583 11239235 11288812 11505165 11158742 11008728 10809081 10602226 10609739
2868 10609739 10488527 10286357 10197790 9979496 10190631 9998248 9574725 9593607 9865606 9835556
2858 9835556 9760582 9810277 9748476 10350746 10335131 10726159 9991210 10474018 10378580 10264790
2848 10264790 10110387 10409720 10549640 10676866 10507708 10316822 10406303 10564047 10498505 10456695
2838 10456695 10908369 10982168 10986916 10812228 11129078 11255692 11288885 11417286 11431380 11604903
2828 11604903 12265465 12559422 13272587 13906797 14669457 14753778 14566745 14559482 14500588 13871056
$$ packed form
2898A3626073n6002l36773N2877l18302l8014J90672o07516j05079k0565K13429
2888A2600800J76964L21416l05028m01846J6224L57889N5491k59240k39306o19169
2878A1704195k45980k07632j1348M9577K16353l46423j50014j99647k06855P513
2868A0609739j21212k02170q8567k18294K11135j92383m23523J8882K71999l0050
2858I835556p4974M9695o1801O02270j5615L91028p34949M82808r5438j13790
2848A0264790j54403K99333J39920J27226j69158j90886Q9481J57744o5542m1810
2838A0456695M51674P3799M748j74688L16850J26614L3193J28401J4094J73523
2828A1604903O60562K93957P13165O34210P62660Q4321j87033p263n8894o29532
$$ plain form
2818 13871056 13657034 13705839 13348745 13332915 13955830 14237206 14621694 14382974 14668529 15118965
2808 15118965 15483262 15774495 16042619 16245963 16247373 16892895 17181417 17116751 17673387 17747404
2798 17747404 18384577 19083862 19435053 19852416 19871923 20507931 21402569 22081933 22219711 23006127
2788 23006127 23938779 24636082 25115359 26333028 26923161 27214217 27883420 28657851 29813371
2779 29813371 29494542 29218658 29376390 29940645 30954985 32477770 33241299 34356961 36039234
2770 36039234 37919661 40097230 42052572 44521537 47159089 49510376 51196962 53227830
2762 53227830 54822960 55399338 55870372 56198612 56745321 57450720 58868504 60348845 62038629
2753 62038629 64136599 66435858 69398360 72996169 76707940 81572480 86229263 91550604
$$ packed form
2818A3871056k14022M8805l57094j5830O22915K81376L84488k38720K85555M50436
2808A5118965L64297K91233K68124K03344J410O45522K88522o4666N56636P4017
2798A7747404O37173O99285L51191M17363J9507O36008Q94638O79364J37778P86416
2788B3006127R32652O97303M79277J217669N90133K91056O69203P74431J155520
2779B9813371l18829k75884J57732N64255J014340J522785P63529J115662J682273
2770C6039234J880427K177569J955342K468965K637552K351287J686586K030868
2762E3227830J595130N76378M71034L28240N46709P05399J417784J480341J689784
2753F2038629K097970K299259K962502L597809L711771M864540M656783N321341
$$ plain form
2745 91550604 97828156 103582578 109812967 115749562 121191288 126053571 130969724 134542798
2737 134542798 137743252 140614934 141952992 142283881 140035613 135547224 128961084 122135196
2729 122135196 115518086 109783744 106008829 103071835 100694528 98783062 96453415 93298168
2721 93298168 90666630 86999605 82488320 77493566 72061464 66776494 61933510 57668625
2713 57668625 54157322 50880327 48041596 45175555 42657928 40648045 38614745 36480389
2705 36480389 34880881 33226431 31508790 30400551 29334473 27684978 26208269 24902608
2697 24902608 24227051 23857472 23130217 22308290 21162548 20474915 19845096 19488780 19122002
2688 19122002 18319016 17816651 17197154 16561957 15921762 15257604 15107828 14798445 14415453
$$ packed form
2745I1550604O277552N754422O230389N936595N441726M862283M916153L573074
2737A34542798L200454K871682J338058L30889k248268m488389o586140o825888
2729A22135196o617110n734342l774915k936994k377307j911466k329647l155247
2721I3298168k631538l667025m511285m994754n432102n284970m842984m264885
2713E7668625l511303l276995k838731k866041k517627k009883k033300k134356
2705C6480389j599508j654450j717641j108239j066078j649495j476709j305661
2697B4902608o75557l69579p27255q21927j145742o87633o29819l56316l66778
2688A9122002q02986n02365o19497o35197o40195o64158j49776l09383l82992
$$ plain form
2679 14415453 14134649 13602605 13436038 13187373 12795216 12404168 11978904 12006588 11711967 10972061
2669 10972061 10146622 10166479 10526216 10002107 9663751 9758887 9666155 8726339 8622733 8864416
2659 8864416 8836998 7708764 7934530 7569249 6926457 6999652 6712785 7072000 7045400 6657643
2649 6657643 6488969 6447423 6530349 6520247 6189599 6108576 5863002 6015904 5765370 5782088
2639 5782088 5716438 5236128 4954037 5241115 4993424 5215772 4982356 4690500 4978241 4851457
2629 4851457 5006139 4565683 4281049 4433218 4390774 4430777 4174996 4215723 3856195 3800369
2619 3800369 4063748 4029674 3706287 3667823 3745404 3728341 3539669 3305113 3534298 3648394
2609 3648394 3635626 4021165 3755047 3496348 3247600 3124981 2261001 2061426 2580079 2648428
$$ packed form
2679A4415453k80804n32044j66567k48665l92157l91048m25264K7684k94621p39906
2669A0972061q25439J9857L59737n24109l38356R5136r2732r39816j03606K41683
2659H864416k7418j128234K25766l65281o42792P3195k86867L59215k6600l87757
2649F657643j68674m1546Q2926j0102l30648q1023k45574J52902k50534J6718
2639E782088o5650m80310k82091K87078k47691K22348k33416k91856K87741j26784
2629D851457J54682m40456k84634J52169m2444M0003k55781M0727l59528n5826
2619C800369K63379l4074l23387l8464P7581j7063j88672k34556K29185J14096
2609C648394j2768L85539k66118k58699k48748j22619q63980j99575N18653O8349
$$ plain form
2599 2648428 2705409 2842548 3037483 2958992 2277778 2381242 2528628 2484126 2908555 2577821
2589 2577821 2545555 2361358 2569786 2449608 2264540 2214105 2165734 2399732 1938215 2182011
2579 2182011 2080316 1829475 1868127 1769963 1847501 1903840 2394262 1956162 2353846 2203226
2569 2203226 2188183 2040180 2003345 1518720 1875838 2210291 2377682 2594068 2686901 2462094
2559 2462094 1830187 2097480 2382579 2211968 2098986 2147679 1911928 1915563 1897377 1701969
2549 1701969 1429521 1902463 1942536 2223697 1904967 1863901 2115847 2097236 1895791 2031240
2539 2031240 1959931 1396076 1562025 1739072 1774675 1893734 2414170 2567063 2299148 2196261
2529 2196261 2670058 3095785 2521537 2610205 2442661 2215541 1716558 1703081 1633194 2015572
$$ packed form
2599B648428N6981J37139J94935p8491o81214J03464J47386m4502M24429l30734
2589B577821l2266j84197K08428j20178j85068n0435m8371K33998m61517K43796
2579B182011j01695k50841L8652r8164P7538N6339M90422m38100L97684j50620
2569B203226j5043j48003l6835m84625L57118L34453J67391K16386R2833k24807
2559B462094o31907K67293K85099j70611j12982M8693k35751L635j8186j95408
2549A701969k72448M72942M0073K81161l18730m1066K51946j8611k01445J35449
2539B031240p1309n63855J65949J77047L5603J19059N20436J52893k67915j02887
2529B196261M73797M25727n74248Q8668j67544k27120m98983j3477o9887L82378
$$ plain form
2519 2015572 2235254 2130268 1826501 1724167 1907392 1589312 1048829 989735 1340808 1792538
2509 1792538 1859307 1463364 1608247 1446766 1863388 1562097 1595442 1982069 2080146 2073138
2499 2073138 2218167 2129070 2235809 2099227 1838457 2198171 1980285 1939354 1903596 1831802
2489 1831802 2049928 1761964 1917011 2241383 2147903 2370979 2360474 2235339 2160141 2117731
2479 2117731 2501657 2477269 2582254 2249613 2393272 2364771 1930538 1703624 1824205 1662725
2469 1662725 2367498 2151952 1821790 1678192 1518308 1366314 1023285 1347550 1355380 1434474
2459 1434474 1075518 1234091 999645 1232737 1034095 1203103 1148931 1289133 1144234 1074937
2449 1074937 1329496 1415662 1422859 1486795 1730200 1150520 703303 708345 966796 413106 594066
$$ packed form
2519B015572K19682j04986l03767j02334J83225l18080n40483n9094L51073M51730
2509A792538O6769l95943J44883j61481M16622l01291L3345L86627R8077p008
2499B073138J45029q9097J06739j36582k60770L59714k17886m0931l5758p1794
2489A831802K18126k87964J55047L24372r3480K23076j0505j25135p5198m2410
2479B117731L83926k4388J04985l32641J43659k8501m34233k26914J20581j61480
2469A662725P04773k15546l30162j43598j59884j51994l43029L24265P830P9094
2459A434474l58956J58573k34446K33092j98642J69008n4172J40202j44899o9297
2449A074937K54559Q6166P197O3936K43405n79680m47217N042K58451n53690J80960
$$ plain form
2438 594066 760225 523004 474886 466541 370557 304785 659627 604571 859929 712090 620884
2427 620884 533543 310110 404329 125467 566403 740237 945411 956007 519957 647740
2417 647740 666135 851012 922037 571036 899953 973179 805409 389260 330486 579840
2407 579840 545394 691231 945433 606671 475373 655450 403045 473978 326751 708240
2397 708240 533083 398254 896554 1167793 734314 559961 527546 402811 849619 668196
2387 668196 561167 162484 101522 228434 684740 811155 678152 848204 680234 928459
2377 928459 716933 659091 372261 440194 98540 29631 209425 715689 280640 276381 918312
2366 918312 748411 370871 70074 91004 -197741 10679 80130 309785 645781 559570
$$ packed form
2438E94066J66159k37221m8118q345r5984o5772L54842n5056K55358j47839r1206
2427F20884q7341k23433R4219k78862M40936J73834K05174J0596m36050J27783
2417F47740J8395J84877P1025l51001L28917P3226j67770m16149n8774K49354
2407E79840l4446J45837K54202l38762j31298J80077k52405P0933j47227L81489
2397G08240j75157j34829M98300K71239m33479j74353l2415j24735M46808j81423
2387F68196j07029l98683o0962J26912M56306J26415j33003J70052j67970K48225
2377I28459k11526n7842k86830O7933l41654o8909J79794N06264m35049m259O41931
2366I18312j69901l77540l00797K0930k88745K08420O9451K29655L35996q6211
$$ plain form
2356 559570 365127 461585 483376 758505 540050 133189 96617 471858 726358 532745
2346 532745 128012 88032 386746 332435 317501 243882 141117 -21531 643421 920396
2336 920396 787811 480463 240436 416939 47169 107851 272377 -49513 173881 317394
2326 317394 233002 132781 606245 303171 -47806 264341 -91494 274405 307608 477449
2316 477449 308349 220336 564904 572072 603988 852761 1139086 765150 900593 807093 744539
2305 744539 872281 843724 945148 750484 633565 508806 514584 286551 918185 937780
2295 937780 239082 17454 925797 983844 915455 819568 838692 900103 682078 535096 505223
2284 505223 785794 660369 611223 602006 822386 493906 529948 589839 286600 569328 604601
$$ packed form
2356E59570j94443R6458K1791K75129k18455m06861l6572L75241K54500j93613
2346E32745m04733l9980K98714n4311j4934p3619j02765j62648O64952K76975
2336I20396j32585l07348k40027J76503l69770O0682J64526l21890K23394J43513
2326C17394q4392j00221M73464l03074l50977L12147l55835L65899L3203J69841
2316D77449j69100q8013L44568P168L1916K48773K86325l73936J35443r3500o2554
2305G44539J27742k8557J01424j94664j16919j24759N778k28033O31634J9595
2295I37780o98698k21628R08343N8047o8389r5887J9124O1411k18025j46982k9873
2284E05223K80571j25425m9146r217K20380l28480L6042N9891l03239K82728L5273
$$ plain form
2273 604601 942 214829 225702 36118 130008 97818 147918 -220317 49725 -230605
2263 -230605 -364759 -125705 -134894 -28653 205106 312809 390141 342850 -68881 165053
2253 165053 282749 447128 350469 441746 30819 13681 203896 488098 381149 90720
2243 90720 43235 -166843 13702 -256891 -507617 -517028 -339765 -298718 -442645 -273141 -132675
2232 -132675 71273 182602 52882 -270103 19845 431361 575380 517771 352264 474609
2222 474609 376902 714111 646053 400388 261892 502079 756265 683332 657154 668878 1019826
2211 1019826 1135941 933035 441975 339531 541353 735584 737642 491048 609426 1138921
2201 1138921 1159635 1097973 937787 974459 957336 509680 888533 533608 363148 384692
$$ packed form
2273F04601o03659K13887J0873j89584R3890l2190N0100l68235K70042k80330
2263b30605j34154K39054r189J06241K33759J07703P7332m7291m11731K33934
2253A65053J17696J64379r6659R1277m10927j7138J90215K84202j06949k90429
2243I0720m7485k10078J80545k70593k50726r411J77263M1047j43927J69504J40466
2232a32675K03948J11329j29720l22985K89948M11516J44019n7609j65507J22345
2222D74609r7707L37209o8058k45665j38496K40187K54186p2933k6178J1724L50948
2211A019826J16115k02906m91060j02444K01822J94231K058k46594J18378N29495
2201A138921K0714o1662j60186L6672j7123m47656L78853l54925j70460K1544
$$ plain form
2191 384692 509840 527890 485179 593635 854056 666763 625824 482916 659353 821942
2181 821942 336330 546849 218442 682269 840999 898434 746719 1007868 1286830 1196761
2171 1196761 1040058 780642 1000457 1302845 1129176 903928 877419 1085281 778345 864118
2161 864118 1017498 1016087 1265589 739507 783401 1229321 1195684 909776 1567337 1694220
2151 1694220 1641176 1329718 713020 1228244 1551525 1189504 1077964 1340488 1241511 1125171
2141 1125171 1031417 1364098 1318361 1809244 1737233 1967429 2036295 2061353 2181137 1866174
2131 1866174 2098046 2108452 2124811 2235189 2905490 2657190 2596882 2851692 2955897 2784198
2121 2784198 2528509 2758490 3092905 3634466 3651280 3398325 3514267 3881786 4188378 4468347
$$ packed form
2191C84692J25148J8050m2711J08456K60421j87293m0939j42908J76437J62589
2181H21942m85612K10519l28407M63827J58730N7435j51715K61149K78962r0069
2171A196761j56703k59416K19815L02388j73669k25248k6509K07862l06936Q5773
2161H64118J53380j411K49502n26082M3894M45920l3637k85908O57561J26883
2151A694220n3044l11458o16698N15224L23281l62021j11540K62524r8977j16340
2141A125171r3754L32681m5737M90883p2011K30196O8866K5058J19784l14963
2131A866174K31872J0406J6359J10378O70301k48300o0308K54810J04205j71699
2121B784198k55689K29981L34415N41561J6814k52955J15942L67519L06592K79969
$$ plain form
2111 4468347 4584402 4314281 4221186 3949758 3984566 4938462 5181590 5317214 5344901 6204213
2101 6204213 6470603 6402561 6899876 6910623 7489824 7707209 8211333 8524032 8732308 9297468
2091 9297468 10254091 10956159 12006316 12972514 13758584 14573282 15751236 16708022 18456528
2082 18456528 19801755 21480142 23094947 25793035 28259444 30847902 34086677 37890686
2074 37890686 41711741 48029188 55007080 63506405 72959143 84025407 94497223 102086799
2066 102086799 110723775 122710174 118763671 97278682 77222656 58880563 46983243
2059 46983243 39083267 33883025 30400879 28096895 25860871 24526749 22812220 21558490
2051 21558490 20427155 18605865 16878178 15532392 13903210 12466470 11732544 11397697
$$ packed form
2111D468347J16055k70121r3095k71428L4808R53896K43128J35624K7687Q59312
2101F204213K66390o8042M97315J0747N79201K17385N04124L12699K08276N65160
2091I297468R56623P02068J050157R66198P86070Q14698J177954R56786J748506
2082A8456528J345227J678387J614805K698088K466409K588458L238775L804009
2074C7890686L821055O317447O977892Q499325R452738J1066264J0471816P589576
2066A02086799Q636976J1986399l946503k1484989k0056026j8342093j1897320
2059D6983243p899976n200242l482146k303984k236024j334122j714529j253730
2051B1558490j131335j821290j727687j345786j629182j436740p33926l34847
$$ plain form
2043 11397697 10737267 10250388 9657319 9259817 8856567 8768755 8421074 8810035 8182545 7976221
2033 7976221 7719487 6982027 6346597 6085970 6214146 5992441 5272535 5423647 5121318 4821383
2023 4821383 5172163 5441165 5152406 4684441 3878627 3998967 3792347 3106551 3359753 3236513
2013 3236513 3574756 3280667 3388366 3421168 3309561 3308763 3370050 3055754 3123309 3280488 3387996
2002 3387996 3017315 3054323 2665123 2425677 2317752 2452325 2575251 2463724 2471684 2475932
1992 2475932 2192530 2059662 1666070 1670207 1355080 1601690 2513478 2361080 1922536 1726273
1982 1726273 1813104 1935032 1967916 1409017 1336495 1846192 1969598 1347675 1303561 1251536
1972 1251536 1415865 1848218 1428463 1336509 1624112 1604761 1468645 1353904 923641 1224653
$$ packed form
2043A1397697o60430m86879n93069l97502m03250q7812l47681L88961o27490k06324
2033G976221k56734p37460o35430k60627J28176k21705p19906J51112l02329k99935
2023D821383L50780K69002k88759m67965q05814J20340k06620o85796K53202j23240
2013C236513L38243k94089J07699L2802j11607p98O1287l14296O7555J57179J07508
2002C387996l70681L7008l89200k39446j07925J34573J22926j11527P960M248
1992B475932k83402j32868l93592M137l15127K46610R11788j52398m38544j96263
1982A726273Q6831J21928L2884n58899p2522N09697J23406o21923m4114n2025
1972A251536J64329M32353m19755r1954K87603j9351j36116j14741m30263L01012
$$ plain form
1962 1224653 1166069 745371 882161 696618 669087 880641 886060 879907 1066256 1090265 1185919
1951 1185919 991904 1054845 1049520 777519 868938 704978 1348134 782962 595202 805485
1941 805485 608108 1155400 839402 428873 504210 689597 917385 814165 548884 454745
1931 454745 590254 726443 759562 280677 139283 -103199 229821 549816 491594 486200
1921 486200 259573 156809 218987 134035 333194 774249 717259 270365 394446 500494
1911 500494 672133 918479 363863 488693 807917 183873 -13800 725013 817104 833687
1901 833687 514410 217940 91167 303413 69741 53992 412019 1055517 786437 544097
1891 544097 373386 308516 432855 -75513 -97801 201591 299984 -418893 -157771 -9662
$$ packed form
1962A224653n8584m20698J36790j85543k7531K11554N419o153J86349K4009R5654
1951A185919j94015O2941n325k72001R1419j63960O43156n65172j87760K10283
1941H05485j97377N47292l15998m10529P5337J85387K27788j03220k65281r4139
1931D54745J35509J36189L3119m78885j41394k42482L33020L19995n8222n394
1921D86200k26627j02764O2178q4952J99159M41055n6990m46894J24081J06048
1911E00494J71639K46346n54616J24830L19224o24044j97673P38813R2091J6583
1901H33687l19277k96470j26773K12246k33672j5749L58027O43498k69080k42340
1891E44097j70711o4870J24339n08368k2288K99392R8393p18877K61122J48109
$$ plain form
1881 -9662 247574 814 305724 389268 504399 532072 -39267 179789 299652 787875
1871 787875 624874 842655 608930 1010585 1018795 764112 539071 37866 44923 147659
1861 147659 637868 719131 173955 19135 31195 -299481 38657 -81735 39631 568341
1851 568341 458715 722916 483456 -45501 -62121 -66324 -63601 -333969 -6574 246019 232744
1840 232744 194898 335191 595399 112397 -37235 -23570 383166 66848 -76976 -126500
1830 -126500 92204 622430 912615 772409 894193 553086 573719 643529 99553 355835
1820 355835 357055 821039 720014 663793 736879 861007 428191 55726 148710 352732 360950
1809 360950 -30216 -211445 -163511 121925 335766 -170180 -339910 -170658 -355381 -250265
$$ packed form
1881i662K57236k46760L04910Q3544J15131K7673n71339K19056J19863M88223
1871G87875j63001K17781k33725M01655Q210k54683k25041n01205P057J02736
1861A47659M90209Q1263n45176j54820J2060l30676L38138j20392J21366N28710
1851E68341j09626K64201k39460n28957j6620m203K723k70368L27395K52593j3275
1840B32744l7846J40293K60208m83002j49632J3665M06736l16318j43824m9524
1830a26500K18704N30226K90185j40206J21784l41107K0633O9810n43976K56282
1820C55835J220M63984j01025n6221P3086J24128m32816l72465R2984K04022Q218
1809C60950l91166j81229M7934K85436K13841n05946j69730J69252j84723J05116
$$ plain form
1799 -250265 -66936 -395344 -164721 -163378 -207792 29892 217390 337450 387723 207820
1789 207820 25780 642469 179879 -133680 159122 -66507 228644 262236 -160180 -174026
1779 -174026 -407201 -569190 63288 609627 174858 420416 359161 18578 72099 -1601
1769 -1601 10684 291485 296797 -125295 54774 588989 317052 294282 256498 -186059 93575
1758 93575 236992 292469 446767 360730 -170335 -235022 -168333 -313391 -133847 -281405 163246
1747 163246 -102159 57249 231385 -119430 406066 187120 -137678 -39094 -508946 -104816
1737 -104816 507761 423512 421114 -468195 -420524 -74705 -142507 -562958 -425837 -15210 56037
1726 56037 -425828 -630849 -358536 -590181 -493765 -33881 -47202 112780 60237 -277970
$$ packed form
1799b50265J83329l28408K30623J343m4414K37684J87498J20060N0273j79903
1789B07820j82040O16689m62590l13559K92802k25629K95151L3592m22416j3846
1779a74026k33175j61989O32478N46339m34769K45558o1255l40583N3521p3700
1769a601J2285K80801N312m22092J80069N34215k71937k2770l7784m42557K79634
1758I3575J43417N5477J54298q6037n31065o4687O6689j45058J79544j47558M44651
1747A63246k65405J59408J74136l50815N25496k18946l24798R8584m69852M04130
1737a04816O12577q4249k398q89309M7671L45819o7802m20451J37121M10627P1247
1726E6037m81865k05021K72313k31645R6416M59884j3321J59982n2543l38207
$$ plain form
1716 -277970 -462135 -278214 -34735 328790 408850 45921 253156 305506 122624 310614
1706 310614 136493 -298193 -181117 155021 162708 164792 162695 581826 108895 -49100 -56781
1695 -56781 -157807 53853 -46748 -285989 -265329 251713 496566 432894 374696 300394 129968
1684 129968 627282 718248 595840 99665 -194161 -354721 -277269 -17272 -16704 -61765 166497
1673 166497 -149948 -36799 -383272 -669780 -86781 18127 -174447 -25346 13461 182925
1663 182925 239043 243612 291924 -4437 -23559 77635 145670 327678 215858 156914 61979
1652 61979 271094 437227 -100714 322413 150300 64796 -279495 -701892 -372455 -196407
1642 -196407 -298852 -159452 -100949 40444 485025 498822 -27220 -15353 -169694 -588024
$$ packed form
1716b77970j84165J83921K43479L63525Q0060l62929K07235N2350j82882J87990
1706C10614j74121m34686J17076L36138P687K084k097M19131m72931j57995p681
1695e6781j01026K11660j00601k39241K0660N17042K44853o3672n8198p4302j70426
1684A29968M97314R0966j22408m96175k93826j60560P7452K59997N68m5061K28262
1673A66497l16445J13149l46473k86508N82999J04908j92574J49101L8807J69464
1663A82925N6118M569M8312k96361j9122J01194O8035J82008j11820n8944r4935
1652F1979K09115J66133n37941M23127j72113q5504l44291m22397L29437J76048
1642a96407j02445J39400N8503J41393M44581J3797n26042J1867j54341m18330
$$ plain form
1632 -588024 38701 615660 508951 100539 -495884 -268891 -243847 -824567 -84570 -153238
1622 -153238 -105038 -162008 -108140 290402 322428 -35330 -338793 -468753 -325705 168836
1612 168836 238419 -101764 7389 216311 -109619 39170 -177794 -176146 -162260 -389029
1602 -389029 -203235 273358 86769 -177245 252547 -6614 99302 191901 48756 195801
1592 195801 -40390 31869 -165632 69333 -368018 -395181 -173614 -343912 -363152 -65009
1582 -65009 -87274 -25632 297769 88967 -134272 -58391 -125972 -412644 77779 346072 87296
1571 87296 -115727 -310086 -82057 96542 -39297 -100148 148216 201867 -73276 189743
1561 189743 234086 594788 222983 21010 -240902 -242803 -282863 -390388 -230602 -189625 -226355
$$ packed form
1632e88024O26725N76959j06709m08412n96423K26993K5044n80720P39997o8668
1622a53238M8200n6970N3868L98542L2026l57758l03463j29960J43048M94541
1612A68836O9583l40183J09153K08922l25930J48789k16964J648J3886k26769
1602c89029J85794M76593j86589k64014M29792k59161J05916R2599j43145J47045
1592A95801k36191P2259j97501K34965m37351k7163K21567j70298j9240K98143
1582f5009k2265O1642L23401k08802k23239P5881o7581k86672M90423K68293k58776
1571H7296k03023j94359K28029J78599j35839o0851K48364N3651k75143K63019
1561A89743M4343L60702l71805k01973k61912j901m0060j07525J59786M0977l6730
$$ plain form
1550 -226355 -343531 -292084 -349538 -292480 -8736 -76005 135251 147063 262795 -452775 -678518
1539 -678518 -592665 -492019 -120973 305154 -182938 -289961 -128827 -196673 -265465 -638208
1529 -638208 -262984 -308674 -105712 -304261 -435411 -838341 -283437 174380 -204999 -364215
1519 -364215 -243552 -250822 -151404 312149 362380 276476 -299377 -332420 -373549 -357782 240724
1508 240724 65897 -49572 -370096 -268902 -396090 -110269 -146906 -127431 188956 296068
1498 296068 172775 -107088 -895815 -508604 -471706 -28543 -12669 145691 483460 -197540
1488 -197540 -106321 -102609 -235038 -526606 -614029 -639648 -266962 -117860 -134589 -352259 -770494
1477 -770494 -42801 201971 -48594 -305229 -39090 80203 133118 696499 323781 107058
$$ packed form
1550b26355j17176N1447n7454N7058K83744o7269K11256J1812J15732p15570k25743
1539f78518Q5853J00646L71046M26127m88092j07023J61134o7846o8792l72743
1529f38208L75224m5690K02962j98549j31150m02930N54904M57817l79379j59216
1519c64215J20663p270R9418M63553N0231q5904n75853l3043m1129J5767N98506
1508B40724j74827j15469l20524J01194j27188K85821l6637J9475L16387J07112
1498B96068j23293k79863p88727L87211L6898M43163J5874J58360L37769o81000
1488a97540R1219L712j32429k91568q7423k5619L72686J49102j6729k17670m18235
1477g70494P27693K44772k50565k56635K66139J19293N2915N63381l72718k16723
$$ plain form
1467 107058 -290345 -76545 23439 258385 333063 67520 -9706 -223535 -128932 -121078 -104860
1456 -104860 132650 157909 -70953 -502869 -331104 40295 -574246 -482624 -309708 -367185
1446 -367185 -283550 -319473 -38869 -82707 -126573 37335 128179 -63708 -75673 -372258 -343592
1435 -343592 -285792 228868 435451 333933 452752 445577 552995 238050 -42726 158816
1425 158816 -7149 -545159 -406659 287863 248072 226223 342758 -68766 -189564 -332776
1415 -332776 -11499 272366 -111846 -69441 -372235 -264159 81634 -35411 171651 223011
1405 223011 385653 57009 -447197 -641552 -738686 -359256 -216579 58149 190343 248668
1395 248668 108824 -62983 -77505 139700 99648 11830 -62466 78590 57422 254856 -341623
$$ packed form
1467A07058l97403K13800R9984K34946P4678k65543p7226k13829R4603P854J6218
1456a04860K37510K5259k28862m31916J71765L71399o14541R1622J72916n7477
1446c67185Q3635l5923K80604m3838m3866J63908R0844j91887j1965k96585K8666
1435c43592N7800N14660K06583j01518J18819p175J07418l14945k80776K01542
1425A58816j65965n38010J38500O94522l9791k1849J16535m11524j20798j43212
1415c32776L21277K83865l84212M2405l02794J08076L45793j17045K07062N1360
1405B23011J62642l28644n04206j94355r7134L79430J42677K74728J32194N8325
1395B48668j39844j71807j4522K17205m0052q7818p4296J41056k1168J97434n96479
$$ plain form
1384 -341623 14834 528155 125568 -162396 -226603 -210479 -569254 -216587 12731 -84212
1374 -84212 -390000 -571231 -561587 -135914 -610387 -360509 -305348 -203780 -58084 65405
1364 65405 -246188 -218181 -2798 -372270 -169471 -513613 -363850 91185 95591 -215247
1354 -215247 -310323 -420087 3624 110460 168963 -2993 -255208 -269557 -421125 -431109 -131021
1343 -131021 370426 542827 259656 -353694 -223856 123290 -124451 126267 301865 -43631
1333 -43631 119658 -29248 204858 138247 305542 243196 -122087 -238130 -76075 32412
1323 32412 67224 521763 225933 259158 432657 825073 504633 -105077 138501 -102625
1313 -102625 243796 196933 -130077 -181176 -73195 -136334 125215 108340 -277545 -112293
$$ packed form
1384c41623L56457N13321m02587k87964o4207J6124l58775L52667K29318r6943
1374h4212l05788j81231R644M25673m74473K49878N5161J01568J45696J23489
1364F5405l11593K8007K15383l69472K02799l44142J49763M55035M406l10838
1354b15247r5076j09764M23711J06836N8503j71956k52215j4349j51568r984L00088
1343a31021N01447J72401k83171o13350J29838L47146k47741K50718J75598l45496
1333d3631J63289j48906K34106o6611J67295o2346l65283j16043J62055J08487
1323C2412L4812M54539k95830L3225J73499L92416l20440o09710K43578k41126
1313a02625L46421m6863l27010n1099J07981o3139K61549j6875l85885J65252
$$ plain form
1303 -112293 108253 95206 261947 13898 -413817 28676 -27670 -75847 -20804 -270391
1293 -270391 160569 266385 -20166 28875 370740 104151 69961 376265 676443 409103
1283 409103 98703 -43393 -87493 402989 646750 479932 644391 749977 475378 -266108
1273 -266108 -294829 244277 354551 373353 -160752 -216677 -349586 284169 457419 -157391
1263 -157391 -5946 -197828 -232088 -209449 -109944 -176204 -540658 -456780 -524587 -544207 -561917
1252 -561917 -136069 -256606 -23465 230374 233561 117750 -126276 -88120 -8917 -181526
1242 -181526 -471679 -660783 -502977 -476295 -154473 -175612 -38498 251088 148298 394690
1232 394690 424833 324875 441973 349329 45302 -74297 -94813 715693 746502 613537 386053
$$ packed form
1303a12293K20546j3047J66741k48049m27715M42493n6346m8177N5043k49587
1293b70391M30960J05816k86551M9041L41865k66589l4190L06304L00178k67340
1283D09103l10400j42096m4100M90482K43761j66818J64459J05586k74599p41486
1273b66108k8721N39106J10274J8802n34105n5925j32909O33755J73250o14810
1263a57391J51445j91882l4260K2639R9505o6260l64454Q3878o7807j9620j7710
1252e61917M25848j20537K33141K53839L187j15811k44026L8156P9203j72609
1242a81526k90153j89104J57806K6682L21822k1139J37114K89586j02790K46392
1232C94690L0143r9958J17098r2644l04027j19599k0516Q10506L0809j32965k27484
$$ plain form
1221 386053 -6672 250454 -11035 -325883 -354057 -265318 257016 576665 404908 -366151
1211 -366151 -426358 -209872 56460 40443 -111332 135032 -134318 266044 -82532 -144447
1201 -144447 -233020 -145003 -288675 -303348 -353762 -258570 292044 283801 265504 188576 104841
1190 104841 261611 493811 457578 309288 -20838 -139661 192082 788821 477493 9931
1180 9931 305308 174170 -309086 -272232 -553577 -193262 -77811 -160775 -169577 6795 -284529
1169 -284529 -38472 131669 147222 110332 190381 112636 30370 3339 164581 361452 238741
1158 238741 373109 72777 30181 214519 189766 488129 202045 -89181 -271457 95698
1148 95698 138984 -277619 64555 243808 169555 -243693 205919 332614 155 -243567
$$ packed form
1221C86053l92725K57126k61489l14848k8174Q8739N22334L19649j71757p71059
1211c66151o0207K16486K66332j6017j51775K46364k69350M00362l48576o1915
1201a44447q8573Q8017j43672j4673n0414R5192N50614q243j8297p6928q3735
1190A04841J56770K32200l6233j48290l30126j18823L31743N96739l11328m67562
1180I931K95377j31138m83256L6854k81345L60315J15451q2964q802J76372k91324
1169b84529K46057J70141J5553l6890Q0049p7745q2266k7031J61242J96871j22711
1158B38741J34368l00332m2596J84338k4753K98363k86084k91226j82276L67155
1148I5698M3286m16603L42174J79253p4253m13248M49612J26695l32459k43722
$$ plain form
1138 -243567 -129678 -367886 -565296 -529767 -13804 68574 27854 93336 252109 241993 372406
1127 372406 -27773 -11349 -66380 -643117 -289087 209430 -288910 5443 490544 -41137
1117 -41137 -140875 2422 -260750 277167 217756 331155 217436 -198162 214100 69212
1107 69212 253764 29313 185493 -75980 -147595 132611 -94839 93634 364822 335268
1097 335268 19707 -54989 15990 -432745 -402328 116427 37543 -743 1417 300307 23045
1086 23045 -411266 -152472 -89459 15617 -70216 39497 183808 383023 33826 230953
1076 230953 -234154 -488007 -107375 -481731 -668286 -337513 -123552 330779 45921 -20101
1066 -20101 -112842 -233543 -77138 436955 384190 -111949 -232634 -328943 -592195 -634573 -95216
$$ packed form
1138b43567J13889k38208j97410L5529N15963Q2378m0720O5482J58773j0116J30413
1127C72406m00179J6424n5031n76737L54030M98517m98340K94353M85101n31681
1117d1137r9738J43297k63172N37917n9411J13399j13719m15598M12262j44888
1107F9212J84552k24451J56180k61473p1615K80206k27450J88473K71188k9554
1097C35268l15561p4696P0979m48735L0417N18755p8884l8286K160K98890k77262
1086B3045m34311K58794O3013J05076q5833J09713J44311J99215l49197J97127
1076B30953m65107k53853L80632l74356j86555L30773K13961M54331k84858o6022
1066b0101r2741j20701J56405N14093n2765m96139j20685r6309k63252m2378N39357
$$ plain form
1055 -95216 57340 -160279 -137500 -240323 -409915 -52665 -570333 -545160 -8445 72417
1045 72417 65350 -38277 -429022 -308813 -64384 -107542 -852 146100 -54466 -148686 457773
1034 457773 329722 158722 21137 -86428 -191617 -129493 115635 -252613 195416 345196
1024 345196 -248526 451438 523691 140951 271882 -117242 -98195 97740 489941 456400
1014 456400 -50740 -302649 349555 707062 29259 -137482 -230122 -248002 -93940 118292
1004 118292 -34666 152635 -17181 136841 57658 -230994 -323062 -241977 -301093 -675056
994 -675056 -493076 -249509 -1159 -393106 -236932 -365909 -44497 -44590 -331911 -24713 217069
983 217069 32187 -423118 -273043 -233281 -237226 -67199 -233697 -187498 -556148 -16348 127109
$$ packed form
1055i5216J52556k17619K2779j02823j69592L57250n17668K5173N36715Q0862
1045G2417p067j03627l90745J20209K44429m3158J06690J46952k00566r4220O06459
1034D57773j28051j71000j37585j07565j05189O2124K45128l68248M48029J49780
1024C45196n93722O99964P2253l82740J30931l89124J9047J95935L92201l3541
1014D56400n07140k51909O52204L57507o77803j66741r2640j7880J54062K12232
1004A18292j52958J87301j69816J54022p9183k88652r2068Q1085n9116l73963
994f75056J81980K43567K48350l91947J56174j28977L21412r3k87321L07198K41782
983B17069j84882m55305J50075L9762l945J70027j66498M6199l68650N39800J43457
$$ [...]
##END NTUPLES=NMR SPECTRUM
##END=
