##TITLE=1H_CA-8887-4
 CDCl3, 8 sc, 
 2.07.2021
##JCAMPDX= 6.0         $$ Bruker NMR JCAMP-DX V2.0
##DATA TYPE= NMR SPECTRUM
##DATA CLASS= NTUPLES
##ORIGIN= UXNMR, Bruker Analytische Messtechnik GmbH
##OWNER= root
$$ XWIN-NMR		Version 3.5
$$ Fri Jul  2 10:55:16 2021 Russian Standard Time (UT+4h)  she@DPX200
##.OBSERVE FREQUENCY= 200.131506
##.OBSERVE NUCLEUS= ^1H
##.ACQUISITION MODE= SIMULTANEOUS
##.ACQUISITION SCHEME= undefined
##.AVERAGES= 8
##.DIGITISER RES= 18
##SPECTROMETER/DATA SYSTEM= spect
##.PULSE SEQUENCE= zg30
##.SOLVENT NAME= CDCl3
##.SHIFT REFERENCE= (INTERNAL, CDCl3, 0, 17.5081)
##AUDIT TRAIL= $$ (NUMBER, WHEN, WHO, WHERE, WHAT)
$$ ##TITLE= Audit trail, XWIN-NMR		Version 3.5
$$ ##JCAMPDX= 5.01
$$ ##ORIGIN= Bruker BioSpin GmbH
$$ ##OWNER= she
$$ F:/spectra/data/she/nmr/H-F/1/pdata/1/auditp.txt
$$ ##AUDIT TRAIL=  $$ (NUMBER, WHEN, WHO, WHERE, WHAT)
(   1,<2021-07-02 10:53:55.46 +0400>,<she>,<DPX200>,
      <created by zg, POWCHK disabled, PULCHK disabled
       configuration hash MD5:
       00 E9 B6 7A A2 85 ED C7 34 08 36 98 17 FE 4E 26
       data hash MD5: 16K
       AB F2 6F 3C 49 84 8F DA 79 D8 18 B7 7F 5A C4 DC>)
(   2,<2021-07-02 10:53:58.07 +0400>,<she>,<DPX200>,
      <Start of raw data processing
       efp BC_mod = 2 LB = 0.24 FT_mod = 6 PKNL = 1 PHC0 = -11912 PHC1 = 9.40099 SI = 16K 
       data hash MD5: 16K
       70 91 B8 3C F5 54 5A 32 A1 D6 0A 72 AA A3 F0 5C>)
(   3,<2021-07-02 10:54:15.85 +0400>,<she>,<DPX200>,
      <pk PHC0 = 0.2744344 PHC1 = 0 
       data hash MD5: 16K
       21 2F 6E 01 C9 57 6D 1D FC 50 35 AC C9 5B 2D 9A>)
(   4,<2021-07-02 10:54:19.15 +0400>,<she>,<DPX200>,
      <abs ABSG = 5 
       data hash MD5: 16K
       40 FA D4 25 4D 32 4B 2D 6C 22 28 D6 50 80 35 02>)
$$ ##END=
$$ 
$$ hash MD5
$$ AC BE 7E D3 24 01 04 7A 44 27 5C 3D A8 5B 27 55
##$RELAX= 
##$RELAX= 
##$RELAX= 
##$RELAX= 
##$RELAX= 
##$RELAX= 
$$ Bruker specific parameters
$$ --------------------------
##$DU= <F:/spectra>
##$EXPNO= 1
##$NAME= <H-F>
##$PROCNO= 1
##$TYPE= <nmr>
##$USER= <she>
##$AMP= (0..31)
100 100 100 100 100 100 100 100 100 100 100 100 100 100 100 100 100 100 
100 100 100 100 100 100 100 100 100 100 100 100 100 100 
##$AQSEQ= 0
##$AQ_mod= 1
##$AUNM= <au_zg>
##$AUTOPOS= <>
##$BF1= 200.13
##$BF2= 200.13
##$BF3= 200.13
##$BF4= 200.13
##$BF5= 200.13
##$BF6= 200.13
##$BF7= 200.13
##$BF8= 200.13
##$BYTORDA= 1
##$CFDGTYP= 0
##$CFRGTYP= 5
##$CHEMSTR= <none>
##$CNST= (0..31)
1 1 145 1 1 1 1 1 1 1 1 1 1 1 1 1 1 1 1 1 1 1 1 1 1 1 1 1 1 1 1 1 
##$CPDPRG= <>
##$CPDPRG1= <>
##$CPDPRG2= <>
##$CPDPRG3= <>
##$CPDPRG4= <mlev>
##$CPDPRG5= <mlev>
##$CPDPRG6= <mlev>
##$CPDPRG7= <mlev>
##$CPDPRG8= <mlev>
##$CPDPRGB= <>
##$CPDPRGT= <>
##$D= (0..31)
0 1.2 0 0 0 0 0 0 0 0.06 0 0.03 0 0 0 0 0.0002 0 0 0 0 0 0 0 0 0 0 0 0 
0 0 0 
##$DATE= 1625208834
##$DBL= (0..7)
120 120 120 120 120 120 120 120 
##$DBP= (0..7)
150 150 150 150 150 150 150 150 
##$DBP07= 0
##$DBPNAM0= <>
##$DBPNAM1= <>
##$DBPNAM2= <>
##$DBPNAM3= <>
##$DBPNAM4= <>
##$DBPNAM5= <>
$$ [...]
##$SUBNAM3= <"">
##$SUBNAM4= <"">
##$SUBNAM5= <"">
##$SUBNAM6= <"">
##$SUBNAM7= <"">
##$SUBNAM8= <"">
##$SUBNAM9= <"">
##$SW= 20.0188882624521
##$SWIBOX= (0..15)
0 0 2 0 0 0 0 0 0 0 0 0 0 0 0 0 
##$SW_h= 4006.41025641026
##$TD= 16384
##$TD0= 1
##$TE= 0
##$TE2= 300
##$TE3= 300
##$TEG= 300
##$TL= (0..7)
0 120 120 120 120 120 120 120 
##$TP= (0..7)
150 150 150 150 150 150 150 150 
##$TP07= 0
##$TPNAME0= <>
##$TPNAME1= <>
##$TPNAME2= <>
##$TPNAME3= <>
##$TPNAME4= <>
##$TPNAME5= <>
##$TPNAME6= <>
##$TPNAME7= <>
##$TPOAL= (0..7)
0.5 0.5 0.5 0.5 0.5 0.5 0.5 0.5 
##$TPOFFS= (0..7)
0 0 0 0 0 0 0 0 
##$TUNHIN= 0
##$TUNHOUT= 0
##$TUNXOUT= 0
##$USERA1= <user>
##$USERA2= <user>
##$USERA3= <user>
##$USERA4= <user>
##$USERA5= <user>
##$V9= 5
##$VALIST= <valist>
##$VCLIST= <CCCCCCCCCCCCCCC>
##$VD= 0
##$VDLIST= <DDDDDDDDDDDDDDD>
##$VPLIST= <PPPPPPPPPPPPPPP>
##$VTLIST= <TTTTTTTTTTTTTTT>
##$WBST= 1024
##$WBSW= 4
##$XGAIN= (0..3)
0 0 0 0 
##$XL= 0
##$YL= 0
##$YMAX_a= 497640
##$YMIN_a= -657069
##$ZGOPTNS= <>
##$ZL1= 120
##$ZL2= 120
##$ZL3= 120
##$ZL4= 120
##$ABSF1= 17.50811
##$ABSF2= -2.510929
##$ABSG= 5
##$ABSL= 3
##$ALPHA= 0
##$AQORDER= 0
##$ASSFAC= 0
##$ASSFACI= 0
##$ASSFACX= 0
##$ASSWID= 0
##$AUNMP= <proc_1d>
##$AZFE= 0.1
##$AZFW= 0.1
##$BCFW= 0
##$BC_mod= 2
##$BYTORDP= 0
##$COROFFS= 0
##$CY= -3
##$DATMOD= 1
##$DC= 0
##$DFILT= <>
##$DTYPP= 0
##$F1P= 0
##$F2P= 0
##$FCOR= 1
##$FTSIZE= 16384
##$FT_mod= 6
##$GAMMA= 0
##$GB= 0
##$INTBC= 1
##$INTSCL= 1.334414e-10
##$ISEN= 128
##$LB= 0.24
##$LEV0= 0
##$LPBIN= 0
##$MAXI= 10000
##$MC2= 0
##$MEAN= 0
##$ME_mod= 0
##$MI= 1.114404
##$NCOEF= 0
##$NC_proc= -5
##$NLEV= 6
##$NOISF1= 3.799351
##$NOISF2= 2.8
##$NSP= 0
##$NTH_PI= 0
##$NZP= 0
##$OFFSET= 17.50811
##$PC= 1
##$PHC0= -11911.73
##$PHC1= 9.40099
##$PH_mod= 1
##$PKNL= yes
##$PPARMOD= 0
##$PSCAL= 0
##$PSIGN= 0
##$REVERSE= no
##$SF= 200.130005308693
##$SI= 16384
##$SIGF1= 3
##$SIGF2= 2
##$SINO= 5.538805
##$SIOLD= 16384
##$SREGLST= <1H.CDCl3>
##$SSB= 0
##$STSI= 16384
##$STSR= 0
##$SW_p= 4006.41025641026
##$SYMM= 0
##$S_DEV= 0
##$TDeff= 16384
##$TDoff= 0
##$TI= <>
##$TILT= no
##$TM1= 0
##$TM2= 0
##$TOPLEV= 0
##$USERP1= <user>
##$USERP2= <user>
##$USERP3= <user>
##$USERP4= <user>
##$USERP5= <user>
##$WDW= 1
##$XDIM= 16384
##$YMAX_p= 456295105
##$YMIN_p= -155171
$$ End of Bruker specific parameters
$$ ---------------------------------
##NTUPLES= NMR SPECTRUM
##VAR_NAME=  FREQUENCY,     SPECTRUM/REAL,   SPECTRUM/IMAG
##SYMBOL=    X,             R,               I
##VAR_TYPE=  INDEPENDENT,   DEPENDENT,       DEPENDENT
##VAR_FORM=  AFFN,          ASDF,            ASDF
##VAR_DIM=   16384,         16384,           16384
##UNITS=     HZ,            ARBITRARY UNITS, ARBITRARY UNITS
##FACTOR=    0.24454680195387, 1,            1
##FIRST=     3503.89815652856, 0,            0
##LAST=      -502.512099881705, 0,           0
##MIN=       -502.512099881705, -155171,     0
##MAX=       3503.89815652856, 456295105,    0
$$ Real data points
##PAGE= N=1
##DATA TABLE= (X++(R..R)), XYDATA
$$ [...]
9080 1904 -20768 -53004 -43097 22970 60147 30578 25129 -1693 -7277 3116 -2726 -6157 29441
9067 29441 47741 13096 15909 13467 13577 26932 20579 40903 34635 -9832 12366 34586 13057
9054 13057 45380 13155 17729 -17947 -33561 14924 74221 71698 82145 45966 36113 66902
9042 66902 22584 -53290 -13390 20589 14040 24594 33790 37541 -27465 -30684 18488 18802 32546
9029 32546 9801 -10787 3879 40813 60508 65373 34536 15708 29724 8342 21612 27223
9017 27223 20363 -2258 17657 -9565 -18359 -29149 -78086 -46360 -76327 12260 -5717 -1420
9005 -1420 8837 184 40498 67353 10405 -8943 7976 12941 50507 69465 22228 25322 71730
8992 71730 46555 60190 -5198 10668 49303 45551 65524 96947 126546 110780 108668 18957
8980 18957 6752 62782 79406 98542 86978 66685 12432 55062 99233 56658 92233 74676
8968 74676 77478 122004 143063 110168 97116 122520 106703 150138 186947 236805 223285 227104
8956 227104 191161 187327 197371 195843 196570 144953 127045 272793 278708 301112 282277 269430
8944 269430 304069 304305 313308 303550 335200 367333 466551 585261 694509 765397 780404 859471
8932 859471 860261 802125 771453 681965 572691 477029 431727 382163 375578 346052 309296 319000
8920 319000 239670 284424 263822 256294 223968 145851 130164 145948 93548 119618 138426 111248
8908 111248 48751 69336 102144 97070 59491 102689 89797 103950 145781 114722 142257 109603
8896 109603 100963 116123 135385 130513 124025 140549 120310 74357 129496 189923 167906 160989
8884 160989 191485 163551 155109 140778 157568 124491 112488 131553 94691 69557 124948 163787
8872 163787 154646 157301 181044 129411 161801 157299 103295 47229 99019 109121 185960 170700
8860 170700 131082 139142 184550 199468 194918 217928 214014 164215 215467 168703 188115 209272
8848 209272 189991 193087 189615 221821 274007 293866 339445 336091 298148 238087 309493 355902
8836 355902 337069 365404 356641 350807 388058 369182 411512 469030 460342 446854 458304 525519
8824 525519 548074 516445 500473 563165 563391 619338 655704 634846 571857 551160 573364 643858
8812 643858 627394 660172 655929 627519 583405 559747 499053 473265 511035 550339 514039 554323
8800 554323 533470 520502 471119 542000 554208 549807 577962 620109 598121 613206 634549 638887
8788 638887 648119 705002 728934 751768 843115 830630 785537 741834 707603 719472 698534 680489
8776 680489 615187 579616 621608 532782 505795 536875 519573 438650 402201 405365 386971 392653
8764 392653 387672 377367 322689 319941 366452 326178 354384 317527 304011 227540 309367 355612
8752 355612 273489 297917 271878 333740 376513 342491 338203 321908 352599 365540 391067 340944
8740 340944 373333 409115 417441 420503 395815 443837 478544 441123 456002 466470 439105 446748
8728 446748 340900 314354 350871 375593 392892 391501 352156 341490 333654 341151 410074 377186
8716 377186 379429 390948 398055 394563 355415 350569 362193 368468 420426 397218 419057 422969 462118
8703 462118 443563 436050 466911 412848 439996 427281 441982 455370 452078 442239 418586 455746
8691 455746 471264 462558 477647 542926 558393 556020 606415 595379 585103 607157 597149 609969
8679 609969 618639 626114 619406 682266 735653 655099 689732 722676 726218 723139 752081 769198 828145
8666 828145 779693 780185 806836 814228 879511 914679 911130 909604 907277 906772 950736 1027125 1006176
8653 1006176 936193 939294 999344 1077831 1034634 1024902 1102859 1179563 1174833 1151994 1181754 1157703
8641 1157703 1238763 1263974 1239015 1303550 1375528 1375868 1376371 1416069 1368477 1502807 1576227 1561718
8629 1561718 1593843 1635098 1639547 1704976 1742579 1737542 1798543 1859820 1907126 1953376 2018356 2090389
8617 2090389 2103974 2174842 2252749 2355321 2436695 2515007 2524598 2617629 2692669 2717518 2788996
8606 2788996 2836947 2892913 2940969 2951586 2927040 2960645 3017772 3094495 3172466 3246563 3223010
8595 3223010 3284871 3335169 3411579 3466749 3566233 3648132 3783666 3893686 3987468 4121117 4287238
8584 4287238 4422976 4546860 4727562 4916533 5166645 5375810 5565962 5745995 6022996 6251751
8574 6251751 6466892 6798032 7129621 7462962 7794312 8167847 8598376 9181463 9750005 10458134
8564 10458134 11259548 12021633 12818730 13600842 14275524 14907463 15435299 15723122 15884553
8555 15884553 15875665 15667164 15296384 14975227 14699887 14441814 14177600 14066754 14031916 13916564
8545 13916564 14029030 14321024 14386391 14444303 14567323 14768512 14996774 15029055 14862037 14495920
8535 14495920 14058151 13675188 13463027 13340935 13271724 13335184 13372069 13513627 13632737 13835778
8525 13835778 14100652 14362330 14769432 15213903 15758564 16317052 16962616 17716921 18542943
8516 18542943 19450901 20346438 21215217 22184156 23133628 24031379 24954896 26012880 27151572
8507 27151572 28076971 28984741 29877486 30654063 31411496 31971816 32599303 33521458 34652321
8498 34652321 36247503 38213986 40524291 43245524 46362289 49933101 53833103 58119997
8490 58119997 62629046 67362604 72324770 77272683 81879035 85785311 88874061 91266205
8482 91266205 93223079 94433704 94358408 92631367 89523488 85455290 81021123 76800172
8474 76800172 72948405 69737779 66909212 64310313 62033261 60073208 58535801 57515354
8466 57515354 57033501 57202455 57892538 59141422 61053125 63639324 66762770 70403515 74488291
8457 74488291 78748358 83144118 87493449 91724950 95651652 99252205 102595288 105154727
8449 105154727 106564000 106473949 104890717 101978629 97537985 91626963 84681641 77309221
8441 77309221 70286877 63969267 58407956 53665092 49561070 45998567 42872824 40003795
8433 40003795 37337993 34849451 32633772 30555173 28613790 27001151 25458457 24121547
8425 24121547 22925508 21829385 20770158 19890367 19092817 18407805 17790568 17109239 16540473
8416 16540473 16089462 15581608 15162049 14771062 14338026 13868679 13487748 13151979 12767569
8407 12767569 12423489 12125152 11819783 11494327 11246068 10966649 10717265 10443040 10113089
8398 10113089 9798338 9621530 9339635 9105465 8872416 8660290 8448412 8237331 8198008 8127382
8388 8127382 7976583 7835144 7710145 7591736 7487937 7375809 7339304 7300354 7159936 7055937
8378 7055937 6954516 6958390 6881694 6824903 6750894 6622686 6513818 6426876 6329703 6227736 6240820
8367 6240820 6216510 6172955 6186769 6205165 6213157 6218808 6269927 6374739 6454133 6583383 6783246
8356 6783246 6974141 7177139 7461857 7735596 7983524 8248652 8619851 8952257 9239166 9546878
8346 9546878 9927843 10211559 10479624 10599290 10738577 10825521 10903896 10875553 10753701 10590924
8336 10590924 10324502 10153004 9937696 9712662 9473806 9260546 9129009 9084026 9005169 9080564
8326 9080564 9211227 9373470 9616199 9948845 10211218 10633571 11220292 11862718 12551008 13259968
8316 13259968 13936271 14616922 15374168 16090533 16623141 17114021 17428145 17559957 17631786 17559146
8306 17559146 17312924 16763735 15985756 15199139 14304282 13551487 12778350 12047133 11470400
8297 11470400 10826725 10408678 9963000 9615719 9347258 9169197 9106751 9178273 9193278 9316548
8287 9316548 9480181 9774176 10051687 10348074 10685132 11066653 11423681 11678635 11900443 12156976
8277 12156976 12375522 12351239 12082839 11800631 11430281 10830185 10239984 9443823 8689310 8038748
8267 8038748 7499357 7052540 6686130 6361202 6070536 5861540 5699417 5448553 5252417 5112675
8257 5112675 5001346 4903707 4763042 4590768 4489940 4317903 4206506 4151036 4097056 4042784
8247 4042784 3965738 3918187 3917884 3930661 3883663 3791474 3765495 3781841 3696532 3644775 3644872 3559034
8235 3559034 3569882 3598725 3559637 3496818 3420046 3424148 3411311 3431252 3429393 3428510 3392181 3332437
8223 3332437 3358122 3384490 3348492 3404837 3404973 3385595 3439323 3503039 3534957 3557486 3556163 3630758
8211 3630758 3746493 3767233 3880349 3906178 3955566 4081434 4106799 4112346 4195804 4275654 4322086
8200 4322086 4368315 4435167 4501976 4499369 4488390 4572942 4551466 4764097 4962234 4634657 4636042
8189 4636042 4648980 4753285 4896563 4991571 5137591 5245030 5408291 5624110 5747119 5944665
8179 5944665 6098775 6335096 6668323 6875735 7166551 7456100 7773376 8053052 8389634 8795253
8169 8795253 9176282 9407026 9624887 9893496 10092304 10096736 10002879 9925293 9946816 10041959 10164720
8158 10164720 10407605 10627528 10816469 11043724 11239779 11495425 11828474 12249800 12652663
8149 12652663 13173407 13733534 14300758 14908908 15513925 16289743 17152489 18031383 18987901
8140 18987901 20063891 21264297 22343932 23400124 24471161 25353364 26139754 26851649 27640202
8131 27640202 28709767 29947367 31460109 33114809 35045035 37326958 39909417 42755127
8123 42755127 45674550 48797843 52551474 57068652 62032668 66746479 70249645 72486628
8115 72486628 73131295 71774764 69004809 65877752 63195133 61332173 60181471 59498005
8107 59498005 58781480 57739820 56699152 55956641 55722404 55961236 56527916 57551395 59020409
8098 59020409 61022304 63636640 66825329 70481251 74430110 78930268 84428157 90980731
8090 90980731 98376692 106244366 114098923 121284836 126595424 129213072 128932323 126278614
8082 126278614 121544258 115672339 110077036 104818840 98601481 91278953 84403584 78602425
8074 78602425 73750350 69596523 66126171 63355070 61289186 59780299 58769643 58327194
8066 58327194 58445896 58968923 59960651 61367489 63151000 65271555 67732844 70414685 72844509
8057 72844509 74777508 76902527 79718914 82765105 85335498 86985039 86518449 83127594
8049 83127594 77486561 70728038 64338141 58898530 54416595 50733523 47904591 45527504
8041 45527504 43257233 40969167 38873151 37142202 35657007 34325474 33197916 32254405
8033 32254405 31370108 30544607 29858549 29160281 28501604 27896842 27194574 26536211 26061271
8024 26061271 25641038 25426589 25240089 25087710 25007286 25191419 25546839 26180456 27102805 28467201
8014 28467201 30212834 32157643 34624666 36729865 35798372 32068789 28989459 26475613
8006 26475613 24088490 22152743 20655939 19617866 18939697 18245456 17772301 17453789 17116867
7997 17116867 16917839 16792857 16722843 16759806 16688159 16415605 16022549 15643787 15237844 14909508
7987 14909508 14643393 14454609 14309507 14272996 14187460 14134335 14119553 14140390 14223408 14309914 14377712
7976 14377712 14469185 14565609 14768325 15004169 15205750 15502331 15876561 16270756 16717218 17274503
7966 17274503 17692647 18141423 18544092 18923783 19340438 19728374 19993011 20268765 20603540
7957 20603540 20955008 21374864 21859802 22382016 23005664 23992055 25190690 26561499 28285947
7948 28285947 30412390 32841580 35655996 38939426 42408570 45468799 47615016 49678551
7940 49678551 52195918 54584818 55405136 53844549 51875402 50493456 49206883 47397399
7932 47397399 44806919 42304940 40122298 38080485 36045691 34464654 33311853 32580973
7924 32580973 32274913 32420315 32884565 33797668 35128443 36858104 39021858 41632481 44456680
7915 44456680 46963992 49281637 52191264 55888658 59951327 63493792 65726832 65987610
7907 65987610 63793294 59611500 54359670 49318493 45186292 41913597 39287042 36715737
7899 36715737 33843612 31190464 28971738 27136349 25648631 24382126 23500737 22889787
7891 22889787 22402778 22180256 22196190 22422904 22917580 23734353 24804712 26074640 27246483
7882 27246483 27966567 28318067 28858106 29535548 29672229 28502048 26748539 25229261 23865909
7873 23865909 22432537 20582344 18605163 16924537 15499005 14247866 13193495 12301873
7865 12301873 11583987 10989759 10471479 9979147 9527725 9137503 8705573 8406517 8175548
7856 8175548 7865870 7590425 7309437 7093370 6857255 6648515 6495246 6314892 6164759 6024745
7846 6024745 5848849 5672733 5526640 5350844 5195091 5114883 4999580 4944171 4679372 4567416
7836 4567416 4513253 4330937 4218351 4156874 4035056 3923241 3766862 3620584 3551918 3411546
7826 3411546 3333959 3241581 3239645 3138431 3034469 2989824 2934165 2852494 2813679 2721294 2682145
7815 2682145 2596016 2600384 2637007 2580829 2489473 2410268 2440537 2389731 2391485 2424747 2303125 2285493
7803 2285493 2252092 2181198 2140980 2089430 2048641 2031585 2011636 1939516 1969270 1987311 1977900 1933951
7791 1933951 1921738 1896734 1864498 1826024 1817842 1852540 1884886 1945593 1936459 1871710 1860855 1801486
7779 1801486 1785829 1796591 1726882 1744307 1743709 1611346 1571985 1598082 1518162 1490256 1516447 1515022
7767 1515022 1459552 1424014 1437237 1462974 1468469 1462474 1467321 1477490 1522359 1577325 1526613 1548198
7755 1548198 1547048 1520018 1565200 1549357 1523131 1543308 1466662 1471143 1436923 1376094 1342118 1289594
7743 1289594 1295075 1258263 1220476 1242434 1161483 1095220 1087888 1053229 1105944 1074984 995808 951907
7731 951907 982818 997272 993672 1005751 987213 980828 975986 986661 981085 924723 965516 940922
7719 940922 885849 904605 871172 871917 872888 845863 820625 813375 795860 798945 762940 693811 747710
7706 747710 711836 697113 714849 669586 633243 612411 609169 599988 592369 594294 568656 636613
7694 636613 651091 635935 632662 593579 553011 579152 580822 547170 539179 544094 555776 564449 522806
7681 522806 559380 537536 494435 553943 528044 523594 512623 515105 490425 450911 470122 480068
7669 480068 553833 559334 462088 431701 459305 482626 402565 452487 471920 457705 453241 427957
7657 427957 404792 385015 417681 394467 461820 477491 396638 386677 416460 352829 335693 329603
7645 329603 312385 338147 369443 336916 387669 394253 392619 400806 433615 391825 368414 378323
7633 378323 376318 424344 417282 421375 393143 463685 445593 418831 397073 346600 398640 417481
7621 417481 416781 391793 402983 415448 417965 425482 433617 457669 467301 462432 549113 578074 539062
7608 539062 555206 478169 484227 483695 450226 387545 360617 409649 383086 355482 432424 492295
7596 492295 470908 417078 436212 443249 477231 464490 458020 409380 437441 476397 537153 553549
7584 553549 528997 550606 558810 618809 647653 607002 582841 527966 479819 487950 452123 364304
7572 364304 354173 302277 290952 326928 297215 253900 218623 257698 384062 302087 241925
7561 241925 277750 231061 272713 263565 260759 300691 315068 332660 300712 257122 276739 298816
7549 298816 280792 285098 301956 297334 263930 214982 188323 180589 212581 183474 155840 191395
7537 191395 208085 201769 224965 216174 195882 149850 124673 138832 96520 127052 221096 231484
7525 231484 186824 100765 130437 150955 104456 84375 130215 94131 55257 43453 71920 104472
7513 104472 148048 101047 109925 128438 112451 144189 116448 103933 80890 125471 162249 136000
7501 136000 135231 117079 112687 105789 133694 83294 77022 127912 127031 65874 55434 93360 40820
7488 40820 67357 52226 98410 92848 116201 111669 119003 125926 157931 125382 124429 131230 108341
7475 108341 66111 121020 162248 138257 116660 147428 170012 57198 106657 82135 26173
7464 26173 -13742 32658 37918 53065 82112 120231 91887 147280 133108 134267 177985 110811
7452 110811 36205 26714 62259 109323 114822 96445 104414 91592 119821 129205 47215 25807
7440 25807 67012 61779 59228 65402 79123 21746 -1174 36090 41492 42516 51288 77098 86511
7427 86511 56458 47524 13574 46533 79596 96788 126320 17034 36751 77983 74812 58310
7415 58310 19528 52822 32717 55081 38763 26722 61238 19988 42448 22593 6000 16447
7403 16447 13897 998 67708 9761 -15508 5521 -16026 -16055 12423 87391 60680 74170 80699
7390 80699 56768 20394 70699 100043 96422 38615 57387 87536 58256 26388 19706 -6700
7378 -6700 10092 2826 44836 49879 66931 77138 -8743 -32895 -20885 -30736 15450 10089 57599
7365 57599 87964 88180 87905 49912 42627 71919 80496 49957 81016 71236 90931 94066 49347
7352 49347 58481 50798 76918 47286 14402 11035 61054 39684 103301 104097 48854 9789 -11678
7339 -11678 28397 61242 30385 -1282 23244 88617 123934 69604 49993 -16789 9720 76742
7327 76742 124645 103720 81187 64625 81219 29688 12592 12615 -26986 2044 54318 -3237
7315 -3237 -30449 13443 51525 43873 38653 26628 77635 69680 82460 101097 -10095 33207
7303 33207 50981 35984 26060 29440 40919 30771 49920 78366 37633 -13652 -14483 -19871 29454
7290 29454 61511 47220 60655 95808 57513 14941 2527 13683 128667 96136 26302 87497
7278 87497 56350 78433 46237 -22864 2459 17662 57049 48913 11043 56197 101291 92717
7266 92717 81175 107760 44853 51874 72090 67371 36065 64309 76591 90006 81666 89078 72399
7253 72399 29119 95324 104645 19903 -4736 58668 124793 95694 90677 78573 119082 108464
7241 108464 88194 124908 68605 89091 76659 33326 49730 92923 117553 157025 102628 76423
7229 76423 62251 91841 108667 45474 20776 -53229 38350 133640 71632 43040 9905 95
7217 95 15008 43312 40042 20923 20494 56361 95498 104597 127621 69220 108008 78399 60208
7204 60208 51625 56829 105169 92199 82867 74217 17068 53764 84513 57599 99535 80392 108765
7191 108765 79141 87513 100013 82714 63994 72718 67673 99369 86976 77406 70786 114253 97707
7178 97707 131308 125294 96088 102154 142176 139165 139076 92181 95835 172911 129841 168096 159375
7165 159375 66548 40617 31031 93047 84050 83617 89133 69776 56388 52010 34430 88147 141648
7152 141648 132034 100047 138905 164707 154449 109501 117250 138758 159102 148269 147195 88155
7140 88155 35709 134045 140461 137028 87426 20508 68194 107039 53707 27551 20162 90596
7128 90596 110678 142959 92053 106318 81096 66216 123509 150622 144781 139169 102755 78502
7116 78502 69796 113379 69923 70719 50864 161067 147064 95188 154809 139694 106290 78235
7104 78235 94723 118082 150083 186907 135091 53811 87769 91043 99858 133199 124913 123370 158059
7091 158059 123812 93655 77571 88856 82977 156415 173477 101332 71476 71761 90477 125090
7079 125090 145153 185521 169399 142637 128367 137853 170538 178304 174463 153895 239480 204212
7067 204212 134934 104859 98839 140340 116723 161997 200548 177960 150418 152392 147820 85626
7055 85626 116315 217017 167958 136539 176786 199907 137810 143876 181237 170638 178226 176317
7043 176317 173654 145382 152603 199667 234288 242726 203574 136629 124479 101670 118868 171638
7031 171638 165906 135284 120184 125165 144323 166444 175006 185951 122699 123949 170796 159364
7019 159364 184560 169209 149094 153075 178128 135151 115284 159302 139846 127521 118608 107547
7007 107547 138298 139712 159665 136574 155164 167872 136609 165748 148562 160667 112551 164667
6995 164667 203927 148429 172014 184739 165013 195387 240612 224314 178764 183539 194734 211053
6983 211053 226060 201338 192019 195960 149304 161601 168232 159213 109374 147290 182562 199907
6971 199907 225755 187492 173437 184423 203828 178762 180863 187557 208525 160093 134271 159214
6959 159214 239496 256305 248332 250225 190963 222172 240893 212695 297777 221190 243709 245725
6947 245725 258004 337580 327893 289035 272150 267219 283913 298873 288792 269075 284586 268855
6935 268855 154067 202944 291031 286796 247382 263273 244618 242089 294539 268219 285547 249340
6923 249340 258913 238798 269709 315571 308443 282664 243164 246314 244551 297930 300608 265513 219290
6910 219290 269522 238626 215464 252647 296070 260014 244024 238318 282710 317952 323014 277026
6898 277026 323176 308332 314326 323741 282596 314251 289039 347917 353358 346575 337240 273568 297596
6885 297596 352817 376215 402921 414282 435605 406049 326911 330199 341630 355290 303628 300202
6873 300202 351987 379672 346604 345435 321079 333700 339750 371779 378008 366348 384205 378082
6861 378082 321605 302698 382115 353206 360254 355809 344452 337514 304040 330207 348075 367907
6849 367907 396842 357300 339375 356708 367998 364868 353379 342854 398701 369250 406188 355188
6837 355188 331548 316645 342946 382350 358796 337086 318687 319240 295356 309217 341642 354484
6825 354484 347520 381639 403000 371345 352865 299674 319293 356294 332486 362779 393661 361650
6813 361650 309193 327903 312466 331183 335243 348631 407729 363578 389834 360253 369351 396153
6801 396153 415000 445681 408592 428863 388048 397694 430149 389543 371134 394507 357774 365972
6789 365972 390710 399514 393431 401592 429022 417263 371354 377105 419198 459730 448835 411586
6777 411586 430002 446319 427560 371838 377331 437124 454783 461196 506093 497470 435530 408522
6765 408522 409660 421995 429569 380775 415191 421240 431068 484713 451145 466139 455656 428743
6753 428743 474106 491748 451704 452989 484865 426590 408625 419743 452524 478822 470396 462671
6741 462671 480827 455918 412482 453856 492880 471354 452990 485800 525173 532767 556154 556199
6729 556199 527185 528385 512572 544902 548040 557894 522916 526325 562840 539518 563747 593755
6717 593755 596858 513640 559592 589304 523709 531607 598228 601552 601186 607775 558198 584833 666353
6704 666353 661279 591840 543113 548563 569909 571694 673444 691166 635097 621529 592428 616299
6692 616299 684546 646747 671231 657277 635062 618659 601700 624121 669431 698322 660205 669904
6680 669904 702987 645043 669433 721677 648741 677960 669659 660592 633379 631636 691975 675268
6668 675268 754357 775870 745385 738011 754851 742210 774002 776610 760903 738781 745265 769073
6656 769073 764504 763985 801417 843348 815355 830261 883904 863837 834564 844492 830915 877538
6644 877538 875191 853250 886942 839080 876531 911733 901427 946958 952381 955025 986228 980575
6632 980575 971597 1000079 975610 984959 983335 979700 1029066 1028549 951150 971513 999285 1023874 1056717
6619 1056717 1062145 1072341 1123980 1115196 1131121 1195960 1176529 1148385 1152301 1191221 1155835 1180802
6607 1180802 1238498 1201251 1222517 1279786 1256640 1245751 1257027 1265800 1252262 1288086 1354663 1385083
6595 1385083 1437104 1463704 1454306 1457456 1491777 1520409 1602621 1629744 1655074 1730496 1758836 1819810
6583 1819810 1884625 1882675 1983699 2068176 2175697 2285805 2391610 2479388 2496994 2439699 2342743
6572 2342743 2244900 2201090 2150978 2158595 2200860 2149138 2110925 2136983 2197688 2263124 2328448 2378145
6560 2378145 2436268 2490439 2513528 2542328 2562044 2611308 2681094 2752882 2816116 2861831 2940941
6549 2940941 3001371 3150053 3318579 3404878 3492727 3572953 3707162 3836568 3963241 4198010
6539 4198010 4425674 4752414 5057541 5504779 5960100 6456241 7037020 7525373 7955068 8286089
6529 8286089 8597594 8917104 9340820 9747821 10123665 10406361 10587865 10488924 10008805 9370702
6519 9370702 8612987 7903574 7320070 6847395 6487028 6246417 6146857 6071090 6060769 6115781
6509 6115781 6227345 6389033 6557416 6776724 7016538 7252401 7535938 7885639 8244935 8715023
6499 8715023 9136104 9409307 9453713 9307365 8855006 8247006 7606473 6908103 6411480 5953766
6489 5953766 5545329 5226746 4965376 4711141 4525426 4373592 4216520 4098136 4019822 3843209
6479 3843209 3779893 3710015 3672257 3572848 3477709 3393008 3338486 3234453 3208886 3148620 3051627
6468 3051627 2990138 2979115 2943961 2850278 2858946 2837562 2841390 2810226 2769275 2733294 2780959 2726952
6456 2726952 2725555 2742864 2708237 2687210 2662815 2682646 2683492 2672430 2733453 2633768 2578547 2638461
6444 2638461 2617606 2589319 2600595 2555884 2587736 2583849 2598710 2561203 2562188 2536700 2540591 2516820
6432 2516820 2559764 2514424 2544781 2557370 2582447 2581920 2554171 2578033 2596088 2626663 2681451 2694047
6420 2694047 2651846 2631382 2654208 2656934 2603302 2624869 2644428 2615117 2611253 2532735 2556549 2625150
6408 2625150 2647594 2668953 2679017 2678531 2637713 2701551 2682946 2683724 2679207 2717464 2730589 2727813 2709642
6395 2709642 2739905 2770130 2760201 2753179 2814586 2854506 2813421 2778062 2783458 2803637 2803013 2824070
6383 2824070 2882353 2927737 2887454 2858066 2844867 2842653 2881030 2895230 2900192 2873714 2938701 2918879
6371 2918879 2948888 2933411 2916343 2955298 2950448 2976102 2960231 2974361 3038109 3017222 3007523 3028317
6359 3028317 3101816 3012348 2993145 2949897 2961091 2989090 3028792 2937457 2975372 3065490 3065729 3041209
6347 3041209 3088325 3129628 3076075 3102500 3157680 3136865 3096503 3068726 3102682 3124197 3124773 3169695
6335 3169695 3204356 3168624 3156375 3195491 3215428 3246455 3209550 3233354 3250008 3201945 3208484 3300612
6323 3300612 3276451 3322848 3299332 3331768 3323381 3324363 3323649 3313378 3295985 3284018 3298498 3283728
6311 3283728 3295305 3313657 3332551 3259928 3239129 3231383 3238181 3254414 3245850 3242181 3266028 3251095
6299 3251095 3238889 3213880 3230310 3271189 3263114 3239434 3249544 3280185 3217060 3217439 3263050 3293779
6287 3293779 3262727 3295320 3249488 3265866 3285904 3264586 3217439 3234465 3172842 3196486 3202303 3207990
6275 3207990 3218510 3216451 3186648 3193624 3214188 3201219 3202170 3141963 3155022 3150507 3193180 3154668
6263 3154668 3155970 3134510 3088267 3130979 3163428 3189651 3153636 3148655 3151984 3096347 3124354 3198470
6251 3198470 3125749 3115098 3163609 3114604 3156646 3159981 3125208 3121505 3079698 3040725 3020598 3115046
6239 3115046 3120468 3115462 3075570 3038544 3049791 3052043 3019278 3006350 3020781 2985602 2978664 2995111
6227 2995111 2933774 2939078 3003743 2978951 2966421 2882958 2946169 2975538 2920829 2899950 2885197 2865323
6215 2865323 2877779 2841400 2857597 2871671 2834398 2860080 2859916 2869488 2816355 2827614 2817478 2787524
6203 2787524 2757083 2703983 2752694 2801203 2791371 2751122 2701118 2706226 2733420 2762993 2744479 2713767
6191 2713767 2735221 2705309 2671759 2638779 2578765 2598420 2610134 2622999 2627074 2638499 2571518 2541218
6179 2541218 2547830 2579378 2607336 2583270 2604472 2578641 2589611 2519264 2527755 2509003 2501312 2565898
6167 2565898 2545136 2502210 2537182 2537283 2539854 2544857 2506192 2505983 2486706 2476619 2474141 2435576 2438783
6154 2438783 2394984 2414990 2395828 2391069 2327580 2330012 2341024 2342353 2337335 2306806 2311798 2250425
6142 2250425 2253802 2275930 2265435 2285181 2298860 2277745 2322550 2285325 2245632 2289704 2180302
6131 2180302 2251519 2250896 2198307 2105114 2096221 2091555 2121835 2166448 2135689 2111892 2064334 2090028
6119 2090028 2140975 2105650 2032203 2047971 2057891 2111512 2094168 2069497 2070276 2044866 1999793 2031072
6107 2031072 2025598 1976263 2003234 2005063 1950741 1947624 1942550 1955565 1939179 1985094 1985332 1953644 1905899
6094 1905899 1860296 1852522 1879865 1887168 1872046 1802715 1833714 1819807 1827139 1841806 1868793 1885618
6082 1885618 1864375 1859191 1827116 1782045 1741861 1776357 1820105 1822443 1821368 1800434 1780564 1773196
6070 1773196 1776146 1776568 1771311 1779569 1757445 1702936 1683151 1672631 1708097 1694506 1650322 1652750 1570591
6057 1570591 1588630 1650869 1649091 1658807 1597394 1629838 1596301 1624522 1639558 1619977 1586519 1569827
6045 1569827 1626960 1613610 1602148 1512819 1511941 1512320 1547747 1554874 1515080 1538763 1587083 1610532
6033 1610532 1593833 1516223 1500852 1524728 1475207 1482468 1504535 1482856 1478853 1498802 1507808 1513512
6021 1513512 1471111 1426988 1448358 1480562 1470957 1456630 1446138 1487673 1473605 1410561 1388272 1389114
6009 1389114 1392751 1428510 1451008 1446604 1412328 1390871 1386553 1380854 1416815 1407633 1398014 1358223 1318505
5996 1318505 1319201 1349792 1368389 1354545 1326945 1319357 1297495 1321656 1325458 1308416 1307929 1286475 1270412
5983 1270412 1302859 1293572 1274927 1323044 1320524 1264703 1196630 1244144 1216486 1230439 1226995 1274096
5971 1274096 1327900 1300739 1262287 1245943 1248357 1242604 1226229 1236849 1219764 1199589 1236482 1200319
5959 1200319 1271201 1255056 1231880 1209016 1191012 1156215 1179857 1229778 1205700 1190269 1132619
5948 1132619 1169326 1180677 1117225 1176086 1190235 1220551 1202798 1195418 1202228 1134862 1103746 1164781
5936 1164781 1132813 1120588 1105499 1127015 1128685 1075789 1033972 1049828 1077296 1112505 1116279 1078560
5924 1078560 1095176 1095908 1091527 1072864 1085742 1078095 1057360 1041941 1021201 1067349 1078218 1114196
5912 1114196 1042752 1032025 1094502 1069820 1015512 990213 1057521 1094563 1004618 1014759 1018670 986697
5900 986697 1024008 1036101 1083445 1098965 1081573 1081612 1050486 992296 989946 978566 944882 1002314
5888 1002314 1014731 989684 978608 1003599 989395 985390 976658 950052 1020714 1033501 1041654 976812
5876 976812 978312 974912 1048804 984755 994244 1049906 1035281 968072 945113 959888 983284 997153
5864 997153 951715 947152 1020366 1038714 977803 968289 928369 976216 950630 919954 980940 981688
5852 981688 990886 953742 990355 946627 914160 970911 946938 956061 987875 1032245 1008476 938451
5840 938451 903927 864718 887189 865292 929777 938711 952477 908967 901463 990712 1006304 959524
5828 959524 961307 903193 954374 965134 937767 957831 932839 933984 993738 959992 934960 958094
5816 958094 938618 946891 946657 984004 971428 992005 979262 980876 938693 942091 899183 932700 924664
5803 924664 917377 913668 900483 947998 920410 928610 964812 915474 952161 924274 932818 992417
5791 992417 969610 932450 886468 895782 883625 860934 894182 866304 844257 885918 929580 951875
5779 951875 945119 870548 838242 825801 864435 854051 787774 780634 834014 865362 796811 820266
5767 820266 799116 795340 835833 840162 871657 868107 832511 835692 878983 852307 838285 834274 856528
5754 856528 805670 791274 784819 825810 835999 829124 782716 773947 799889 714136 767991 771306
5742 771306 789628 800835 818656 777125 790811 756684 723125 805559 778672 783999 758268 767711
5730 767711 810645 829974 806053 807976 819239 822152 873711 861084 796415 758507 761397 730654
5718 730654 771041 757332 777553 812093 809039 751004 733014 784621 796650 736330 760036 838881
5706 838881 797463 816725 740045 757532 747470 739387 731851 680925 674834 689109 715461 745752
5694 745752 732708 801400 818469 837330 807065 776089 743927 741807 781607 784933 708225 729819
5682 729819 748630 723246 786100 791903 796164 801347 830077 784313 786831 733469 702254 790505
5670 790505 746149 743380 754047 767420 812487 849133 885804 805139 779011 756608 782442 765529
5658 765529 785325 744349 773432 818885 784933 744844 728964 746454 832242 808093 774320 775442
5646 775442 791442 744068 780230 781808 827113 868355 762850 731726 750982 787148 806509 793104
5634 793104 846926 811033 791112 774426 727755 791425 844016 834151 834527 821061 831392 824949
5622 824949 858206 833713 758205 801850 845956 900110 912444 958908 885187 882915 869887 852461
5610 852461 864516 857665 864373 869470 899790 837286 832946 838416 870031 908766 855163 941670 972758
5597 972758 875425 872418 867435 896334 886373 845539 844039 848642 888118 931102 948510 932430 913082
5584 913082 957248 929881 930265 930627 956293 996156 976817 969764 876546 892114 904096 924061 956010
5571 956010 931491 963903 957209 986473 1025992 946906 919325 940466 975761 942151 914844 925217
5559 925217 1053974 1064372 1013187 1010017 1027138 925428 978398 993677 1038789 1006404 983330
5548 983330 1014735 1013333 1043699 989724 1008089 1043561 1016569 1002260 1016108 1048565 1038618 1040286
5536 1040286 1070132 1075483 1079938 1105526 1076312 1039986 1047295 1064924 1074215 1029068 1052960 1025798
5524 1025798 1093035 1070113 1095490 1159088 1150651 1180241 1178398 1219179 1168265 1111907 1127148 1121887
5512 1121887 1105198 1104179 1166716 1157121 1194233 1215245 1238199 1210268 1159572 1165302 1216751 1147546
5500 1147546 1172166 1297227 1274259 1319454 1320314 1357578 1425508 1407497 1460245 1460869 1465282 1450600
5488 1450600 1477360 1491942 1491707 1487929 1532330 1525253 1555239 1558542 1608203 1614616 1584450 1663794 1678203
5475 1678203 1658173 1681111 1676425 1726681 1778728 1840765 1891026 1864188 1878314 1919946 1956585 1981790
5463 1981790 2019656 2041191 2111693 2148264 2237116 2246108 2256242 2241029 2305312 2350954 2352087 2315761
5451 2315761 2335177 2351870 2472099 2561413 2672397 2768808 2835247 2910632 2946228 3015287 3176578
5440 3176578 3313794 3476636 3653113 3852609 4043093 4270851 4616944 4917392 5232984 5512066
5430 5512066 5755071 5816792 5731893 5546428 5369569 5160257 4996608 4923202 4790846 4571242
5420 4571242 4428564 4225770 4007155 3795280 3702399 3614154 3490823 3368841 3254939 3182115
5410 3182115 3168988 3134781 3076343 3017511 3004692 3007079 2957630 2911637 2933397 2953453 2878092 2845925
5398 2845925 2858997 2833223 2870770 2866149 2902963 2921465 2939192 2935738 2963609 2952551 2972516 3001650
5386 3001650 3089954 3145350 3147531 3211440 3223946 3257644 3262191 3312302 3357129 3445614 3449406 3515835
5374 3515835 3528551 3588136 3676505 3748691 3788054 3898714 3955945 4034523 4197005 4305246 4374994
5363 4374994 4451098 4524328 4642763 4749048 4808600 4930128 5017529 5103165 5180464 5283498 5393710
5352 5393710 5482224 5677384 5765855 5867381 5988118 6094149 6183577 6265405 6340459 6460022
5342 6460022 6589316 6680337 6847229 6952441 7046690 7153404 7310512 7472474 7650132 7743704
5332 7743704 7838797 8032926 8265869 8458870 8597823 8782299 8885428 8989352 9039849 9201244
5322 9201244 9342527 9418029 9532289 9595552 9688387 9811273 9935152 10030983 10120893 10243109
5312 10243109 10336953 10427057 10545755 10672688 10839326 10943394 11051858 11210344 11362180 11574962
5302 11574962 11884765 12049707 12337476 12738408 13155764 13536254 13978605 14335729 14736413
5293 14736413 15043438 15198800 15269505 15189645 15077663 14904892 14593526 14275210 13929691 13511230
5283 13511230 13125620 12756587 12378254 12046913 11794222 11628250 11400683 11216417 11076876
5274 11076876 10855248 10662074 10464551 10348451 10128644 9876079 9625503 9420492 9191600
5265 9191600 8960731 8728414 8512004 8273084 8056889 7947150 7738497 7482290 7325026 7207382
5255 7207382 7028168 6839466 6760361 6664477 6502870 6408505 6318404 6182491 6153454 6056085 5976961
5244 5976961 5912336 5857688 5818411 5729514 5680640 5614610 5570027 5552476 5409426 5356760 5354796
5233 5354796 5245558 5137370 5081551 5000524 4911631 4878308 4799148 4753739 4680519 4648501 4608340
5222 4608340 4571606 4479971 4384955 4320570 4226749 4195083 4133373 4171928 4107764 4045796 3930752
5211 3930752 3910557 3898410 3820502 3799524 3779157 3743750 3717383 3673200 3627790 3618189 3592054 3548731
5199 3548731 3516196 3576974 3488684 3460876 3488919 3429466 3377956 3375633 3333609 3347812 3305348 3289414
5187 3289414 3275195 3251545 3224350 3245456 3252987 3190549 3228017 3242900 3176221 3215703 3201550 3243628
5175 3243628 3297944 3276809 3237323 3229152 3297923 3299928 3289299 3276266 3325348 3334373 3325302 3352067
5163 3352067 3363038 3380133 3421842 3447216 3449375 3459901 3478097 3438078 3412307 3431848 3420085 3441687
5151 3441687 3454797 3468224 3452245 3481109 3517592 3615917 3574141 3580642 3618405 3622944 3607614 3584321
5139 3584321 3633241 3626597 3562775 3524377 3510518 3488925 3526886 3529975 3552566 3563398 3529062 3550615
5127 3550615 3587977 3543620 3570218 3534872 3554320 3576315 3560837 3541909 3537215 3522663 3571391 3572175
5115 3572175 3536028 3467343 3487691 3559526 3543502 3525490 3547422 3567893 3605045 3620279 3590107
5104 3590107 3544336 3569090 3553646 3539183 3544208 3500747 3470475 3470358 3505711 3472280 3471375 3461725 3489304
5091 3489304 3493566 3470888 3461896 3469218 3457187 3511163 3536543 3558710 3562376 3581750 3644531 3641247
5079 3641247 3633554 3646280 3661701 3661578 3662794 3714438 3763249 3791035 3878148 3898904 3881851 3884024
5067 3884024 3869051 3894625 3906756 3928941 3959921 4026982 4021988 4090726 4183666 4252906 4262507 4285752
5055 4285752 4321052 4298343 4334156 4335966 4464519 4488238 4502597 4528480 4626229 4665568 4724227
5044 4724227 4748759 4806826 4892443 4910140 4900374 4924363 5061697 5144743 5265931 5334477 5495838
5033 5495838 5660538 5787667 6085528 6300234 6529958 6830767 7109045 7256885 7261949 7169012
5023 7169012 7095946 7031512 7000047 7016618 7092608 7141271 7116980 7173489 7297923 7388164 7448592
5012 7448592 7552408 7579049 7687376 7793120 7971920 8214948 8468039 8548345 8653379 8642625
5002 8642625 8519623 8433941 8263926 8211827 8057446 7936210 7810709 7723908 7636172 7560575
4992 7560575 7540321 7505529 7467125 7451348 7355646 7304621 7297822 7235221 7202985 7202186 7238423 7190218
4980 7190218 7229680 7254701 7276192 7303284 7323396 7331923 7342091 7416230 7466848 7511536 7546723 7501347
4968 7501347 7602057 7678835 7699260 7804776 7870528 7864467 7957411 8054015 8148936 8166373 8260389
4957 8260389 8238101 8355897 8465099 8545929 8622593 8687629 8724140 8797609 8898990 8974322 9098740
4946 9098740 9216309 9292491 9342043 9473218 9582789 9709229 9798124 9915157 10114875 10244716
4936 10244716 10357088 10582823 10721102 10877469 11001138 11157230 11325697 11531672 11690178
4927 11690178 11854234 12011274 12218529 12414382 12538562 12616804 12863918 13097490 13280360 13494734
4917 13494734 13744980 13967804 14136815 14293433 14398789 14609076 14808771 14876903 15006173 15131279
4907 15131279 15212386 15265692 15373147 15460192 15548817 15700171 15847052 16014519 16190295 16466486
4897 16466486 16617066 16787130 16994907 17186434 17453818 17644463 17772202 17976241 18171147
4888 18171147 18350769 18540844 18722201 18882736 19065076 19231958 19422042 19672756 19864580
4879 19864580 20075126 20262371 20507906 20720130 20915406 21158369 21424482 21640576 21922370
4870 21922370 22082607 22288360 22533369 22882871 23157574 23396642 23624041 23891955 24203016
4861 24203016 24471683 24771817 25060537 25371551 25665015 25979106 26294283 26557972 26784900
4852 26784900 27063011 27338536 27602275 27879718 28140436 28346734 28655998 28942973 29119430
4843 29119430 29354757 29581999 29762344 30018252 30208448 30392709 30556707 30747681 30944700
4834 30944700 31144307 31264434 31481305 31635380 31728678 31772787 31876069 31976909 32005970 32033118
4824 32033118 32103415 32130943 32077492 32034794 31978782 31934252 31910766 31777645 31647707 31550306 31466732
4813 31466732 31331140 31174287 30945142 30753925 30552761 30325808 30100694 29815958 29604345
4804 29604345 29382485 29122304 28860154 28605643 28254953 27994069 27682748 27401132 27119409
4795 27119409 26821314 26480261 26221580 25913217 25531519 25280828 24986539 24641240 24288807
4786 24288807 23936731 23589584 23266584 22911988 22579531 22263089 21929369 21596700 21308200
4777 21308200 21024274 20666940 20411788 20123989 19811382 19527301 19202357 18924885 18668010
4768 18668010 18327532 18064763 17769896 17514330 17273992 16967171 16712886 16477492 16167885
4759 16167885 15856785 15673117 15404382 15182920 14981243 14736041 14520334 14361396 14148580
4750 14148580 13887827 13625676 13447906 13268376 13045114 12861910 12655211 12436231 12243046
4741 12243046 12047707 11933672 11776057 11627537 11426241 11280638 11095147 10925807 10788644
4732 10788644 10617329 10418440 10268970 10140554 9980922 9818885 9652531 9517976 9354945
4723 9354945 9277370 9175153 9035935 8973204 8849450 8644286 8564926 8465755 8339190 8215014
4713 8215014 8069715 7977515 7885814 7795259 7668665 7499772 7402970 7357354 7276205 7117585 7053810
4702 7053810 6976537 6901289 6894358 6886805 6818980 6730668 6653278 6620465 6493036 6371993 6280077
4691 6280077 6262994 6137834 6025466 5962871 5895845 5808007 5692641 5567070 5561846 5532928 5404434
4680 5404434 5382279 5321313 5265261 5113002 5051346 5039343 4939950 4824071 4763928 4708627 4705936
4669 4705936 4706315 4621704 4588471 4515130 4431276 4330356 4296371 4241120 4224283 4238273 4166423 4142240
4657 4142240 4134818 4120962 4116274 4097067 4068811 4064989 3997203 3955360 3893305 3828144 3783175 3743621
4645 3743621 3732843 3673307 3629682 3557701 3511435 3465571 3471569 3404797 3306474 3255661 3254657 3272049
4633 3272049 3230227 3208102 3185481 3161887 3109002 3084548 3125167 3127297 3094822 3046287 2979579 2970635
4621 2970635 2955005 2973220 2979060 2998863 2943826 2950445 2918203 2902669 2898282 2842291 2837118 2846169
4609 2846169 2849088 2833005 2798487 2806755 2808532 2842193 2853773 2877731 2846686 2862369 2877332 2849899
4597 2849899 2851121 2863094 2877839 2943733 3009698 3043318 3064336 3116909 3123579 3132760 3188832 3179816
4585 3179816 3222565 3157426 3178593 3264855 3358180 3366845 3353758 3333995 3284045 3332738 3317912 3283938
4573 3283938 3313097 3308234 3269979 3204466 3183031 3121238 3111529 3039065 2985927 3055491 2998105 2958984
4561 2958984 2974093 2979059 2946948 2883679 2879560 2801216 2811110 2771172 2728870 2697180 2643363 2664204
4549 2664204 2657449 2668089 2651688 2649809 2636046 2593299 2649491 2674990 2673730 2763438 2792619 2771603
4537 2771603 2763544 2864092 2916209 2916622 2931666 3023373 3117796 3110045 3188204 3247200 3273364 3314619
4525 3314619 3399153 3343513 3309496 3331191 3288172 3285623 3325578 3353774 3324424 3405082 3371296 3404988
4513 3404988 3336532 3345458 3307757 3207079 3229201 3206646 3180164 3081054 3055754 2996087 2997037 2962844
4501 2962844 2905283 2886199 2882524 2840320 2800824 2810601 2732518 2758835 2759024 2750090 2762197 2756883 2783515
4488 2783515 2755694 2822947 2893785 2870561 2901625 2871756 2861734 2854191 2800576 2831192 2861492 2878161
4476 2878161 2904994 2854012 2883974 2898880 2894215 2888965 2931556 3010521 3049241 3034475 3048150 3102963
4464 3102963 3133502 3140363 3214205 3291275 3333318 3346560 3424540 3492075 3506116 3574305 3647669 3765703
4452 3765703 3870930 3949840 4112723 4226224 4329103 4488243 4661784 4911458 5076353 5288159
4442 5288159 5519440 5813815 6001542 6243733 6406333 6603508 6862690 7223420 7594244 7994129
4432 7994129 8478349 9062244 9792957 10591584 11483734 12587563 13866956 15301867 17024893
4423 17024893 19191936 21773982 25038620 28998165 33551897 38587784 43091734 45072053
4415 45072053 43747253 39652719 34079666 28908614 24572008 21001121 18319674 16296284
4407 16296284 14734783 13510619 12539788 11807511 11191910 10689888 10326485 9987607 9756160
4398 9756160 9650635 9503822 9392919 9256970 9208944 9249842 9261191 9307433 9375670 9580374
4388 9580374 9847371 10143168 10471817 10937089 11571755 12266754 13027613 13893102 15017290
4379 15017290 16441641 18099730 20085705 22598816 25669767 29473797 33815301 38613496
4371 38613496 42589422 43884528 43062987 40551124 35637901 30279269 25853425 22242998
4363 22242998 19244923 16954797 15124064 13754541 12695928 11776535 10994345 10367656 9826756
4354 9826756 9346261 8929299 8550197 8234195 7933024 7642494 7324352 7109317 6911702 6697017
4344 6697017 6505618 6410230 6331265 6186511 6010930 5931380 5849155 5760038 5584993 5524519 5474224
4333 5474224 5336872 5251805 5224102 5188951 5176758 5139704 5132677 5112766 5135701 5168594 5191679
4322 5191679 5205083 5155746 5251158 5350480 5436403 5509693 5612490 5727988 5800958 5874882 5967863
4311 5967863 6035743 6121277 6293007 6356566 6432707 6496410 6556339 6613424 6584010 6550255 6614716
4300 6614716 6580382 6494539 6426376 6375872 6278532 6175663 6150820 6090551 6036400 5919412 5789071
4289 5789071 5757816 5708850 5585538 5543815 5396415 5295884 5302316 5226840 5144779 5067101 4995091
4278 4995091 4883986 4706961 4568256 4510048 4341269 4228258 4140046 4051151 3923579 3797510
4268 3797510 3766480 3673742 3611022 3630890 3582315 3490719 3508925 3446774 3454552 3407696 3390022 3411341
4256 3411341 3408040 3495075 3495456 3505558 3553787 3596812 3611605 3587900 3585858 3524159 3491326 3435104
4244 3435104 3409385 3362079 3309276 3290087 3257837 3179078 3094575 3000680 2883941 2868502 2891352
4233 2891352 3007430 2933742 2864501 2842511 2765057 2731774 2704622 2641011 2710970 2710591 2756225 2751484
4221 2751484 2746177 2789202 2860846 2923815 2913958 2905147 2895834 2895185 2907883 2947491 2952587 2900853 2891899
4208 2891899 2882249 2845653 2865382 2810502 2797184 2839936 2830722 2790249 2771326 2724144 2693809 2624702
4196 2624702 2540507 2515523 2458647 2421287 2368277 2360288 2350630 2357013 2340877 2318269 2317770 2360738
4184 2360738 2437702 2496271 2534210 2516874 2588420 2592261 2633207 2619175 2580113 2560842 2590508 2582051
4172 2582051 2578025 2547528 2532974 2566607 2629847 2604682 2610799 2614919 2627796 2631798 2663156 2686027
4160 2686027 2658582 2705892 2691074 2681040 2758070 2752233 2658439 2640521 2694698 2689381 2628287 2522150
4148 2522150 2471112 2478278 2448535 2439067 2372556 2390378 2410563 2426956 2442345 2476583 2580762 2605396
4136 2605396 2610273 2664324 2762875 2868919 2916987 2992801 2972708 3015560 3094567 3050466 3057881 3075467
4124 3075467 3016266 2970699 3058213 3050841 2992493 2921306 2851539 2867861 2864970 2797114 2804617 2799230
4112 2799230 2785587 2836241 2844758 2872797 2855876 2861792 2874223 2881808 2863663 2859605 2892798 2874396
4100 2874396 2842376 2837927 2903274 2883317 2892233 2942978 2878328 2893681 2891316 2940484 2970663 2954735
4088 2954735 2980578 3007442 3045258 3082150 3043164 3097652 3060375 3101286 3096539 3102823 3199126 3284495
4076 3284495 3291776 3339216 3376765 3419361 3547081 3624547 3734084 3804465 3882697 3965653 4056235
4065 4056235 4116084 4242430 4366957 4514419 4749524 4990395 5190600 5410822 5322052 5003865
4055 5003865 4661347 4388733 4169340 3870055 3640386 3522556 3438010 3375757 3328856 3251583
4045 3251583 3214858 3177830 3157288 3158106 3158179 3221144 3200131 3210822 3206323 3176356 3135058 3132272 3143775
4032 3143775 3117741 3105348 3155867 3155010 3215124 3193471 3157406 3188494 3219551 3240299 3258504 3258258
4020 3258258 3311682 3319637 3344060 3416328 3424274 3469813 3450223 3477892 3466814 3491227 3543094 3578414
4008 3578414 3583243 3525376 3573099 3656678 3633003 3600503 3612607 3577405 3593752 3583048 3626766 3678475
3996 3678475 3794936 3985832 4036390 4061077 4152840 4287359 4382815 4486600 4591837 4676596
3986 4676596 4781076 4951765 5055136 5118211 5233194 5376711 5557653 5688556 5821310 5922887
3976 5922887 6086441 6296097 6463543 6749690 7031840 7351552 7705959 8150660 8636994 9233552
3966 9233552 9880650 10607590 11446165 12491706 13737154 15224999 17014085 19149824 21490903
3957 21490903 24062845 26632886 28415052 28072872 25692069 22858595 20202448 17746594
3949 17746594 15648679 14045614 12806553 11914488 11274156 10800730 10401300 10127170 9889137
3940 9889137 9693004 9460344 9236121 9029592 8869898 8765442 8661666 8638009 8614247 8611954
3930 8611954 8669424 8797929 8973776 9203601 9408864 9661048 9944365 10250312 10598420 10973426
3920 10973426 11315064 11722529 12200108 12608809 13036154 13506120 14016508 14595519 15111457
3911 15111457 15746017 16617410 17558820 18567264 19708329 20922432 22403102 24040862 25871459
3902 25871459 28085416 30622752 33464525 36547103 39894509 43593930 47535002 51641027
3894 51641027 55482408 58226660 58967647 57374789 53919737 49589925 45100376 40977464
3886 40977464 37359006 34302649 31770319 29597927 27729589 26141681 24955170 23926302
3878 23926302 22908518 22017748 21279301 20602073 20049831 19606940 19234695 19044248 19029000
3869 19029000 19088114 19187966 19127707 18942306 18742838 18542099 18306975 18209197 18168387 18163251 18147899
3858 18147899 18195724 18231434 18225920 18235093 18414573 18550918 18691526 18885787 19135967 19349464
3848 19349464 19590678 19836868 20038965 20214746 20381670 20560829 20822361 21105563 21647892
3839 21647892 22488957 23388183 24225984 25131150 25874048 26478817 27152448 28243937 29489886
3830 29489886 30818058 32161135 33379944 34753382 36307927 38012408 40087479 42323118
3822 42323118 44687257 46999372 49397097 51783646 54157114 56743884 59778394 63239873
3814 63239873 67315959 72264691 78008770 84353279 91268220 98950803 108097514 118599834
3806 118599834 130552023 144353691 161193184 181954414 207275034 238066988 275292877
3799 275292877 318591511 366521003 416242993 456295105 455923092 407666776 349958584
3792 349958584 299103835 252272891 211974598 180410490 156223402 137349483 122313625
3785 122313625 110072171 100197252 92025611 85172978 79450286 74701672 70576438 66478021
3777 66478021 62328879 58287547 54631114 51481861 48680234 46325701 44222585 42515644
3769 42515644 41127657 39982228 38961448 37983748 37078096 36207849 35326757 34343656 33274774
3760 33274774 32316821 31418041 30638838 29841826 29092253 28464801 28053122 27708600 27465789
3751 27465789 27127148 26723342 26299284 25888717 25473331 25085208 24741628 24442881 24254371
3742 24254371 24159669 23987341 23787055 23533381 23279939 22960089 22418723 21643929 20810013 19972914
3732 19972914 19236695 18542104 18006679 17440691 16950167 16454513 16075915 15738160 15310116
3723 15310116 14923892 14483082 13949979 13460361 12906174 12382615 11997878 11559969 11170577
3714 11170577 10809488 10546363 10270931 9985622 9728360 9399671 9062090 8751054 8483182
3705 8483182 8262934 8171142 7972732 7792303 7654056 7472653 7374026 7327851 7234509 7100407
3695 7100407 6849018 6639415 6488794 6387082 6228416 6009199 5860826 5695369 5461610 5314699
3685 5314699 5062161 4877198 4839313 4654369 4515426 4406014 4242161 4144225 4051752 3878005
3675 3878005 3849586 3816766 3789023 3824989 3869127 3926740 3947243 3940762 3958322 3980398 3923683 3869703
3663 3869703 3821007 3780124 3776831 3707734 3671244 3655508 3534554 3464655 3350728 3248240 3108635
3652 3108635 3057739 3028590 2991669 3014022 3091661 3082051 3062682 3099852 3079213 3028686 2918396
3641 2918396 2828132 2795135 2730441 2675585 2716901 2695812 2677658 2569091 2548012 2512133 2460255
3630 2460255 2453855 2459721 2416696 2361697 2261557 2206778 2164236 2172551 2145156 2055691 2030250 1973849
3618 1973849 1875741 1816086 1791174 1766002 1717326 1668796 1667496 1651612 1652451 1648451 1658288 1698848
3606 1698848 1783667 1842561 1831677 1863011 1848379 1815111 1852383 1938247 1985688 1916467 1923136 1910621
3594 1910621 1898969 1862451 1745101 1713190 1738032 1728274 1655646 1617806 1588148 1650080 1658665 1634313
3582 1634313 1616959 1570304 1523621 1537916 1481203 1402360 1398674 1391017 1356699 1401272 1405545 1405787
3570 1405787 1388674 1386367 1371245 1424004 1415494 1462309 1516090 1465749 1408766 1437932 1489556 1467844
3558 1467844 1487453 1508741 1496394 1490400 1512725 1536063 1541936 1502867 1579901 1614417 1643893 1676540
3546 1676540 1660564 1695801 1779072 1857345 1899677 1915612 1969406 2058832 2200984 2335256 2504130
3535 2504130 2702991 2952241 3221935 3464061 3633517 3628412 3443638 3134160 2773261 2575690
3525 2575690 2411889 2236180 2103451 1921361 1779099 1739725 1708649 1629647 1549498 1513922
3515 1513922 1473099 1417303 1431189 1411080 1358287 1366525 1348102 1321927 1289694 1240319 1250188 1251555
3503 1251555 1205991 1229536 1200229 1183589 1105220 1053786 1087013 1138611 1061686 1021864 1094535
3492 1094535 1103313 1060184 1056797 1047254 1072368 1034381 1019848 1031183 1022849 1098215 1065192 1037185
3480 1037185 1048965 1088698 1141889 1144968 1066118 1082326 1133555 1193318 1213806 1242136 1300901 1283460
3468 1283460 1295409 1393132 1478591 1474808 1541445 1609170 1638377 1693023 1659261 1626473 1630842 1649402
3456 1649402 1645548 1651785 1625733 1681355 1688029 1669095 1710190 1684550 1661731 1637818 1615813 1513992
3444 1513992 1442704 1390760 1374060 1266470 1251963 1189639 1097638 1097652 1133280 1120267 1105768 1115556
3432 1115556 1136409 1114027 1014415 1068551 1079876 1100192 1096977 1071224 1066880 1098577 1073321 1066363
3420 1066363 1103141 1178847 1175113 1155330 1128716 1100184 1157410 1079919 1057688 1080159 1127368 1154435
3408 1154435 1148965 1212362 1271325 1301743 1363114 1377414 1432669 1498951 1546140 1575565 1628340 1557354
3396 1557354 1585041 1626995 1620611 1679774 1710983 1733321 1762099 1876313 1939242 2001946 2063502
3385 2063502 2076353 2106608 2198329 2229060 2295711 2335179 2337889 2457937 2512186 2529132 2582668
3374 2582668 2609813 2627727 2586949 2711579 2718086 2703332 2681448 2676583 2650064 2655381 2637182 2583540
3362 2583540 2523729 2500489 2402873 2328975 2328456 2335904 2310051 2274617 2243622 2158202 2125595 2131054
3350 2131054 2157820 2201479 2122178 2153159 2162636 2190346 2255192 2212596 2151136 2213229 2330948
3339 2330948 2321999 2334715 2360746 2335059 2314346 2388202 2380110 2365633 2349024 2386965 2385372 2436782
3327 2436782 2426858 2408999 2408012 2440509 2482370 2522442 2473953 2519829 2505519 2576730 2658454 2676318
3315 2676318 2664845 2700941 2758326 2878809 2932225 2927933 3055459 3121007 3147007 3244895 3273003
3304 3273003 3303439 3447697 3594976 3733335 3787550 3957763 4121957 4184589 4217533 4334795
3294 4334795 4464378 4502299 4579239 4656440 4727692 4797977 4783708 4818756 4816347 4855896 4932593
3283 4932593 4964529 5004657 5063950 5102376 5069505 4988866 5040427 5007387 4960515 4894328 4894430 4876651
3271 4876651 4848045 4829111 4817946 4800557 4760670 4736854 4756439 4807699 4729252 4705817 4759107
3260 4759107 4878624 4890245 4955467 5007415 5034707 5060612 5030173 5122596 5195253 5335434 5399036
3249 5399036 5459194 5530290 5578459 5644347 5735602 5842403 5908846 5995496 6109606 6189978 6285153
3238 6285153 6364469 6490289 6592968 6712399 6851708 6939277 7063798 7125470 7204567 7252821
3228 7252821 7334518 7430451 7486740 7555615 7704470 7740122 7853001 7978043 8098621 8262693
3218 8262693 8369369 8471775 8625972 8806241 8943307 9145880 9436996 9617825 9821163 10059579
3208 10059579 10243332 10513215 10745492 10821397 10951208 11163003 11299112 11359223 11440646 11504511
3198 11504511 11568138 11589702 11646565 11635778 11580205 11600131 11554935 11470139 11439420 11275513 11174103
3187 11174103 11064844 11007059 10885115 10727579 10575119 10515744 10325916 10147542 10047561 9883432
3177 9883432 9805531 9596358 9424364 9280380 9104624 8902687 8834042 8777849 8635487 8595996
3167 8595996 8559226 8485977 8398507 8331533 8287642 8214760 8154378 8036775 7952634 7868017 7868140 7812941
3155 7812941 7832347 7831185 7889041 7843091 7870914 7902266 7898797 7956837 8010107 8052506 8058503 8144133
3143 8144133 8279671 8326771 8382478 8450098 8533333 8616715 8707302 8852290 8931137 9027960 9191114
3132 9191114 9286571 9406527 9515680 9640450 9755949 9870072 9982390 10091832 10199146 10286724
3122 10286724 10528993 10678697 10782278 10983731 11107775 11273668 11498298 11697115 11848539
3113 11848539 12063255 12253198 12417854 12627234 12857323 13097719 13315226 13546298 13787514
3104 13787514 14085070 14302548 14648810 14946139 15211602 15572188 15909617 16255238 16575400
3095 16575400 16962263 17397346 17793350 18171260 18596146 18996667 19455968 19898696 20329655
3086 20329655 20676616 21013916 21355772 21653759 21755475 21784351 21835633 21822930 21825858 21851584
3076 21851584 21933407 22034095 22176014 22361316 22473167 22636513 22889264 23074120 23317062 23556616
3066 23556616 23832660 24159410 24515758 24840788 25278915 25738993 26248349 26714259 27160755
3057 27160755 27655886 28093772 28563237 29110381 29486487 29999118 30450507 30881368 31426053
3048 31426053 31935619 32419420 32969570 33471095 33946549 34496955 35101775 35593563 36035920
3039 36035920 36444501 36837495 37310854 37713475 38066181 38286463 38581180 38772860 38774055 38752624
3029 38752624 38628419 38393412 38071040 37654334 37117930 36461516 35773210 34998589 34188049
3020 34188049 33374925 32585335 31712836 30827700 30008691 29187108 28350165 27552686 26755317
3011 26755317 25936142 25145410 24376901 23608593 22845384 22084188 21403963 20738105 20067044
3002 20067044 19395826 18782692 18189737 17634431 17161548 16735323 16350349 15952568 15623031
2993 15623031 15285423 14979589 14726005 14562903 14380592 14144894 14010484 13841093 13766920 13680908
2983 13680908 13581679 13531447 13465174 13384117 13361973 13325740 13215870 13236165 13244740 13190376 13126659
2972 13126659 13102687 13087687 13016176 12964439 12851456 12778174 12752504 12670404 12623256 12466992 12384436
2961 12384436 12278096 12141055 11994282 11764154 11565439 11410230 11206322 11042572 10827017
2952 10827017 10566328 10357833 10174681 10054346 9892058 9787387 9714500 9696550 9619204 9517608
2942 9517608 9547986 9516117 9441112 9447543 9451159 9510598 9535854 9534467 9528770 9535946 9618186 9641913
2930 9641913 9689776 9725962 9768708 9864064 9883789 9915582 9989214 10039100 10047699 10055963 10156904 10220057
2918 10220057 10299153 10388964 10471456 10585777 10672787 10730516 10839017 10906478 10913810 10912881 10854062
2907 10854062 10828808 10729195 10581015 10395364 10179093 9925744 9664497 9453040 9217637 8954169
2897 8954169 8725124 8483611 8287808 8103622 7954890 7742415 7589478 7486089 7363159 7269434
2887 7269434 7124291 7004695 7021639 6978663 6888695 6870848 6854508 6832505 6824980 6840060 6877503
2876 6877503 6962353 7012592 6968811 6970501 7002143 7102563 7129547 7153486 7205320 7303406 7322663
2865 7322663 7398314 7522581 7570065 7572416 7626876 7642238 7618580 7576512 7523142 7500761 7459973
2854 7459973 7450757 7328004 7228810 7092110 6999355 6861272 6681748 6466259 6309249 6147391
2844 6147391 5976298 5859407 5797137 5680965 5559656 5458689 5281173 5189984 5012142 4983092
2834 4983092 5014125 4950349 4908256 4832137 4834985 4838795 4801349 4741579 4732537 4801839 4818023 4832631
2822 4832631 4853463 4838146 4952586 4960427 5008684 5054165 5094931 5121965 5197473 5265076 5384519
2811 5384519 5447404 5596872 5672697 5768609 5930403 6074552 6190446 6342749 6584176 6783624
2801 6783624 7020744 7282163 7610026 7972251 8366731 8640605 8787577 8682307 8256502 7808002
2791 7808002 7388054 6974292 6597122 6339436 6145853 6016775 5936401 5790869 5676953 5658388
2781 5658388 5704724 5700839 5684660 5800053 5842153 5871367 5907289 5940409 6058750 6076034 6159550
2770 6159550 6221455 6397266 6503729 6558203 6681976 6854190 7025992 7145799 7260138 7401237
2760 7401237 7530263 7755935 7916797 8023735 8225703 8440855 8691113 8994315 9395000 9795914
2750 9795914 10284488 10781413 11379506 12072927 12784590 13608300 14356068 15013674 15417119 15691329
2740 15691329 15934562 16156623 16303903 16318861 16262726 16223165 16242542 16131475 15945210 15879551
2730 15879551 15727896 15556025 15467561 15526740 15713479 15988911 16311847 16705380 17356985 18084531
2720 18084531 18920715 19912791 20941264 21994504 23130847 24229757 25210541 26074436 26702463
2711 26702463 27150015 27421757 27561647 27580025 27525114 27504739 27387838 27376249 27517558 27860304
2701 27860304 28375877 28981324 29906392 30960638 32166664 33420331 34636428 35841378 37115104
2692 37115104 38358777 39681335 40991203 42275909 43598302 44765526 45888050 46954429
2684 46954429 47838185 48435254 48470981 47828661 46466242 44475862 42091945 39426939 36713339
2675 36713339 34187430 31787916 29601283 27579888 25723670 24097201 22536948 21127087
2667 21127087 19873959 18690782 17612170 16706225 15856155 15052718 14311625 13657393 13052900
2658 13052900 12456918 11927308 11521906 11069275 10625748 10175688 9825219 9511566 9249298
2649 9249298 8896799 8581730 8267094 7981162 7736097 7516139 7266260 7047045 6815277 6662221
2639 6662221 6550026 6362199 6115617 5908897 5748683 5555842 5415880 5209735 5074731 4960268
2629 4960268 4793071 4611911 4487606 4368602 4215748 4087466 3932969 3832206 3725160 3625991
2619 3625991 3545178 3477171 3374812 3254071 3207521 3121288 3071627 2990213 2894796 2867354 2823267
2608 2823267 2743547 2613130 2528285 2458260 2436638 2394310 2287370 2246128 2200219 2189230 2083629
2597 2083629 2082979 1990102 2028212 2006723 1885874 1932680 1867847 1834228 1791297 1776151 1671145
2586 1671145 1609951 1595575 1586746 1554779 1495479 1490752 1479045 1436784 1380164 1330086 1289510 1275246
2574 1275246 1230479 1229540 1223151 1251731 1316229 1249488 1172817 1217494 1152510 1115839 1121029 1084577
2562 1084577 1091087 1093525 1058972 1082876 1109466 1045954 1051224 1063795 1015028 1075066 1095723 1012240
2550 1012240 930207 944238 958802 981544 1007104 927718 857352 885502 861907 904360 912687 870283
2538 870283 814432 798050 846123 822341 798339 801491 761059 674485 745305 777293 785741 782746
2526 782746 782627 726390 700552 719808 688598 635128 619558 640376 677832 676068 661276 664512
2514 664512 597286 646679 638357 579730 559602 624934 648769 600703 567662 565356 598341 611033
2502 611033 609993 592102 610628 597263 591164 587198 608532 591108 557016 585802 561112 567145
2490 567145 553691 518638 526586 515809 507700 536600 551256 529385 601437 581015 466248 528982
2478 528982 533208 478921 481699 507765 534671 492200 509615 521087 495772 500964 482728 459043
2466 459043 518676 504474 487787 510283 502972 479945 419867 474677 491046 482247 498738 468241
2454 468241 458806 449375 495576 523199 537107 502334 482970 424618 418861 410242 427291 399805
2442 399805 387795 448512 525179 499579 460323 460084 483471 482635 443805 477041 449741 444277 444433
2429 444433 441860 436289 452423 434103 475326 492321 416910 407437 399262 399281 352417 329399 372601
2416 372601 396936 355094 294374 287164 293440 328108 281738 263531 286531 256002 262402 222156
2404 222156 232166 228707 231263 230014 234592 234637 214256 160137 207711 298721 226863 209649 225022
2391 225022 217360 242124 143579 105789 127127 146483 178136 108274 133880 131208 187492 159203
2379 159203 73726 130336 185487 119827 126715 137729 176125 173921 182057 172474 149425 111633
2367 111633 80532 141709 132318 102207 148002 142407 88923 79647 59421 68683 111710 87992
2355 87992 94335 170875 195731 199854 169175 126950 73221 27544 97864 83170 101095 106873
2343 106873 95879 85752 102284 93554 113868 113033 112884 118034 147599 116209 72453 72105 68850
2330 68850 42550 38853 38909 57896 84206 117519 87727 81441 39426 5471 82796 67243 110211
2317 110211 84959 31704 13414 72027 97110 83155 106791 110001 75985 96347 55935 76611
2305 76611 99947 110090 95610 73776 84857 61370 69141 127964 120210 145775 153582 130705
2293 130705 158678 127984 141017 124334 98975 96571 58464 60799 53891 71641 35813 51754
2281 51754 54490 75384 46952 97080 162695 120215 57398 77235 54062 100371 63461 70233
2269 70233 97263 136380 121627 102438 136478 106505 73039 102157 75220 69893 59259 23427
2257 23427 64083 69517 54256 38489 61694 79347 46877 4305 74558 43561 56949 116471
2245 116471 70809 1778 5713 19351 41567 44763 56937 84457 68961 16088 -8683 46721
2233 46721 29505 -34768 8833 30717 57967 31313 48506 20793 15176 842 -25540 19108
2221 19108 25336 -7813 16758 52846 62710 132404 102641 69082 -20343 973 39767 2371
2209 2371 73786 118482 80507 7077 8894 73317 83564 34626 28177 13339 11365 -23408 -25147
2196 -25147 30030 32039 11527 103234 75213 21742 -14639 -6695 -30260 -13280 38738 49126
2184 49126 89204 93899 104340 111219 67655 44086 47170 58527 76874 84038 40027 13792 14040
2171 14040 11639 9709 -10986 19576 89599 55703 32436 71119 78324 92359 145212 75345
2159 75345 37197 56812 81927 109929 99053 107930 145019 140419 142336 156621 197160 188973 199422
2146 199422 215507 210089 198081 192764 145621 123030 129846 145655 180091 113753 158657 121252
2134 121252 83664 131421 133036 206593 242915 197754 252092 247680 224757 216754 277674 268941
2122 268941 229943 220511 237037 250147 246720 261088 241052 269029 313569 321600 302083 317340
2110 317340 328889 331265 405886 386959 392651 415098 380458 369650 390231 398504 363219 440421
2098 440421 466782 493981 509478 455321 508205 537744 558091 592682 738093 783459 740059
2087 740059 738401 805805 816714 924751 1008530 1030697 1103373 1193221 1299151 1332995 1390684
2076 1390684 1449248 1553876 1625149 1751671 1945089 2101007 2373610 2575942 2774306 2978199
2066 2978199 3268438 3623911 3976303 4417081 5075234 5862447 6914275 8140104 9573374
2057 9573374 11274703 13084142 14392407 13357190 10981429 9268665 7756913 6380284
2049 6380284 5319601 4453947 3866636 3392371 3059009 2897608 2720650 2481913 2293966
2040 2293966 2132425 1985073 1865673 1762564 1588566 1456204 1322347 1248337 1173344 1083544
2030 1083544 1033043 984412 951329 923380 904210 893937 881204 817714 785475 794768 747764 725809
2018 725809 650679 602503 568516 598911 578481 549380 598929 540226 480857 459778 488326 435098
2006 435098 409001 363059 373318 409476 409188 358965 347194 265159 275476 334300 390460 309533
1994 309533 244129 254272 284732 286969 276823 249195 256788 236825 216557 275485 237058 282448
1982 282448 241261 187129 171997 240073 187423 147850 96009 146114 122722 162766 109510 60940
1970 60940 75418 129084 145661 169648 103402 67886 64901 124009 135657 59647 -8387 31086
1958 31086 78862 66809 43804 45661 133356 123519 96705 85969 88287 61224 74944 25939
1946 25939 38399 27183 46318 39450 -15428 2248 59918 63351 -961 26142 11672 15543
1934 15543 -19348 -14315 75205 88400 86519 34683 23346 29377 49185 90125 76615 62331
1922 62331 67889 36623 38522 39469 6831 6128 60373 58982 54325 43415 -16187 19276 53733
1909 53733 50355 61091 59650 61299 58434 21608 -18874 8245 -18062 -64519 -53824 -14260 -24540
1896 -24540 2897 2033 -26287 24882 5674 17290 5949 25133 7449 -43263 -32008 -95416
1884 -95416 -62831 22281 14767 -69599 -60538 -68495 -56218 -68080 -33408 -6168 -41392 -96041
1872 -96041 -24780 -40690 -12560 -4304 -35209 -17070 -14779 -22511 25170 4069 -14109 -39408
1860 -39408 -48071 -58258 -46636 -67310 -62181 -47058 -36174 16733 24155 6539 -13302 23402
1848 23402 27805 -37940 -51981 -32441 -69854 -34505 30470 -17927 -22321 -12631 -34109 -74590
1836 -74590 -13612 104338 52102 129 19785 55248 43380 46748 44413 19221 40164 23827
1824 23827 35486 88156 31777 40029 51256 85314 49986 44451 6945 3816 37441 105559
1812 105559 143424 113208 113398 75824 51689 16064 21907 61947 -37107 -36109 -5936 -30158 30411
1799 30411 21000 12106 41084 33021 8203 22750 9990 -51927 -44405 -40194 -33489 -45834 -62484
1786 -62484 -105999 -75063 -22714 -18250 -36435 21001 62936 41413 -1827 -17964 -28120 -25264
1774 -25264 -17040 4454 -53806 -45175 -18094 -60106 -40704 -6280 -14316 -23268 -19640 -29295 23156
1761 23156 27074 21064 -22295 -51042 2223 -24073 -54289 -40191 -64212 -84028 -59725 -46199
1749 -46199 -47910 -48837 15740 -16281 -24178 -35479 -35596 -31521 -46185 -138372 -98529 -66067 -50793
1736 -50793 -67794 -88887 -46470 -21861 27995 8995 34208 62964 35847 15422 -26682 -81122
1724 -81122 -24406 28748 -15888 -24063 -17874 -8582 11480 -15532 -30335 -29971 -30550 -12331 -15288
1711 -15288 -22557 -35868 -38372 29730 -30245 -33828 -23300 -31193 -15860 15327 -6402 -50337 -53193
1698 -53193 -33581 -28770 -19622 -30217 -19861 -76062 -51439 -40626 -21017 -8936 -38493 -27061
1686 -27061 -17552 -56587 -215 18963 20097 -54653 16814 69 -14411 -25274 -31980 -29750 -21738
1673 -21738 6061 1988 19197 -15421 16430 -8675 -79603 -50673 -7590 24975 19837 30733
1661 30733 42111 25413 -11977 -35117 -42602 -20140 -37112 -63710 6045 2122 754 -66498
1649 -66498 -93723 -86133 -44704 -32057 -23163 -7819 -36359 -12871 10628 -19528 -7988 -36395
1637 -36395 34874 -6528 -32768 2413 49122 24598 -31746 -46730 -75258 -47174 -27928 -4030
1625 -4030 -20611 26916 -44588 -41204 -27339 -32657 -30362 -28278 25970 20014 -318 -55525 -72400
1612 -72400 -16569 12742 -5612 -11386 -6398 -59906 -3434 -9682 -36849 -24271 -67517 21940
1600 21940 6636 -36168 -19649 -1469 -49681 -51630 -14254 -29009 -100934 -51070 -17451 -12488
1588 -12488 -29123 -16236 41548 36615 -2104 -15788 -85854 -108723 -77956 -44360 147 -37942
1576 -37942 -53824 -5088 -36887 16046 29120 48047 33193 -21508 -76467 -97831 -68441 -15291
1564 -15291 -17125 -107193 -6669 37847 21504 25937 -8788 -6443 -21881 -5082 55022 -12762
1552 -12762 -13369 -53879 -84230 -80217 -56285 205 -15179 35814 25196 -6632 -38804 -23512
1540 -23512 -5107 3939 -2735 -36570 7519 34144 -42903 -39208 -83560 -66356 -57090 -78414 -73511
1527 -73511 -9042 -37089 -80190 -37037 -12886 -20696 -61288 -54158 -21684 -23720 -77059 -53678
1515 -53678 -20568 -43412 -44089 -41865 -96991 -96215 -45011 -69036 -82050 6675 46744 36081 -38514
1502 -38514 -46983 -37736 2320 21599 32 -5750 40901 -15524 -16090 -25555 -81732 -85090 -72347
1489 -72347 -57591 -18968 -52798 15407 -12073 -38721 -97665 -91403 -40730 -61022 -106209 -97973
1477 -97973 -43351 9267 -28559 -35536 -37772 -43682 4935 25858 -40469 -67272 -48286 -30202
1465 -30202 -8944 -44562 -56665 -29490 -25217 -68031 -28595 -46416 -18267 -26229 -34774 -24891 -12907
1452 -12907 -42425 -56070 -43771 -7445 -2798 -52442 -87856 -60902 -17443 -58540 -64095 -37698
1440 -37698 -29271 -63220 -36001 4056 -29554 -17081 -59524 9578 33016 -516 -45629 -12526
1428 -12526 16344 -8257 5979 -50236 -71909 -58754 -104794 -73478 -42438 -56806 -69125 -70774
1416 -70774 -87247 -67685 -111744 -129563 -112828 -64232 -24987 -40185 -20231 -40924 -33494 -50903
1404 -50903 3324 -46435 -31327 18402 -7063 -44765 -72467 -24622 -89485 -71664 -65741 -45276
1392 -45276 33876 -15917 -20410 -19924 -83778 -55545 8499 -44555 -64123 -14435 -20084 -61592 -51699
1379 -51699 4353 17732 14637 -25156 -40461 -1955 -8720 3784 -87636 -80539 -62131 -58524 -23724
1366 -23724 -4985 -38711 -67141 -57181 -37198 2123 -25565 -38958 -40540 -38376 -18076 -42
1354 -42 22844 -36993 -40053 12927 -29760 10626 -28660 -69295 -49422 -12996 -43036 -5690 57858
1341 57858 42032 30615 17715 -44754 -40859 -43707 -850 25042 27302 18814 32001 8294 -46638
1328 -46638 -39422 -38552 -41356 -28321 13529 -5075 -89074 -36418 -10677 -39467 -7722 1297 -57534
1315 -57534 -69931 -43322 -30348 -67597 -7358 34160 -8148 11085 -32427 -60742 1587 -4774
1303 -4774 13114 -19502 -85973 -83487 -97761 -89108 -85864 -38268 -15509 5985 -33243 -22581 -91929
1290 -91929 -6142 -36825 -102318 -84308 -34881 -13699 15270 -26098 -41591 -38230 -12301 -15861
1278 -15861 -20501 -21941 -50222 -12379 -17514 5682 -18587 39316 -17310 16487 65310 42910
1266 42910 32662 -42650 -12667 -52561 12093 -29349 -39642 12989 -954 957 -10650 656
1254 656 35328 7572 -68277 16397 69680 28593 22214 35449 -17467 -6277 -53001 -21820
1242 -21820 7394 60729 73041 -221 -4623 23888 8481 9963 613 -23525 -7703 33633
1230 33633 3025 -40560 -34875 -17134 19634 16751 -36138 -38367 -13643 -38948 24151 -5088
1218 -5088 -23384 -30024 -5351 28502 -1624 33377 52163 -35472 -44255 -2236 25208 18316 -9421
1205 -9421 -41567 -8174 -21591 -27588 -7358 -40656 -70153 -57645 -47532 -32720 14564 33212
1193 33212 -1394 3231 -10979 10134 12730 -68193 5277 18838 -992 11982 -9574 -41138
1181 -41138 -2874 -63387 -36329 -102269 -58386 -42724 29219 37268 10836 26942 47125 21240
1169 21240 -10112 51857 33858 -13440 -57943 -40418 -44627 -19048 -66076 -76097 -73334 -43377
1157 -43377 10252 17781 -42507 -31553 -39239 -45175 -5028 37147 19500 70292 7347 4181 56568
1144 56568 38138 -8206 -6281 3023 6015 -59766 -60369 -32267 -32829 -57074 -74666 -27062 -64614
1131 -64614 -36880 14611 -18310 -82867 -57815 -42459 -34193 -69194 14361 65885 -16415 -33572
1119 -33572 -61662 -16961 -9427 -34678 -66661 -25988 40056 -63475 6395 -9899 -4347 -24968
1107 -24968 -38529 -27511 -13884 -27686 -44197 -31938 29527 9326 -24768 -41737 -17012 -4321
1095 -4321 -44172 -69121 -64497 -46302 -26185 -14164 -47280 26996 -26927 -29530 28172 -7961
1083 -7961 463 -26587 1512 37280 -10293 17602 15096 -209 -6918 5803 15216 39621 -10767
1070 -10767 -20775 -18757 -4537 14271 37806 -32263 -28200 -48978 29626 38783 1970 -44514
1058 -44514 -29922 19757 -3497 -2007 -34913 -45764 -47471 2845 -48 -12502 -29167 -76656
1046 -76656 -54004 50723 30160 16112 2332 -23873 3421 -13464 -57228 58652 11737
1035 11737 -36232 -18238 16795 29692 20136 60750 68310 36740 12549 -10436 -5608 16454
1023 16454 -18011 29925 -10331 -1641 -4587 -24340 -37369 -43751 -480 25520 31930 7623 -6258
1010 -6258 -47296 -12635 -9457 -53271 -62935 -2837 19579 23626 25158 54729 31346 -7875 55614
997 55614 43585 5623 9902 5709 -493 19141 -8104 33048 43287 31910 74481 40706 5856
984 5856 41995 76567 51742 40586 20364 -34052 -35015 -28323 14833 28201 45601 45146 26378
971 26378 -12325 -13466 -7534 19473 -23741 8462 67044 64538 7513 14508 17291 10906 62322
958 62322 58485 55574 21068 -40205 -54766 -13601 27163 33357 -21965 32404 23856 9854 -12813
945 -12813 14893 56802 76410 72865 50117 -1970 -19662 24169 28608 -16912 28484 37211 36870
932 36870 -32805 2141 14089 -18234 -30574 -43609 -34025 -45617 3893 13079 11744 -20178 -21316
919 -21316 -3200 10139 -36838 4371 31026 -17050 -4817 -60384 -46952 -43671 -63603 1499
907 1499 23934 57249 35853 10826 -27808 22196 40806 15045 12248 13172 -4153 -34081 -19099
894 -19099 1692 16042 16606 -5426 -20996 -41657 -35815 -6948 -80921 -78531 6014 6796 14616
881 14616 -27999 -82455 -6988 48543 6536 -36745 -5607 -25249 -37989 -53837 -7540 22483
869 22483 16260 4688 -51740 -69672 -43636 11678 23268 5794 7749 -4376 -31162 -58846
857 -58846 -49512 -27457 1869 -28805 16138 -10173 -11930 20957 41589 9151 -76268 -4703
845 -4703 -10298 -38365 -13379 45574 33216 554 -56152 -64647 -41299 17228 40615 35486 32691
832 32691 3562 5838 12851 -30638 -90006 -49622 16798 20920 14535 45756 49332 47090 52397
819 52397 6089 -28158 2348 39652 11746 34075 42391 30205 -5934 12005 -724 -53473
807 -53473 -56831 -41235 487 1993 17464 30173 8190 39520 -7720 41468 43820 -10808 -1303
794 -1303 12213 22216 42346 36685 52869 18614 19793 10991 -21998 17246 -3894 10681 40352
781 40352 33748 11364 24699 24296 -18019 15085 68608 47841 13306 24124 42629 11290 35317
768 35317 23150 50175 -2948 -2730 -1454 -15784 46774 63691 -17291 -12376 22464 40405 65129
755 65129 20132 41580 7018 2186 36941 28243 27833 43030 60746 7965 -5960 -48864 -30620
742 -30620 -82685 -41147 44252 38765 -6873 -28110 369 -25487 -18710 -59134 -37435 -47448
730 -47448 -49441 19752 13602 29346 27861 56557 68130 29292 20069 24472 14507 -18845 -15042
717 -15042 -36119 -41988 8344 44708 32594 56641 22372 25744 57117 9905 7503 33961 24684
704 24684 20438 -47987 -45238 30015 35366 30594 5771 20059 72282 49780 53821 89072 108115
691 108115 42046 46281 67884 39118 17280 -13065 27469 63054 37632 36035 78130 97824
679 97824 94611 34086 -23106 -29125 26977 25932 8599 8493 -29474 31992 -20867 -35288 3077
666 3077 -14556 35572 -14442 44020 35266 17290 -6307 -23627 2914 61828 -15761 -55765
654 -55765 -7536 48424 21758 -3557 -43101 16159 -2239 -31308 42665 7379 2533 29646
642 29646 55841 -7214 -33019 -62314 -31733 875 -2598 -3995 42301 29919 -9230 16322
630 16322 55537 16713 -14581 30990 17393 -50531 -15796 23613 17439 23593 40401 4701
618 4701 -27990 14115 25183 -30984 11747 -14700 4266 3740 -18431 -2125 3950 43447 59424
605 59424 116366 92241 87864 3784 -47812 -25650 -49014 -8173 1168 24806 30720 -7379 -14148
592 -14148 73187 116002 92648 -21192 -6334 21498 19437 21843 89599 139174 111424 35100
580 35100 66130 59191 98160 23301 -24387 23546 6034 6164 -25114 678 15744 -7746 -41950
567 -41950 38582 69323 47075 20355 6103 63630 25397 34788 113887 87159 42060 54164
555 54164 48681 117125 53562 33221 82532 140464 109556 12980 47831 86149 90221 32980
543 32980 55850 -38938 -31919 31818 22247 39749 26443 11313 58023 1011 38498 -8914
531 -8914 18250 -276 24671 29587 81634 58455 27031 21315 -10342 11813 14533 36182 40288
518 40288 22447 24076 38618 97165 75850 13971 -5077 44277 38257 61425 49232 36685
506 36685 18568 47361 28416 19944 -28574 -15143 -47162 -24858 49225 37442 80381 43264
494 43264 21093 59133 46050 37339 125484 65699 38066 19315 45488 -5013 23978 40226
482 40226 10614 -10188 66745 27849 -11619 75215 79124 30721 6699 46316 86094 110464
470 110464 43620 -22466 -7398 4375 28428 1992 22098 68229 165865 64059 -331 8115
458 8115 38127 20291 3173 48274 28085 19075 64316 57127 91154 77771 51839 9704 4807
445 4807 -48946 -9982 8434 -8284 14296 5914 20348 8902 -20795 -18309 -8628 -51442 28731
432 28731 96043 87072 102274 74616 59599 29889 12179 64923 24665 -28023 2881 43988
420 43988 32295 78882 34794 40061 -272 -29316 21818 39932 17249 14017 9596 23866 1936
407 1936 8601 -30335 -17739 -29424 2311 -1452 -46880 -36415 -42539 -41132 -4805 15561 48305
394 48305 13652 -24636 -15040 -7695 13283 11218 70369 76277 105431 52623 6214 14073 47115
381 47115 67803 11442 -17574 -46562 -44730 -65982 -72756 10579 3664 -46806 -52316 3176 5325
368 5325 -1412 -40839 -32691 -35673 -2642 9461 24805 17737 53165 88658 35227 29363 43243
355 43243 100198 36245 33935 28826 -9827 -57379 -20231 -21075 -8059 -33219 -10720 4363 -35731
342 -35731 -1532 -21992 5362 -33934 -31604 21332 28664 -5530 22995 36086 59822 30048
330 30048 2112 3039 -504 44923 26948 9201 -23219 -76744 -55358 -36449 -3819 -31156 -75254
317 -75254 -6884 22185 52822 29886 27548 43843 -3771 -20451 7403 -3690 16507 -1438
305 -1438 -16168 -43285 -46142 -733 4872 5112 -54138 -37179 -14332 18221 15855 -17317 -2831
292 -2831 22265 17576 -18962 24039 34557 -23909 -13571 28778 32247 11498 -30954 -17489 101
279 101 43008 19178 10719 13653 32635 13827 55511 92789 16753 38907 18521 408 -22135
266 -22135 -10587 21327 77845 14897 -47571 -38187 -42352 -51038 -94864 -3367 18222 8831 43063
253 43063 47975 41384 -13401 -64440 -17113 -23797 -28639 16154 -6311 -23987 31880 54889 -21208
240 -21208 1561 -37879 -28579 -14190 -57528 27676 19742 5089 -4356 -8833 9700 12059 -949
227 -949 10542 74342 19255 -29543 10344 30940 -2158 -19021 2097 -13590 -13874 45844 79140
214 79140 92292 38706 7100 -1972 -24664 1630 18601 8532 -3662 859 -24750 433
202 433 2244 -53682 -29699 -15491 -9132 -22972 -36118 -45082 -33157 -39506 -38820 -29686 6206 -8059
188 -8059 -7982 -28020 -28846 5155 -61688 -42290 22622 11455 26889 -10248 -60832 1943 -4839
175 -4839 -16216 -30192 -225 30635 26457 104644 70731 48979 76602 35937 41052 2215 36585
162 36585 25768 41645 37079 28109 11807 -29432 -27893 -19787 18815 19518 12801 -13907 -21323 -20408
148 -20408 8692 -10333 9579 -20583 11927 15229 30375 48902 55071 49759 6786 -22034 28914
135 28914 15493 23436 49495 40313 7157 1710 29227 -20378 43907 60701 12298 16860 40643
122 40643 19033 35571 19193 -16839 -2877 4969 -7548 -16707 -28930 12251 -29164 -19544 -12143
109 -12143 -9450 29475 18073 24722 32190 -16019 1664 -32919 -48865 -49822 -13775 -35839 -10372
96 -10372 41272 9018 17265 -20873 -1113 -1497 12737 2663 20102 5754 5735 22752 6702
83 6702 41028 15924 -17976 4083 24684 24020 193 23662 4585 -33407 31763 28528 35372
70 35372 36170 51170 39205 17416 32566 10835 -28114 -9573 -1135 -32696 -36990 -36054 -11460
57 -11460 -8843 32543 -12789 -43723 -16212 -20733 5648 14687 13381 19971 18176 27731 -5896 -228
43 -228 -5594 -42070 -31104 -33224 -3450 27144 3859 -3691 15429 15371 3621 22132 13858 11694
29 11694 13457 -3124 -13806 -13451 -1564 -23955 -10875 19763 28294 4629 13921 -442 -14853
16 -14853 769 22103 20341 -838 -4792 3945 -11551 14225 48245 31564 16889 27362 25299
3 25299 7580 11234 26891
0 26891
$$ Imaginary data points
##PAGE= N=2
##DATA TABLE= (X++(I..I)), XYDATA
16383 -996701 -944304 -942107 -960152 -938671 -911566 -906209 -878335 -845532 -817030 -832116 -819093 -795155
16371 -795155 -761554 -766157 -766682 -699623 -646837 -647807 -671228 -639584 -617690 -594653 -600935 -601455 -569278
16358 -569278 -555446 -506399 -468047 -462307 -438233 -416329 -415743 -428939 -390807 -346143 -340290 -277343
16346 -277343 -295758 -258242 -275144 -281193 -210726 -220063 -191508 -164545 -139187 -106391 -113310 -89842
16334 -89842 -116462 -110652 -75633 -83553 -48729 -23009 -19943 -29439 25190 60280 87681 114591
16322 114591 83998 102879 124094 159640 177818 147063 174948 218614 241389 245205 246636 235512
16310 235512 257881 256461 284301 314210 273457 316631 355956 355898 389254 404658 422268 441383
16298 441383 428003 488713 480658 474577 538621 540490 562092 580571 600500 598631 673926 668419
16286 668419 612255 603114 686783 730248 722035 717188 751763 731033 712391 697955 772212 764850
16274 764850 773365 773413 831891 858525 827138 844922 808981 879091 906856 893177 852346 832198
16262 832198 889077 920848 960792 997869 983124 1013571 1046163 1034727 1055768 1047094 1084263 1071001
16250 1071001 1098770 1100973 1110278 1109700 1093846 1097157 1143803 1192524 1193872 1174493 1154744 1160499 1172610
16237 1172610 1155659 1177617 1244886 1232342 1274610 1289485 1290469 1268739 1273836 1313292 1335847 1310719
16225 1310719 1292363 1282834 1320275 1318962 1350214 1322640 1332838 1343709 1343797 1348682 1342131 1321767 1405355
16212 1405355 1418544 1420722 1419420 1430656 1427300 1480438 1475791 1455809 1477084 1460455 1467761 1496083
16200 1496083 1496001 1478464 1478128 1495473 1461894 1483570 1551094 1561263 1588567 1614643 1569539 1512761
16188 1512761 1539298 1549290 1558170 1571608 1541288 1543686 1555108 1619833 1629396 1605142 1612529 1633750
16176 1633750 1616716 1558353 1586928 1604997 1597480 1612114 1658559 1587955 1634554 1708550 1698263
16165 1698263 1706099 1732820 1741465 1763910 1713476 1707873 1678877 1689527 1706101 1716638 1710273 1719834
16153 1719834 1750796 1722559 1726057 1776932 1770819 1748719 1768788 1766785 1759533 1776280 1775279 1719106
16141 1719106 1748373 1756071 1781181 1774945 1760560 1752583 1817101 1776290 1778376 1786699 1825565 1815434
16129 1815434 1695007 1730183 1758650 1826599 1826769 1778806 1774037 1837895 1856632 1809469 1816173 1806490
16117 1806490 1779073 1764354 1835179 1852033 1833227 1862259 1863480 1793536 1834352 1856273 1850962 1882186
16105 1882186 1855215 1859139 1869351 1855566 1804314 1772858 1818239 1882985 1860424 1832235 1807390
16094 1807390 1814760 1844842 1810617 1824612 1902511 1886759 1830140 1818225 1845314 1875965 1861497
16083 1861497 1823042 1866879 1810087 1846235 1871377 1850358 1854545 1887964 1825022 1806959 1782144
16072 1782144 1787167 1802339 1868374 1845177 1853939 1902359 1887933 1862219 1833641 1813062 1820136 1869931
16060 1869931 1913130 1930090 1895192 1905941 1866169 1846680 1892307 1937590 1899170 1850558 1894565
16049 1894565 1950828 1914115 1831716 1866485 1909968 1850701 1799466 1827002 1860131 1940185 1939527 1885283
16037 1885283 1901682 1971857 1921980 1931504 1966247 1910391 1909648 1928304 1950494 1941556 1967004 1963602
16025 1963602 1928741 1878581 1924521 1930193 1937280 1884743 1910323 1960761 1928232 1905878 1907617 1893592
16013 1893592 1895849 1892949 1906949 1883384 1923161 1925998 1931925 1915514 1881112 1892214 1918389 1866796
16001 1866796 1868976 1865684 1883164 1889720 1899701 1880475 1908865 1925803 1892083 1965445 1997749 1925900
15989 1925900 1902750 1874622 1854741 1928666 1932824 1934064 1965573 1945600 1974186 1913386 1868029 1938739
15977 1938739 1970735 1942951 1912933 1912226 1989035 1970036 1923440 1891511 1916164 1948036 1871990 1866379
15965 1866379 1831870 1918435 1945234 1890674 1912198 1861668 1855067 1893751 1923331 1935366 1945132 1872629
15953 1872629 1913367 1961148 1939755 1916114 1869222 1920532 1956401 1957469 1902471 1948907 1944125 1937534
15941 1937534 1936599 1899101 1859506 1908660 1945416 1941707 1931052 1970171 1964708 1964909 1941465 1926763
15929 1926763 1914442 1924083 1895429 1893435 1872304 1906826 1954595 1976051 1987323 1984734 1935267 1879739
15917 1879739 1926150 1908570 1947555 1959542 1939407 1976986 2029951 1994203 1949255 1959338 1942929
15906 1942929 1946387 1939112 1945191 1960401 1937189 1921427 1943601 1946541 1991606 2010871 2008580 1952156
15894 1952156 1955279 1915068 1888098 1892329 1914805 1916453 1866853 1905109 2008229 1976194 1913533 1936732
15882 1936732 1931760 1994617 1953170 1979631 2002112 1947988 1932392 1985417 1944757 1942616 1934150 1940843
15870 1940843 1946846 1953218 1953211 2002528 1966381 1941392 1905185 1925254 2001234 1987498 1940516 1914888
15858 1914888 1984523 1908570 1948644 1986664 1948850 1951726 1968579 1982583 1938108 1877389 1870053 1855718
15846 1855718 1870043 1873993 1929833 1933996 1913737 1966510 1970143 1936119 1952503 1960843 1960400 1914775
15834 1914775 1958564 1988189 1979601 2072075 2034584 1899938 1894703 1960443 1993261 1938385 1914397
15823 1914397 1905744 1854179 1905384 1880196 1913248 1928387 1893927 1872591 1939748 1922016 1901828
15812 1901828 1920317 1883887 1900914 1931804 1948676 2005604 1929804 1883785 1894414 1917368 1983501
15801 1983501 1921519 1850097 1883817 1899830 1857595 1927941 1961042 1984271 1936053 1904549 1931704
15790 1931704 1883758 1979541 1970011 1959525 1967834 1898899 1923375 1943936 1965186 1973882 1994240 2012426
15778 2012426 2035804 1955609 1893125 1891653 1976221 1978218 1917494 1890504 1901078 1957211 1946807 1951579
15766 1951579 1945348 1925587 1913558 1968069 1983785 1933852 1938921 1963373 1921278 1938461 1972966 1949936
15754 1949936 1948510 1981137 1956946 1933667 1963426 1974713 1948985 1987318 1943699 1928567 1959027
15743 1959027 1942671 1928709 1948399 1940218 1925460 1950367 1918382 1947547 1968492 1970341 1949975 1987666
15731 1987666 1966984 1957679 1963897 1993203 1951344 1951320 1997591 1982684 1961455 1989241 1963923 1988828
15719 1988828 1940897 1924048 1968988 1917461 1967486 1995749 1961601 1924902 1908478 1932800 1951260
15708 1951260 1935148 1931516 1935706 1948054 1921686 1890871 1930264 1991223 1983659 1982209 1971137 1975015
15696 1975015 1939086 1974236 1968867 1927081 1907626 1952280 2002991 1966855 1954210 1978613 1984318 2005068
15684 2005068 2009502 1983905 1992844 1969149 1908487 1971374 1985919 1961932 1950184 1989469 1993124 1999749
15672 1999749 2022816 2047195 2034121 1976238 1964860 1987323 1977266 1929842 1933392 1959831 2010232
15661 2010232 2031802 1973210 1925570 1918927 1994903 2016817 1957022 1992557 1942898 1943735 1988783 1989959
15649 1989959 1987749 1983410 1986809 1972114 1935930 1987094 2034432 2020529 2010776 2021871 1947869 1978794
15637 1978794 1987531 1979919 1988778 1961189 2004855 2031951 2074578 2112012 2052992 2001812 2002741 2006591
15625 2006591 1938146 1923743 1936798 1957855 1987131 2000726 1996256 1993754 2027243 2065081 2070728 2022589
15613 2022589 2013418 2035224 2003679 1996090 1985213 2042224 2048942 1977154 2038884 2069483 2045364 2030731
15601 2030731 1983187 1970726 2057365 2068689 2070990 2037934 2029457 2055205 2067171 2041529 1985853 1990462
15589 1990462 2034300 1996563 1994115 2044407 2053566 2015397 2037292 2061925 2023894 2023119 2034706 2003217
15577 2003217 1959487 1928659 1954604 2020928 2000808 1973426 1995057 2047798 2022373 1997313 1994357
15566 1994357 1991724 2003886 2035346 1998569 2009969 2017549 2024142 1973832 2011674 2052993 2022949 1978411
15554 1978411 1968016 1954004 1898450 1980021 1997339 1986362 2012888 2032539 1993776 1975596 2040429
15543 2040429 2053416 2028752 2003203 2003152 2020566 1952853 2017643 2077188 2010729 2021663 1970345 1980322
15531 1980322 2055604 2041391 2051042 2022738 1978597 2038565 2076810 2048806 2026919 2008217 1997347
15520 1997347 1967823 1986166 2002940 2055170 2014342 2000171 1959245 2009225 1997196 1980034 2047611
15509 2047611 2016916 2007832 2062914 2057209 2063551 2036559 2061951 2058958 2063227 2039002 1972930 1998188
15497 1998188 1982176 2027320 2010068 1979864 1999461 2005575 2019358 2017146 2024503 2001598 1975091 1964563
15485 1964563 1974086 1962001 2009843 2007837 2011748 2045862 2005006 2002148 2017063 2053706 2063587 2037428
15473 2037428 2032145 2032039 2034614 2057208 2036200 2009870 1990164 1975013 1970048 2007111 2027941 2059376
15461 2059376 2056275 2031634 2004498 2021935 1974972 1978287 2043470 2074415 2070476 2112273 2084660 2054012
15449 2054012 2071205 2003246 2024703 2081227 2071530 1999375 2012158 2009203 2042386 2052853 2023537 1998527
15437 1998527 1998799 2013163 2022935 2037326 1980012 1962077 1963383 2025475 2055637 2044546 2026965 2055557
15425 2055557 2055965 2078023 2008927 2020807 2049838 2065951 1975315 1979733 2031339 2039971 2028531 2016873
15413 2016873 2057169 2036018 2019031 2052366 2061858 2055693 2032920 2027839 2003650 1985107 2025615 1983124
15401 1983124 1989925 1969660 2015201 2041779 2027259 2109059 2110334 2038018 2042959 2057080 2068410 2070221
15389 2070221 2039276 2039702 2062462 1998805 2002537 2014673 2027247 2098301 2071486 2015936 2007695 2092308
15377 2092308 2057351 2080791 2085946 2050598 2043742 2013055 2046084 2034544 2027070 2044838 2063169 2064285
15365 2064285 2072046 2114380 2097672 2058445 2072502 2093838 2111034 2106897 2108331 2092018 2079330 2060754
15353 2060754 2070309 2070234 2072968 2052497 2071487 2051162 2117663 2076021 2086614 2086908 2112099 2101989 2058852
15340 2058852 2083085 2066721 2040198 2101892 2101315 2052646 2095968 2062404 2078486 2057087 2046505 2067876
15328 2067876 2065838 2031037 1987028 2027438 2065484 2022464 2007751 2018691 2014432 2033965 2001918 2050760
15316 2050760 2102464 2028974 2034631 2040507 2067809 2060077 2043714 2005968 2025694 2062363 2079323 2126518
15304 2126518 2083591 2081161 2129346 2081857 2059403 2091623 2081487 2101768 2091187 2029462 2040504
15293 2040504 2019752 2060781 2101391 2092760 2145541 2112288 2047979 2071181 2061934 1998323 2022302 2023980
15281 2023980 2056390 2070539 2088917 2063139 2069338 2080804 2052069 2085119 2104310 2090795 2134450
15270 2134450 2148741 2062037 2086741 2134679 2101472 2085984 2045312 2063620 2112690 2118021 2150606
15259 2150606 2143316 2092950 2091950 2069857 2033320 2027576 2035402 2076230 2040735 2028927 2092173 2093098
15247 2093098 2078113 2045153 2036829 2027814 2035424 2017933 2068291 2134849 2107690 2077710 2092485 2060604
15235 2060604 2109130 2170224 2148844 2039755 2039453 2095632 2082198 2099707 2025415 2068238 2043290
15224 2043290 2057156 2075433 2086002 2111078 2089003 2092093 2098283 2094469 2104373 2084553 2159437 2124176
15212 2124176 2130692 2081729 2075287 2060993 2055219 2075562 2096532 2004849 2011574 2110806 2098521 2081594
15200 2081594 2026626 2048317 2080878 2095942 2038421 2049700 2104864 2105432 2119480 2114122 2094271 2094771
15188 2094771 2104693 2123465 2133181 2126201 2073334 2072301 2114579 2128071 2144609 2162103 2139035 2118034
15176 2118034 2084460 2053216 2097109 2131505 2121875 2122607 2099004 2072067 2090695 2032417 2049239 2118036
15164 2118036 2160148 2147590 2123603 2105025 2098796 2157500 2148659 2088050 2079330 2077607 2084652 2105672
15152 2105672 2047775 2041783 2047917 2097761 2105172 2158750 2134469 2082431 2074653 2087579 2112841 2148580
15140 2148580 2130867 2115094 2141868 2116861 2124697 2170415 2122463 2106685 2066832 2070977 2081096 2062204
15128 2062204 2116406 2119687 2096467 2108388 2100210 2080152 2105394 2179776 2169082 2107009 2119810 2082718
15116 2082718 2062635 2126915 2171163 2146204 2115447 2130784 2109035 2104174 2121088 2169448 2129680
15105 2129680 2136282 2121116 2157376 2100079 2088452 2139242 2094763 2086998 2135104 2145089 2103963 2096707
15093 2096707 2136911 2131991 2071908 2088247 2089571 2140386 2155940 2152600 2112942 2103284 2104734 2098361
15081 2098361 2099669 2153910 2084397 2076078 2131073 2115355 2130500 2094825 2098752 2114306 2124677 2182763
15069 2182763 2131394 2125454 2118131 2133913 2128316 2100172 2155392 2132525 2112044 2137482 2145179 2168155
15057 2168155 2148471 2116376 2135886 2118313 2105247 2089929 2029869 2063251 2102726 2093222 2064049
15046 2064049 2132958 2151023 2119234 2120013 2144389 2150466 2096206 2105187 2109926 2125578 2138058 2128442
15034 2128442 2111031 2104897 2047293 2059948 2050518 2062430 2111010 2075916 2096430 2153662 2140283 2131984
15022 2131984 2136445 2173185 2126582 2067197 2119441 2121762 2153326 2133624 2140142 2119999 2175301 2188778
15010 2188778 2131472 2122029 2107533 2078334 2146606 2119532 2099488 2094378 2092830 2045992 2096003 2148953
14998 2148953 2076320 2130911 2160477 2217163 2204182 2197203 2151990 2162841 2064618 2097922 2145322
14987 2145322 2123060 2126389 2098197 2153929 2134672 2151583 2184621 2158927 2207807 2190525 2188845 2204972
14975 2204972 2220072 2214671 2168961 2098388 2112358 2184132 2222385 2184389 2167530 2215314 2148613
14964 2148613 2210942 2191884 2154481 2148901 2131028 2121343 2169984 2188119 2167233 2210220 2173726 2166752
14952 2166752 2151636 2118115 2163156 2196355 2214168 2168432 2159330 2181925 2167773 2135859 2109704
14941 2109704 2137061 2143127 2124453 2174564 2189924 2217574 2208966 2163790 2167336 2180181 2160269 2156775
14929 2156775 2137171 2159646 2140674 2111032 2127465 2125609 2132699 2149835 2174995 2173479 2181192 2157579
14917 2157579 2204744 2191954 2156590 2152780 2163337 2123916 2140128 2160954 2146634 2144057 2146318 2125086
14905 2125086 2174369 2200174 2191611 2197022 2193657 2237600 2216047 2148758 2171987 2194550 2161868 2080503
14893 2080503 2104644 2114084 2105282 2116233 2104874 2108825 2104117 2101009 2202762 2243707 2180443 2169130
14881 2169130 2099807 2159224 2168485 2173434 2220395 2211992 2211763 2186640 2174246 2171194 2175249 2141527 2217947
14868 2217947 2203087 2145139 2141297 2146272 2153628 2186534 2244184 2200729 2156439 2168550 2233507 2207164
14856 2207164 2226189 2261268 2222413 2183183 2159284 2168789 2172671 2180571 2188302 2176672 2202022 2181300
14844 2181300 2158046 2181612 2184419 2198516 2203765 2125930 2134909 2215789 2188447 2167611 2229531 2223362
14832 2223362 2219856 2240788 2232567 2215524 2257237 2251481 2222390 2210871 2177191 2180868 2144168 2083577
14820 2083577 2151101 2170378 2204004 2216526 2198780 2212524 2180557 2218891 2208859 2179423 2196746
14809 2196746 2205469 2203530 2197354 2144984 2115143 2168169 2157815 2147138 2212404 2160146 2139100 2154106
14797 2154106 2217545 2234781 2260830 2177146 2159569 2228852 2222868 2267666 2249457 2245956 2231087 2216074
14785 2216074 2228067 2256449 2231660 2217322 2239776 2245453 2254533 2202679 2153681 2185509 2245589 2238355
14773 2238355 2214194 2206572 2190747 2221681 2195602 2212696 2235853 2232929 2198792 2239467 2182274 2119959
14761 2119959 2132745 2169835 2213630 2231821 2260436 2234725 2206899 2211318 2266591 2214153 2200461
14750 2200461 2195740 2151697 2202843 2191389 2165953 2196696 2205692 2187717 2183179 2194644 2213308 2189625
14738 2189625 2145549 2201687 2263811 2273129 2221545 2203399 2200761 2190347 2215988 2225402 2217108 2248695
14726 2248695 2187623 2131238 2180216 2225885 2263526 2238390 2199043 2185032 2183938 2195658 2167188
14715 2167188 2199563 2182463 2162554 2222812 2202017 2167196 2183365 2245338 2271750 2277880 2243606
14704 2243606 2195137 2223405 2263447 2258137 2201455 2167139 2233788 2159385 2176536 2177478 2176647 2173125
14692 2173125 2185370 2284505 2250056 2212128 2169848 2169287 2198454 2257827 2220333 2252510 2251106 2192661
14680 2192661 2216706 2241065 2225240 2258484 2316160 2314647 2266408 2217314 2242434 2181222 2112637
14669 2112637 2184540 2234341 2232816 2219490 2202876 2218757 2222796 2222787 2193620 2192838 2258499 2235082 2192652
14656 2192652 2198921 2250692 2265166 2272365 2194078 2207258 2228733 2210133 2221857 2175545 2170904 2197115
14644 2197115 2265778 2256392 2197898 2219750 2177995 2140531 2195530 2239098 2279385 2243962 2260539
14633 2260539 2290356 2280198 2200482 2177690 2220408 2231935 2264065 2279313 2252352 2252629 2217853 2225176
14621 2225176 2270408 2329180 2290175 2251967 2302588 2284163 2233508 2181411 2176526 2208735 2265736
$$ [...]
##END NTUPLES=NMR SPECTRUM
##END=
