##TITLE=1H_CA-8887-3
 CDCl3, 8 sc, 
 2.07.2021
##JCAMPDX= 6.0         $$ Bruker NMR JCAMP-DX V2.0
##DATA TYPE= NMR SPECTRUM
##DATA CLASS= NTUPLES
##ORIGIN= UXNMR, Bruker Analytische Messtechnik GmbH
##OWNER= root
$$ XWIN-NMR		Version 3.5
$$ Fri Jul  2 10:47:33 2021 Russian Standard Time (UT+4h)  she@DPX200
##.OBSERVE FREQUENCY= 200.131506
##.OBSERVE NUCLEUS= ^1H
##.ACQUISITION MODE= SIMULTANEOUS
##.ACQUISITION SCHEME= undefined
##.AVERAGES= 8
##.DIGITISER RES= 18
##SPECTROMETER/DATA SYSTEM= spect
##.PULSE SEQUENCE= zg30
##.SOLVENT NAME= CDCl3
##.SHIFT REFERENCE= (INTERNAL, CDCl3, 0, 17.5081)
##AUDIT TRAIL= $$ (NUMBER, WHEN, WHO, WHERE, WHAT)
$$ ##TITLE= Audit trail, XWIN-NMR		Version 3.5
$$ ##JCAMPDX= 5.01
$$ ##ORIGIN= Bruker BioSpin GmbH
$$ ##OWNER= she
$$ F:/spectra/data/she/nmr/H-F/1/pdata/1/auditp.txt
$$ ##AUDIT TRAIL=  $$ (NUMBER, WHEN, WHO, WHERE, WHAT)
(   1,<2021-07-02 10:46:05.89 +0400>,<she>,<DPX200>,
      <created by zg, POWCHK disabled, PULCHK disabled
       configuration hash MD5:
       00 E9 B6 7A A2 85 ED C7 34 08 36 98 17 FE 4E 26
       data hash MD5: 16K
       0D 68 87 5C 4B 90 5C D6 67 97 93 8C F5 50 23 E1>)
(   2,<2021-07-02 10:46:09.60 +0400>,<she>,<DPX200>,
      <Start of raw data processing
       efp BC_mod = 2 LB = 0.24 FT_mod = 6 PKNL = 1 PHC0 = -11912.9 PHC1 = 11.40099 SI = 16K 
       data hash MD5: 16K
       86 50 5D 02 44 6B 61 0B 3C B9 6A 47 B7 BC 89 91>)
(   3,<2021-07-02 10:46:34.43 +0400>,<she>,<DPX200>,
      <pk PHC0 = 0.8966069 PHC1 = -2 
       data hash MD5: 16K
       4A 5F 64 92 CC 9B 81 34 21 EC A7 6C 97 47 34 7F>)
(   4,<2021-07-02 10:46:37.71 +0400>,<she>,<DPX200>,
      <abs ABSG = 5 
       data hash MD5: 16K
       BF B3 D1 F5 9B B0 4A 9F 4E 7F 71 84 71 4B 98 2A>)
(   5,<2021-07-02 10:46:58.79 +0400>,<she>,<DPX200>,
      <abs ABSG = 5 
       data hash MD5: 16K
       55 52 DC 20 83 A6 80 4C 65 65 20 AA 90 D5 26 64>)
$$ ##END=
$$ 
$$ hash MD5
$$ E2 FC 51 3E A1 82 5F B2 2A 67 36 BD BE 0B 09 CC
##$RELAX= 
##$RELAX= 
##$RELAX= 
##$RELAX= 
##$RELAX= 
##$RELAX= 
$$ Bruker specific parameters
$$ --------------------------
##$DU= <F:/spectra>
##$EXPNO= 1
##$NAME= <H-F>
##$PROCNO= 1
##$TYPE= <nmr>
##$USER= <she>
##$AMP= (0..31)
100 100 100 100 100 100 100 100 100 100 100 100 100 100 100 100 100 100 
100 100 100 100 100 100 100 100 100 100 100 100 100 100 
##$AQSEQ= 0
##$AQ_mod= 1
##$AUNM= <au_zg>
##$AUTOPOS= <>
##$BF1= 200.13
##$BF2= 200.13
##$BF3= 200.13
##$BF4= 200.13
##$BF5= 200.13
##$BF6= 200.13
##$BF7= 200.13
##$BF8= 200.13
##$BYTORDA= 1
##$CFDGTYP= 0
##$CFRGTYP= 5
##$CHEMSTR= <none>
##$CNST= (0..31)
1 1 145 1 1 1 1 1 1 1 1 1 1 1 1 1 1 1 1 1 1 1 1 1 1 1 1 1 1 1 1 1 
##$CPDPRG= <>
##$CPDPRG1= <>
##$CPDPRG2= <>
##$CPDPRG3= <>
##$CPDPRG4= <mlev>
##$CPDPRG5= <mlev>
##$CPDPRG6= <mlev>
##$CPDPRG7= <mlev>
##$CPDPRG8= <mlev>
##$CPDPRGB= <>
##$CPDPRGT= <>
##$D= (0..31)
0 1.2 0 0 0 0 0 0 0 0.06 0 0.03 0 0 0 0 0.0002 0 0 0 0 0 0 0 0 0 0 0 0 
0 0 0 
##$DATE= 1625208365
##$DBL= (0..7)
$$ [...]
##$SUBNAM3= <"">
##$SUBNAM4= <"">
##$SUBNAM5= <"">
##$SUBNAM6= <"">
##$SUBNAM7= <"">
##$SUBNAM8= <"">
##$SUBNAM9= <"">
##$SW= 20.0188882624521
##$SWIBOX= (0..15)
0 0 2 0 0 0 0 0 0 0 0 0 0 0 0 0 
##$SW_h= 4006.41025641026
##$TD= 16384
##$TD0= 1
##$TE= 0
##$TE2= 300
##$TE3= 300
##$TEG= 300
##$TL= (0..7)
0 120 120 120 120 120 120 120 
##$TP= (0..7)
150 150 150 150 150 150 150 150 
##$TP07= 0
##$TPNAME0= <>
##$TPNAME1= <>
##$TPNAME2= <>
##$TPNAME3= <>
##$TPNAME4= <>
##$TPNAME5= <>
##$TPNAME6= <>
##$TPNAME7= <>
##$TPOAL= (0..7)
0.5 0.5 0.5 0.5 0.5 0.5 0.5 0.5 
##$TPOFFS= (0..7)
0 0 0 0 0 0 0 0 
##$TUNHIN= 0
##$TUNHOUT= 0
##$TUNXOUT= 0
##$USERA1= <user>
##$USERA2= <user>
##$USERA3= <user>
##$USERA4= <user>
##$USERA5= <user>
##$V9= 5
##$VALIST= <valist>
##$VCLIST= <CCCCCCCCCCCCCCC>
##$VD= 0
##$VDLIST= <DDDDDDDDDDDDDDD>
##$VPLIST= <PPPPPPPPPPPPPPP>
##$VTLIST= <TTTTTTTTTTTTTTT>
##$WBST= 1024
##$WBSW= 4
##$XGAIN= (0..3)
0 0 0 0 
##$XL= 0
##$YL= 0
##$YMAX_a= 596676
##$YMIN_a= -753916
##$ZGOPTNS= <>
##$ZL1= 120
##$ZL2= 120
##$ZL3= 120
##$ZL4= 120
##$ABSF1= 17.50811
##$ABSF2= -2.510929
##$ABSG= 5
##$ABSL= 3
##$ALPHA= 0
##$AQORDER= 0
##$ASSFAC= 0
##$ASSFACI= 0
##$ASSFACX= 0
##$ASSWID= 0
##$AUNMP= <proc_1d>
##$AZFE= 0.1
##$AZFW= 0.1
##$BCFW= 0
##$BC_mod= 2
##$BYTORDP= 0
##$COROFFS= 0
##$CY= -3
##$DATMOD= 1
##$DC= 0
##$DFILT= <>
##$DTYPP= 0
##$F1P= 0
##$F2P= 0
##$FCOR= 1
##$FTSIZE= 16384
##$FT_mod= 6
##$GAMMA= 0
##$GB= 0
##$INTBC= 1
##$INTSCL= 1.334414e-10
##$ISEN= 128
##$LB= 0.24
##$LEV0= 0
##$LPBIN= 0
##$MAXI= 10000
##$MC2= 0
##$MEAN= 0
##$ME_mod= 0
##$MI= 1.114404
##$NCOEF= 0
##$NC_proc= -5
##$NLEV= 6
##$NOISF1= 3.799351
##$NOISF2= 2.8
##$NSP= 0
##$NTH_PI= 0
##$NZP= 0
##$OFFSET= 17.50811
##$PC= 1
##$PHC0= -11912
##$PHC1= 9.40099
##$PH_mod= 1
##$PKNL= yes
##$PPARMOD= 0
##$PSCAL= 0
##$PSIGN= 0
##$REVERSE= no
##$SF= 200.130005307788
##$SI= 16384
##$SIGF1= 3
##$SIGF2= 2
##$SINO= 5.538805
##$SIOLD= 16384
##$SREGLST= <1H.CDCl3>
##$SSB= 0
##$STSI= 16384
##$STSR= 0
##$SW_p= 4006.41025641026
##$SYMM= 0
##$S_DEV= 0
##$TDeff= 16384
##$TDoff= 0
##$TI= <>
##$TILT= no
##$TM1= 0
##$TM2= 0
##$TOPLEV= 0
##$USERP1= <user>
##$USERP2= <user>
##$USERP3= <user>
##$USERP4= <user>
##$USERP5= <user>
##$WDW= 1
##$XDIM= 16384
##$YMAX_p= 379502535
##$YMIN_p= -153652
$$ End of Bruker specific parameters
$$ ---------------------------------
##NTUPLES= NMR SPECTRUM
##VAR_NAME=  FREQUENCY,     SPECTRUM/REAL,   SPECTRUM/IMAG
##SYMBOL=    X,             R,               I
##VAR_TYPE=  INDEPENDENT,   DEPENDENT,       DEPENDENT
##VAR_FORM=  AFFN,          ASDF,            ASDF
##VAR_DIM=   16384,         16384,           16384
##UNITS=     HZ,            ARBITRARY UNITS, ARBITRARY UNITS
##FACTOR=    0.24454680195387, 1,            1
##FIRST=     3503.89815651271, 0,            0
##LAST=      -502.512099897549, 0,           0
##MIN=       -502.512099897549, -153652,     0
##MAX=       3503.89815651271, 379502535,    0
$$ Real data points
##PAGE= N=1
##DATA TABLE= (X++(R..R)), XYDATA
$$ [...]
9005 81537 89209 158771 118834 102912 83533 40915 89925 95291 133848 85415 26267 68020
8993 68020 56330 63928 41259 36162 82179 105126 133856 124825 119706 134909 114884 116405 144256
8980 144256 196115 181037 173952 203251 216653 181854 200310 189321 191233 185498 197836 184306
8968 184306 235461 248259 223855 224171 245785 248971 192934 241045 274821 230564 252525 308626
8956 308626 269396 245209 341180 397851 335963 360355 423220 509339 487561 423123 450034 532895
8944 532895 606024 606331 646454 674858 742364 825454 919012 987605 1047184 1200180 1354764 1429624
8932 1429624 1584534 1732847 1790298 1785971 1717562 1589644 1472912 1354759 1167233 966870
8922 966870 839928 786042 751924 693324 586243 576861 500494 471768 447497 441161 466500 398598
8910 398598 468526 449557 386402 402524 355339 355155 338855 379050 313720 254864 236471 252064
8898 252064 259334 234454 216008 235136 208632 239432 252690 247389 247777 179022 211904 266606
8886 266606 290421 238693 259477 219242 275362 297400 324005 345729 306237 343931 353149 289057
8874 289057 305794 333773 368093 337600 339434 346598 339128 359091 345376 301875 289460 286152
8862 286152 269534 289593 307481 332627 350181 357792 328836 360808 347727 342999 341832 292996
8850 292996 305062 352829 344349 346568 265354 270739 317484 311431 306782 343983 360993 363623 395099
8837 395099 420038 384439 414143 466652 447033 428419 434142 471722 446145 445298 489731 446883
8825 446883 460410 556258 601164 574514 578284 553760 522306 593957 620039 589267 594041 623558
8813 623558 659079 651369 643164 596520 609662 590482 635450 652958 621795 635118 637011 628247
8801 628247 600716 583177 644068 629469 594711 632513 678610 662537 647615 669145 735975 773518
8789 773518 766617 797681 847742 873183 907027 922467 907640 921886 906432 867557 804929 789542
8777 789542 680791 715330 712393 705637 691704 682654 679637 685282 658262 600418 614841 554161
8765 554161 572215 560311 584669 541350 506933 485360 477759 498284 501485 545199 469228 425278
8753 425278 466775 509157 521426 575452 529843 518896 475497 543065 525841 466562 495467 493412
8741 493412 537515 583361 532444 516859 562943 574549 571378 581970 615999 615640 622408 655040
8729 655040 601809 603002 570319 617698 568575 551006 560520 499611 487699 550906 557418 547246
8717 547246 579524 522197 604273 613397 601047 604240 575097 558802 540372 603998 615680 616122
8705 616122 609581 599516 631340 541792 582599 635597 677359 676951 636183 668865 659356 644812
8693 644812 625924 627972 647354 631210 664628 712587 750574 721690 747483 797082 818027 820886
8681 820886 856525 830638 838003 875812 923989 939644 923710 890716 970982 1024274 994524 959540
8669 959540 1028226 1003430 991695 1113267 1135709 1140853 1146786 1092082 1147077 1157653 1163088 1203652
8657 1203652 1182619 1205222 1216952 1261725 1291633 1375546 1375324 1409969 1465689 1527362 1573913 1563886
8645 1563886 1635117 1720924 1742138 1767766 1849491 1879295 1899786 1919954 1959306 2042451 2088034
8634 2088034 2134284 2221968 2242110 2241578 2308949 2360472 2384932 2406711 2548514 2596924 2689358 2810775
8622 2810775 2936194 3065323 3222686 3350578 3478471 3607944 3778531 3918046 4051764 4183720
8612 4183720 4390339 4517807 4586563 4713401 4708833 4766655 4799674 4812361 4738543 4703593 4708097
8601 4708097 4717962 4821155 4917147 4936090 4970058 5080392 5159486 5259207 5386418 5529285 5734727
8590 5734727 5902624 6111925 6343567 6578044 6750429 7003683 7239744 7432175 7697303 7974031
8580 7974031 8242170 8453255 8785563 9082880 9285524 9548715 9804429 9946408 10084358 10311569
8570 10311569 10515249 10763157 11092166 11470453 11880640 12405940 12971313 13598940 14247278
8561 14247278 14922779 15571585 16268343 16934006 17568726 18219550 18818356 19436274 19937488
8552 19937488 20394501 20949693 21604350 22302242 23130494 23973869 24806232 25647010 26662256
8543 26662256 27715909 28411131 28778022 29181159 29576038 29857933 29873091 29325151 28388633
8534 28388633 27211755 26234196 25683167 25416053 25460195 25622466 25783229 25862507 26072256 26470588
8524 26470588 26915955 27450115 28156629 28915328 29757573 30718086 31758143 32867439 34184024
8515 34184024 35699834 37048300 38480269 39932793 41292413 42514332 43758278 45022934
8507 45022934 46306702 47151960 47531667 47671066 47569135 47477137 47136199 46868776 47054607
8498 47054607 47801641 49109702 51030370 53356895 55988868 58884783 61884421 64845434
8490 64845434 67896789 70886908 73658759 76181268 78197542 79660044 80525185 80757250
8482 80757250 80255952 79090440 77198265 74656146 71716615 68695231 65691026 62900401
8474 62900401 60447932 58433519 56670877 55161457 54036611 53244948 52952714 53140224 53747411
8465 53747411 54700385 56164166 57958545 60083232 62456677 65085263 67851698 70559099
8457 70559099 73242254 75763626 78097442 80087361 81559117 82536590 82847341 82304790 80828490
8448 80828490 78446449 75195482 71228073 66717644 61892491 57030128 52355262 48093992
8440 48093992 44282942 41002875 38055871 35514093 33229357 31043502 29128396 27324096
8432 27324096 25729005 24276009 22910025 21746297 20649432 19559048 18555631 17604732
8424 17604732 16809137 16138530 15458441 14719769 14016372 13504506 13006496 12529825 12172585
8415 12172585 11716284 11361142 11098946 10842369 10568645 10291104 10081028 9867808 9685310
8406 9685310 9506536 9347702 9123542 8996434 8895697 8752479 8646658 8552041 8373540 8234422
8396 8234422 8162474 8050933 7932908 7826068 7701349 7641201 7588407 7505678 7478722 7431448 7374727
8385 7374727 7279495 7273406 7266808 7232234 7228578 7218476 7243155 7317594 7259436 7203688 7240785 7281409
8373 7281409 7296107 7239984 7293262 7341989 7318415 7416974 7435877 7473377 7591551 7700163 7835723
8362 7835723 8026956 8257031 8501297 8841335 9116454 9427521 9830422 10251129 10710975 11224341
8352 11224341 11719971 12350220 12910264 13606652 14352241 14998174 15696643 16316511 16891440
8343 16891440 17464319 17811466 18004140 18164353 18212438 18127299 17933898 17569377 17055359 16506350
8333 16506350 16052799 15500648 14995895 14541116 14177996 13856396 13625445 13558267 13600567 13759923
8323 13759923 13943275 14274937 14676143 15149084 15687169 16345112 17011674 17756365 18482524
8314 18482524 19208047 19969237 20565571 21100980 21552363 21969372 22203634 22168840 21954261 21482631
8304 21482631 20855641 20089210 19162322 18101909 17123246 16094052 15111192 14176506 13297008
8295 13297008 12577300 11996367 11564255 11222048 10854862 10616660 10411295 10199422 10039120
8286 10039120 9880214 9729457 9648397 9468788 9253168 9102116 8980387 8790785 8652462 8537983
8276 8537983 8438423 8335186 8077406 7843730 7634433 7445602 7302391 7162060 6989641 6941816
8266 6941816 6897460 6840092 6841597 6825661 6841338 6906202 6981656 7034945 7072668 7170685 7254754 7281013
8254 7281013 7340461 7242965 7104590 6923538 6644240 6325457 5962976 5668590 5420824 5230277
8244 5230277 5039015 4908489 4800463 4716397 4687497 4546867 4488372 4465653 4382958 4249757
8234 4249757 4170881 4198474 4207889 4175627 4050338 3996939 4030897 4027383 3991043 4058989 4056195 4014235
8222 4014235 4047825 4083611 4197035 4281904 4271889 4331229 4462680 4562387 4662118 4758195 4807684
8211 4807684 4844380 4996318 5161484 5243214 5296628 5426826 5675934 5792839 5874186 6014528
8201 6014528 6197501 6353433 6495852 6681545 6891306 6958188 7092164 7185518 7332655 7160937
8191 7160937 7059084 7215774 7234268 7448521 7631740 7811314 7974474 8190279 8470304 8704489
8181 8704489 8965933 9297166 9641787 10047322 10475255 10972853 11481342 12033752 12717599 13372951
8171 13372951 14098698 14812953 15532759 16328331 17084236 17979354 18779477 19308746 19613178
8162 19613178 19854419 19869705 19588047 19173139 18784915 18682311 18783105 18908755 19101342 19317565
8152 19317565 19541345 19746414 20083229 20522008 21118823 21854338 22671900 23585303 24636443
8143 24636443 25789906 27018031 28326779 29847465 31581967 33534471 35595917 37688561
8135 37688561 39813733 41779846 43439301 44799649 45728357 46243257 46590480 47017757 47770637
8126 47770637 48874624 50309101 51814761 53549261 55625606 57984462 60587269 63531606
8118 63531606 66745679 70127396 73117606 75274787 76290992 76229147 74961983 72899895
8110 72899895 70677263 68770138 67565032 67008469 66992519 67044279 66860584 66605627 66528232
8101 66528232 66965857 67883692 69118826 70464369 71741886 73142173 74723046 76871924
8093 76871924 79757115 83317211 87444463 92328955 97916979 103757781 109679602 115041402
8085 115041402 119408617 122128766 122833598 121360824 118183866 113711960 108247009 102685184
8077 102685184 97238879 91854643 86153570 80319000 75012396 70548777 66979793 64182963
8069 64182963 61938341 60267737 58993345 58081077 57631402 57566608 57907208 58722934 60115441
8060 60115441 61848573 63804894 65975506 68305331 70728131 72832732 74714438 76588562
8052 76588562 78329162 79461635 79625466 78351377 75252560 70571346 64952637 59425375
8044 59425375 54661119 50892205 47823398 45121680 42846831 40548627 38303026 36301997
8036 36301997 34608621 33191393 32089123 31146693 30197722 29451731 28850542 28326965 28059942
8027 28059942 27985588 27977302 28012227 28121301 28180242 28182023 28164482 28231695 28329755 28229885 28013953
8016 28013953 27972746 28063136 28172026 28104458 27807613 27236624 25766531 23939231 22333221
8007 22333221 20901905 20009950 19489860 19041045 18803425 18751270 18777347 18922788 19117993 19375725
7997 19375725 19730288 20044447 20411993 20869065 21299210 21743043 22211068 22364255 22230988
7988 22230988 21741652 20929649 20068578 19302782 18744834 18396140 18172429 18090186 17999201 17938658
7978 17938658 17854046 17796984 17881034 18009524 18185662 18444356 18750584 19095491 19392749 19801904
7968 19801904 20212317 20657630 21046899 21507280 22061590 22403940 22735225 22994533 23347428
7959 23347428 23723762 24010063 24214410 24423810 24696838 25131822 25669829 26264039 26893680
7950 26893680 27736408 28795263 30058478 31572714 33415674 35603496 37835200 40204435
7942 40204435 42684788 45158948 47434157 48902235 50048210 50941440 51606286 51574343 49904528
7933 49904528 47503386 45105804 43051698 41165261 38964059 37007992 35472592 34499393
7925 34499393 34023668 33922416 34127422 34502776 35180377 36117461 37452518 39103846 41326935
7916 41326935 43811823 46558409 49628864 52966349 56240090 59249014 62256057 65059211
7908 65059211 67247657 67957408 66843776 63884358 59400293 54107281 48720142 43950411
7900 43950411 40175643 37305071 35026940 32969295 30769157 28639954 26846400 25482728
7892 25482728 24457966 23745249 23194694 22849284 22647600 22658842 22734720 23120740 23659439 24255500
7882 24255500 24929134 25524265 26145568 26371167 26302855 26052192 25749435 25311589 24173717
7873 24173717 22532411 20838221 19354618 18075383 16690018 15250137 13911666 12795236
7865 12795236 11884220 11131182 10544267 10005857 9634721 9212926 8815392 8530886 8246915
7856 8246915 7982340 7756854 7436388 7183369 6983837 6721840 6542623 6344604 6113659 5887085
7846 5887085 5748602 5515404 5323048 5183991 5076052 4893351 4694396 4348275 4263645 4196949
7836 4196949 4067597 3964575 3807522 3691476 3701138 3587526 3430032 3314428 3215661 3138703
7826 3138703 3041515 3030776 2898230 2750313 2730001 2672925 2652508 2640701 2604653 2555775 2517205
7815 2517205 2470950 2403683 2402190 2352321 2323009 2245053 2227180 2219555 2223637 2165023 2075770 2059697
7803 2059697 1994535 1947393 1908729 1887181 1855030 1886531 1858370 1829529 1843486 1851593 1884246 1829328
7791 1829328 1810788 1780078 1762043 1771995 1726926 1726794 1745974 1724495 1671598 1722971 1666507 1667427
7779 1667427 1682868 1654225 1615867 1604949 1611515 1549687 1555271 1571336 1476694 1417429 1385180 1358973
7767 1358973 1374270 1426842 1507803 1348951 1408042 1452320 1458647 1465220 1511676 1524958 1526066 1535138
7755 1535138 1513353 1477136 1444122 1446580 1513551 1465924 1460980 1406875 1330637 1323905 1351334 1358254
7743 1358254 1293876 1239965 1210793 1196753 1171708 1146315 1127984 1074681 1051083 1013828 971349
7732 971349 995482 1008468 1018185 950693 913454 893713 919095 936765 959222 935279 947203 873596
7720 873596 862043 918036 898118 892128 822724 821578 803179 816368 806512 761514 737635 708977
7708 708977 697707 726768 708667 677783 659190 653804 608392 630099 642810 620352 617261 561257
7696 561257 585139 565058 558685 504447 494946 492428 548140 521287 484986 435068 463280 482439
7684 482439 466013 381439 396141 370147 371106 393991 337467 302313 347614 460126 437582 371980
7672 371980 393635 374094 341359 366159 394970 405385 343185 372837 418246 401866 336727 393302
7660 393302 404896 343503 318223 324039 296976 362728 366140 351724 323880 315759 313910 307026 322669
7647 322669 265474 315891 315751 299511 318693 279626 305601 374983 336180 327447 293926 305208
7635 305208 358153 328702 360259 338654 275543 315608 326661 253323 288118 292715 313111 300406
7623 300406 329815 380061 343684 326291 332922 370096 362312 370316 408399 375055 434223 444410
7611 444410 401745 396674 423717 463194 529192 461636 417480 408623 407388 437118 408092 409294
7599 409294 347268 284299 243533 255251 243655 289415 319327 293220 276182 263024 330762 346444
7587 346444 334006 387357 447466 412520 443649 419601 466416 502617 542390 547984 418811 423472
7575 423472 460518 423333 342739 386517 384367 346257 261342 258310 236543 284717 310623 279024
7563 279024 253263 258411 261821 281850 286590 312448 328841 315354 290965 303987 285099 261481
7551 261481 267298 286624 284928 217733 181814 228140 267851 301374 245472 226462 127737 135442
7539 135442 192641 185718 184119 159735 163221 181962 254066 195879 190953 171600 153051 185055
7527 185055 178639 140330 116829 132242 190367 183455 191127 137288 130088 131755 91072 131034 148741
7514 148741 97737 127244 175507 162414 169099 158877 126529 147180 184808 234710 177372 157437
7502 157437 194509 168711 123108 66977 88453 117067 99569 53492 101936 125376 110719 138135
7490 138135 157999 164421 109140 65349 38111 23483 112658 129413 133697 107833 93684 98608
7478 98608 93204 100553 67922 106712 94817 115041 99735 78380 -2951 29933 69116 71088
7466 71088 60177 99372 72525 26399 24644 42667 -9876 -49093 19057 24453 -9235 2667
7454 2667 36079 120761 103218 8194 24129 74586 62793 24674 15619 -4854 -6867 -998 36419
7441 36419 22971 44927 183 22800 49467 26015 34637 -10104 26576 37913 69610 59904
7429 59904 36546 26816 -38814 5189 44108 3488 -47603 -55039 -51097 -38634 -25731 21309
7417 21309 33665 -10215 1878 -19994 15698 39012 16842 -13959 -54722 1815 -29145 34211
7405 34211 7915 -25636 -22600 -23887 -19407 -37225 -66623 -9187 49595 7246 -19797 -21575 5569
7392 5569 -13175 -43249 -62443 -38776 -20412 -48892 -96611 -137211 -78804 -8958 24166 23310
7380 23310 4569 20477 -28828 27608 19546 9846 30778 -9876 9699 14107 -6655 -72320
7368 -72320 -21468 -49170 -25204 -37045 -81912 -39614 -50124 -23687 -22268 39583 9838 -79196
7356 -79196 -35684 -42551 -53585 -35054 -18424 -61987 -63108 -5433 50802 -45525 6497 53950
7344 53950 3139 -58076 -35622 -64968 -74118 5687 -13291 -9354 -3342 -7373 -25931 -44377 -6978
7331 -6978 45844 9575 -56481 -41404 26225 -9715 -34142 5733 20635 -22804 -47585 -100483
7319 -100483 -82344 -64967 -20708 -29364 -8600 -34457 -58702 -78902 -19099 -5651 -17391 18168
7307 18168 11064 50800 -21706 -25643 -5282 -4483 -24166 -45892 20204 5078 -49325 -87978 -49148
7294 -49148 -24502 -47041 -11625 18435 20035 16770 26580 14338 30278 49221 25048 49623
7282 49623 7630 375 -28036 122 5991 -10631 -30956 -51490 -33227 -79973 -73284 -41309
7270 -41309 -57360 5656 -34442 -54836 -26872 -36032 -42871 -5750 2554 -66732 -11319 -25525
7258 -25525 -21953 72794 43174 29165 23557 33756 70708 49696 -6078 5669 -49771 -70942
7246 -70942 -29093 30293 -6586 -300 10321 -50867 10597 38956 -19038 1273 43284 65647
7234 65647 10831 -53418 -33987 -27366 -36243 -23584 -3915 -17989 4524 8634 47289 75573
7222 75573 28393 34019 7793 -12399 -10980 308 38435 -17352 -29928 -44973 -41979 -13239
7210 -13239 -3010 -55387 -52845 -74199 -45055 -53874 -46111 4790 46865 10562 -7739 30354
7198 30354 -12588 -41220 18018 -27198 7781 16067 7567 19401 52104 35056 -27318 -11368
7186 -11368 41830 -16059 16703 -3685 35305 17854 306 -1917 4664 59264 83414 28725
7174 28725 -1335 -7718 17511 2652 32632 26346 -45894 -8264 -31885 -13374 -23422 20793
7162 20793 28891 64299 46542 10694 59468 22973 73799 57076 46330 43893 28603 25286
7150 25286 19589 48595 -8795 5473 -8210 -65411 -77947 -22729 -31138 -57220 5339 -32615
7138 -32615 -54419 261 -43098 -61426 14481 74409 35269 8597 -38436 -1028 -11471 4413
7126 4413 7536 27496 9783 5250 3307 26338 18605 48672 34498 87757 114964 75205 12598
7113 12598 18424 89392 76950 9176 50890 8007 26822 -21530 -21276 6233 -10599 3137
7101 3137 -15104 41240 61639 12291 49533 20744 -3058 10232 65335 68535 3943 47026
7089 47026 36448 48323 13138 -950 81863 16820 -16521 34591 53463 30842 -13873 21087
7077 21087 104319 108539 150937 157640 126739 121966 64676 67398 75285 51258 65142 74141 31629
7064 31629 75513 53120 17202 40073 39070 34296 56101 59777 66320 15882 49799 72321 5829
7051 5829 -4344 45001 109706 160591 70926 71955 143007 152683 163671 181592 101603 77017
7039 77017 61734 90567 90488 137898 68115 85152 95469 43245 35132 80675 77042 43550 48907
7026 48907 85873 97878 56093 21512 73642 50423 52911 50876 28712 4856 70369 81687
7014 81687 36588 44848 97631 104027 86419 140194 115232 112966 101006 79441 75447 108721 68157
7001 68157 61109 36235 62920 53887 66101 71117 101410 117837 139242 121040 86839 78206 119454
6988 119454 113499 77387 62451 84669 117541 63884 77919 84699 125550 121989 102588 119186
6976 119186 145165 164675 120848 84334 132766 139617 189795 171587 158416 137122 101468 106886
6964 106886 75532 89725 99403 131374 73301 110254 107682 124125 135812 126577 102663 137907
6952 137907 145663 165422 200015 194955 191813 200185 157579 118082 149181 146893 118168 154615 140175
6939 140175 73735 41063 119099 140637 114918 130389 108093 127006 120391 155769 156726 215820
6927 215820 200903 152279 126836 136185 195188 130834 96216 116001 175756 158958 186657 177719
6915 177719 189018 197589 206739 187036 196411 195967 177396 199533 149045 183684 274461 236201 195059
6902 195059 234228 207275 159362 188267 172039 170379 245907 261256 218578 250169 304999 239953
6890 239953 186545 166602 265556 239150 257449 235244 248329 253611 289346 270801 211236 273744
6878 273744 235042 237891 263574 276519 218258 183986 223612 219311 198021 206850 180736 199871
6866 199871 206918 144227 155217 178584 188351 227819 217131 221983 223660 236283 213054 135564
6854 135564 130171 157400 186743 198810 199759 167682 204258 240358 197417 164833 152445 194392
6842 194392 193271 176254 245576 270096 224534 263892 243355 195888 151116 212478 271635 183699
6830 183699 211666 166136 170012 227332 170077 151072 200844 186410 184684 163162 171346 150439
6818 150439 162999 192050 209307 216407 218031 253027 318080 257001 181121 181268 183663 241272 235642
6805 235642 225711 220479 199981 196592 229724 217801 248293 216282 216737 234604 276907 240705 233525
6792 233525 250335 279538 229834 241519 219983 236821 275103 252822 283460 295189 250726 209286
6780 209286 248028 220464 221283 254852 324116 267981 282992 278101 256648 191852 222756 205323
6768 205323 254059 276160 284319 235095 283039 279466 293649 314474 255755 217988 225747 299668
6756 299668 258017 206753 233770 269614 294535 282012 247751 250612 243492 182322 230537 310071
6744 310071 257491 192574 207837 200993 211310 255730 267973 312367 246892 235479 217743 269671
6732 269671 255227 251165 215269 212411 236659 288108 251063 306723 331309 319978 300101 334691
6720 334691 304906 278690 254198 268320 274224 283148 303668 282262 299129 328084 312843 343574
6708 343574 317194 303928 255612 255283 266693 257551 314944 296049 280778 295068 314974 318162
6696 318162 342249 383090 376398 333218 361246 360408 340380 328444 366640 409091 485114 412780
6684 412780 373916 391691 470679 441394 349442 333264 408973 385550 382906 427223 386120 363896
6672 363896 386151 429995 430086 484262 454985 442932 440318 432894 439269 422248 409648 393356 454284
6659 454284 459425 467772 460215 459068 469104 467636 474001 532386 544705 478963 512033 507629 548345
6646 548345 586126 532830 554603 562312 594764 622116 646842 632933 547898 569780 614919 616755
6634 616755 585688 588401 621273 675454 745408 734624 730169 702859 697667 756295 787030 782030
6622 782030 777184 770905 802726 808115 824731 858589 856890 879079 936199 946270 949203 938487 900296
6609 900296 945876 1009542 1005217 1015743 1063357 1106568 1106541 1108009 1133209 1213654 1196070 1189024 1196771
6596 1196771 1258457 1267555 1248722 1269922 1338075 1372727 1407960 1486035 1529040 1567818 1638487 1773806
6584 1773806 1807693 1895589 2016201 2179158 2277473 2386361 2526317 2741328 2973253 3163298
6574 3163298 3227476 3251154 3209218 3106500 2914977 2774498 2648409 2548004 2545801 2513270 2530519
6563 2530519 2474535 2464176 2508167 2562188 2595820 2649818 2750444 2802948 2890299 2925955 3002997
6552 3002997 3047133 3086009 3118475 3146794 3224014 3290652 3380869 3468034 3505995 3577740 3782476
6541 3782476 3934657 4088624 4313371 4588638 4877851 5210778 5590444 6008358 6399370 6880838
6531 6880838 7479582 8097077 8849335 9714337 10647368 11706231 12792799 14017340 15247761
6522 15247761 16373603 17247048 17762994 17860682 17501199 16638898 15258088 13585748 11834712
6513 11834712 10257481 8914043 7928510 7199799 6660105 6239315 5906310 5614147 5309882
6504 5309882 5134681 5056335 4975673 4972366 4916250 4830928 4719691 4552457 4297570 4104509 3911531
6493 3911531 3758249 3520688 3307792 3105189 2953145 2838381 2692200 2622915 2575056 2528212
6483 2528212 2461963 2450494 2428423 2390376 2372694 2385920 2316069 2371670 2434297 2458395 2438568
6472 2438568 2517103 2623297 2611632 2644413 2744247 2778636 2778461 2801832 2783378 2772457 2860202 2925965
6460 2925965 2939373 2973447 3076909 3090259 3118888 3141838 3053544 2962161 2905266 2840895 2756990
6449 2756990 2632843 2447189 2333900 2240042 2116050 2053963 1934472 1898478 1853534 1701283
6439 1701283 1625705 1650116 1612058 1565971 1537766 1490560 1500577 1464876 1465364 1443674 1384280 1390479
6427 1390479 1396014 1385269 1342046 1325527 1317817 1301474 1300264 1289837 1296937 1309847 1340671 1284085
6415 1284085 1240126 1247147 1287240 1232865 1189097 1211814 1206052 1244923 1235822 1235972 1210285 1249038
6403 1249038 1276886 1278575 1264771 1216858 1266389 1267952 1262290 1241514 1264031 1238635 1232957 1199199
6391 1199199 1243506 1226289 1204023 1237997 1291145 1324194 1312957 1234380 1179760 1263382 1331796
6380 1331796 1316532 1233810 1268846 1311470 1283616 1257908 1266886 1258247 1232372 1202331 1230108 1248628
6368 1248628 1216649 1268081 1281358 1298897 1255079 1192839 1229098 1252791 1290269 1295169 1338345 1339696
6356 1339696 1347504 1343806 1352382 1348190 1361164 1349084 1355311 1388130 1342909 1332921 1371874 1370293 1389048
6343 1389048 1402530 1346511 1356381 1435009 1462198 1465810 1495460 1482155 1498838 1502010 1548078 1567770
6331 1567770 1527796 1487040 1458665 1506366 1528434 1544888 1522246 1514955 1540619 1514943 1507259 1505927
6319 1505927 1505701 1526329 1519650 1517786 1543114 1558098 1542562 1538334 1546327 1527490 1534353 1498258 1535363
6306 1535363 1520262 1548399 1558879 1584515 1595853 1556742 1567809 1603398 1658032 1621429 1614094 1606889
6294 1606889 1644102 1608447 1663765 1640963 1644026 1653420 1697483 1723103 1690841 1680990 1677759 1713335
6282 1713335 1622874 1688744 1730329 1762106 1749447 1764379 1808941 1778319 1769552 1719401 1751542 1711483
6270 1711483 1779934 1776829 1806665 1800799 1767431 1738332 1790499 1872650 1872250 1834549 1834802 1868847 1884482
6257 1884482 1901410 1920406 1937337 1972457 1905073 1952720 1987098 1902903 1934411 1987432 1972009
6246 1972009 1934681 2033229 2010460 2026420 1996075 2021026 2028820 2051716 2084836 2112094 2095294 2118177
6234 2118177 2092901 2067771 2103643 2104179 2120027 2072299 2099498 2152601 2139814 2205372 2179473 2188998
6222 2188998 2261184 2267684 2260939 2249399 2313081 2349424 2290320 2284539 2258934 2313613 2278842 2240665
6210 2240665 2316107 2263136 2258998 2281827 2323603 2388131 2375767 2402953 2413798 2441699 2435974 2450989
6198 2450989 2442178 2450499 2448999 2465555 2430078 2395940 2433402 2475322 2478775 2510869 2508862 2542203
6186 2542203 2579508 2504119 2524731 2569382 2552717 2553179 2593958 2645043 2634661 2609802 2635965 2668561
6174 2668561 2657734 2657530 2651332 2682633 2698878 2706730 2813204 2800703 2781962 2738082 2788971 2791734
6162 2791734 2848588 2847675 2864244 2887177 2900024 2950966 2936717 2945958 2896918 2864417 2878768 2915702
6150 2915702 2963100 2925185 2932296 2931814 2962999 2959541 2977874 3010144 2972381 2944588 2972998 2980797
6138 2980797 3007682 3018214 3066850 3078004 3072674 3097602 3086609 3075621 3107793 3129332 3058085 3079225
6126 3079225 3128593 3176612 3125752 3129259 3172575 3161351 3234340 3208861 3222800 3222997 3229392 3212955
6114 3212955 3266272 3266416 3248004 3292075 3257733 3235206 3228470 3287616 3309911 3311004 3298137 3305719
6102 3305719 3295976 3296228 3360020 3338601 3361722 3366796 3315091 3283617 3277603 3350296 3341762 3347371 3353897
6089 3353897 3354078 3312759 3369751 3396985 3370287 3409867 3442983 3386387 3339128 3394029 3429697 3394934
6077 3394934 3367536 3369477 3460974 3453376 3435719 3433305 3437699 3423619 3379758 3385159 3324686 3373612
6065 3373612 3424610 3404451 3400412 3414374 3471831 3464991 3446261 3461312 3454755 3497974 3488331 3508222
6053 3508222 3499072 3499770 3413726 3445583 3460185 3444278 3441061 3437097 3516100 3496975 3541749 3494237
6041 3494237 3480353 3459686 3476183 3502059 3460712 3419943 3447800 3462770 3493189 3494682 3468656 3470219
6029 3470219 3471723 3438165 3441371 3463029 3526101 3465615 3442915 3399249 3362039 3428447 3422663 3488704
6017 3488704 3461971 3461574 3417338 3432784 3480241 3492739 3463830 3428289 3410180 3443717 3408489 3425394
6005 3425394 3451527 3386098 3373819 3318709 3299512 3331192 3359084 3350684 3337309 3422604 3369668 3327680
5993 3327680 3331558 3346179 3314704 3331880 3352776 3296310 3342762 3302744 3287352 3303222 3340782 3263113
5981 3263113 3261996 3240062 3261355 3237310 3226288 3234169 3238375 3207455 3253023 3243898 3236119 3234618 3237790
5968 3237790 3137784 3086722 3125024 3110320 3141569 3118681 3140736 3110088 3078341 3065893 3075706
5957 3075706 3009229 2999148 3056391 3075949 3056289 3049552 3015905 3009150 3029023 2993172 2997814 2929518
5945 2929518 2944773 2961192 2970026 3021833 2952232 2909445 2918367 2957912 2914120 2878482 2850565 2888299
5933 2888299 2903001 2881827 2824515 2838429 2832689 2747148 2732709 2753243 2737932 2794599 2823856 2807098
5921 2807098 2743441 2745845 2738243 2742133 2750107 2733801 2740481 2723116 2685621 2670709 2652436 2632362
5909 2632362 2613013 2567321 2591006 2643778 2624683 2654675 2639624 2595104 2580772 2560761 2557065 2517509
5897 2517509 2528503 2506039 2531995 2525243 2487544 2488947 2468395 2465421 2473061 2451506 2405880 2392944
5885 2392944 2370726 2418275 2426255 2387471 2358283 2368899 2306765 2382897 2369628 2354884 2349697 2328162
5873 2328162 2328960 2289059 2298210 2237409 2203099 2216263 2259344 2316187 2280008 2291361 2234104 2223281
5861 2223281 2192276 2178628 2187772 2152139 2156795 2154011 2187964 2157604 2119878 2086094 2101947 2082910
5849 2082910 2030538 2050122 2048360 2008881 1993052 2002999 2115314 2022403 2052133 2087049 2044401 2044034
5837 2044034 1998779 2014965 2066182 2031627 2030249 1957195 1945641 1962035 2010031 1971691 1972160 2009370
5825 2009370 1971882 1896376 1855909 1863016 1902210 1853306 1894419 1880176 1902267 1879343 1850526 1849110
5813 1849110 1894689 1870781 1839655 1806652 1782918 1782749 1785309 1829131 1867568 1856511 1778822 1743470
5801 1743470 1730098 1738522 1712956 1749097 1709031 1731030 1778949 1753874 1669895 1659159 1685361 1696246
5789 1696246 1706188 1678460 1642779 1644441 1659655 1643117 1617319 1643546 1630962 1573900 1609835 1641416
5777 1641416 1608055 1621554 1601622 1540421 1526103 1527444 1540352 1537651 1588535 1589622 1499880 1521068
5765 1521068 1473205 1513692 1513889 1546888 1569167 1526221 1494535 1496897 1472694 1479968 1483739 1503049
5753 1503049 1492952 1480057 1483122 1515984 1501216 1484710 1498631 1446489 1416566 1423364 1410044 1423862
5741 1423862 1427881 1356909 1390825 1414619 1354880 1390387 1402351 1404403 1425511 1416915 1437855 1437105
5729 1437105 1383338 1385050 1400389 1394563 1342877 1349625 1350993 1349583 1307052 1358057 1385287 1393910 1357239
5716 1357239 1265538 1223923 1245671 1283162 1288584 1285161 1278432 1270833 1263421 1277652 1313314 1275280
5704 1275280 1214574 1228601 1228364 1204208 1177273 1255670 1247531 1267731 1269491 1253162 1262679 1259792 1193783
5691 1193783 1236346 1257825 1274296 1221594 1189447 1218342 1204784 1196321 1169562 1189740 1222116 1205144
5679 1205144 1178130 1148015 1133864 1148621 1086649 1058696 1165639 1172283 1160083 1191609 1214092
5668 1214092 1194780 1237070 1248445 1184867 1192076 1169209 1197447 1196122 1201975 1213050 1195140 1200636
5656 1200636 1164449 1133001 1139774 1117358 1150634 1169320 1135818 1184127 1186852 1117046 1076439 1124481
5644 1124481 1149577 1109194 1099785 1088078 1141139 1116264 1094176 1096983 1109967 1106296 1082738 1092845
5632 1092845 1071096 1159360 1165231 1228532 1117910 1078601 1122165 1108038 1090108 1063567 1070572 1087922
5620 1087922 1145361 1146660 1138202 1151164 1170312 1158762 1150269 1149164 1139557 1149189 1129588 1148124 1170298
5607 1170298 1159423 1172040 1159268 1155251 1162456 1195300 1189342 1154349 1165481 1152219 1115772 1137462
5595 1137462 1124824 1103618 1187738 1144898 1099984 1070711 1010991 1071915 1083428 1080046 1132332 1191159
5583 1191159 1153670 1167280 1136653 1121527 1126381 1160471 1167645 1127260 1052309 1147444 1154569 1145706
5571 1145706 1148382 1161040 1195573 1145245 1128180 1150822 1183864 1195328 1139259 1080585 1098233 1092589
5559 1092589 1137067 1112780 1065869 1096592 1124651 1165551 1192224 1157241 1220930 1211262 1215173 1151997
5547 1151997 1126228 1165745 1136124 1179763 1249325 1218380 1152226 1149919 1138136 1144142 1117337 1119361
5535 1119361 1206933 1201971 1221934 1184535 1180835 1199428 1165194 1179451 1166410 1167065 1185938 1209680
5523 1209680 1256409 1234800 1193643 1220257 1183666 1223222 1268544 1283735 1224815 1276695 1302639
5512 1302639 1265734 1273873 1310014 1305693 1302784 1279930 1298272 1289610 1273845 1265042 1214709 1333334
5500 1333334 1353057 1339101 1322900 1325426 1326015 1353861 1421084 1491558 1448660 1388971 1429808 1453609
5488 1453609 1463251 1440331 1424859 1480015 1583950 1564801 1559347 1563061 1579102 1568278 1568417 1599613
5476 1599613 1594383 1612156 1603857 1589329 1665688 1687372 1727073 1715563 1711527 1746435 1781712 1829834
5464 1829834 1876244 1954037 1933194 1941833 1980380 2029610 2092739 2110604 2103282 2147065 2182994 2227853
5452 2227853 2257582 2362212 2418312 2451459 2443459 2538905 2549263 2573303 2588324 2589718 2573388 2661971
5440 2661971 2834578 2877640 2895085 2988027 3134364 3219589 3354467 3430213 3565830 3693454
5430 3693454 3876478 4070518 4285457 4486266 4659212 4871093 5097726 5360607 5583237 5778900
5420 5778900 5917619 5953715 5856482 5737221 5574717 5402143 5286279 5205644 5116867 5019936
5410 5019936 4857621 4649118 4383967 4214647 4080894 3939547 3841526 3709452 3679304 3671551
5400 3671551 3659206 3613457 3640864 3549506 3486087 3528941 3497590 3505943 3499406 3517325 3487666 3489739
5388 3489739 3485763 3445500 3497367 3514534 3496764 3553313 3687529 3744300 3792308 3839081 3808095
5377 3808095 3877904 3946739 3977236 4057515 4097203 4148861 4181698 4250408 4283779 4340065 4377666
5366 4377666 4459207 4538114 4660146 4758365 4901105 5029354 5097668 5200691 5301530 5434940
5356 5434940 5532938 5699452 5774136 5893819 6026287 6178033 6347880 6463700 6607348 6736287
5346 6736287 6878833 7017287 7224884 7350483 7440870 7578819 7707179 7859487 8010057 8107651
5336 8107651 8343390 8522008 8702610 8980224 9208743 9500280 9792313 10035476 10287856 10530992
5326 10530992 10826137 11165918 11405117 11608208 11734546 11973355 12105760 12190065 12289207 12412447
5316 12412447 12529944 12628746 12706610 12830712 12938842 13078978 13211585 13354745 13538509 13699726
5306 13699726 13908958 14141145 14267997 14375020 14469277 14511658 14576840 14618815 14679522 14735168
5296 14735168 14785819 14874800 15061849 15237927 15425614 15634321 15879128 16089024 16216263 16259291
5286 16259291 16158027 15872207 15501181 15013195 14488127 13986784 13520367 13117693 12763856
5277 12763856 12448002 12161530 11913697 11690973 11561990 11462391 11282289 11070479 10901757 10730436
5267 10730436 10615555 10528465 10400219 10267663 10157826 10072792 9880763 9786250 9643769 9583534
5257 9583534 9528810 9427877 9431842 9401939 9331936 9314009 9216625 9073962 9050254 8960602 8948757
5246 8948757 8945371 8875140 8857885 8784948 8747393 8714621 8678674 8676459 8650022 8650347 8635269 8661919
5234 8661919 8719635 8754039 8703849 8670933 8664577 8659818 8591739 8581443 8533604 8444850 8422120 8342714
5222 8342714 8250051 8243305 8159264 7993314 7864582 7671076 7508885 7370533 7179067 7080510
5212 7080510 6916863 6719779 6588182 6414462 6248286 6153180 6063459 5892709 5774509 5631362
5202 5631362 5513194 5336348 5242258 5155182 5120449 5019690 4895678 4818667 4737206 4756947 4683029
5191 4683029 4595008 4467557 4416202 4371473 4347239 4340931 4276505 4202505 4191867 4119080 4063145
5180 4063145 4043522 4000813 3977051 4009891 4032257 3995518 3977179 3940327 3911700 3960932 3976376
5169 3976376 3938117 3918687 3899369 3877336 3900769 3903746 3904343 3917389 3899901 3917844 3943704 3947269
5157 3947269 3964871 3984126 4001044 3982444 3983097 3989111 4006587 4028626 4039391 4022519 4036073 4076088
5145 4076088 4090900 4110083 4162585 4198649 4192294 4226362 4219016 4225755 4205202 4130168 4116557 4124547
5133 4124547 4064918 4034722 4066957 4011904 3966975 3922186 3854478 3851831 3884622 3903215 3885702 3863460
5121 3863460 3879104 3914171 3879571 3845823 3900245 3888967 3885314 3858333 3820019 3852024 3834123 3794883
5109 3794883 3732531 3783369 3761790 3738480 3732926 3753237 3796495 3812140 3795984 3811835 3825793 3779157
5097 3779157 3715237 3676137 3717145 3694708 3665130 3656038 3583813 3556850 3547713 3569545 3566941 3569699
5085 3569699 3599986 3589479 3622629 3669427 3632916 3640530 3638687 3597104 3558966 3573446 3601038 3637295
5073 3637295 3636524 3626618 3563481 3571566 3649699 3681777 3656537 3699776 3669789 3648795 3676510 3681143
5061 3681143 3684064 3691712 3727676 3709836 3793733 3863766 3868561 3895893 3915024 3917095 3969885 4005053
5049 4005053 4061102 4023813 4056320 4101524 4131957 4181333 4214478 4253018 4305407 4294753 4267157
5038 4267157 4320784 4371351 4380660 4389851 4476154 4559186 4590535 4705146 4796127 4929521 5048318
5027 5048318 5164866 5355466 5617989 5799287 6058148 6360076 6623996 6896155 7189412 7433466
5017 7433466 7467343 7332674 7082999 6838318 6611211 6483461 6439573 6444693 6496964 6566185 6603993
5006 6603993 6639156 6686371 6772934 6967694 7151030 7319081 7512552 7654459 7860337 8019920
4996 8019920 8089327 8023442 7851046 7637344 7341254 7106091 6898580 6800331 6707740 6594792
4986 6594792 6442907 6324074 6285518 6277264 6209811 6139113 6052996 6024408 5998145 5900146 5903615
4975 5903615 5807853 5760679 5788733 5761648 5705581 5619727 5634918 5585187 5594443 5611729 5646477 5587636
4963 5587636 5579843 5669364 5737289 5799502 5771187 5872574 5965931 6008809 6039616 6124001 6172319
4952 6172319 6160017 6222187 6282381 6312497 6378858 6361697 6431698 6461979 6513281 6557837 6628334
4941 6628334 6708631 6809265 6925470 6998036 7112296 7204885 7321493 7484704 7656134 7805277
4931 7805277 7979666 8139746 8362570 8457882 8647676 8851502 8918387 9108036 9333248 9515079
4921 9515079 9595336 9755141 9870161 10051714 10254472 10417323 10635628 10903351 11076013 11272633
4911 11272633 11491569 11648288 11759426 11884144 11935583 12008920 12000581 12046232 12097937 12067964 12143404
4900 12143404 12196494 12280144 12354810 12384471 12465383 12627724 12766761 12938162 13150892 13352272
4890 13352272 13567486 13740827 13853709 13966073 14141798 14252975 14274296 14351168 14502157 14643409
4880 14643409 14766306 14865250 14911995 15026547 15179044 15363538 15534612 15706720 15840167 16005359
4870 16005359 16178757 16393170 16580203 16715109 17046372 17342881 17560733 17871816 18215021
4861 18215021 18505064 18909032 19220455 19570968 19999606 20404811 20798837 21224010 21671908
4852 21671908 22130271 22575891 23074920 23572871 24029680 24592226 25059374 25645597 26207069
4843 26207069 26756098 27324354 27945640 28566932 29158646 29851356 30630307 31310523 32022707
4834 32022707 32718362 33504986 34223278 34997126 35730286 36508907 37308691 38057134 38814269
4825 38814269 39576042 40351994 41091182 41799772 42533549 43224646 43838152 44471418 44998948
4816 44998948 45473868 45918289 46350690 46721150 47029046 47230725 47362282 47489607 47505973 47417980
4806 47417980 47291408 47046311 46762543 46426014 46025387 45581874 45017003 44410171 43823263
4797 43823263 43129277 42418563 41624021 40823072 40054972 39194609 38293565 37396395 36540430
4788 36540430 35660708 34790415 33873256 33042531 32141528 31274066 30381263 29564193 28810095
4779 28810095 28011793 27235943 26468995 25736173 24977567 24314605 23681970 23039228 22341016
4770 22341016 21749187 21175663 20576039 19989407 19434030 18943017 18452538 17928094 17485294
4761 17485294 17066389 16708702 16207879 15753630 15353055 14921706 14613485 14248754 13850110
4752 13850110 13528333 13207366 12860371 12563611 12344938 12099901 11798446 11536245 11320239
4743 11320239 11054057 10828089 10586112 10368087 10123690 9884384 9683283 9518546 9348635
4734 9348635 9111780 8884809 8701466 8589817 8394977 8158154 7978026 7884066 7763169 7532220
4724 7532220 7363265 7236269 7138244 6959933 6869065 6739642 6611763 6547254 6418768 6261672
4714 6261672 6132135 6008726 5925087 5834109 5748037 5602137 5502110 5488734 5359256 5258229
4704 5258229 5170239 5071030 5051436 5001058 4880094 4863962 4834784 4792935 4667116 4664949 4601702
4693 4601702 4504378 4439887 4397138 4390545 4316383 4259720 4249718 4201024 4076210 3966082 3929714
4682 3929714 3952537 3858503 3738438 3658026 3620187 3612803 3590477 3487258 3535999 3492012 3387634
4671 3387634 3386667 3354141 3331426 3247911 3177384 3114251 3113599 3022913 2967185 2913200 2955512 2944859
4659 2944859 2886840 2811844 2758931 2824658 2794148 2785886 2721295 2650683 2661803 2694344 2679481 2643949
4647 2643949 2656350 2597671 2588507 2569203 2584197 2532126 2505586 2500947 2518000 2503682 2426529 2419583
4635 2419583 2396611 2455772 2469182 2458796 2388546 2371491 2362993 2403145 2351996 2345590 2381162 2327758
4623 2327758 2354980 2319803 2326480 2296562 2352362 2305884 2288826 2282015 2298121 2269450 2268719 2329036
4611 2329036 2296382 2332364 2337073 2337956 2318571 2334651 2347157 2339478 2307837 2288963 2337990 2364167
4599 2364167 2329878 2356331 2416810 2483184 2532131 2553986 2585156 2617153 2629437 2745294 2812848
4588 2812848 2898971 2952591 2958678 3100013 3147508 3138441 3243249 3353278 3407745 3404367 3454676
4577 3454676 3552780 3598348 3628434 3600272 3664125 3797428 3787053 3807483 3816926 3849384 3844505 3841627
4565 3841627 3770925 3747461 3761242 3665097 3593070 3530934 3500082 3417198 3317375 3286824 3240776
4554 3240776 3239240 3240294 3182174 3116176 3066781 2992240 2949767 2962095 2954588 2945410 2874681 2813470
4542 2813470 2893698 2946282 2881935 2854155 2835664 2856345 2919505 2958527 2922809 3089154 3110877
4531 3110877 3046961 3181001 3272203 3325131 3363786 3376057 3514247 3660304 3712291 3801743 3951741
4520 3951741 3960120 4054167 4145318 4173697 4265122 4242155 4276225 4315191 4295211 4242956 4268574 4205660
4508 4205660 4147141 4130118 4043646 3979685 3920583 3780580 3706132 3668459 3537624 3442371 3297500
4497 3297500 3222465 3204039 3140507 3049409 2957205 2922808 2832906 2714378 2766673 2690607 2636018
4486 2636018 2626617 2578084 2484875 2421775 2395390 2377845 2387902 2335772 2329156 2292530 2261151 2243639
4474 2243639 2238159 2274880 2286609 2281780 2273000 2262762 2316708 2319990 2314181 2328863 2385632 2377272 2393320
4461 2393320 2396457 2392082 2466225 2452185 2398638 2426885 2437131 2484148 2538977 2562201 2601759 2627315
4449 2627315 2659873 2716728 2774962 2819133 2798826 2829283 2871932 2925495 2986401 2966793 2989561
4438 2989561 3041334 3044561 3133539 3192476 3265850 3305029 3377866 3547750 3661668 3782186 3960626
4427 3960626 4141777 4394680 4613874 4846568 5201549 5595347 5974769 6427761 7012992 7671658
4417 7671658 8457652 9476880 10599194 11759674 12956848 13949916 14719602 14902750 14273165
4408 14273165 12945294 11113360 9393048 8144122 7184127 6534252 6119207 5716917 5397730
4399 5397730 5220489 5040243 4912484 4766367 4669574 4631609 4598670 4620180 4593059 4636430 4703924
4388 4703924 4749578 4813724 4855187 4930575 5094026 5220071 5421624 5673383 5799157 6108432
4378 6108432 6480173 6879342 7387580 7943632 8645684 9554706 10558275 11590207 12699575
4369 12699575 13857693 14813115 15431538 15407415 14700211 13439590 11784350 10242021 8939937
4360 8939937 7982715 7302503 6802064 6331939 5988113 5745383 5402640 5156794 4958053 4785732
4350 4785732 4677831 4627236 4474777 4324010 4193215 4076907 4007205 3921655 3789733 3664521
4340 3664521 3569665 3529784 3497407 3455199 3427792 3385079 3332623 3296786 3274299 3304163 3335287
4329 3335287 3411863 3490017 3577015 3607142 3629067 3699537 3778979 3806846 3905672 3971643 3949673
4318 3949673 4081658 4226584 4248514 4331405 4448405 4519219 4603728 4755916 4818666 4889869 4991204
4307 4991204 4984234 5019950 5091252 5116924 5171455 5250570 5196466 5252936 5213939 5184885 5128567 5058553
4295 5058553 4967123 4892315 4811548 4757078 4682763 4553402 4483512 4391818 4271777 4153745 4118985
4284 4118985 4065201 4020571 3934690 3895638 3914186 3958085 3941591 3968982 3952265 4043527 4064340
4273 4064340 4001985 4060496 4132968 4180295 4139940 4173540 4162447 4144498 4099686 4188875 4192785 4164026
4261 4164026 4178281 4125821 4138164 4155434 4107616 4098664 4126723 4113410 4076091 4070199 4010631 3997519
4249 3997519 4041483 4093839 4099618 4069333 4073010 4084908 4014762 3934541 3923779 3891784 3874840 3887977
4237 3887977 3770878 3700285 3677893 3641123 3617733 3540164 3493323 3433135 3426363 3469195 3478944 3478459
4225 3478459 3506463 3501708 3512995 3568968 3636115 3681187 3741899 3833387 3863104 3964935 4079295
4214 4079295 4164280 4264478 4348630 4400900 4422665 4558120 4599464 4549232 4587683 4622711 4656420
4203 4656420 4611506 4525685 4414466 4314833 4210322 4114323 4106008 4052162 3973283 3911493 3924755
4192 3924755 3970491 3941060 4008230 3985951 3985804 4043369 4146741 4232519 4304477 4400392 4466883 4498924
4180 4498924 4597487 4687291 4768522 4843492 4927519 5005983 5062539 5129042 5263230 5352549 5389248
4169 5389248 5485657 5631237 5756654 5879390 6080800 6254466 6452358 6731880 7107960 7435545
4159 7435545 7827224 8312051 8915752 9512918 10210090 10892669 11522530 11925883 12054476 11692441
4149 11692441 10777370 9601626 8476324 7567999 6872376 6363085 6031551 5698501 5500835
4140 5500835 5352159 5209085 5091386 5010048 4958523 4949104 4952732 5022780 5050980 5100861 5174252
4129 5174252 5197301 5242494 5294040 5342404 5381216 5398300 5433032 5437492 5417608 5339026 5228809
4118 5228809 5180413 5151954 5163783 5117497 5094177 5135472 5048605 4969734 5018969 5046012 5066712
4107 5066712 5050473 5043239 5082629 5081279 5061646 5070368 5098553 5088358 5008019 4968572 4975408 4971943
4095 4971943 4965659 4950742 5017882 5061666 5087505 5049594 5027834 5049034 5097628 5179989 5136910 5137249
4083 5137249 5095128 5082638 5130091 5116083 5123696 5073108 5075147 5112959 5178769 5306287 5411847
4072 5411847 5513801 5655995 5782037 5887678 5992556 6101921 6193185 6207381 6323875 6465020
4062 6465020 6542356 6608429 6723544 6815237 6918391 6982498 7083840 7217547 7312905 7416054
4052 7416054 7540138 7604052 7620853 7566150 7312664 7029554 6790470 6536693 6403248 6307604
4042 6307604 6249057 6188690 6143208 6102444 6114346 6093955 6178473 6153446 6197004 6276838 6274681 6220194
4030 6220194 6260803 6329560 6369498 6450964 6479156 6476009 6487460 6500004 6452717 6371598 6430140 6414928
4018 6414928 6391746 6444744 6560228 6671720 6759549 6926615 7074359 7159626 7232628 7283827 7311220
4007 7311220 7386670 7386262 7340125 7325487 7341262 7411099 7509805 7671097 7792426 7910008 8099484
3996 8099484 8341033 8632406 8891925 9189089 9558365 9971989 10388840 10955597 11570990 12232421
3986 12232421 13051671 13994487 14930693 15834312 16677771 17330358 17590819 17419312 16825799
3977 16825799 16061824 15378586 14817644 14428650 14258716 14278293 14255989 14307747 14433783 14544200
3967 14544200 14770063 15048015 15446697 15866771 16343567 16959199 17607201 18356104 19302608
3958 19302608 20361143 21593370 22974516 24488829 26152845 27957536 30024464 32398195
3950 32398195 35206010 38327453 42046159 46512840 51608268 57499512 63969935 70143963
3942 70143963 75419470 79389459 81182499 78590517 70987048 61445294 52422049 45357676
3934 45357676 40482831 37065096 34457146 32535854 31047952 29926114 29193134 28909347
3926 28909347 28958622 29276626 29634711 29970094 30161065 29984729 29501166 28639954 27575695
3917 27575695 26659223 26042789 25710440 25700524 25907642 26195487 26676920 27274255 28034152 29087741
3907 29087741 30317029 31814741 33597989 35682950 38017321 40627343 43581322 46766626
3899 46766626 50283032 53946439 57709011 61585177 65460612 69277459 72754442 75406520
3891 75406520 76785797 76324286 73767792 69425027 64119507 58889337 54288138 50235404
3883 50235404 46710573 43627752 40884688 38463761 36405028 34668716 33278095 32117893
3875 32117893 31178189 30428710 29895145 29451992 29210963 29067103 29044548 29148377 29264025 29296608
3865 29296608 29340996 29327176 29020692 28192925 27203248 26290180 25543256 25022652 24666141 24338863
3855 24338863 24090202 23820276 23724333 23743008 23803667 23956290 24167680 24500366 24857759 25250556
3845 25250556 25607062 25997118 26403706 26800248 27352102 28072980 28819723 29711893 30696564
3836 30696564 31728362 32766436 33834226 34883365 36010887 37142624 38444156 39752015
3828 39752015 41100562 42429351 43952266 45474055 47019894 48478920 50163393 51992841
3820 51992841 54024320 56187621 58361484 60584786 63123879 66053341 69381461 73056052
3812 73056052 77166483 81830388 87312814 93558760 100850082 109329631 119437821 131170668
3804 131170668 144981729 160996069 178331548 194923844 211451162 227404889 242376759
3797 242376759 245781383 244373836 247460542 256302641 274864353 299915337 326662243 350279597
3789 350279597 368985644 379502535 373323198 339717493 290710405 240917205 199177611
3782 199177611 168990630 147155821 130275300 116397539 104628019 94450361 85596914
3775 85596914 78421659 72785340 68524302 64973912 61785462 58739073 55954796 53245521
3767 53245521 50626672 48019982 45621725 43387693 41252254 39274498 37323589 35547264
3759 35547264 33992158 32480706 30950943 29498494 28290602 27365757 26747803 26174398 25758705
3750 25758705 25474797 25287762 25298248 25315654 25278054 25144745 25044374 24939272 24819426 24882334
3740 24882334 24901936 25101371 25450998 25727434 25912197 26003808 25895959 25571686 25111199 24505792
3730 24505792 23650545 22663604 21633174 20611048 19729707 18839414 18030926 17258663 16421501
3721 16421501 15558721 14843563 14188517 13609530 13023826 12575505 12149877 11819011 11508425
3712 11508425 11224430 10963892 10640133 10312363 9919759 9595908 9271067 8916789 8611861
3703 8611861 8399156 8258969 8104048 8012245 7879106 7800490 7772668 7738966 7666941 7519391
3693 7519391 7397414 7228004 7083907 6959119 6797652 6643974 6574869 6505392 6476598 6475283
3683 6475283 6455806 6396896 6309148 6222218 6119903 6080398 5978145 5946139 5859332 5744219 5639817
3672 5639817 5605042 5475367 5382595 5255110 5156769 5076614 4993431 4923838 4913935 4839135 4866210
3661 4866210 4818838 4733897 4710076 4685995 4619259 4501182 4382699 4371274 4243136 4185540 4084375
3650 4084375 3947790 3912626 3820342 3748678 3644460 3608170 3574506 3531279 3558737 3515323 3427416
3639 3427416 3304311 3223398 3201366 3163610 3157865 3173573 3118734 3063968 3026200 2995687 2898307
3628 2898307 2839584 2779934 2685818 2718610 2757812 2808546 2840913 2829049 2813058 2815810 2795079 2830687
3616 2830687 2890893 2905995 2951003 2913012 2848189 2849194 2866303 2895361 2942750 2994427 2990009 3105536
3604 3105536 3158936 3188979 3199914 3154401 3088426 3026517 2973449 2891262 2793827 2671904 2534251
3593 2534251 2505796 2456253 2405303 2374759 2304079 2324451 2295183 2235950 2158789 2139705 2129879 2065948
3581 2065948 1993785 1925788 1925600 1922061 1860545 1815877 1832163 1765034 1725763 1689118 1634683 1594243
3569 1594243 1547871 1591512 1565870 1542569 1486573 1478913 1547715 1575308 1595641 1668509 1732528 1778574
3557 1778574 1777624 1794437 1786584 1758879 1750810 1682811 1700995 1708563 1793912 1804160 1881665 1946175
3545 1946175 2012880 2019315 2070861 2073399 2133805 2160307 2144469 2214620 2287583 2298353 2337321 2338819
3533 2338819 2348705 2439985 2535482 2596541 2704616 2805408 3013150 3139113 3204130 3304639 3369069
3522 3369069 3328137 3148644 2907037 2717313 2519777 2278143 2181972 2182648 2125716 2013440 1949342
3511 1949342 1923134 1846433 1761499 1737009 1628984 1559784 1556167 1513700 1492436 1566291 1512844
3500 1512844 1478305 1510259 1568263 1532684 1489271 1456419 1422919 1429326 1442548 1463722 1540729 1513221
3488 1513221 1491702 1544507 1570780 1598567 1589481 1606741 1632848 1585275 1628287 1669781 1672395 1680563
3476 1680563 1708877 1694166 1773461 1898309 1942459 2033873 2094652 2121068 2263307 2302228 2345626
3465 2345626 2527832 2649469 2818146 2944940 3074538 3200223 3302817 3376444 3431235 3475950
3455 3475950 3470090 3511384 3518341 3468314 3455329 3412727 3435931 3450345 3444671 3395798 3305482 3317455
3443 3317455 3246218 3141608 2977379 2851651 2695748 2546593 2411682 2276614 2173682 2127639
3433 2127639 2165116 2028294 1965909 1939436 1897195 1897309 1845531 1805921 1755146 1685396 1688116 1746948
3421 1746948 1716573 1678706 1694512 1773540 1775477 1814361 1803322 1748065 1767414 1806790 1847181 1881483
3409 1881483 1885978 1878968 1940083 2007457 2053595 2166123 2158713 2240952 2330461 2271847 2342511 2430257
3397 2430257 2418007 2483882 2560040 2567999 2635449 2710776 2836064 2856633 2903757 2995461 3056229
3386 3056229 3084914 3154935 3190951 3248348 3300871 3342668 3378598 3477747 3614249 3675325 3735503
3375 3735503 3737058 3807934 3802552 3895594 3947782 3971248 4020694 4016229 4036353 4100055 4146148 4132636
3363 4132636 4084232 4049976 4073021 4080753 3982800 3898421 3851807 3785642 3745421 3673686 3646143 3525145
3351 3525145 3511957 3485316 3465084 3452824 3407278 3444345 3452355 3413919 3457025 3509189 3528457 3550686
3339 3550686 3593848 3620285 3649955 3668806 3709890 3699461 3704139 3740859 3775070 3750279 3801760 3921709
3327 3921709 3901803 3984354 4018182 4039426 4122829 4206203 4286251 4299162 4363929 4395088 4442677
3316 4442677 4530217 4589570 4653101 4743282 4810998 4907956 5029823 5115118 5320576 5390927 5467443
3305 5467443 5646729 5799634 6004983 6117820 6260199 6476941 6691235 6923092 7237523 7512401
3295 7512401 7744474 8004667 8245203 8421943 8614639 8831592 8921346 9007140 9063455 9167895
3285 9167895 9196348 9177137 9216051 9243222 9212813 9142123 9076776 9071903 9008897 8916872 8768617
3274 8768617 8605240 8540183 8429809 8307052 8138121 7990383 7886834 7787091 7694306 7634238
3264 7634238 7591324 7518668 7510106 7535273 7494541 7544356 7615101 7691107 7770215 7817610 7912106 7971155
3252 7971155 8118112 8232546 8316475 8410256 8493883 8636855 8839132 9035692 9210578 9392796
3242 9392796 9600156 9701028 9835172 10021804 10182658 10376073 10493258 10630587 10820929 11001709
3232 11001709 11135321 11294854 11342829 11408265 11466315 11507749 11572105 11646991 11678382 11700977 11717576
3221 11717576 11755936 11694922 11619872 11581850 11571072 11563185 11504668 11443351 11402012 11328664 11276365
3210 11276365 11258845 11220626 11137566 11122948 11125182 11061425 10970298 10884141 10801458 10779491 10705572
3199 10705572 10601247 10568879 10464779 10486487 10548051 10602750 10638068 10690586 10844578 10929816 11045413
3188 11045413 11202008 11357514 11580234 11814477 12010750 12254499 12523983 12798730 13125690
3179 13125690 13392069 13663846 13948612 14200031 14382829 14539885 14634881 14716515 14725414 14667478
3169 14667478 14578797 14533955 14457430 14467775 14464949 14488595 14485653 14466817 14343902 14221796 14086946
3158 14086946 13881526 13624402 13381120 13200196 13014973 12882492 12750696 12716307 12712603 12655120
3148 12655120 12602211 12538632 12521131 12594016 12622187 12686780 12720712 12786020 12893064 12960207 13032959
3137 13032959 13077350 13124067 13242145 13394632 13529538 13640668 13807458 14003875 14184731 14374391
3127 14374391 14501026 14672281 14788711 14962373 15043572 15194328 15341911 15453809 15603683 15798959
3117 15798959 16002183 16227636 16441762 16625875 16838702 17082010 17360153 17620559 17801018
3108 17801018 18029726 18259281 18455021 18763346 18997982 19352525 19633273 19965120 20273684
3099 20273684 20606978 20967541 21337303 21743433 22092908 22451709 22906183 23390521 23927171
3090 23927171 24463076 24950975 25450794 25925120 26390967 26926219 27400083 27845919 28238997
3081 28238997 28562263 28844965 29101432 29312132 29619312 29895934 30130577 30478802 30884378
3072 30884378 31137795 31381775 31769094 32119316 32464186 32810910 33145744 33505230 33864572
3063 33864572 34332691 34766338 35151829 35525726 35892468 36256054 36601770 36952023 37239161
3054 37239161 37470251 37615504 37749958 37865971 37956916 38012995 37974360 37986149 37949041 37960940
3044 37960940 37970583 37938253 37931436 37976109 37981345 38023503 38103484 38197250 38280069 38253405 38324013 38376387
3032 38376387 38487926 38422935 38355260 38355217 38268130 38124756 37883898 37636048 37419100 37072632 36748648
3021 36748648 36338109 35876467 35356888 34819312 34220182 33576573 32940279 32245402 31653698
3012 31653698 31000615 30370159 29835388 29257843 28694808 28075765 27456217 26953963 26515456
3003 26515456 26002411 25436252 24934507 24459430 23991599 23599348 23201670 22706825 22321809
2994 22321809 21934987 21588748 21330348 21083978 20785121 20555704 20334901 20134715 19993045
2985 19993045 19800925 19626875 19453166 19238104 19033875 18845211 18714310 18598718 18476677
2976 18476677 18345927 18150092 18004989 17898968 17780355 17604936 17440769 17291059 17171490
2967 17171490 17057883 16870812 16686420 16558507 16456197 16285033 16152498 16035965 15856388
2958 15856388 15778808 15691698 15589992 15466338 15382053 15394824 15321478 15175701 15126393 15073213 15014264
2947 15014264 14984809 14944047 14877421 14851478 14830742 14874295 14812298 14750875 14717763 14684165 14711034
2936 14711034 14680628 14615725 14560389 14483898 14513740 14616597 14601944 14549923 14520932 14540571 14563342
2925 14563342 14575607 14564100 14474875 14414110 14341546 14237258 14208799 14139859 14040363 13955833 13883261
2914 13883261 13826603 13768636 13686960 13605141 13549244 13507064 13415392 13347877 13306523 13213929 13237411
2903 13237411 13204620 13186187 13121347 13098667 13075208 12972175 12872511 12748262 12680817 12618844 12510507
2892 12510507 12335632 12243101 12049728 11839895 11693152 11580556 11434273 11289662 11116219 10990370
2882 10990370 10831688 10730378 10564453 10498396 10454638 10329914 10253529 10130508 9991430 9937952
2872 9937952 9862295 9689560 9592019 9487605 9346408 9209126 9108764 9002329 8901073 8755049
2862 8755049 8658366 8592167 8445119 8348726 8265212 8193351 8091878 8058629 8031630 8016182 8025336
2851 8025336 8005059 8051243 8017523 7999177 8023378 8014319 7999201 7939525 7890024 7873842 7864484 7813587
2839 7813587 7717475 7653527 7594930 7528012 7617866 7644083 7595851 7576286 7549624 7669867 7683179
2828 7683179 7645751 7672969 7690031 7710616 7755832 7824880 7907342 7853321 7874771 7981098 8011461
2817 8011461 8029902 8073744 8158933 8216761 8227442 8310154 8434933 8514648 8660768 8832185 9023946
2806 9023946 9232381 9465668 9751587 10082591 10461835 10997446 11532509 12118735 12899203 13752650
2796 13752650 14726375 15731305 16634455 17306413 17687078 17573871 16820410 15587669 14291213
2787 14291213 13099094 12105521 11363220 10938386 10555553 10259576 10103540 9907827 9733513
2778 9733513 9643461 9650929 9618988 9604032 9638206 9693877 9728618 9852715 9992431 9997995 10015504
2767 10015504 10086011 10187277 10350441 10478549 10608395 10711772 10838636 11070584 11183656 11370862
2757 11370862 11640949 11884995 12241924 12603952 13069787 13530092 14031852 14689953 15377393
2748 15377393 16087864 16866112 17738282 18656452 19585204 20576655 21521544 22431602 23246664
2739 23246664 23841159 24196062 24252339 24202200 24052518 23837975 23775222 23742619 23709226 23776857
2729 23776857 23952549 24084544 24301239 24460099 24804133 25363892 26035762 26756254 27682100
2720 27682100 28902045 30152454 31580873 32923976 34366544 35769256 36954326 37927721
2712 37927721 38613841 39022221 39199047 39132080 38800762 38345853 37919668 37662207 37486058 37615650
2702 37615650 37952108 38571571 39444354 40449051 41657510 42979019 44308675 45546062 46736433
2693 46736433 47644868 48136869 48241115 48004636 47395339 46572696 45454030 44107593 42555785
2684 42555785 40827806 39139308 37496699 35934241 34656577 33450667 32482061 31732074
2676 31732074 30994290 30470099 30092006 29780955 29546303 29345734 29120071 28930272 28638332
2667 28638332 28430552 28214029 27811366 27447069 27119518 26622043 26069687 25520830 24851502
2658 24851502 24058372 23229852 22423979 21472596 20451446 19403730 18471673 17539557 16583687
2649 16583687 15755371 14932842 14172191 13488371 12823242 12236653 11612971 11118963 10672640
2640 10672640 10242312 9760820 9362725 8995993 8643342 8340841 8024846 7756614 7414530
2631 7414530 7162691 6888292 6704177 6464657 6220555 6022220 5756480 5567543 5400386 5243418
2621 5243418 5057276 4940847 4866129 4698876 4570607 4450180 4310889 4204254 4091490 4031492
2611 4031492 3900087 3786586 3711267 3632573 3580795 3431475 3350883 3299733 3275388 3162502 3123789
2600 3123789 3063433 2955186 2896588 2806899 2707315 2695831 2645625 2579670 2563424 2519152 2442720
2589 2442720 2384496 2320842 2361654 2337739 2195362 2141458 2080552 2028640 1991426 1977786 1975224
2578 1975224 1937377 1937077 1918655 1892954 1903214 1845531 1822815 1797302 1767567 1743207 1689039 1665858
2566 1665858 1661796 1661139 1665358 1649856 1644973 1608857 1539517 1502311 1509858 1526411 1593989 1554488 1486005
2553 1486005 1507729 1466251 1415757 1469479 1435637 1413169 1402826 1367322 1394043 1408815 1320970
2542 1320970 1346639 1327050 1243507 1295802 1263687 1297762 1318849 1306282 1310543 1286993 1300207 1278570
2530 1278570 1211298 1182584 1133372 1119061 1141702 1154550 1189516 1200107 1143351 1128854 1165747
2519 1165747 1158851 1095140 1127694 1097813 1146035 1191478 1141267 1118896 1145863 1142202 1079184 1055206
2507 1055206 1098335 1063441 1082485 1112373 1042787 1072574 1081912 1062126 979181 1021740 1062152 1052190
2495 1052190 1059282 993672 933874 917056 985764 1003388 1028427 1000237 1035325 1072215 1040024 1022264
2483 1022264 1000038 965712 908555 919578 937684 921197 930877 983405 943415 949557 923627 899216
2471 899216 901827 903718 874095 862723 813632 794235 788165 860638 865696 843684 856115 855430 796258
2458 796258 796021 798024 829855 848163 822812 778051 810334 831553 830238 830741 770024 752039 730438
2445 730438 766760 736831 718242 716908 702597 705325 716880 709847 709625 680198 696402 675305 651295
2432 651295 625052 627695 621281 647439 605993 594466 548980 476774 523531 482830 465157 496947
2420 496947 525143 508707 460272 465887 435629 479313 530831 496755 451321 432677 421473 455359
2408 455359 482407 469710 444462 386814 409769 375286 407151 367252 330591 325410 366412 370740
2396 370740 337906 372022 330452 319552 360370 282344 277767 332880 365124 337029 300240 280106
2384 280106 312114 290429 313945 316591 218068 208309 220191 256965 289651 268753 285268 276735
2372 276735 246668 257118 268173 266355 284781 277471 224710 277856 236647 249675 220255 250498
2360 250498 272730 247455 253144 249292 194444 213222 232223 239569 208178 260904 262801 214722
2348 214722 234753 258547 230009 190391 239962 235286 173226 195671 192492 164828 156925 196258
2336 196258 188253 203811 203858 147270 136110 102538 100047 132740 138523 172148 120271 81402 135071
2323 135071 225177 166443 170125 141024 95087 172042 74678 95972 141677 159742 154727 147887
2311 147887 133097 161471 147095 124082 93913 131015 115616 72430 130089 134082 98092 126557
2299 126557 111515 116190 140777 144171 171805 137521 108779 143755 210765 160760 106476 79439
2287 79439 81186 89804 73395 81764 98405 147670 167819 82573 47067 48586 71388 79695 99761
2274 99761 93647 57615 83013 63333 39173 55743 63829 59160 35816 26489 89596 120663 49586
2261 49586 -31967 -15681 25101 96312 106584 89344 48180 16390 79856 51116 -18126 -33667
2249 -33667 27144 65498 53460 65221 52564 -7813 59749 73309 -23372 25939 17476 78944
2237 78944 -13172 10906 39860 59221 86916 88343 29041 -40485 -28678 10125 35640 47816
2225 47816 34898 31959 37504 64523 45009 53789 -10599 -25720 27996 52184 17284 23706 -5593
2212 -5593 -18924 28587 -42726 -13120 -35051 69 75555 74692 51032 18141 24081 40565 45554
2199 45554 30837 1147 12089 -764 -32808 -49513 21898 31478 76039 90461 76862 59257
2187 59257 109329 78451 65393 72997 78327 133634 60132 47467 122209 66168 47423 16089
2175 16089 76720 113209 96510 88568 80581 75603 117692 166872 133522 123820 134590 89750 94710
2162 94710 91342 138010 159228 91209 75335 144333 153497 162080 147677 122884 156943 145738
2150 145738 140795 195580 155051 124809 208620 193032 210615 247485 199104 158935 247591 277143
2138 277143 281851 244274 206686 236691 266422 251662 260238 276778 331001 297373 293597 278061
2126 278061 297077 274898 244213 291218 236306 292047 283521 265937 327645 303907 330421 326204
2114 326204 379282 398660 407835 369320 322950 355155 350586 431066 374478 443950 508955 526057
2102 526057 506553 558346 535701 573764 638923 669406 711492 720451 750341 802630 848858 813220
2090 813220 871160 959364 969265 1027765 1038929 1020102 1026506 1072002 1133276 1193814 1303067 1366686
2078 1366686 1432101 1494071 1608064 1727364 1849231 1927851 2223248 2444420 2701658 2953952
2068 2953952 3112641 3360280 3688872 4076397 4498954 5061862 5740593 6524060 7548546
2059 7548546 8740627 9841396 10899124 11598176 12081459 11395302 9462372 7575217 5849385
2050 5849385 4732768 4000046 3441517 3065508 2745387 2442713 2134857 2013464 1820221
2041 1820221 1695437 1616135 1520381 1406807 1202877 1154033 1096298 1084335 1015340 887788 858434
2030 858434 790921 722672 669655 616543 614978 531639 442312 412332 420371 398088 442973 436821
2018 436821 380767 370510 330273 319063 351363 335613 330041 304599 244617 238179 224329 234965
2006 234965 260826 228128 217890 232712 230189 228153 240967 266964 274153 220450 231592 250034
1994 250034 226948 189156 233584 240052 139839 136080 131143 96583 77313 58642 132012 111854
1982 111854 96527 84816 71302 16887 -6922 25013 53109 28916 -16320 -34656 4401 48120
1970 48120 69702 106883 42383 -57648 -47585 2646 5230 23793 11230 8595 -24204 -10053
1958 -10053 -2041 37409 8378 -1001 45817 47350 16747 1456 -40661 -39132 -27147 -43890 6668
1945 6668 61278 -659 3624 -36612 -23461 33130 47824 -7312 17768 91510 88197 75996
1933 75996 41477 -19221 26930 54851 29015 -7488 -12864 -34060 4748 42202 -10428 -39720
1921 -39720 -36396 -27035 335 26869 28108 47961 75035 18704 6428 24054 45249 39545 6837
1908 6837 4701 -17591 -19 -45101 -47936 -21312 -11011 -10009 -30419 -16716 -10199 6531 -1608
1895 -1608 -27391 -80202 -41739 12645 -36007 -6526 -25910 -69292 -38674 -13811 -18530 -1567
1883 -1567 14259 26058 -19768 -62148 -14504 -2640 -35347 -74181 -55016 -77604 -67304 -60503
1871 -60503 16078 29912 -29158 -6179 -3338 2080 -10874 -24290 -11603 46716 9174 -35132
1859 -35132 22490 31459 -11455 -4954 8688 20930 2759 23506 -9275 -16347 -55023 -6095
1847 -6095 543 73296 37103 -18040 -3657 -23658 -37244 15846 -12128 -58153 -54681 -93083
1835 -93083 -23275 38152 -22277 -6071 17962 -9837 -33730 -32877 -95039 -121162 -67833 -38466
1823 -38466 39493 25308 17400 -6835 10606 -22704 65139 110077 64701 3896 19562 12670
1811 12670 -44598 -7205 18519 -52119 -74531 -21795 -71534 -71484 3583 -16264 -30832 -30279 -86756
1798 -86756 -45713 -94382 -88645 -56497 -33779 -40526 -41297 -5552 -33235 -45304 -45869 -28039 -9249
1785 -9249 -24583 -14839 -37492 -56078 -81370 -31110 7171 -17849 -78136 -93546 -115611 -59384
1773 -59384 -70768 -67401 1538 -51962 -76000 -3370 12421 -27100 -87217 -70648 -48591 -87602
1761 -87602 -52739 -121400 -63161 -82614 -75912 -51479 -13448 -17072 -45490 -42148 13558 40399
1749 40399 -15024 -12099 -20604 -7342 4297 -1022 -57452 -55012 -32036 -47861 -44989 -78432 -66885
1736 -66885 -59657 -23650 -26004 -76209 -47645 -48483 -40372 -16768 -18476 -52320 -62118 -10282 43290
1723 43290 10438 -14270 -10662 -12229 -25925 -88658 -8073 -32361 -39249 -87475 -93906 -52333 -57925
1710 -57925 -79133 -78777 -33454 9425 -6298 -4373 5671 -44751 -15690 10872 -35465 -36998 -26704
1697 -26704 -4893 -41771 -67239 -19453 8309 25400 -11198 23479 80993 24692 -8626 -31001
1685 -31001 -26428 -132848 -103630 -67188 -133764 -74051 -28334 -59911 -67455 -46114 -16112 -29152
1673 -29152 -109793 -74244 -65336 -53888 -83046 -27569 -13469 -57047 -83836 -39229 -26167 -44672
1661 -44672 -80285 -77183 -71244 -44880 -60170 -69507 -82065 -74962 -69531 -60914 -8709 20288 -13924
1648 -13924 -10265 -28797 -70950 -69211 -67286 -83874 -64013 -46755 -37793 -18533 -50777 -27017 25991
1635 25991 57202 14450 3201 -55202 -33685 -47567 -79467 -56857 -76245 -62108 -49196 -13023
1623 -13023 -10503 -50745 -34028 -75703 -54615 -66174 -32081 -25668 -69946 -10462 -65845 -94999
1611 -94999 7925 -11786 -41451 -73493 -69432 -20936 -52019 -87484 -109988 -53243 17799 -20344
1599 -20344 -75607 -99800 -119935 -88217 -126580 -98199 -107855 -153652 -117538 -61750 -74522 -76380
1587 -76380 -90105 13018 8755 40507 7928 -23912 4318 -6589 -25457 -71096 -27403 -66138
1575 -66138 -130964 -111568 -104541 -13923 -2369 -31620 -42017 -47924 -35297 1297 -1131 38382
1563 38382 44089 1710 -15244 -41910 -32787 -10580 -5001 -35908 -1913 -29222 -32672 -74897 -36720
1550 -36720 -53929 -36194 -43829 -85973 -102147 -92351 26186 41500 6402 -17985 35097 17120
1538 17120 11415 47963 11643 -33782 -24092 -42268 -52209 -47590 -79410 -37180 -45398 -36778 -52233
1525 -52233 -52941 -32904 17255 -19127 -19015 -28675 -68710 -68833 -34781 -43759 -63598 -69191 -69743 -34838
1511 -34838 -38414 -37450 1484 -31594 -16157 27743 23765 -51534 -11628 26958 26497 -35295 -12113
1498 -12113 -44682 -14671 -13285 -17166 -19758 -71660 -19983 -8808 -45482 -40251 -45062 -76414 -63488
1485 -63488 -28739 -752 -31117 -26474 -63710 -56271 -16387 -24036 -44854 -19656 -27417 -96156 -108986
1472 -108986 -83218 -39464 -31687 -23122 -39983 -65550 -50168 -18784 -12876 -42573 14568 -31592
1460 -31592 -23728 -4999 -44142 -98010 -74422 -48075 -27910 -49956 -82068 -73969 -52706 -8308
1448 -8308 -5239 -82144 -75086 -33037 -31058 -50323 -24550 -34744 -51813 -97412 -86310 -80841 -58833
1435 -58833 -57865 -55226 -29804 2638 1904 -29658 -18849 33172 -62856 -95773 -106292 -105711 -120479
1422 -120479 -80063 -68944 -22661 -1788 -20641 -8883 -71670 -33987 -39739 -59836 -37513 13891
1410 13891 12161 80699 35510 -32932 -39768 -43576 -69054 -47379 -23130 -43313 -70997 -14190
1398 -14190 -69707 -43188 -20499 -81141 -61222 -27959 -4690 -18183 -6957 -50545 -66475 -66303
1386 -66303 -40668 -66315 -21221 25158 -27354 -52063 -57148 -17024 -74605 -67334 -37720 -37289 37296
1373 37296 33797 -57532 -11594 7934 19175 14359 -56697 -66741 -59559 -42797 4061 23978
1361 23978 17592 -12346 -14979 -50228 -41530 19492 -67141 -60382 -8078 365 -55834 15469 16385
1348 16385 4008 450 19020 -29320 -51671 -94021 -101927 8789 -14755 -46432 -58486 -34135
1336 -34135 -51817 -10461 -69333 -63364 -39647 50210 3108 -29424 -4529 -28664 12977 19713
1324 19713 -31492 -12016 -32684 -76661 -114990 -122135 -125458 -81818 -18144 -29724 -20292 -31209
1312 -31209 -65105 -5784 -8862 -50544 -32587 -30121 382 -91251 -98708 -28189 -27304 -9859 -6412
1299 -6412 -31408 -70676 -52588 -58843 -35614 -11579 -11146 -39314 -43146 1317 -40952 -50051 -39594
1286 -39594 -14593 -37760 -25665 -7075 -56603 -117247 -85084 -53794 -38765 -32589 7238 9617
1274 9617 21217 14035 29801 9587 -22356 52427 21643 20676 13778 22646 -4512 -58576 -6569
1261 -6569 -7936 -11656 -8438 -58722 -39488 -3618 5999 18765 -28957 -734 -20408 -57053 -49041
1248 -49041 -6642 6549 -13140 3414 22474 -28147 -34944 34389 -20864 -21783 -46810 -67933
1236 -67933 -62747 -38382 -2526 -29301 -27085 -38245 -20122 -33271 -14659 -73987 -83167 -43315
1224 -43315 1880 46431 39078 23579 -4573 -48361 -58707 -50909 -52214 -43036 -24684 -23370 29741
1211 29741 87573 70929 30348 53184 66179 1266 -39257 2942 -49298 -65018 -31065 -15179
1199 -15179 -49490 -35822 -59163 -83434 -48685 514 26985 -18268 -24523 -9066 -1077 -38015
1187 -38015 -22983 -26581 -23831 -29657 -22850 -29937 2996 -43236 -36591 -17341 4046 15592 -32933
1174 -32933 -20558 22868 -2633 -19598 -86217 -63438 -4873 15894 -17458 -37555 -10036 -53741
1162 -53741 -72176 -48661 -34340 -34059 -6326 -6823 -5329 22398 -41422 -39232 -32135 -5103 -6521
1149 -6521 -6539 5384 14410 -45600 -14258 44740 -17600 3083 13669 -7968 32152 56740 9466
1136 9466 7392 -37587 -50871 -57071 6443 9725 -12564 21605 -21283 1656 25360 35190 54827
1123 54827 36829 -6498 -5109 -25968 -23610 -59728 -95452 -38867 -40176 -43998 -40898 -53570 -53815
1110 -53815 -37984 -40339 -43123 29633 48287 63297 -7585 -72124 -11566 4641 -16442 17986
1098 17986 33002 -69227 9579 25035 872 -6488 -51827 -56666 -9368 1741 13697 -5372
1086 -5372 -12493 58001 45275 46503 43728 43153 -41756 39221 12997 42327 39585 5078 -365
1073 -365 6051 -24780 -76121 -70456 -77559 -28220 -4415 77290 30612 43625 10016 12237 27772
1060 27772 40164 16605 34425 16246 6636 20916 34900 935 44417 -6464 -46854 2047
1048 2047 30428 -5270 -44878 -91650 -75765 -39701 -37845 -53260 -36486 -18905 -3389 -12209
1036 -12209 -24912 5848 16598 3143 -10434 -31225 46171 110311 91302 16605 10346 10915
1024 10915 19377 1931 -12023 19541 32299 55404 14034 43329 601 4850 -18717 -36252
1012 -36252 -27262 -10667 -18979 4824 3517 40775 86885 57414 57926 13439 287 386 -19886
999 -19886 -13848 15970 -19411 13593 -9368 -12991 38366 17102 66234 30044 3834 -5413 42006
986 42006 16529 6162 38327 51617 51864 -10308 -50948 -29029 -18753 50448 38102 -14719
974 -14719 -20130 9240 28410 67228 47186 21442 564 41005 26144 84394 33515 -9996
962 -9996 -51900 -67784 24959 7382 21536 39641 -13197 -14784 -46095 -59367 -31396 -45434
950 -45434 -45301 -70762 -47752 27640 30726 -751 24570 8804 -55184 -28453 20116 36480 7933
937 7933 -2618 24395 -19751 -29844 -29310 5522 -2179 6227 51888 45831 65989 19713 28717
924 28717 28432 17323 -16454 1316 37992 17978 22001 15812 6243 -6551 9126 -12143 6051
911 6051 5609 71247 28412 -10250 -16460 7632 43175 29189 26518 1830 12437 18923 -50933
898 -50933 -26095 -14758 33662 -24562 -41508 -38319 -17377 21689 12117 12161 12291 -33888 -2707
885 -2707 31873 9309 -26780 -15147 -37606 -75705 -52916 -109957 -109159 -68987 -39431 -3498 37831
872 37831 36793 84134 37873 -203 19749 48415 55250 -47475 4854 -21062 -32236 14184
860 14184 30254 19024 13542 22673 7111 -3638 -5629 -2325 3701 4054 -14926 -60514 -22874
847 -22874 19268 74008 81215 -7485 -58465 22173 -173 -172 12306 -30996 -32729 -21514 -950
834 -950 45285 57898 55245 57348 18847 4465 -59540 -73899 -19485 -40003 -64986 -30841 9078
821 9078 27800 72541 66985 -43983 5749 55614 100046 57943 -6723 -20247 45096 -9368
809 -9368 14444 27033 53479 78810 38090 25231 57649 46053 49278 14417 7739 5748 6551
796 6551 -56689 17045 150 18416 30480 30611 44383 45041 53905 32614 31787 -31484 -13747 49085
782 49085 97495 52074 10202 66709 71121 26991 -30961 1841 33287 4844 46373 50989
770 50989 80652 8885 16223 19329 13590 23791 14417 -1023 54016 44749 27986 25033 3463
757 3463 19090 -27094 -37281 -20994 16242 40154 51776 26867 27367 43400 37808 3955 -25210
744 -25210 28123 -55655 -71488 -46662 -4191 30137 56989 -25669 -67858 -10703 -31326 52521
732 52521 108064 34634 19667 -4062 -12646 31505 25170 33311 -1069 -17127 -3033 -23920 8102
719 8102 56117 77549 14420 -20061 16381 -22294 81760 71895 -16265 -13691 -9686 -13559 6335
706 6335 18790 41382 40213 54445 13037 6657 31790 31885 43839 16478 23681 -25825 7628
693 7628 13661 38546 23197 -19947 -516 -10268 -45111 -25999 -23419 -1047 22371 4015 41948
680 41948 70322 -34357 52642 -5439 -33014 11559 28159 -20254 665 3665 2603 26831
668 26831 19310 17832 44126 22428 -26888 -41873 -46200 22099 -28158 -14323 2241 -16468 9296
655 9296 -11717 -32040 -29406 -44378 -42697 -18915 -12858 -7558 15858 15337 53067 5474 12575 56574
641 56574 106755 94395 51153 21218 -6536 38292 23170 33822 47601 94513 77198 51137
629 51137 -34 -12668 14568 -20162 26435 -32710 -68325 -37201 -1551 -33428 27931 -1735
617 -1735 35686 68004 40324 34471 81180 76913 39963 -26299 -17813 -2978 22888 40346 62000
604 62000 22218 15661 47781 92760 93240 71563 47948 30796 21168 16794 35965 -24695 -9935
591 -9935 31522 26272 26256 61879 47186 -14551 29840 33252 49056 59210 -12316 -21282 34816
578 34816 5507 38158 52107 49962 93019 61608 23586 5483 -13838 12781 24528 22662
566 22662 90555 38613 29478 51972 23548 -37179 -5633 45652 37434 2780 38378 53381
554 53381 79239 102651 84726 75579 53968 10440 70740 42206 18972 32845 68776 54142
542 54142 62484 44195 -366 -32716 30797 35555 79697 94417 53376 43592 64931 59734 52223
529 52223 79060 110234 49702 5558 54348 98395 43320 -28206 31726 41213 63063 67217
517 67217 -1575 -19952 -15748 28659 57981 10876 -7138 16787 49777 83676 56838 17595
505 17595 28274 -11224 8177 -36856 14927 12945 14010 26434 63705 59510 98390 65529 -34896
492 -34896 -14650 69304 68681 12535 29504 55608 35492 46008 54999 57445 77777 62389 73328
479 73328 36642 20198 16360 81371 108986 93369 59769 76597 79410 70292 8110 46177 72887
466 72887 21693 12383 13158 -1775 -4893 51378 62942 57795 25874 27296 29827 187 25281
453 25281 55726 -865 10333 35110 43922 28694 23302 8454 -4300 75890 15864 48725
441 48725 58205 34871 50955 34864 113623 88453 63611 74611 100147 28349 -28436 6349
429 6349 71223 92987 45172 85735 9637 10034 5728 46525 116258 65074 24537 21310 52601
416 52601 9989 79004 130834 96682 86383 48356 40896 58559 51816 78896 50233 -3960
404 -3960 81522 92372 102575 59914 64193 77481 2963 -10473 27030 63017 68395 116733 60792
391 60792 56016 -2192 -24259 -24236 32562 59150 113385 100396 101224 36835 37221 -11397 10834 36132
377 36132 15278 -17641 24548 53505 52277 55494 7693 15655 67121 61973 -17665 -7499 58124
364 58124 92068 71779 86560 136266 94873 57868 61116 447 71156 84616 32791 23062
352 23062 88142 64779 23203 -3697 -42972 -4932 67575 46285 131932 84963 91383 80099
340 80099 42085 5462 8516 73952 102263 109029 85827 29729 37980 56756 98296 27124 35510
327 35510 64991 70552 57726 14794 75830 38972 45161 89440 66116 57801 67281 50398 48969
314 48969 47807 87393 43731 56337 52427 1678 -37541 39519 32572 -16038 30532 130546
302 130546 103756 47783 55652 17545 13929 54411 95017 52560 161147 103271 98404 53751
290 53751 38969 56601 21958 27644 75110 60401 81395 40847 12622 57049 -4563 34808
278 34808 40998 98815 75539 36328 69310 41840 67854 95981 114740 97584 60819 76586
266 76586 82181 51264 63246 30550 31146 58044 38359 43611 41957 -8501 -14648 67930 123356
253 123356 124268 34667 36106 39383 80138 84102 36661 24566 50153 33202 25896 -38168 19708
240 19708 47242 -18201 -35204 18160 55775 42417 49549 76467 87956 71590 42100 -10138
228 -10138 47667 94865 57812 74300 75041 87096 53057 48072 -8283 73837 109474 47870 66420
215 66420 61289 35249 50960 127347 121709 114691 88376 60545 38080 89320 86711 64067 49320
202 49320 20230 49295 35833 46862 68138 103663 70708 54679 20034 8173 47919 64904
190 64904 -1120 -30510 66545 68133 62253 29007 66906 76201 90103 -7140 -39385 27145 53393
177 53393 29633 7449 28507 34541 12687 2391 61111 40765 51439 73920 87758 79942
165 79942 71968 71539 36737 43381 46694 -23796 7857 83823 99126 94764 103317 65665 90816
152 90816 105254 73200 38550 59073 77594 47333 25917 6317 36327 21280 14599 58032
140 58032 106303 97557 71325 13016 60740 63997 57862 71143 50795 31515 46912 58559 73595
127 73595 109560 87108 20946 42756 61495 42190 14274 49194 100801 94057 83777 117516
115 117516 76554 38864 11463 95413 132846 68959 56243 62691 90363 65557 75539 104743
103 104743 51636 65992 124597 90775 89811 101154 78862 69651 99970 68339 35522 41427 66191
90 66191 66018 95464 65976 71957 102488 59843 25451 35141 62861 91126 66243 11448 52309
77 52309 67050 29539 47480 26637 31821 51886 46903 79417 43852 19855 -7523 22424 25595
64 25595 12437 25326 33496 61884 41556 59857 59954 56835 76172 107428 68138 62742 108882
51 108882 80994 42424 48369 43882 59997 67568 25068 30058 22041 39364 56683 58385 51291
38 51291 50925 61749 33077 52323 39217 16508 72290 45482 73394 101022 76476 17664 38864
25 38864 91093 66736 99763 132550 90673 87289 45670 29629 66946 65929 101188 66708 60247
12 60247 13629 16071 48489 83391 44908 34491 78754 90533 91929 105338 55946 49017
0 49017
$$ Imaginary data points
##PAGE= N=2
##DATA TABLE= (X++(I..I)), XYDATA
16383 -1282380 -1247753 -1241486 -1153599 -1141534 -1133726 -1164449 -1140004 -1122216 -1077846 -1068869 -1054113 -1024390
16371 -1024390 -1028685 -1008270 -1032762 -987171 -938673 -883505 -901690 -919195 -853019 -807984 -789146
16360 -789146 -757967 -750222 -725321 -685458 -729807 -653754 -619997 -618412 -619604 -640488 -623698 -595667
16348 -595667 -512506 -455108 -470069 -468119 -448734 -410737 -371818 -330238 -361467 -324697 -325707 -286146
16336 -286146 -275700 -268369 -211772 -197149 -190645 -198585 -183156 -181197 -169364 -123155 -67032 -63430
16324 -63430 -58223 -76972 -49056 -1908 47919 52980 38857 60818 91113 103751 130144 167666
16312 167666 178877 138748 168667 198835 184768 184094 244078 294930 300536 318067 318315 281079
16300 281079 284068 334071 405311 401189 401176 486974 491063 471603 449271 488947 543850 575403 586749
16287 586749 580655 642065 631118 625847 659501 674633 705066 725776 713755 779046 770480 777584
16275 777584 808064 828362 829511 830297 875334 875285 887391 869579 893631 918197 964713 954569 963572
16262 963572 933160 978246 971220 967142 1020647 1023687 1055998 1108620 1031108 1037744 1050969 1024327
16250 1024327 1055489 1051578 1110782 1146695 1197608 1160707 1143140 1167104 1168255 1164922 1179219 1259308
16238 1259308 1232882 1201962 1224829 1230873 1226104 1318974 1335904 1269776 1281276 1276764 1305364 1313446
16226 1313446 1358660 1387014 1356566 1392228 1458618 1424713 1435985 1437389 1412070 1454601 1504349
16215 1504349 1479704 1468578 1460450 1451721 1446266 1480848 1500549 1488067 1504734 1554383 1576440 1571012
16203 1571012 1517860 1492841 1504085 1565628 1588486 1600444 1618757 1587201 1570113 1581572 1599677
16192 1599677 1671909 1677569 1643901 1661101 1700744 1749275 1790887 1779839 1681687 1742400 1778711
16181 1778711 1756987 1759756 1767850 1749219 1717320 1777287 1801478 1769149 1746178 1738802 1762924 1727536
16169 1727536 1803693 1845082 1801861 1787578 1778922 1861320 1821928 1795129 1814651 1802698 1824143
16158 1824143 1831789 1799407 1791660 1783769 1817506 1828300 1853267 1873325 1862954 1861599 1841142 1929025
16146 1929025 1908529 1889585 1903317 1885482 1907505 1887217 1856594 1884609 1855647 1839069 1884274
16135 1884274 1874894 2000229 2018736 1951975 1955912 1917684 1930293 1939137 1923966 1907047 1924830 1903884
16123 1903884 1897120 1923886 1925883 1907052 1913813 1982802 1981016 1958709 1918862 1888736 1935998 1981861
16111 1981861 1996044 2037795 2025125 2001110 1938413 1993023 2086194 2097252 2041176 1988093 1999867
16100 1999867 1980387 1979625 1947098 2025869 2054221 2046259 1970167 1950144 1957012 2011170 1985272 2008149
16088 2008149 2021363 2042631 2018013 2006830 2082993 2072142 2061327 2054670 2045262 1990325 2016085 2059023
16076 2059023 2079759 2063868 2055166 2065580 2072325 2085911 2048272 1984648 2063111 2088093 2063095 2042149
16064 2042149 1992034 2057825 2082062 2057581 2074153 2093287 2041525 1989735 1993654 2063966 2054473 1994587
16052 1994587 2068976 2042379 1985061 2034856 2111916 2120172 2100026 2074159 2118477 2084022 2050595
16041 2050595 2070904 2039436 2077759 2070215 2033594 2041867 2073068 2070765 2076595 2053737 2061461 2056866
16029 2056866 2072334 2125111 2103214 2083052 2094436 2086095 2091531 2075406 2035285 2083396 2098290 2091794
16017 2091794 2042487 2001974 2041559 2052883 2083197 2090749 2088705 2059066 2040195 2082970 2091826 2103272
16005 2103272 2104257 2107272 2087578 2062308 2038914 2093489 2072363 2046921 2110541 2133194 2069182 2127741
15993 2127741 2101873 2020074 2044761 2075124 2083735 2095614 2013143 2061845 2066700 2039898 2077744 2097639
15981 2097639 2113470 2099996 2136906 2109935 2098821 2112188 2149556 2105811 2088249 2047518 2084532
15970 2084532 2097638 2096436 2077118 2081380 2071856 2074867 2081801 2098108 2091868 2100230 2084278 2129374 2132350
15957 2132350 2107424 2068849 2042437 2085039 2074334 2121822 2119894 2126463 2129215 2103971 2087807 2086581
15945 2086581 2152961 2123368 2090751 2090803 2089628 2075578 2063412 2113885 2104371 2090765 2087248 2083088 2076992
15932 2076992 2089525 2016099 2081164 2063527 2064405 2097821 2127591 2112648 2056823 2035576 2066955 2082033
15920 2082033 2154671 2126696 2124198 2149266 2098644 2111091 2171199 2162080 2094175 2092640 2081816 2099138
15908 2099138 2100562 2113106 2110322 2134982 2188528 2130269 2109320 2090702 2125424 2149856 2087066 2105275
15896 2105275 2169511 2134264 2109503 2103313 2076749 2102853 2140326 2211754 2198941 2121634 2071834
15885 2071834 2087224 2076662 2117262 2117400 2127535 2113790 2028181 2045253 2145261 2143872 2092880 2009336
15873 2009336 2089897 2096345 2152817 2214606 2165175 2125807 2165107 2111609 2105557 2158296 2133615 2098745
15861 2098745 2106205 2133063 2124695 2116148 2118663 2146256 2120426 2114782 2089693 2095566 2144460 2070418
15849 2070418 2090218 2147628 2114940 2121473 2136264 2085574 2082856 2127619 2110733 2152897 2142806 2164314
15837 2164314 2161304 2166035 2122709 2098099 2135411 2100476 2127822 2179348 2117339 2127006 2120190 2082937
15825 2082937 2088965 2138156 2141296 2173025 2182286 2154553 2171048 2166455 2197601 2222881 2238297 2148543
15813 2148543 2155200 2110185 2113639 2077957 2137596 2143834 2139371 2089079 2093821 2126755 2185245 2139563
15801 2139563 2110837 2166384 2159033 2163032 2149588 2160394 2107289 2166831 2188591 2182933 2170321 2123915
15789 2123915 2152411 2180009 2141920 2130969 2091026 2103993 2127938 2160162 2129339 2144565 2148777
15778 2148777 2149361 2111903 2161895 2139358 2172176 2170217 2131127 2107375 2121025 2218046 2221392 2187392
15766 2187392 2162837 2178101 2181623 2117055 2141704 2171202 2207802 2204141 2213132 2180128 2147933 2131555
15754 2131555 2176813 2151153 2180847 2171391 2117876 2117225 2103909 2144380 2182886 2172050 2139993 2150783
15742 2150783 2146373 2139390 2139690 2155347 2189009 2190482 2191178 2170690 2127909 2148892 2149271 2165168 2153935
15729 2153935 2136079 2143359 2159910 2142777 2136573 2122578 2109155 2085514 2101956 2163585 2163842 2201496
15717 2201496 2183368 2152847 2153643 2200207 2209613 2188996 2163310 2147021 2154395 2164973 2227635 2207635
15705 2207635 2180509 2170398 2187577 2135642 2128074 2138815 2201998 2176734 2127188 2133861 2178251 2174449
15693 2174449 2169842 2115743 2094621 2150403 2145529 2137586 2131297 2158879 2183200 2194024 2236851 2246960
15681 2246960 2238506 2270329 2209978 2192252 2216930 2201505 2194117 2134008 2135323 2176122 2173733 2210588
15669 2210588 2192380 2201690 2269200 2196756 2158977 2150316 2199929 2153387 2183220 2137547 2149972 2183786
15657 2183786 2206674 2187522 2179156 2211261 2220441 2195498 2187677 2175025 2196440 2188129 2173556 2175455
15645 2175455 2160575 2136018 2140161 2189370 2214993 2179915 2140373 2225348 2151317 2145739 2226240 2237801
15633 2237801 2257604 2234503 2149100 2175071 2206659 2253007 2184516 2200280 2209749 2235915 2260848
15622 2260848 2206480 2176151 2209614 2205118 2214450 2207090 2230718 2184806 2227490 2198138 2191032 2184665
15610 2184665 2186786 2186232 2153436 2230367 2180643 2195238 2212049 2190595 2177024 2172741 2214987 2245464
15598 2245464 2215886 2199848 2213299 2208586 2239730 2251614 2233176 2196183 2143414 2160492 2203839
15587 2203839 2223952 2210720 2239414 2197350 2130262 2153276 2158556 2167023 2217520 2237257 2268443 2256771
15575 2256771 2246163 2216206 2195256 2214597 2206482 2208238 2249040 2269023 2204071 2192815 2216813 2189669
15563 2189669 2203876 2190753 2193639 2240750 2243118 2274093 2235577 2203558 2187162 2146661 2169671 2175247
15551 2175247 2209974 2152817 2168562 2181719 2169143 2193779 2262561 2199865 2193390 2201795 2195565 2222986
15539 2222986 2198193 2225115 2244744 2213274 2205414 2217095 2216717 2193317 2166557 2208366 2185435 2181219
15527 2181219 2193778 2156140 2105888 2127513 2162284 2225405 2218759 2257463 2248450 2260145 2230638 2209899
15515 2209899 2235835 2263196 2255418 2236338 2203210 2204421 2224443 2211658 2189516 2190858 2269985 2261936
15503 2261936 2252508 2250017 2238444 2262617 2247739 2254313 2247634 2255871 2283865 2193680 2171456 2198707
15491 2198707 2190470 2170842 2212722 2217494 2222902 2199521 2137062 2158024 2220588 2234700 2178566 2169285
15479 2169285 2224504 2196971 2146661 2233968 2210251 2229721 2171360 2214537 2232717 2215498 2209045
15468 2209045 2222825 2217113 2209598 2161737 2107436 2142391 2169448 2246248 2221604 2270725 2250123 2244092
15456 2244092 2259592 2205535 2216228 2185136 2211825 2272259 2260066 2244244 2272796 2289252 2287631
15445 2287631 2316970 2263324 2243419 2261876 2309242 2276749 2263683 2263921 2288602 2332482 2298028 2287715
15433 2287715 2307457 2295443 2278691 2267246 2289826 2264857 2244705 2237497 2299448 2285141 2292103 2243654
15421 2243654 2206386 2189266 2229048 2208538 2235013 2234560 2241407 2212893 2219474 2236576 2146470 2195190
15409 2195190 2305065 2291234 2282409 2274793 2238868 2188008 2201489 2260903 2270815 2279003 2258990 2272134
15397 2272134 2271899 2267165 2260510 2279047 2246910 2236705 2219657 2197929 2206029 2246597 2233347 2213757
15385 2213757 2261044 2250749 2236389 2228628 2278747 2313657 2255082 2264798 2311153 2272370 2275040 2302650
15373 2302650 2258408 2274524 2232736 2227086 2252848 2223007 2201458 2275429 2251625 2257701 2239930 2204961
15361 2204961 2223601 2244139 2219765 2219986 2287639 2328900 2272415 2267641 2201711 2198870 2245323 2288576
15349 2288576 2270030 2244704 2283605 2301291 2292854 2308602 2250868 2199896 2236487 2320413 2283720
15338 2283720 2274730 2258190 2338274 2329105 2237526 2254235 2244781 2266877 2304614 2269066 2300747 2310465
15326 2310465 2226701 2266637 2308164 2347325 2359046 2345584 2316595 2312126 2314767 2331832 2302119 2318139
15314 2318139 2320300 2306675 2302354 2272073 2322813 2296511 2291117 2295139 2261371 2293106 2320569 2343063
15302 2343063 2258416 2210567 2223968 2279347 2234842 2209616 2186552 2210188 2191549 2232700 2240734
15291 2240734 2249742 2300008 2261570 2286345 2300096 2298560 2333960 2330609 2303100 2307798 2315525 2306591
15279 2306591 2295481 2253824 2258039 2286123 2269624 2283193 2302753 2282896 2290232 2283757 2350698 2324960
15267 2324960 2321398 2323561 2327639 2275535 2313156 2286195 2302057 2326185 2318512 2318281 2337067 2343217 2273733
15254 2273733 2325857 2314890 2306634 2308242 2287464 2316247 2320019 2301583 2337324 2328045 2314296 2271720
15242 2271720 2243979 2300427 2378053 2309855 2303046 2299081 2331169 2367176 2339330 2336976 2347547 2258026
15230 2258026 2311213 2347126 2352014 2327745 2247963 2250233 2295769 2246871 2327180 2333633 2336839 2302771
15218 2302771 2263428 2261152 2230023 2253630 2212232 2304798 2342535 2397856 2332947 2331412 2369779 2357702
15206 2357702 2300118 2304106 2336106 2330401 2291991 2225838 2307219 2342299 2264934 2220056 2191845 2262278
15194 2262278 2353994 2312408 2289809 2313866 2313855 2337629 2376382 2423821 2415813 2347372 2320697 2291643
15182 2291643 2338697 2328881 2329186 2351736 2325871 2326999 2302168 2310945 2328065 2347564 2345320 2346393 2343125
15169 2343125 2372560 2411401 2367646 2340456 2297252 2295337 2325858 2348059 2325191 2293554 2293351 2313791
15157 2313791 2355434 2310230 2257728 2261135 2299461 2333433 2310378 2279253 2250975 2288684 2310606
15146 2310606 2305374 2275677 2299348 2330027 2334848 2321691 2321819 2374709 2392990 2383190 2352130 2270630
15134 2270630 2307424 2305437 2364914 2366454 2375327 2388064 2340029 2330508 2369345 2412236 2334710 2299520
15122 2299520 2315482 2396597 2398751 2324849 2317887 2324470 2286906 2299197 2321096 2326859 2344774 2377800
15110 2377800 2373885 2302061 2323551 2361620 2441234 2421774 2340340 2341705 2320466 2414829 2373124 2316930
15098 2316930 2313049 2305584 2337810 2371104 2331692 2377704 2376338 2382151 2334241 2357026 2356741 2393791
15086 2393791 2414275 2384583 2354368 2329332 2337308 2342552 2369964 2379505 2361765 2341876 2293111 2329459
15074 2329459 2358520 2359265 2373111 2326270 2308555 2332827 2317255 2357882 2376859 2344114 2330063 2353064
15062 2353064 2401943 2398662 2348371 2358323 2409175 2401800 2357182 2321627 2373005 2394053 2359988 2394409
15050 2394409 2387758 2376772 2365927 2340018 2266611 2339669 2324666 2327477 2363504 2326269 2341024 2308045
15038 2308045 2353134 2327862 2316213 2307052 2328525 2326805 2367576 2300346 2326166 2310721 2330026 2326838
15026 2326838 2351053 2350372 2345422 2352795 2388255 2347112 2321363 2347251 2374016 2350009 2352089 2381219
15014 2381219 2372853 2308943 2312975 2351252 2398199 2370523 2351822 2320065 2355397 2400158 2378990 2477928
15002 2477928 2508311 2422465 2459843 2403651 2364342 2355447 2331718 2368285 2399347 2434889 2417324
14991 2417324 2384691 2345821 2342161 2295971 2369703 2441874 2384819 2434472 2419996 2370383 2433595
14980 2433595 2336699 2336676 2393029 2440948 2409288 2411599 2417048 2399635 2349657 2325317 2330360 2354598
14968 2354598 2382225 2391882 2409791 2372934 2361020 2360167 2332681 2448955 2498555 2487141 2396568 2369888
14956 2369888 2332628 2333223 2335151 2357666 2393276 2341765 2323387 2351134 2349571 2356555 2360205 2401076
14944 2401076 2417953 2368669 2380279 2352911 2410262 2359229 2343922 2315484 2366521 2415155 2399378
14933 2399378 2418007 2353232 2298588 2319459 2343017 2368259 2385118 2413911 2427519 2429890 2426575 2413086
14921 2413086 2446672 2437020 2441072 2385093 2377033 2389871 2420045 2426989 2434987 2400236 2378437 2361815
14909 2361815 2377098 2391011 2350510 2386054 2412924 2438140 2436173 2457133 2472173 2460389 2509418
14898 2509418 2492120 2468837 2445537 2389315 2407370 2427117 2456160 2475121 2450871 2398533 2392056
14887 2392056 2457269 2466512 2467838 2461807 2420891 2395288 2438587 2449449 2343275 2337380 2384227 2408840
14875 2408840 2437444 2402539 2410735 2413787 2393332 2434347 2428994 2364303 2403186 2451656 2454949 2458072
14863 2458072 2476624 2419316 2422995 2425712 2424589 2411527 2418529 2417865 2403831 2400623 2367532 2430811 2456045
14850 2456045 2375163 2387026 2392996 2389902 2439647 2425239 2409596 2430757 2408213 2433727 2322131
14839 2322131 2381231 2441021 2426537 2488483 2445588 2452361 2461059 2440011 2437175 2497026 2430558 2408638
14827 2408638 2353811 2402527 2435882 2477685 2456318 2468542 2485802 2485066 2473513 2474043 2469679 2427633
14815 2427633 2378914 2402562 2462764 2421653 2426937 2358371 2403670 2443567 2402148 2431244 2431210 2428699
14803 2428699 2447664 2407513 2323589 2393593 2390201 2400925 2475875 2464532 2419442 2463382 2387889
14792 2387889 2453626 2449038 2447795 2400048 2443911 2424218 2440144 2440504 2402498 2408389 2424413 2432968
14780 2432968 2399021 2374165 2401824 2434283 2456303 2435604 2473866 2457942 2426764 2464027 2433817
14769 2433817 2447227 2395321 2468442 2407109 2387366 2394584 2413761 2431202 2463235 2506949 2463233
14758 2463233 2437060 2437978 2426255 2471763 2465877 2447097 2424687 2474576 2453806 2414259 2454256 2471718
14746 2471718 2511509 2451104 2405096 2457311 2438942 2516951 2510851 2535522 2443630 2423782 2416669 2392313
14734 2392313 2398896 2452700 2431691 2390068 2396190 2448791 2486398 2407100 2457776 2495535 2498749 2531172
14722 2531172 2515750 2467624 2442767 2456945 2481157 2534387 2522793 2512326 2525966 2472861 2482774
14711 2482774 2389379 2339655 2418559 2425644 2485121 2481560 2494806 2520412 2513420 2516826 2525033 2486910
14699 2486910 2473153 2438604 2428949 2407093 2407687 2425056 2467666 2444735 2478294 2466336 2443778 2470508
14687 2470508 2496969 2490243 2467025 2496777 2477737 2490843 2508584 2472841 2478183 2513289 2496404 2504143
14675 2504143 2469560 2429163 2404461 2441531 2493243 2496683 2430948 2399909 2435408 2439832 2437449 2427316
14663 2427316 2411590 2402871 2436061 2470214 2446252 2438065 2410732 2442015 2463842 2438794 2460262 2487442
14651 2487442 2509067 2539897 2523668 2537131 2481786 2493796 2481687 2426839 2469710 2507125 2503514
$$ [...]
##END NTUPLES=NMR SPECTRUM
##END=
