##TITLE=1H_CA-8887-10
 CDCl3, 8 sc, 
 6.07.2021
##JCAMPDX= 6.0         $$ Bruker NMR JCAMP-DX V2.0
##DATA TYPE= NMR SPECTRUM
##DATA CLASS= NTUPLES
##ORIGIN= UXNMR, Bruker Analytische Messtechnik GmbH
##OWNER= root
$$ XWIN-NMR		Version 3.5
$$ Tue Jul  6 09:59:46 2021 Russian Standard Time (UT+4h)  she@DPX200
##.OBSERVE FREQUENCY= 200.131506
##.OBSERVE NUCLEUS= ^1H
##.ACQUISITION MODE= SIMULTANEOUS
##.ACQUISITION SCHEME= undefined
##.AVERAGES= 8
##.DIGITISER RES= 18
##SPECTROMETER/DATA SYSTEM= spect
##.PULSE SEQUENCE= zg30
##.SOLVENT NAME= CDCl3
##.SHIFT REFERENCE= (INTERNAL, CDCl3, 0, 17.4983)
##AUDIT TRAIL= $$ (NUMBER, WHEN, WHO, WHERE, WHAT)
$$ ##TITLE= Audit trail, XWIN-NMR		Version 3.5
$$ ##JCAMPDX= 5.01
$$ ##ORIGIN= Bruker BioSpin GmbH
$$ ##OWNER= she
$$ F:/spectra/data/she/nmr/H-F/1/pdata/1/auditp.txt
$$ ##AUDIT TRAIL=  $$ (NUMBER, WHEN, WHO, WHERE, WHAT)
(   1,<2021-07-06 09:58:20.06 +0400>,<she>,<DPX200>,
      <created by zg, POWCHK disabled, PULCHK disabled
       configuration hash MD5:
       00 E9 B6 7A A2 85 ED C7 34 08 36 98 17 FE 4E 26
       data hash MD5: 16K
       CC 9B 23 1A B2 CF E6 95 74 6B DC 6A 6E 82 79 CB>)
(   2,<2021-07-06 09:58:23.00 +0400>,<she>,<DPX200>,
      <Start of raw data processing
       efp BC_mod = 2 LB = 0.24 FT_mod = 6 PKNL = 1 PHC0 = -11914.05 PHC1 = 10.80099 SI = 16K 
       data hash MD5: 16K
       A6 EC 08 91 F5 F2 70 6D 6C A6 D9 79 93 C2 0F DF>)
(   3,<2021-07-06 09:58:45.96 +0400>,<she>,<DPX200>,
      <pk PHC0 = -1.780763 PHC1 = 2 
       data hash MD5: 16K
       C2 D5 5D 21 73 1E C5 4C 7B 60 54 75 58 16 66 57>)
(   4,<2021-07-06 09:58:49.95 +0400>,<she>,<DPX200>,
      <abs ABSG = 5 
       data hash MD5: 16K
       3D D3 3C 92 8D 5A 2F 59 B4 60 FE 6A 24 A9 72 ED>)
$$ ##END=
$$ 
$$ hash MD5
$$ DB 55 45 9C 04 6A 17 32 F7 F3 6B 1F CD 6F 9B 91
##$RELAX= 
##$RELAX= 
##$RELAX= 
##$RELAX= 
##$RELAX= 
##$RELAX= 
$$ Bruker specific parameters
$$ --------------------------
##$DU= <F:/spectra>
##$EXPNO= 1
##$NAME= <H-F>
##$PROCNO= 1
##$TYPE= <nmr>
##$USER= <she>
##$AMP= (0..31)
100 100 100 100 100 100 100 100 100 100 100 100 100 100 100 100 100 100 
100 100 100 100 100 100 100 100 100 100 100 100 100 100 
##$AQSEQ= 0
##$AQ_mod= 1
##$AUNM= <au_zg>
##$AUTOPOS= <>
##$BF1= 200.13
##$BF2= 200.13
##$BF3= 200.13
##$BF4= 200.13
##$BF5= 200.13
##$BF6= 200.13
##$BF7= 200.13
##$BF8= 200.13
##$BYTORDA= 1
##$CFDGTYP= 0
##$CFRGTYP= 5
##$CHEMSTR= <none>
##$CNST= (0..31)
1 1 145 1 1 1 1 1 1 1 1 1 1 1 1 1 1 1 1 1 1 1 1 1 1 1 1 1 1 1 1 1 
##$CPDPRG= <>
##$CPDPRG1= <>
##$CPDPRG2= <>
##$CPDPRG3= <>
##$CPDPRG4= <mlev>
##$CPDPRG5= <mlev>
##$CPDPRG6= <mlev>
##$CPDPRG7= <mlev>
##$CPDPRG8= <mlev>
##$CPDPRGB= <>
##$CPDPRGT= <>
##$D= (0..31)
0 1.2 0 0 0 0 0 0 0 0.06 0 0.03 0 0 0 0 0.0002 0 0 0 0 0 0 0 0 0 0 0 0 
0 0 0 
##$DATE= 1625551099
##$DBL= (0..7)
120 120 120 120 120 120 120 120 
##$DBP= (0..7)
150 150 150 150 150 150 150 150 
##$DBP07= 0
##$DBPNAM0= <>
##$DBPNAM1= <>
##$DBPNAM2= <>
##$DBPNAM3= <>
##$DBPNAM4= <>
$$ [...]
##$SUBNAM3= <"">
##$SUBNAM4= <"">
##$SUBNAM5= <"">
##$SUBNAM6= <"">
##$SUBNAM7= <"">
##$SUBNAM8= <"">
##$SUBNAM9= <"">
##$SW= 20.0188882624521
##$SWIBOX= (0..15)
0 0 2 0 0 0 0 0 0 0 0 0 0 0 0 0 
##$SW_h= 4006.41025641026
##$TD= 16384
##$TD0= 1
##$TE= 0
##$TE2= 300
##$TE3= 300
##$TEG= 300
##$TL= (0..7)
0 120 120 120 120 120 120 120 
##$TP= (0..7)
150 150 150 150 150 150 150 150 
##$TP07= 0
##$TPNAME0= <>
##$TPNAME1= <>
##$TPNAME2= <>
##$TPNAME3= <>
##$TPNAME4= <>
##$TPNAME5= <>
##$TPNAME6= <>
##$TPNAME7= <>
##$TPOAL= (0..7)
0.5 0.5 0.5 0.5 0.5 0.5 0.5 0.5 
##$TPOFFS= (0..7)
0 0 0 0 0 0 0 0 
##$TUNHIN= 0
##$TUNHOUT= 0
##$TUNXOUT= 0
##$USERA1= <user>
##$USERA2= <user>
##$USERA3= <user>
##$USERA4= <user>
##$USERA5= <user>
##$V9= 5
##$VALIST= <valist>
##$VCLIST= <CCCCCCCCCCCCCCC>
##$VD= 0
##$VDLIST= <DDDDDDDDDDDDDDD>
##$VPLIST= <PPPPPPPPPPPPPPP>
##$VTLIST= <TTTTTTTTTTTTTTT>
##$WBST= 1024
##$WBSW= 4
##$XGAIN= (0..3)
0 0 0 0 
##$XL= 0
##$YL= 0
##$YMAX_a= 122755
##$YMIN_a= -161246
##$ZGOPTNS= <>
##$ZL1= 120
##$ZL2= 120
##$ZL3= 120
##$ZL4= 120
##$ABSF1= 17.50444
##$ABSF2= -2.514599
##$ABSG= 5
##$ABSL= 3
##$ALPHA= 0
##$AQORDER= 0
##$ASSFAC= 0
##$ASSFACI= 0
##$ASSFACX= 0
##$ASSWID= 0
##$AUNMP= <proc_1d>
##$AZFE= 0.1
##$AZFW= 0.1
##$BCFW= 0
##$BC_mod= 2
##$BYTORDP= 0
##$COROFFS= 0
##$CY= -3
##$DATMOD= 1
##$DC= 0
##$DFILT= <>
##$DTYPP= 0
##$F1P= 0
##$F2P= 0
##$FCOR= 1
##$FTSIZE= 16384
##$FT_mod= 6
##$GAMMA= 0
##$GB= 0
##$INTBC= 1
##$INTSCL= 1.334414e-10
##$ISEN= 128
##$LB= 0.24
##$LEV0= 0
##$LPBIN= 0
##$MAXI= 10000
##$MC2= 0
##$MEAN= 0
##$ME_mod= 0
##$MI= 1.114404
##$NCOEF= 0
##$NC_proc= -9
##$NLEV= 6
##$NOISF1= 3.799351
##$NOISF2= 2.8
##$NSP= 0
##$NTH_PI= 0
##$NZP= 0
##$OFFSET= 17.49833
##$PC= 1
##$PHC0= -11915.83
##$PHC1= 12.80099
##$PH_mod= 1
##$PKNL= yes
##$PPARMOD= 0
##$PSCAL= 0
##$PSIGN= 0
##$REVERSE= no
##$SF= 200.130007264273
##$SI= 16384
##$SIGF1= 3
##$SIGF2= 2
##$SINO= 5.538805
##$SIOLD= 16384
##$SREGLST= <1H.CDCl3>
##$SSB= 0
##$STSI= 16384
##$STSR= 0
##$SW_p= 4006.41025641026
##$SYMM= 0
##$S_DEV= 0
##$TDeff= 16384
##$TDoff= 0
##$TI= <>
##$TILT= no
##$TM1= 0
##$TM2= 0
##$TOPLEV= 0
##$USERP1= <user>
##$USERP2= <user>
##$USERP3= <user>
##$USERP4= <user>
##$USERP5= <user>
##$WDW= 1
##$XDIM= 16384
##$YMAX_p= 406663829
##$YMIN_p= -2502312
$$ End of Bruker specific parameters
$$ ---------------------------------
##NTUPLES= NMR SPECTRUM
##VAR_NAME=  FREQUENCY,     SPECTRUM/REAL,   SPECTRUM/IMAG
##SYMBOL=    X,             R,               I
##VAR_TYPE=  INDEPENDENT,   DEPENDENT,       DEPENDENT
##VAR_FORM=  AFFN,          ASDF,            ASDF
##VAR_DIM=   16384,         16384,           16384
##UNITS=     HZ,            ARBITRARY UNITS, ARBITRARY UNITS
##FACTOR=    0.24454680195387, 1,            1
##FIRST=     3501.94074242331, 0,            0
##LAST=      -504.469513986951, 0,           0
##MIN=       -504.469513986951, -2502312,    0
##MAX=       3501.94074242331, 406663829,    0
$$ Real data points
##PAGE= N=1
##DATA TABLE= (X++(R..R)), XYDATA
$$ [...]
$$ plain form
5361 63870736 64679706 65654548 67181980 68717147 70013322 70408816 71701422 73699839 75078325
5352 75078325 76004776 76746565 76779022 77683263 78290266 78826754 77621519 77679757 76460562
5343 76460562 75856731 76710567 77477013 77618952 79457212 80343099 82458574 85269861 87275982
5334 87275982 89954704 92342883 93394530 92958490 93220775 91837921 90521930 88374224
5326 88374224 86284343 84683858 83610792 81494395 80248264 80668423 81296178 80881848 80699240
5317 80699240 81196909 81531237 81739478 82569161 83511745 85097758 86098701 87311307 89249165
5308 89249165 90338600 91799947 93050826 95230990 97854450 99635195 100406431 101785732
5300 101785732 103124588 104144635 104035771 103903244 103452854 102162747 100781377 98463419
$$ packed form
5361F3870736Q08970R74842J527432J535167J296175L95494J292606J998417J378486
5352G5078325R26451P41789L2457R04241O07003N36488j205235N8238j219195
5343G6460562o03831Q53836P66446J41939J838260Q85887K115475K811287K006121
5334H7275982K678722K388179J051647m36040K62285j382854j315991k147706
5326H8374224k089881j600485j073066k116397j246131M20159O27755m14330j82608
5317H0699240M97669L34328K08241Q29683R42584J586013J000943J212606J937858
5308H9249165J089435J461347J250879K180164K623460J780745P71236J379301
5300A01785732J338856J020047j08864j32527m50390j290107j381370k317958
$$ plain form
5292 98463419 96243238 93550297 91153628 88149764 85954983 83511488 82073822 80851311
5284 80851311 79533854 78618986 77808556 77062998 76782607 75691515 74637089 72945957 71675076
5275 71675076 70678325 69614948 69229562 68865099 68057366 67140266 65977526 65635410 65399832
5266 65399832 64069950 64202255 63709643 62595999 61962539 62087679 61065979 60692087 61370921
5257 61370921 61355444 59807161 59324050 58962372 57955764 57717133 57873658 56848887 55842910
5248 55842910 54542649 53714397 53795062 53264595 52470760 51964525 50709924 50333264 49726944
5239 49726944 49083920 48527760 47545913 46987127 46284673 46044086 45391392 44659419 44889503
5230 44889503 43766618 42934675 43062548 42070472 42740796 42321622 40765586 40472844 40676606
$$ packed form
5292I8463419k220181k692941k396669l003864k194781k443495j437666j222511
5284H0851311j317457r14868q10430p45558k80391j091092j054426j691132j270881
5275G1675076r96751j063377l85386l64463q07733r17100j162740l42116k35578
5266F5399832j329882J32305m92612j113644o33460J25140j021700l73892O78834
5257F1370921j5477j548283m83111l61678j006608k38631J56525j024771j005977
5248E5842910j300261q28252Q0665n30467p93835n06235j254601l76660o06320
5239D9726944o43024n56160r81847n58786p02454k40587o52694p31973K30084
5230D4889503j122885q31943J27873r92076O70324m19174j556036k92742K03762
$$ plain form
5221 40676606 41062265 40629130 40347792 41555911 40230692 38251590 37668442 38156262 38400824
5212 38400824 38009885 36366361 36552962 36466456 36117650 36232401 35044006 36454833 35864790
5203 35864790 34918497 34405744 34326742 34780252 34116532 33502028 34506095 34353326 33252155
5194 33252155 32986023 32675329 33019903 33766372 33390623 32384586 32097658 32549227 31977163
5185 31977163 32546248 32548610 31710662 31131522 32035944 31912959 31052897 31184391 30920922 31263958
5175 31263958 29834919 30242527 30134725 29574636 30015423 30210910 30175606 29823943 30101492
5166 30101492 29489536 29538965 29633601 28964143 28441398 28606374 28863816 28512462 28513350 28196794
5156 28196794 27772829 27923986 27876623 28806509 29023204 28439017 27156131 27226379 27543342 27994780
$$ packed form
5221D0676606L85659m33135k81338J208119j325219j979102n83148M87820K44562
5212C8400824l90939j643524J86601q6506l48806J14751j188395J410827n90043
5203C5864790r46293n12753p9002M53510o63720o14504J004067j52769j101171
5194C3252155k66132l10694L44574P46469l75749j006037k86928M51569n72064
5185C1977163N69085K362q37948n79140R04422j22985q60062J31494k63469L43036
5175C1263958j429039M07608j07802n60089M40787J95487l5304l51663K77549
5166C0101492o11956M9429R4636o69458n22745J64976K57442l51354Q88l16556
5156B8196794m23965J51157m7363R29886K16695n84187j282886P0248L16963M51438
$$ plain form
5146 27994780 28341734 27936440 28115249 28288057 27945441 27605671 27329328 27226648 27219344 27039339
5136 27039339 27889216 27255767 27822103 28372610 27867161 27186069 26002114 26280105 26487976
5127 26487976 26280955 27256025 26995708 27218278 26919245 26073002 25847336 26389200 26858136
5118 26858136 27876882 27974280 27069809 25958498 26509702 26137856 26486666 26370531 26969155
5109 26969155 26783034 26217992 26825879 26568255 27868679 27450608 27285050 28007217 27426785
5100 27426785 28364989 28611545 27903354 27870539 27820362 26357567 27938985 28777100 27699836
5091 27699836 27668031 27936842 28248910 27927742 27447187 27371178 27453667 27581168 27230241 26700263
5081 26700263 27270865 27204744 27368611 27806785 27244518 27725335 28071158 28116880 28538396 29113959
$$ packed form
5146B7994780L46954m05294J78809J72808l42616l39770k76343j02680p304j80005
5136B7039339Q49877o33449N66336N50507n05449o81092j183955K77991K07871
5127B6487976k07021R75070k60317K22570k99033q46243k25666N41864M68936
5118B6858136J018746R7398r04471j111311N51204l71846L48810j16135N98624
5109B6969155j86121n65042O07887k57624J300424m18071j65558P22167n80432
5100B7426785R38204K46556p08191l2815n0177j462795J581418Q38115j077264
5091B7699836l1805K68811L12068l21168m80555p6009Q2489J27501l50927n29978
5081B6700263N70602o6121J63867M38174n62267M80817L45823M5722M21516N75563
$$ plain form
5071 29113959 29869779 29338333 29796253 29512394 29254908 29238349 29717616 29513920 30007918 29641641
5061 29641641 29432761 29373970 29328872 30018508 30302940 30513613 29712306 29117983 29204611 29041654
5051 29041654 29160782 29265101 30788049 30215295 29637112 29032259 28806060 28773986 28815923 28736138
5041 28736138 28339096 28081710 28800254 28353177 28758055 27667988 26818712 27521358 27277690
5032 27277690 27169275 27450738 28086953 28350445 28058978 27985358 28374144 28732160 28477286 27408784
5022 27408784 27123322 27613746 27707981 27407207 27259158 27182096 26450177 26444768 27081553 27772339
5012 27772339 27096242 27880021 28285750 27845560 28953665 27339629 26248744 27492604 27716342
5003 27716342 27028523 27201263 26568546 26143819 27024979 27650869 26834592 27103017 27285148
$$ packed form
5071B9113959P55820n31446M57920k83859k57486j6559M79267k03696M93998l66277
5061B9641641k08880n8791m5098O89636K84432K10673q01307n94323Q6628j62957
5051B9041654J19128J04319J522948n72754n78183o04853k26199l2074M1937p9785
5041B8736138l97042k57386P18544m47077M04878j090067q49276P02646k43668
5032B7277690j08415K81463O36215K63492k91467p3620L88786L58016k54874j068502
5022B7408784k85462M90424R4235l00774j48049p7062p31919n409O36785O90786
5012B7772339o76097P83779M05729m40190J108105j614036j090885J243860K23738
5003B7716342o87819J72740o32717m24727Q81160O25890q16277K68425J82131
$$ plain form
4994 27285148 27784798 27372198 27380935 27327941 27105704 26770249 26259449 26302230 27002733 26619159
4984 26619159 26033590 26085382 25984622 27202604 26618939 26944362 27518781 26620997 26746356
4975 26746356 26469122 27203295 29011821 28850770 29094323 28664304 28268047 27837143 28113409
4966 28113409 29829943 29888849 29988333 29384694 30754592 30450857 30375051 30504938 30095715 29758065
4956 29758065 29485281 29807423 29933195 29673586 28878804 29857365 30248284 31397276 32016227
4947 32016227 31660559 31322741 31180199 32719617 34006274 34269954 33651215 33594729 32520887
4938 32520887 33365767 32260979 31971864 31242856 30630431 30152966 30300108 30566732 29623258
4929 29623258 28813186 28909360 29306990 29297066 28284276 27263532 28054481 28365302 27368645 26193266
$$ packed form
4994B7285148M99650m12600Q737n2994k22237l35455n10800M2781P00503l83574
4984B6619159n85569N1792j00760J217982n83665L25423N74419q97784J25359
4975B6746356k77234P34173J808526j61051K43553m30019l96257m30904K76266
4966B8113409J716534N8906R9484o03639J369898l03735p5806J29887m09223l37650
4956B9758065k72784L22142J25772k59609p94782R78561L90919J148992O18951
4947C2016227l55668l37818j42542J539418J286657K63680o18739n6486j073842
4938C2520887Q44880j104788k89115p29008o12425m77465J47142K66624r43474
4929B9623258q10072R6174L97630r924j012790j020744P90949L10821r96657j175379
$$ plain form
4919 26193266 24836847 25712432 26054025 26019444 26872384 25585040 24934727 25241619 25659294
4910 25659294 24499369 23969904 24077584 23231778 22866948 23161106 22374819 23296850 23761951
4901 23761951 23405729 22637775 23029368 23483536 23022531 22331787 22854570 23252658 23146027
4892 23146027 21981034 20939542 21274330 21300697 21232842 22056334 20697360 20899631 20967841
4883 20967841 20356134 20404437 20498516 20598122 20071099 20059426 20093999 20142089 19737685 19188323
4873 19188323 19556670 17793288 18211363 19092990 18311648 18555672 18388545 17961125 17828808
4864 17828808 17196273 17997678 17877530 17319581 17770353 16926393 15953157 15910400 16160932 16322735
4854 16322735 15696603 15790486 15767119 15597738 16316524 15948361 17522576 16516752 16256457
$$ packed form
4919B6193266j356419Q75585L41593l4581Q52940j287344o50313L06892M17675
4910B5659294j159925n29465J07680q45806l64830K94158p86287R22031M65101
4901B3761951l56222p67954L91593M54168m61005o90744N22783L98088j06631
4892B3146027j164993j041492L34788K6367o7855Q23492j358974K02271O8210
4883B0967841o11707M8303R4079R9606n27023j1673L4573M8090m04404n49362
4873A9188323L68347j763382M18075Q81627p81342K44024j67127m27420j32317
4864A7828808o32535Q01405j20148n57949M50772q43960r73236m2757K50532J61803
4854A6322735o26132R3883k3367j69381P18786l68163J574215j005824k60295
$$ plain form
4845 16256457 15327208 14273249 14047622 13762338 12859813 12298507 12752472 13212013 12653628
4836 12653628 11989823 12750457 13084706 13925213 12725401 12074360 11661676 12021936 12611865
4827 12611865 11621187 11870641 11268667 11979751 12173955 11409352 10461233 9722008 9379873
4818 9379873 11160965 11911647 10431186 11127642 10589922 11202096 11705906 12750309 12218362
4809 12218362 11983316 11967119 10947812 11237800 12013326 12043688 12208543 10780282 9777749
4800 9777749 10729928 11104234 9930709 9704954 9916319 10616077 10638251 10063844 10704946 10552749
4790 10552749 10757151 10234586 10354213 10707779 10550284 9903054 10357225 10338578 9871256 10094648
4780 10094648 10644567 9932372 10004084 9965254 10400785 10848862 10624710 9846450 9305565 9190527
$$ packed form
4845A6256457r29249j053959k25627k85284r02525n61306M53965M59541n58385
4836A2653628o63805P60634L34249Q40507j199812o51041m12684L60260N89929
4827A2611865r90678K49454o01974P11084J94204p64603r48119p39225l42135
4818I379873J781092P50682j480461O96456n37720O12174N03810J044403n31947
4809A2218362k35046j6197j019307K89988P75526L0362J64855j428261j002533
4800I777749R52179L74306j173525k25755K11365O99758K2174n74407O41102j52197
4790A0552749K04402n22565J19627L53566j57495o47230M54171j8647m67322K23392
4780A0094648N49919p12195P1712l8830M35531M48077k24152p78260n40885j15038
$$ plain form
4770 9190527 10043375 10089276 9921226 9810130 10165194 10390296 9174016 9356179 9413355 9019772
4760 9019772 9170710 9315582 9149478 9589758 10028667 10225405 10602323 10288930 9187286
4751 9187286 8746870 9218654 9703928 9299343 8818299 8979828 8964409 8829377 9341600 9756801
4741 9756801 9846828 9168429 9248668 9175858 8504092 9000402 8924206 8907070 9577936 10300270
4731 10300270 9384821 9108126 9573162 8624589 8404799 8775056 9292109 9338925 8146569
4722 8146569 7967380 8948244 10028353 10196300 9723369 9720908 10316135 10332424 10264476 10998695
4712 10998695 10833229 10081731 10931435 10954359 10494076 10103595 10364060 11631083 11343991
4703 11343991 10867959 11028208 11302011 11763214 11264247 10571230 11276317 11250490 10015977
$$ packed form
4770I190527Q52848M5901j68050j11096L55064K25102j216280J82163N7176l93583
4760I019772J50938J44872j66104M40280M38909J96738L76918l13393j101644
4751I187286m40416M71784M85274m04585m81044J61529j5419j35032N12223M15201
4741I756801R0027o78399Q0239p2810o71766M96310p6196j7136O70866P22334
4731A0300270r15449k76695M65036r48573k19790L70257N17053M6816j192356
4722H146569j79189R80864J080109J67947m72931k461N95227J6289o7948P34219
4712A0998695j65466p51498Q49704K2924m60283l90481K60465J267023k87092
4703A1343991m76032J60249K73803M61203m98967o93017P05087k5827j234513
$$ plain form
4694 10015977 9497154 8581703 9819945 10258194 9286471 9022179 9896327 9726383 8442960
4685 8442960 8913780 8918478 8404490 8336233 8165714 8034975 7894725 7377622 7987428 8500482
4675 8500482 9329560 8837090 8679634 7827028 8135609 7224612 6998699 7266547 6850829 7542884
4665 7542884 8569110 7955195 6472142 7200642 7734367 6747530 6985093 6760491 6892699
4656 6892699 7826217 7084433 6841115 7240809 7626838 7296607 6320829 6881788 7094666 7011947
4646 7011947 8024461 7185708 6900436 7744740 7894184 8980269 8207619 8404860 8242969
4637 8242969 7262189 7424314 7551402 7792791 7988885 9036499 8926017 8780100 8411042
4628 8411042 7830029 7414664 8318177 8270924 8929979 7784071 7165699 8219578 8222150 7880600
$$ packed form
4694A0015977n18823r15451J238242M38249r71723k64292Q74148j69944j283423
4685H442960M70820M698n13988o8257j70519j30739j40250n17103O09806N13054
4675H500482Q29078m92470j57456q52606L08581r10997k25913K67848m15718O92055
4665G542884J026226o13915j483053P28500N33725r86837K37563k24602J32208
4656F892699R33518p41784k43318L99694L86029l30231r75778N60959K12878q2719
4646G011947J012514q38753k85272Q44304J49444J086085p72650J97241j61891
4637H242969r80780J62125J27088K41389J96094J047614j10482j45917l69058
4628H411042n81013m15365R03513m7253O59055j145908o18372J053879K572l41550
$$ plain form
4618 7880600 8293778 8730237 7702327 8651145 9162067 9557828 8954079 8098687 8989230
4609 8989230 8793264 8126882 8637157 8665055 9014474 9380692 9938943 10036369 9715036 10095195
4599 10095195 10479744 11088157 10645692 10727149 11056061 10772135 11058319 11148056 10818391 11826134
4589 11826134 12236190 11494064 12127022 13548699 14163572 13875451 14415619 14089319 14117391
4580 14117391 14482176 15481892 17015895 16727303 16644452 17260949 17723867 17078627 16771157
4571 16771157 16244055 16896200 17162198 16948333 16632111 16174539 17016556 17430116 17571253
4562 17571253 17370621 16642596 17024013 16884840 16230651 15541006 15365432 15299136 14764194 14740080
4552 14740080 15272844 16134806 15005859 13979008 14411598 13888855 13255174 12891818 13230787
$$ packed form
4618G880600M13178M36459j027910R48818N10922L95761o03749q55392Q90543
4609H989230j95966o66382N10275K7898L49419L66218N58251R7426l21333L80159
4599A0095195L84549O08413m42465Q1457L28912k83926K86184Q9737l29665J007743
4589A1826134M10056p42126O32958J421677O14873k88121N40168l26300K8072
4580A4117391L64785R99716J534003k88592q2851O16497M62918o45240l07470
4571A6771157n27102O52145K65998k13865l16222m57572Q42017M13560J41137
4562A7571253k00632p28025L81417j39173o54189o89645j75574o6296n34942k4114
4552A4740080N32764Q61962j128947j026851M32590n22743o33681l63356L38969
$$ plain form
4543 13230787 13698661 13290251 13823373 13468955 13461231 13710446 13124022 11693092 12988191
4534 12988191 14172198 13574465 13393331 14026325 14091297 14295483 14604891 15681245 16235978
4525 16235978 15867420 17184864 16793531 17523210 18073574 18946131 18438290 19437553 19572581
4516 19572581 18889620 18599335 19235133 19779629 19597428 19754871 19082564 19102354 19293072 20055020
4506 20055020 20517330 19015082 19301265 19427459 19724250 19132434 18456701 17175624 16856881
4497 16856881 17062469 16651229 16803081 16741039 16694129 15399025 15193326 15092249 15669743 16323872
4487 16323872 16754669 16166645 16099954 16447794 17792424 17835578 17599195 17532816 18812667 19254644
4477 19254644 19354375 20128460 19852762 18346023 16851880 16276258 16056209 15450373 15261094
$$ packed form
4543A3230787M67874m08410N33122l54418p724K49215n86424j430930J295099
4534A2988191J184007n97733j81134O32994O4972K04186L09408J076354N54733
4525A6235978l68558J317444l91333P29679N50364Q72557n07841R99263J35028
4516A9572581o82961k90285O35798N44496j82201J57443o72307J9790J90718P61948
4506B0055020M62310j502248K86183J26194K96791n91816o75733j281077l18743
4497A6856881K05588m11240J51852o2042m6910j295104k05699j01077N77494O54129
4487A6323872M30797n88024o6691L47840J344630M3154k36383o6379J279851M41977
4477A9254644R9731P74085k75698j506739j494143n75622k20049o05836j89279
$$ plain form
4468 15261094 14781713 14490063 14627198 13846900 13704341 13411248 13046515 12751436 13197484
4459 13197484 13979635 13802074 13909484 13889795 14050060 13356124 14221177 14309856 14485018 14362288
4449 14362288 14378767 15166512 14739719 14905697 15168119 15041318 15215867 14880041 14360054 14549183
4439 14549183 14993014 15378378 14990639 16074797 17028386 16445999 17515108 17187071 16599510
4430 16599510 17916939 18315919 18139649 18137742 18398128 19189173 20064236 20247548 21236328 21685901
4420 21685901 22342910 22889693 23469687 24626385 25019015 23279682 22078375 20831205 20567579
4411 20567579 19897254 19956245 19908597 18775337 20048545 19967074 18954456 18808145 19071603
4402 19071603 19460534 18831802 17958488 18864243 19458002 18635255 18758091 19249857 19929318
$$ packed form
4468A5261094m79381k91650J37135p80298j42559k93093l64733k95079M46048
4459A3197484P82151j77561J07410j9689J60265o93936Q65053Q8679J75162j22730
4449A4362288J6479P87745m26793J65978K62422j26801J74549l35826n19987J89129
4439A4549183M43831L85364l87739J084158R53589n82387J069109l28037n87561
4430A6599510J317429L98980j76270j907K60386P91045Q75063J83312R88780M49573
4420B1685901O57009N46783N79994J156698L92630j739333j201307j247170k63626
4411B0567579o70325N8991m7648j133260J273208q1471j012618j46311K63458
4402A9071603L88931o28732q73314R05755N93759q22747J22836M91766O79461
$$ plain form
4393 19929318 20223776 20291897 20521822 20811300 20805802 20840021 20462005 20108858 19295168 19331084
4383 19331084 19337954 19290606 20171360 20058150 19663550 19794008 20788644 19816246 20039280 20874216
4373 20874216 20013584 19286932 20684598 20736606 20653031 20608265 20992663 21912207 21745029 22240584
4363 22240584 21922518 22407902 23200831 22597286 22384750 23573457 22768483 22952263 24508127
4354 24508127 24467356 23840424 23513611 24312971 24886582 24982950 25212315 25049184 25597541 25723491
4344 25723491 25774309 26050659 25809418 26117319 26605543 27045471 27373380 27528939 27849130 29581104
4334 29581104 30369879 31063501 31397814 31634780 31598374 31787523 32078952 32095930 33046128 33385010
4324 33385010 33387989 33875243 34155196 33631213 33672812 34769133 34579230 35337420 35855014 35138788
$$ packed form
4393A9929318K94458O8121K29925K89478n498L4219l78016l53147q13690L5916
4383A9331084O870m7348Q80754j13210l94600J30458R94636r72398K23034Q34936
4373B0874216q60632p26652J397666N2008q3575m4766L84398R19544j67178M95555
4363B2240584l18066M85384P92929o03545k12536J188707q04974J83780J555864
4354B4508127m0771o26932l26813P99360N73611R6368K29365j63131N48357J25950
4344B5723491N0818K76350k41241L07901M88224M39928L27909J55559L20191J731974
4334B9581104P88775O93622L34313K36966l6406J89149K91429J6978R50198L38882
4324C3385010K979M87254K79953n23983M1599J096321j89903P58190N17594p16226
$$ plain form
4314 35138788 34899605 35603829 36343296 36159359 36659454 36742723 36464624 36341574 36283092 35906695
4304 35906695 36003566 36569546 36211946 35025217 35605469 34595296 34401187 33787725 34350377
4295 34350377 34464427 33042770 32370395 31282670 30555596 30641272 29760549 29791704 28913948
4286 28913948 28535881 27942628 28029431 27553913 27033526 27404515 27590633 27156755 25987358
4277 25987358 26211762 26648642 28182412 28517507 28945964 29357429 29422315 29451506 29500776 29560426
4267 29560426 29113639 28401309 28675348 29181313 28618177 28089736 28038502 28376945 28874454 27715321
4257 27715321 27756037 27475768 27753361 28432725 27623212 27397282 27948370 28298611 28388117 28629665
4247 28629665 28072622 27950669 29345701 29727316 30104768 30508517 31110485 30784091 29456310
$$ packed form
4314C5138788k39183P04224P39467j83937N00095Q3269k78099j23050n8482l76397
4304C5906695R6871N65980l57600j186729N80252j010173j94109o13462N62652
4295C4350377J14050j421657o72375j087725p27074Q5676q80723L1155q77756
4286B8913948l78067n93253Q6803m75518n20387L70989J86118m33878j169397
4277B5987358K24404M36880J533770L35095M28457M11465O4886K9191M9270N9650
4267B9560426m46787p12330K74039N05965n63136n28441n1234L38443M97509j159133
4257B7715321M0716k80269K77593O79364q09513k25930N51088L50241Q9506K41548
4247B8629665n57043j21953J395032L81615L77452M03749O01968l26394j327781
$$ plain form
4238 29456310 29391629 31035098 31707568 31205602 31780992 31996575 32170918 32488271 32609311
4229 32609311 32185691 30386437 31362360 30721897 30612550 30098803 29657142 30282729 30292015 29948951
4219 29948951 30073544 29807704 29804543 30258024 30188428 30412047 30749448 31161397 30800289 30402678
4209 30402678 31474642 30687995 30271959 31418121 31600414 31189739 31386724 32436515 32802729
4200 32802729 33043083 32958800 32790071 33279872 34040576 34119496 34509103 35064814 35803809 36090247
4190 36090247 35936117 35849088 35944437 35353213 36067166 35741700 36108238 35790395 35841142 36165811
4180 36165811 35319742 34744215 34118246 33862030 33348707 33909780 33056342 32035169 30981622
4171 30981622 30781047 31783833 32019930 31302983 29882773 30340612 30099726 29932136 30029565
$$ packed form
4238B9456310o4681J643469O72470n01966N75390K15583J74343L17353J21040
4229C2609311m23620j799254R75923o40463j09347n13747m41661O25587R286l43064
4219B9948951J24593k65840l161M53481o9596K23619L37401M11949l61108l97611
4209C0402678J071964p86647m16036J146162J82293m10675J96985J049791L66214
4200C2802729K40354q4283j68729M89801P60704P8920L89607N55711P38995K86438
4190C6090247j54130q7029R5349n91224P13953l25466L66538l17843N0747L24669
4180C6165811q46069n75527o25969k56216n13323N61073q53438j021173j053547
4171C0981622k00575J002786K36097p16947j420210M57839k40886j67590R7429
$$ plain form
4162 30029565 29947063 30125743 29559285 29065173 29195428 29314725 30525657 30609820 29618323 28547271
4152 28547271 29295702 29434139 30190163 30200774 30175661 30358846 30260434 31514856 31231882 30645511
4142 30645511 29976869 29967214 30433677 30433287 30707163 30793609 30232962 30245182 30946580 30136176 29923247
4131 29923247 29416426 29193400 29215055 29746604 28830190 28018271 28666585 29101732 30182868
4122 30182868 28275451 27848831 28200571 28111872 28296520 26543338 26995536 28773463 28738458
4113 28738458 28404439 27953328 27818728 27653104 27654157 28115661 27127763 27884966 29045712 28165398
4103 28165398 28290667 29298029 29361963 29572625 29484709 29799594 30011887 29718540 29737156 29722434
4093 29722434 30496280 30941938 31243872 31250332 31284684 29752843 29350174 29432476 29766063 29496996
$$ packed form
4162C0029565q2502J78680n66458m94112J30255J19297J210932Q4163r91497j071052
4152B8547271P48431J38437P56024J0611k5113J83185r8412J254422k82974n86371
4142C0645511o68642r655M66463l90K73876Q6446n60647J2220P01398q10404k12929
4131B9923247n06821k23026K1655N31549r16414q11919O48314M35147J081136
4122C0182868j907417m26620L51740q8699J84648j753182M52198J777927l5005
4113B8738458l34019m51111j34600j65624J053M61504r87898P57203J160746q80314
4103B8165398J25269J007362O3934K10662q7916L14885K12293k93347J8616j4722
4093B9722434P73846M45658L01934O460L4352j531841m02669Q2302L33587k69067
$$ plain form
4083 29496996 28474535 28758805 29555085 29579245 29519534 29340628 30147568 29353686 28676803 28250620
4073 28250620 28847220 28598339 28855489 29091415 28324551 27704081 27826831 28579074 27581339
4064 27581339 28149246 28696236 28575767 28472754 28765532 28870476 29762710 30093827 29455037
4055 29455037 29494167 28844415 28542085 29288181 29294473 29580200 29910515 30010617 30214367 29846341
4045 29846341 30183744 30761229 30528209 29331464 29330887 29861141 28911636 28528683 28049053 28330221
4035 28330221 28797169 28866541 28807086 29305238 29697615 29272023 30187957 30153692 30202591 30335640
4025 30335640 30342584 30588494 30933880 30743795 30385715 29767856 29933084 30452402 30224047 30406677
4015 30406677 31006899 30962387 30415446 30857067 31231615 30025784 30130651 31383313 32385396
$$ packed form
4083B9496996j022461K84270P96280K4160n9711j78906Q06940p93882o76883m26183
4073B8250620N96600k48881K57150K35926p66864o20470J22750P52243r97735
4064B7581339N67907N46990j20469j03013K92778J04944Q92234L31117o38790
4055B9455037L9130o49752l02330P46096O292K85727L30315J00102K03750l68026
4045B9846341L37403N77485k33020j196745n77N30254r49505l82953m79630K81168
4035B8330221M66948O9372n9455M98152L92377m25592R15934l4265M8899J33049
4025C0335640O944K45910L45386j90085l58080o17859J65228N19318k28355J82630
4015C0406677O00222m4512n46941M41621L74548j205831J04867J252662J002083
$$ plain form
4006 32385396 32902500 32981171 32458402 32091924 33426762 32856246 33235100 33762509 33471683
3997 33471683 33366153 34126610 34272842 34642195 35300465 36158909 36264552 36724978 37404736
3988 37404736 36972621 36937044 37291683 37397329 36954548 37182122 37357831 38513194 38504811 39117219
3978 39117219 40667148 40807170 40495336 40415735 41730945 41504346 41190842 42191858 42536654
3969 42536654 43253667 44007295 45082911 46478469 47664385 48212486 48865936 50456119 50491289
3960 50491289 51548094 53466179 55234180 55833099 56615635 57106597 58169183 59043221 60983800
3951 60983800 61998151 62723214 63610110 65395584 67690028 68747900 70869977 73864111
3943 73864111 77264339 78994826 81535965 84427067 88671479 91862879 96945090 102117093
$$ packed form
4006C2385396N17104P8671n22769l66478J334838n70516L78854N27409k90826
3997C3471683j05530P60457J46232L69353O58270Q58444J05643M60426O79758
3988C7404736m32115l5577L54639J05646m42781K27574J75709J155363q383O12408
3978C9117219J549929J40022l11834p9601J315210k26599l13504J001016L44796
3969D2536654P17013P53628J075616J395558J185916N48101O53450J590183L5170
3960E0491289J056805J918085J768001N98919P82536M90962J062586Q74038J940579
3951F0983800J014351P25063Q86896J785474K294444J057872K122077K994134
3943G3864111L400228J730487K541139K891102M244412L191400N082211N172003
$$ plain form
3935 102117093 106781113 112819285 119604698 126785047 132605254 140118904 149608029 158237011
3927 158237011 168696682 180902416 194079212 209903149 228263666 248464314 269429263
3920 269429263 291160618 313674850 334063633 350237411 360805241 363001122 358961317
3913 358961317 348707203 332212696 311794469 289498548 269553091 251921694 236084423
3906 236084423 222163036 210356237 199106536 187693404 176262111 164888269 154346794
3899 154346794 144727220 135230681 127681172 121397812 116042047 111385457 108749976 104231559
3891 104231559 100674043 97663563 94452668 91971524 89339108 88557413 85779428 83182504
3883 83182504 81242718 80113880 77747082 76212933 75192477 73259077 71734761 71530086
$$ packed form
3935A02117093M664020O038172O785413P180349N820207P513650R489125Q628982
3927A58237011J0459671J2205734J3176796J5823937J8360517K0200648K0964949
3920B69429263K1731355K2514232K0388783J6173778J0567830K195881m039805
3913C58961317j0254114j6494507k0418227k2295921j9945457j7631397j5837271
3906B36084423j3921387j1806799j1249701j1413132j1431293j1373842j0541475
3899A54346794r619574r496539p549509o283360n355765m656590k635481m518417
3891A04231559l557516l010480l210895k481144k632416p81695k777985k596924
3883H3182504j939786j128838k366798j534149j020456j933400j524316k04675
$$ plain form
3875 71530086 70930245 70306141 69642137 68581660 68651120 68750846 68462364 68508170 68364250 68899873
3865 68899873 68983902 68702520 70038006 69599362 69474697 69255162 70368793 72316104 71764229
3856 71764229 72161570 73168814 74410244 74606291 76224028 78342248 80460067 82374509
3848 82374509 84489264 85074630 85537014 85371507 84266838 82288394 80025483 77636748 77264288
3839 77264288 75568792 74842089 73816504 72602951 73409256 74183243 75331664 76826607 78366052
3830 78366052 80179016 83444005 85633372 88902800 92962832 97286133 101666428 107182785
3822 107182785 112369120 116989815 120518793 122115660 121818587 118784903 113779729 108883590
3814 108883590 104055411 99823814 96326318 93681799 90604106 89155227 87481412 86915919
$$ packed form
3875G1530086n99841o24104o64004j060477O9460R9726k88482M5806j43920N35623
3865F8899873Q4029k81382J335486m38644j24665k19535J113631J947311n51875
3856G1764229L97341J007244J241430J96047J617737K118220K117819J914442
3848H2374509K114755N85366M62384j65507j104669j978444k262911k388735l72460
3839G7264288j695496p26703j025585j213553Q06305P73987J148421J494943J539445
3830G8366052J812964L264989K189367L269428M060032M323301M380295N516357
3822A07182785N186335M620695L528978J596867k97073l033684n005174m896139
3814A08883590m828179m231597l497496k644519l077693j448879j673815n65493
$$ plain form
3806 86915919 85193918 83318489 81894362 81568562 80518540 81443519 80948744 80504766 79758869
3797 79758869 79016943 78516032 78158103 77429298 75327258 74927617 74657047 72997504 71695153
3788 71695153 70968665 70361562 71275842 70961330 70420910 70324507 70267658 69102520 68679665 68587216
3778 68587216 69165124 69114841 68338844 67866342 68517064 68447323 68029165 68350026 68587086 68956430
3768 68956430 69462194 69328279 69899642 68564996 68994968 69615569 69675579 71055309 71351658
3759 71351658 70755775 70579813 71532821 72534531 73731351 74613648 75567115 76339733 77568565
3750 77568565 78464625 79180375 80677282 82007006 84828244 87491858 88921028 90298218
3742 90298218 93203273 96500492 99776316 103340673 107730380 112951963 117948142 122203535
$$ packed form
3806H6915919j722001j875429j424127l25800j050022R24979m94775m43978p45897
3797G9758869p41926n00911l57929p28805k102040l99641k70570j659543j302351
3788G1695153p26488o07103R14280l14512n40420r6403n6849j165138m22855r2449
3778F8587216N77908n0283p75997m72502O50722o9741m18158L20861K37060L69344
3768F8956430N05764j33915N71363j334646M29972O20601O0010J379730K96349
3759G1351658n95883j75962R53008J001710J196820Q82297R53467P72618J228832
3750G7568565Q96060P15750J496907J329724K821238K663614J429170J377190
3742I0298218K905055L297219L275824L564357M389707N221583M996179M255393
$$ plain form
3734 122203535 126673995 129218004 130814593 130385103 125488522 119987357 113167483 105289726
3726 105289726 97909823 92156819 87238277 82954677 78821551 74378699 70363952 67455880
3718 67455880 65577824 63282493 60745268 58219542 56048106 54650064 53495376 51030978
3710 51030978 49097955 47337708 45532573 45095792 43822785 42501237 41173539 39896425
3702 39896425 38943480 38203491 37930504 36671074 35987367 35252361 33361602 32296760 30967640
3693 30967640 30295994 28393652 27500333 26593986 26449811 26225732 25529545 24567103 24020615
3684 24020615 23843140 22542896 22963891 22253864 22112260 21238092 20828562 20959802 20242182
3675 20242182 19638705 19334579 18935411 19825286 18972475 18014136 18029900 18128534 17299313 17418082
$$ packed form
3734A22203535M470460K544009J596589m29490m896581n501165o819874p877757
3726A05289726p379903n753004m918542m283600m133126m442852m014747k908072
3718F7455880j878056k295331k537225k525726k171436j398042j154688k464398
3710E1030978j933023j760247j805135m36781j273007j321548j327698j277114
3702C9896425r52945p39989k72987j259430o83707p35006j890759j064842j329120
3693C0967640o71646j902342q93319r06347j44175k24079o96187r62442n46488
3684B4020615j77475j300244M20995p10027j41604q74168m09530J31240p17620
3675B0242182o03477l04126l99168Q89875q52811r58339J5764R8634q29221J18769
$$ plain form
3665 17418082 17812762 16925073 16486981 17674452 17762175 17653544 17089778 16177058 16314875
3656 16314875 15565506 15740852 15836094 15849632 16412783 15733544 14756780 15578063 15409126 14860640
3646 14860640 14182803 14548218 15022536 14095720 13562554 13854762 12706832 12833086 12902106
3637 12902106 12310626 12655014 12259470 11947306 12556857 12079698 11259593 11786270 13123843
3628 13123843 12324980 12093502 12293545 11428000 11796654 11801500 11904628 11940021 13047525 12949197
3618 12949197 11785090 12115143 12514888 12765660 12718161 13785091 14969013 15331729 15541353
3609 15541353 16508576 17021563 17267716 17052623 17489443 17329962 17706984 17124970 15659146
3600 15659146 14880386 14232026 13790178 13658040 12380361 12564086 13623743 11858255 11389882
$$ packed form
3665A7418082L94680q87689m38092J187471Q7723j08631n63766r12720J37817
3656A6314875p49369J75346R5242J3538N63151o79239r76764Q21283j68937n48486
3646A4860640o77837L65415M74318r26816n33166K92208j147930J26254O9020
3637A2902106n91480L44388l95544l12164O09551m77159q20105N26677J337573
3628A3123843p98863k31478K00043q65545L68654M846J03128L5393J107504r8328
3618A2949197j164107L30053L99745K50772m7499J066930J183922L62716K09624
3609A5541353R67223N12987K46153k15093M36820j59481L77022n82014j465824
3600A5659146p78760o48360m41848j32138j277679J83725J059657j765488m68373
$$ plain form
3591 11389882 11458225 11538138 11562087 11042274 10923398 11277457 10821222 11320016 11851790 11182782
3581 11182782 10832022 10196166 9955525 9499972 10125113 10315960 9713010 10200550 11168186
3572 11168186 9711816 10505171 10016384 9883905 10130454 10406433 10727174 10032889 10367514
3563 10367514 9348559 9729764 8846848 9332570 9632928 9566958 9935242 9867998 8564188
3554 8564188 8312961 8806366 9513500 9372775 8800976 9442329 8462796 8541063 8916443 9763232
3544 9763232 10505726 9808072 9748126 9010941 9781431 8989746 9443136 9356915 9056275 8791026
3534 8791026 9699153 9642898 9047728 8322427 8058438 7998533 7510057 7661134 7776187 8367169
3524 8367169 8264436 8292761 8060642 8151935 8597776 8894672 8927337 9401283 9395136 8710394
$$ packed form
3591A1389882O8343P9913K3949n19813j18876L54059m56235M98794N31774o69008
3581A1182782l50760o35856k40641m55553O25141J90847o02950M87540R67636
3572A1168186j456370P93355m88787j32479K46549K75979L20741o94285L34625
3563A0367514j018955L81205q82916M85722L00358o5970L68284o7244j303810
3554H564188k51227M93405P07134j40725n71799O41353r79533P8267L75380Q46789
3544I763232P42494o97654n9946p37185P70490p91685M53390q6221l00640k65249
3534H791026R08127n6255n95170p25301k63989n9905m88476J51077J15053N90982
3524H367169j02733K8325k32119R1293M45841K96896L2665M73946o147o84742
$$ plain form
3514 8710394 8215028 8626908 8384964 8506589 7600858 7847391 8463981 9966312 10760633
3505 10760633 9667234 9482404 9288223 8629952 7836422 8592783 8200308 8264810 8576633
3496 8576633 7947542 7655959 8377045 7900833 7041081 7464499 8015693 7800988 7077115 8028612
3486 8028612 9311187 8666983 7792340 7657304 8096504 8041296 7643359 8431731 8721133 8732557
3476 8732557 8345625 8254160 8821107 8785650 9220947 9754896 8875559 8533904 9056055 9435437
3466 9435437 9564276 10297260 9199799 9149990 9262525 9902857 10591276 10436301 9604723 9420368
3456 9420368 9769191 9870532 9819297 10026025 10029032 9873574 11024571 10328996 10040560 9580892
3446 9580892 10729509 11614677 11781822 11986197 11680032 11850600 11767205 12438007 11952386 11699159
$$ packed form
3514H710394m95366M11880k41944J21625r05731K46533O16590J502331P94321
3505A0760633j093399j84830j94181o58271p93530P56361l92475O4502L11823
3496H576633o29091k91583P21086m76212q59752M23418N51194k14705p23873R51497
3486H028612J282575o44204q74643j35036M39200n5208l97937P88372K89402J1424
3476H732557l86932r1465N66947l5457M35297N33949q79337l41655N22151L79382
3466I435437J28839P32984j097461m9809J12535O40332O88419j54975q31578j84355
3456I420368L48823J01341n1235K06728L007j55458J150997o95575k88436m59668
3446I580892J148617Q85168J67145K04375l06165J70568q3395O70802m85621k53227
$$ plain form
3436 11699159 11550511 12224207 12492733 12458131 11814815 12297922 12655875 13262036 13420238 13439249
3426 13439249 13059906 12188288 13890935 14336073 14182424 14068491 13822908 14476943 15484633
3417 15484633 15932466 15331251 14973327 16384662 16308833 16648883 16180481 16367821 16291737 15959206
3407 15959206 15048880 14685261 14762610 15422238 15478569 14990457 15193558 15195638 14975321 14908762
3397 14908762 14894497 14709052 15014975 15271744 15139781 15567095 15700032 16694397 17033196 15875901
3387 15875901 15127417 15628430 15652715 15565046 15732273 15700493 16492580 16259187 16235341 16347307
3377 16347307 16874498 16869557 17554373 17796482 17798193 17164127 17737298 18304731 19947966 19842192
3367 19842192 18952398 19497005 20427643 19790755 19535708 19760467 21129432 21578228 21551838
$$ packed form
3436A1699159j48648O73696K68526l4602o43316M83107L57953O06161J58202J9011
3426A3439249l79343q71618J702647M45138j53649j13933k45583O54035J007690
3417A5484633M47833o01215l57924J411335p5829L40050m68402J87340p6084l32531
3407A5959206r10326l63619P7349O59628N6331m88112K03101K080k20317o6559
3397A4908762j4265j85445L05923K56769j31963M27314J32937R94365L38799j157295
3387A5875901p48484N01013K4285q7669J67227l1780P92087k33393k3846J11966
3377A6347307N27191m941O84816K42109J711o34066N73171N67433J643235j05774
3367A9842192q89794N44607R30638o36888k55047K24759J368965M48796k6390
$$ plain form
3358 21551838 21125519 22047984 22499262 22535718 22726398 23715236 24008077 23968783 23666481 22934385
3348 22934385 23442291 22923952 23988689 23746081 22638263 22952369 25235061 25819972 24886431
3339 24886431 24569033 24262876 25345682 25701526 25987100 25998568 25498315 25997326 26389238
3330 26389238 26970337 27034605 27969061 28406133 28555536 29327531 30348941 29437869 30533118
3321 30533118 30978870 31345685 32842099 32705531 32654353 33405481 33281340 33105450 33593306
3312 33593306 33343836 34850642 36028434 35519887 35982158 36841107 37608588 36997659 37338531
3303 37338531 36982631 37664969 38496915 37193458 37876706 38487299 38082999 38082544 38442934 38234096
3293 38234096 39026109 39035896 39084712 40023334 39050643 40195272 40495383 40609767 41566900 42171274
$$ packed form
3358B1551838m26319R22465M51278L6456J90680R88838K92841l9294l02302p32096
3348B2934385N07906n18339J064737k42608j107818L14106K282692N84911r33541
3339B4886431l17398l06157J082806L55844K85574J1468n00253M99011L91912
3330B6389238N81099O4268R34456M37072J49403P71995J021410r11072J095249
3321C0533118M45752L66815J496414j36568n1178P51128j24141j75890M87856
3312C3593306k49470J506806J177792n08547M62271Q58949P67481o10929L40872
3303C7338531l55900O82338Q31946j303457O83248O10593m04300m55L60390k08838
3293C8234096P92013R787M8816R38622r72691J144629L00111J14384R57133O04374
$$ plain form
3283 42171274 42175821 43168871 43408546 43242062 43179537 44026174 45093460 44933751 45253144 45435798
3273 45435798 44754188 45159362 45008769 45985925 47326533 47830044 48564785 49115292 49124373 50222846
3263 50222846 51559099 52778659 52176609 52355555 53546960 54938357 55216707 56078264 56887379
3254 56887379 56484111 56767109 57083167 57095581 57778747 58566228 58759987 59570822 59214171 59997906
3244 59997906 59683528 59769968 59968602 59165322 58255880 59394800 58250686 58501296 58946169
3235 58946169 58828599 59570405 60066245 59634021 60612228 60285872 61176878 62829141 62031541
3226 62031541 62234430 63636239 65206237 66442063 67911259 68944077 70176742 72257323
3218 72257323 73022206 74648923 76254738 77765468 79971795 82095591 83086662 83706937 84184336
$$ packed form
3283D2171274M547R93050K39675j66484o2525Q46637J067286j59709L19393J82654
3273D5435798o81610M05174j50593R77156J340608N03511P34741N50507R081J098473
3263E0222846J336253J219560o02050J78946J191405J391397K78350Q61557Q09115
3254E6887379m03268K82998L16058J2414O83166P87481J93759Q10835l56651P83735
3244E9997906l14378Q6440J98634q03280r09442J138920j144114K50610M44873
3235E8946169j17570P41806M95840m32224R78207l26356Q91006J652263p97600
3226F2031541K02889J401809J569998J235826J469196J032818J232665K080581
3218G2257323P64883J626717J605815J510730K206327K123796R91071O20275M77399
$$ plain form
3209 84184336 85116007 86053898 86329013 86906423 87651399 87672395 86615510 86398187 85758996
3200 85758996 84451502 84010317 83534418 82839035 82039079 82311639 81302089 80502806 80204310
3191 80204310 79159143 78110620 78113188 77289549 75622196 74207344 74689461 74911303 74415639
3182 74415639 74153736 73736583 74087139 74011489 73888082 74634549 74884550 76038264 75826655
3173 75826655 75062365 76185448 77361105 77982642 78361918 78967410 79671248 81002488 81177207
3164 81177207 82133317 82766866 83671906 84370778 85077163 85970919 86080766 87010072 87254096
3155 87254096 88140691 89682088 90747156 90646506 90593819 92045834 91798633 93182275 94189933
3146 94189933 94890431 95927176 96989259 97767092 99726493 100149540 99655915 101326881 103725328
$$ packed form
3209H4184336R31671R37891K75115N77410P44976K0996j056885k17323o39191
3200H5758996j307494m41185m75899o95383p99956K72560j009550p99283k98496
3191H0204310j045167j048523K568q23639j667353j414852M82117K21842m95664
3182G4415639k61903m17153L50556p5650j23407P46467K50001J153714k11609
3173G5826655p64290J123083J175657O21537L79276O05492P03838J331240J74719
3164H1177207R56110O33549R05040O98872P06385Q93756J09847R29306K44024
3155H7254096Q86595J541397J065068j00650n2687J452015k47201J383642J007658
3146I4189933P00498J036745J062083P77833J959401M23047m93625J670966K398447
$$ plain form
3137 103725328 104743298 104866914 105291134 107074043 107435042 109512810 110011224 111540395 114159961
3128 114159961 115572873 117210494 118715539 120394266 120764174 122134703 124406260 126157103
3120 126157103 128104894 130419327 131677252 133718177 136699326 137358130 139872441 142736052
3112 142736052 144344479 146202198 147254465 149635762 151743900 155032478 157176357 158954201
3104 158954201 161258500 163830121 165771456 167705858 170104997 172527463 175452904 178160416
3096 178160416 181343705 185819265 188286640 191674345 196890772 200085302 203573852 207398224
3088 207398224 211697043 214327706 217033412 219915645 222905626 226028831 228409067 231499322
3080 231499322 234941093 238680062 242050885 245420885 248598777 251478019 254694722 257959097
$$ packed form
3137A03725328J017970J23616M24220J782909L60999K077768M98414J529171K619566
3128A14159961J412912J637621J505045J678727L69908J370529K271557J750843
3120A26157103J947791K314433J257925K040925K981149O58804K514311K863611
3112A42736052J608427J857719J052267K381297K108138L288578K143879J777844
3104A58954201K304299K571621J941335J934402K399139K422466K925441K707512
3096A78160416L183289M475560K467375L387705N216427L194530L488550L824372
3088B07398224M298819K630663K705706K882233K989981L123205K380236L090255
3080B31499322L441771L738969L370823L370000L177892K879242L216703L264375
$$ plain form
3072 257959097 262420710 265532031 268548838 272642024 276218896 279692057 283395331 287773381
3064 287773381 291244285 294982336 298557497 300739711 303367886 303602936 304684675 306850596
3056 306850596 307609305 308077495 308580103 307479973 306560985 304780674 303370855 302597573 301564653
3047 301564653 300908914 298836318 296922313 294835795 292607865 290647666 287473653 284698650
3039 284698650 281540902 276211234 271463284 266027944 260424744 254665915 249859809 244444651
3031 244444651 238049275 232297150 227439585 221710653 216685950 210541785 205895649 200877603
3023 200877603 196266671 192653841 189489157 184396127 180686394 176965923 173475735 170597660
3015 170597660 167620826 164601341 162511707 159684893 157547630 156011952 153961390 151880218
$$ packed form
3072B57959097M461613L111321L016807M093186L576872L473161L703274M378050
3064B87773381L470904L738051L575161K182214K628175K35050J081739K165921
3056C06850596P58709M68190N02608j100130r18988j780311j409819p73282j032920
3047C01564653o55739k072596j914005k086518k227930j960199l174013k775003
3039B84698650l157748n329668m747950n435340n603200n758829m806106n415158
3031B44444651o395376n752125m857565n728932n024703o144165m646136n018046
3023B00877603m610932l612830l164684n093030l709733l720471l490188k878075
3015A70597660k976834l019485k089634k826814k137263j535678k050562k081172
$$ plain form
3007 151880218 148603915 146216733 144774164 144096451 142220819 140252840 140167593 138336528
2999 138336528 136429163 137311940 137689814 136076140 135578361 135081627 134631883 134531233 133360050
2990 133360050 134071629 134131785 133205353 132939050 133359673 132672036 132389497 130797753 129712376
2981 129712376 128270320 127277689 126907249 126214281 124203898 123149046 122624276 121709151 119675243
2972 119675243 118480503 117779264 116710783 114940846 114406135 114203994 114077038 113683564 111805438
2963 111805438 111592727 111662552 111264084 111833858 112319530 110732106 111592754 111614669 110888213
2954 110888213 112369853 111833843 112069003 112214998 111888996 112256408 111596341 111807648 111774793
2945 111774793 112492844 111974135 111875097 111755502 112149958 111834667 111536662 111251815 110782559
$$ packed form
3007A51880218l276303k387182j442569o77713j875632j967979q5247j831065
2999A38336528j907365Q82777L77874j613674m97779m96734m49744j00650j171183
2990A33360050P11579O0156r26432k66303M20623o87637k82539j591744j085377
2981A29712376j442056r92631l70440o92968k010383j054852n24770r15125k033908
2972A19675243j194740p01239j068481j769937n34711k02141j26956l93474j878126
2963A11805438k12711O9825l98468N69774M85672j587424Q60648K1915p26456
2954A10888213J481640n36010K35160J45995l26002L67412o60067K11307l2855
2945A11774793P18051n18709r9038j19595L94456l15291k98005k84847m69256
$$ plain form
2936 110782559 111515635 111689594 112043359 111217453 111224750 112404725 113330495 113809136 113896987 112728066
2926 112728066 112073029 111287135 110697982 109387267 107838199 106920967 105303324 103902925 102991550
2917 102991550 102041425 100986472 99812219 98609758 98010661 96677226 95694721 95446142 93811877
2908 93811877 93835577 92648057 91483030 89673105 88274581 88053690 87677220 86082631 85026314
2899 85026314 84471986 84068238 83021929 82179157 81598897 80384406 80107542 79844128 80290306
2890 80290306 79284379 77991944 78338668 79015931 78109539 78662254 79420179 79554605 79990047
2881 79990047 80153181 78988100 78010163 77640194 77708617 76482384 75739581 75859105 74697096
2872 74697096 73543118 73846368 71904887 69932447 69909971 67942759 66589702 65430951 64308667
$$ packed form
2936A10782559P33076J73959L53765q25906P297J179975R25770M78641Q7851j168921
2926A12728066o55037p85894n89153j310715j549068r17232j617643j400399r11375
2917A02991550r50125j054953j174253j202461n99097j333435r82505k48579j634265
2908I3811877K3700j187520j165027j809925j398524k20891l76470j594589j056317
2899H5026314n54328m03748j046309q42772n80260j214491k76864k63414M46178
2890H0290306j005927j292435L46724O77263r06392N52715P57925J34426M35442
2881G9990047J63134j165081r77937l69969O8423j226233p42803J19524j162009
2872G4697096j153978L03250j941481j972440k2476j967212j353057j158751j122284
$$ plain form
2863 64308667 62728981 61520107 60062514 57868709 57484400 58162977 56772477 54925966
2855 54925966 54118294 54342664 53302374 52470010 52206521 52022292 51229078 50860100 50134469
2846 50134469 49477343 48989782 48471578 47481238 47124778 47512917 46269827 46216719 46050770
2837 46050770 45128314 44942909 45634922 45579613 45000570 45773648 46186414 45634203 45325481 44922783
2827 44922783 45526958 45504323 46135576 44887942 44506130 44315858 44093505 44314686 43582753
2818 43582753 43526092 43576498 43502972 43639306 42941034 42352861 41689203 41759291 42755223 42890601
2808 42890601 42972564 43586581 43793234 44726724 44577388 45523767 46521589 47084937 48431025
2799 48431025 48802414 48968084 50569047 51834612 51907980 52564173 51625847 51171122 51517772
$$ packed form
2863F4308667j579686j208874j457593k193805l84309O78577j390500j846511
2855E4925966q07672K24370j040290q32364k63489j84229p93214l68978p25631
2846E0134469o57126m87561n18204r90340l56460L88139j243090n3108j65949
2837D6050770r22456j85405O92013n5309n79043P73078M12766n52211l08722m02698
2827D4922783O04175k2635O31253j247634l81812j90272k22353K21181p31933
2818D3582753n6661N0406p3526J36334o98272n88173o63658P0088R95932J35378
2808D2890601Q1963O14017K06653R33490j49336R46379R97822N63348J346088
2799D8431025L71389J65670J600963J265565P3368O56193r38326m54725L46650
$$ plain form
2790 51517772 51716330 51735353 51946297 52896877 53910828 54666323 55157567 56395683 56873872
2781 56873872 57304269 59605044 61968614 62546729 63819777 65550551 66768022 68837208
2773 68837208 70645842 72431770 74543158 77765199 80442277 82548416 85307243 88597925
2765 88597925 91724243 94834295 98835125 102024518 106248857 108759933 110835343 112376948
2757 112376948 114194793 116224538 117647936 119640003 122174007 124089991 125500991 129420671
2749 129420671 131481982 135200164 139639817 144977861 150978639 157598830 164751684 171857981
2741 171857981 179310947 186854049 194033117 200196284 205194188 209507372 213359669 217344737
2733 217344737 220981402 223956595 227646667 231824912 236932682 243547887 250758337 258959349
$$ packed form
2790E1517772J98558J9023K10944R50580J013951P55495M91244J238116M78189
2781E6873872M30397K300775K363570N78115J273048J730774J217471K069186
2773F8837208J808634J785928K111388L222041K677078K106139K758827L290682
2765H8597925L126318L110052M000830L189393M224339K511076K075410J541605
2757A12376948J817845K029745J423398J992067K534004J915984J411000L919680
2749A29420671K061311L718182M439653N338044O000778O620191P152854P106297
2741A71857981P452966P543102P179068O163167M997904M313184L852297L985068
2733B17344737L636665K975193L690072M178245N107770O615205P210450Q201012
$$ plain form
2725 258959349 268800004 278108266 287061680 295132840 303592656 311967918 319487455 326174705
2717 326174705 331273909 335499982 338946209 341982835 343533964 346538934 348826057 352898309
2709 352898309 355977932 361605799 368864162 375089553 382762170 388971117 395407308 400410582
2701 400410582 405251573 406663829 404130409 399064440 389545380 375934271 360077720 343565184
2693 343565184 327379122 310879798 294896919 281009081 266524985 253718883 241983525
2686 241983525 229884094 218822544 209193746 199317270 188942747 181020409 174976268 168339229
2678 168339229 162667764 157791367 153270287 147742194 143170326 137750708 131594266 126232169
2670 126232169 120298119 115416486 109374192 105333472 101614887 96420284 91007262 87101135
$$ packed form
2725B58959349R840655R308262Q953414Q071160Q459816Q375262P519537O687250
2717C26174705N099204M226073L446227L036626J551129L004970K287123M072252
2709C52898309L079623N627867P258363O225391P672617O208947O436191N003274
2701D00410582M840991J412256k533420n065969r519060j3611109j5856551j6512536
2693C43565184j6186062j6499324j5982879j3887838j4484096j2806102j1735358
2686B41983525j2099431j1061550r628798r876476j0374523p922338o044141o637039
2678A68339229n671465m876397m521080n528093m571868n419618o156442n362097
2670A26232169n934050m881633o042294m040720l718585n194603n413022l906127
$$ plain form
2662 87101135 83713193 80607694 77526723 75511290 73814482 70402820 67586119 65388521
2654 65388521 63681240 62621826 59465849 57105842 55789894 55307654 54339267 52271591
2646 52271591 51079146 49981387 48466710 47570601 46371723 44438928 43898004 42597327
2638 42597327 41819792 40575367 40116739 39368572 37684038 36271708 34960508 34594288 33453526
2629 33453526 33170491 32514204 31627291 31129317 29460770 28511832 28506564 27568824 27241603 26580401
2619 26580401 26174075 25637721 24701706 24258645 23945832 23052513 22547808 22485917 22314465 21517764
2609 21517764 21621166 21091599 20449275 20298652 19912604 18500192 17426955 17567562 17590524
2600 17590524 17362641 17281442 16798775 17184386 16582103 16488305 15639049 15766576 15580217 15123307
$$ packed form
2662H7101135l387942l105499l080971k015433j696808l411662k816701k197598
2654F5388521j707281j059414l155977k360007j315948m82240r68387k067676
2646E2271591j192445j097759j514677q96109j198878j932795n40924j300677
2638D2597327p77535j244425m58628p48167j684534j412330j311200l66220j140762
2629C3453526k83035o56287q86913m97974j668547r48938n268r37740l27221o61202
2619B6580401m06326n36354r36015m43061l12813q93319n04705o1891j71452p96701
2609B1517764J03402n29567o42324j50623l86048j412412j073237J40607K2962
2600A7590524k27883q1199m82667L85611o02283r3798q49256J27527j86359m56910
$$ plain form
2590 15123307 15896435 15006010 14678775 14137610 14570577 14611501 14085079 13419223 13094386 12072546
2580 12072546 12557568 13036617 13113101 12962352 12730803 12924322 12089083 11548442 10933138 10946415
2570 10946415 10924812 10810799 10427325 9969591 10273414 10447060 10232797 9930386 9919419 9674975
2560 9674975 10076125 9803227 9553237 8935453 9041285 7596348 8557833 8795723 8518202
2551 8518202 8096706 7557013 7488194 8208754 8610772 8742068 7501704 6712886 6568168 5971507
2541 5971507 6969595 7567033 7890100 7285850 6902675 6703653 6962633 6477491 6820684 7173689
2531 7173689 6439892 5914111 6302026 5949613 5428214 5817021 5719018 4955020 6199352 6222618
2521 6222618 6199125 5761200 5700312 5894261 5781233 6454943 6833059 6282950 6065016 5613404
$$ packed form
2590A5123307P73128q90425l27235n41165M32967M0924n26422o65856l24837j021840
2580A2072546M85022M79049P6484j50749k31549J93519q35239n40641o15304J3277
2570A0946415k1603j14013l83474m57734L03823J73646k14263l02411j0967k44444
2560I674975M01150k72898k49990o17784J05832j444937R61485K37890k77521
2551H518202m21496n39693o8819P20560M02018J31296j240364p88818j44718n96661
2541E971507R98088N97438L23067o04250l83175j99022K58980m85142L43193L53005
2531G173689p33797n25781L87915l52413n21399L88807r8003p63998J244332K3266
2521F222618k3493m37925o0888J93949j13028O73710L78116n50109k17934m51612
$$ plain form
2511 5613404 4932542 5443067 5132118 5487084 4760331 5560598 6705148 6801188 5947207 4777345
2501 4777345 5452885 5419739 5095859 5027418 5265390 5582470 5229189 5221846 5885271 6228336
2491 6228336 5007085 5237279 5573235 5745725 4892717 5011248 5445289 5152403 6205784
2482 6205784 5661119 5916010 5097523 5069651 5428988 4625178 4621932 5747397 5393006 4752651
2472 4752651 4525948 4914040 5238218 5269818 4001163 4504670 5298426 4642222 4980029 5389465
2462 5389465 5009088 3998156 4549135 4541377 4776737 4351618 3393812 4091435 4331693 5090468
2452 5090468 6137487 5881443 5207015 5562315 4797978 4126105 4690663 4808514 4380878
2443 4380878 4290090 4639729 4796784 5123111 4567837 3724048 3928999 3620434 3565901 3952294
$$ packed form
2511E613404o80862N10525l10949L54966p26753Q00267J144550R6040q53981j169862
2501D777345O75540l3146l23880o8441K37972L17080l53281p343O63425L43065
2491F228336j221251K30194L35956J72490q53008J18531M34041k92886J053381
2482F205784n44665K54891q18487k7872L59337q03810l246J125465l54391o40355
2472D752651k26703L88092L24178L1600j268655N03507P93756o56204L37807M09436
2462E389465l80377j010932N50979p758K35360m25119r57806O97623K40258P58775
2452E090468J047019k56044o74428L55300p64337o71873N64558J17851m27636
2443D380878r0788L49639J57055L26327n55274q43789K04951l08565n4533L86393
$$ plain form
2433 3952294 4841066 4241412 3595796 4486739 4285539 4175081 3873740 3880365 3259549 2192435
2423 2192435 1691946 3366422 3839794 2404406 2547115 3168137 3551456 3822160 2918810
2414 2918810 2998176 3348601 3025119 2010509 1500399 1520445 2188727 2227970 2239205 1651806
2404 1651806 1402651 2087983 3049925 2311619 2099901 1502447 2483566 2683519 1672537
2395 1672537 1883574 2493084 2423814 1965289 2349054 2213038 2738376 2509534 2483423 1859607
2385 1859607 1987221 1221848 2561075 2255169 1545148 1888577 1720414 1649125 1795968 549846
2375 549846 1970196 2078547 1822392 2022091 2402175 1989877 2127404 2218300 2200659 2811242
2365 2811242 2386088 1836904 369165 1431833 702817 659474 1691172 2001435 1921136
$$ packed form
2433C952294Q88772n99654o45616Q90943k01200j10458l01341O625o20816j067114
2423B192435n00489J674476M73372j435388J42709O21022L83319K70704r03350
2414B918810P9366L50425l23482j014610n10110K0046O68282L9243J1235n87399
2404A651806k49155O85332R61942p38306k11718n97454R81119J99953j010982
2395A672537K11037O09510o9270m58525L83765j36016N25338k28842k6111o23816
2385A859607J27614p65373J339227l05906p10021L43429j68163p1289J46843j246122
2375E49846J420350J08351k56155J99699L80084m12298J37527R0896j7641O10583
2365B811242m25154n49184j467739J062668p29016m3343J031698L10263q0299
$$ plain form
2356 1921136 1723546 882029 1703200 1652329 1322282 1865690 1578641 1565521 2156650 1733070
2346 1733070 1504520 1099136 1161848 1472611 2040378 1637143 2013822 1623279 760901 1425757
2336 1425757 1627084 1705926 1308796 1906714 1338412 333733 933615 1627277 2515120 2291285
2326 2291285 2536187 1283036 1492144 2093460 1786120 541556 438314 -23948 762903
2317 762903 1525853 1758287 1872270 530991 1708937 1838600 2141110 2484010 2362834
2308 2362834 1683742 2953994 2787335 2997421 3151012 3414432 2823645 1999575 2003116 1117320
2298 1117320 170938 424558 817512 1646482 1833353 1587428 2391230 2302149 1551099 1618463
2288 1618463 1358825 2134710 1264687 523495 69049 967211 2351095 1603990 1319164
$$ packed form
2356A921136j97590q41517Q21171n0871l30047N43408k87049j3120N91129m23580
2346A733070k28550m05384O2712L10763N67767m03235L76679l90543q62378O64856
2336A425757K01327P8842l97130N97918n68302j004679N99882O93662Q87843k23835
2326B291285K44902j253151K09108O01316l07340j244564j03242m62262P86851
2317G62903P62950K32434J13983j341279J177946J29663L02510L42900j21176
2308B362834o79092J270252j66659K10086J53591K63420n90787q24070L541q85796
2298A117320r46382K53620L92954Q28970J86871k45925Q03802q9081p51050O7364
2288A618463k59638P75885q70023p41192m54446Q98162J383884p47105k84826
$$ plain form
2279 1319164 1568850 1106253 1512398 1162598 1210136 1047082 1646228 2390416 1674304 1686079
2269 1686079 1135889 921317 848749 1564723 1243740 1390703 1175985 1084379 1047063 1058902
2259 1058902 1224590 1736798 1277150 1252377 1690934 293275 150135 829777 245671 1347208
2249 1347208 1221287 513960 645528 1126829 1400374 1497682 1662061 1898409 1164761 1477305
2239 1477305 628829 165316 -710593 -790526 1201568 2175532 2507346 1801534 1107180 1956537
2229 1956537 2085253 1584123 1550015 1376047 1296416 1227674 1992684 1426584 1232231 2135765
2219 2135765 1871617 1400991 1459066 1206818 1161461 1665870 2528232 2515163 2816363 1792249
2209 1792249 2166856 2601987 1471883 1067804 877654 831671 1950903 1549387 1544418 1975291
$$ packed form
2279A319164K49686m62597M06145l49800M7538j63054N99146P44188p16112J1775
2269A686079n50190k14572p2568P15974l20983J46963k14718r1606l7316J1839
2259A058902J65688N12208m59648k4773M38557j397659j43140O79642n84106J101537
2249A347208j25921p07327J31568M81301K73545R7308J64379K36348p33648L12544
2239A477305q48476m63513q75909p9933J992094R73964L31814p05812o94354Q49357
2229A956537J28716n01130l4108j73968p9631o8742P65010n66100j94353R03534
2219B135765k64148m70626N8075k52248m5357N04409Q62362j3069L01200j024114
2209A792249L74607M35131j130104m04079j90150m5983J119232m01516m969M30873
$$ plain form
2199 1975291 1734587 1975846 2108880 1403992 2278934 2297355 1599542 1745182 1904206 984970
2189 984970 1195977 1385492 2071315 2246352 2162650 2139378 1936794 2670803 2346416 2855413
2179 2855413 3140110 3057689 2908765 3347609 2589107 3348738 2465769 2507081 3194302 2217225
2169 2217225 2655586 2948208 3198915 3286539 3462577 2998066 3141378 3627732 3953137 3241762
2159 3241762 2728201 3377117 3006211 3328352 3765004 3611317 2946456 2823635 3577778 3832569
2149 3832569 3125222 3497581 3394398 3434462 3680432 3618705 3921854 3669242 4099300 4911159
2139 4911159 4873803 4778763 5215027 5047686 5454517 6247338 5810637 5644107 6380640 6496969
2129 6496969 5598146 6664870 6155783 5728590 6304387 7233554 7339312 7215879 7828767
$$ packed form
2199A975291k40704K41259J33034p04888Q74942J8421o97813J45640J59024r19236
2189I84970K11007J89515O85823J75037q3702k3272k02584P34009l24387N08997
2179B855413K84697q2421j48924M38844p58502P59631q82969M1312O87221r77077
2169B217225M38361K92622K50707Q7624J76038m64511J43312M86354L25405p11375
2159C241762n13561O48916l70906L22141M36652j53687o64861j22821P54143K54791
2149C832569p07347L72359j03183M0064K45970o1727L03149k52612M30058Q11859
2139D911159l7356r5040M36264j67341M06831P92821m36701j66530P36533J16329
2129F496969q98823J066724n09087m27193N75797R29167J05758j23433O12888
$$ plain form
2120 7828767 8234866 8349676 7579108 7647462 7921743 8960386 9669363 9853342 10599820 10149572
2110 10149572 10473037 10421725 11135637 11829288 11604959 11885458 12520673 12264455 12509049 13478975
2100 13478975 12439508 13591785 13940301 13992989 15499930 16521893 17688462 18898705 19630643
2091 19630643 20976730 22134971 22774438 24118396 25590773 26075399 26651305 29133882 30566606
2082 30566606 33470390 36885211 40864479 45438114 48876304 54160022 58932475 63994537
2074 63994537 71063508 77599642 84932126 93880040 104606014 120635650 140226719 165710664
2066 165710664 196017488 232760548 267146173 293126884 282945854 251309863 209516884
2059 209516884 162581196 132000407 108604103 92937033 79813726 71921488 65100185
$$ packed form
2120G828767M06099J14810p70568O8354K74281J038643P08977J83979P46478m50248
2110A0149572L23465n1312P13912O93651k24329K80499O35215k56218K44594R69926
2100A3478975j039467J152277L48516N2688J506941J021963J166569J210243P31938
2091A9630643J346087J158241O39467J343958J472377M84626N75906K482577J432724
2082C0566606K903784L414821L979268M573635L438190N283718M772453N062062
2074F3994537P068971O536134P332484Q947914J0725974J6029636J9591069K5483945
2066A65710664L0306824L6743060L4385625K5980711j0181030l1635991m1792979
2059B09516884m6935688l0580789k3396304j5667070j3123307p892238o821303
$$ plain form
2052 65100185 59604478 55591693 51635132 47620909 44946104 40827338 37511280 33926169
2044 33926169 30869710 29056712 26747290 25275618 24156751 22924330 21567882 20424140
2036 20424140 19225393 18307273 18194405 17505639 16694830 16962608 16641357 16183781 15755973
2027 15755973 14639945 13899826 12244459 12171851 12442088 11556772 10883563 9896850 9700694
2018 9700694 9381516 9364259 8059509 7978385 8503989 7999367 7421809 7568122 6854227 7082732
2008 7082732 7187579 7341932 7306990 7760953 7534085 6559471 6229088 7035389 6689567 6337656
1998 6337656 6729449 5793651 5056197 5308849 5471954 5064360 5018957 5163667 4714415 3693497
1988 3693497 3898967 4090830 3687255 3679925 3946449 3234604 3674999 4058805 3881812 4019297
$$ packed form
2052F5100185n495707m012785l956561m014223k674805m118766l316058l585111
2044C3926169l056459j812998k309422j471672j118867j232421j356448j143742
2036B0424140j198747r18120j12868o88766q10809K67778l21251m57576m27808
2027A5755973j116028p40119j655367p2608K70237q85316o73209r86713j96156
2018I700694l19178j7257j304750q1124N25604n04622n77558J46313p13895K28505
2008G082732J04847J54353l4942M53963k26868r74614l30383Q06301l45822l51911
1998F337656L91793r35798p37454K52652J63105m07594m5403J44710m49252j020918
1988C693497K05470J91863m03575p330K66524p11845M40395L83806j76993J37485
$$ plain form
1978 4019297 3689947 3841594 3433142 3550484 3545668 3215949 2321349 2813560 2706479 2843059
1968 2843059 2784158 2902759 2604557 2099553 3098412 2759598 2609382 2648495 3045684 2560925
1958 2560925 2188091 1449062 1003726 1605950 2039102 1285139 1772743 2013494 1267355 1748951
1948 1748951 1869368 2166487 2277495 2280658 2418043 2005759 2317470 1432630 1945603 1422063
1938 1422063 1890033 1004160 507922 1183779 2107601 2109859 1798366 1775945 2204633 2052394
1928 2052394 1056034 952898 1114139 626878 1082899 1193205 1063789 1906936 1312448 2256062
1918 2256062 2193109 1355484 1683008 1723897 1503893 1901034 1574405 588557 965649 1520782
1908 1520782 1418852 2055604 2090526 1991054 1829401 1512642 1834541 1375420 1604969 1430323
$$ packed form
1978D019297l29350J51647m08452J17342m816l29719q94600M92211j07081J36580
1968B843059n8901J18601k98202n05004R98859l38814j50216L9113L97189m84759
1958B560925l72834p39029m45336O02224M33152p53963M87604K40751p46139M81596
1948A748951J20417K97119J11008L163J37385m12284L11711q84840N12973n23540
1938A422063M67970q85873m96238O75857R23822K258l11493k2421M28688j52239
1928B052394r96360j03136J61241m87261M56021J10306j29416Q43147n94488R43614
1918B256062o2953q37625L27524M0889k20004L97141l26629r85848L77092N55133
1908A520782j01930O36752L4922r9472j61653l16759L21899m59121K29549j74646
$$ plain form
1898 1430323 1031909 741867 645025 303332 199116 633209 1256112 1099114 693114 540377
1888 540377 769580 782655 605099 -122802 -266471 320730 423859 1288393 609913 730822
1878 730822 1017360 948151 776263 760240 759083 626057 513719 1077654 1025336 -121763
1868 -121763 -413179 -336036 -129663 -111807 110166 1465482 1304503 893233 866165 1184610
1858 1184610 1484911 1615796 812944 1332708 984241 330477 -15977 538887 863662 814358
1848 814358 725595 948717 614890 216585 818885 1632695 815025 1231004 1009792 359667
1838 359667 461799 526581 1221930 950243 988137 1048713 1109574 979214 890669 1188741 1347024
1827 1347024 1360442 1047483 991233 1230181 1341008 2541305 3287558 3212547 2916978 2020058
$$ packed form
1898A430323l98414k90042r6842l41693j04216M34093O22903j56998m06000j52737
1888E40377K29203J3075j77556p27901j43669N87201J03129Q64534o78480J20909
1878G30822K86538o9209j71888j6023j157j33026j12338N63935n2318j147099
1868a21763k91416P7143K06373J7856K21973J355316j60979m11270k7068L18445
1858A184610L00301J30885q02852N19764l48467o53764l46454N54864L24775m9304
1848H14358q8763K23122l33827l98305O02300Q13810q17670M15979k21212o50125
1838C59667J02132O4782O95349k71687L7894O0576O0861j30360q8545K98072J58283
1827A347024J3418l12959n6250K38948J10827J200297P46253p5011k95569q96920
$$ plain form
1817 2020058 2057413 2062546 2118844 1939892 1356965 536145 604592 602482 900911 381772 1560250
1806 1560250 1714808 1779930 1427944 -214629 237450 572242 701231 16474 778060 272678
1796 272678 -135882 568778 478957 1166917 270556 -303583 550921 626042 749993 112958
1786 112958 471259 509538 -258194 -142835 1144197 -355814 -397033 -127265 523219 -398427
1776 -398427 -223623 -317342 -279895 301857 978478 1249484 707334 -468555 -52561 330367
1766 330367 607513 80686 -577047 -132563 163889 -257928 634660 1148123 697644 411520
1756 411520 211033 341975 583859 982561 1059923 47759 205419 1671876 482953
1747 482953 -126668 -751514 30371 421650 1031766 -32475 431765 112508 579329 1119290
$$ packed form
1817B020058L7355N133N6298j78952n82927q20820O8447k110K98429n19139J178478
1806A560250J54558O5122l51986j642573M52079L34792J28989o84757P61586n05382
1796B72678m08560P04660q9821O87960q96361n74139Q54504P5121J23951o37035
1786A12958L58301L8279p67732J15359J287032j500011m1219K69768O50484r21646
1776c98427J74804r3719L7447N81752O76621K71006n42150j175889M15994L82928
1766C30367K77146n26827o57733M44484K96452m21817Q92588N13463m50479k86124
1756D11520k00487J30942K41884L98702P7362j012164J57660J466457j188923
1747D82953o09621o24846P81885L91279O10116j064241M64240l19257M66821N39961
$$ plain form
1737 1119290 1240834 852348 38949 83589 -310623 -649939 -791162 -600458 -590249 -459590
1727 -459590 -677888 776767 668273 -40567 282950 1027041 1513802 276067 -794262
1718 -794262 -401458 -932114 -771446 264950 852560 205825 -169176 -112456 -699540 -81223
1708 -81223 614037 56063 -206969 394313 930888 1444603 1612025 1047602 755213 861454
1698 861454 768337 208750 484499 -132993 -141694 335198 534156 709129 447676 565129
1688 565129 285070 433320 180731 85828 361202 -22518 -308893 134322 -642163 -824091
1678 -824091 462050 138372 313705 307497 193404 189865 102440 426241 181280 449716
1668 449716 131010 1376102 593470 528989 171136 1048662 361760 -925363 193835
$$ packed form
1737A119290J21544l88486q13399M4640l94212l39316j41223J90704J0209J30659
1727d59590k18298J454655j08494p08840L23517P44091M86761j237735j070329
1718g94262L92804n30656J60668J036396N87610o46735l75001N6720n87084O18317
1708h1223O95260n57974k63032O01282N36575N13715J67422n64423k92389J06241
1698H61454r3117n59587K75749o17492q701M76892J98958J74973k61453J17453
1688E65129k80059J48250k52589r4903K75374l83720k86375M43215p76485j81928
1678h24091J286141l23678J75333o208j14093l539q7425L23801k44961K68436
1668D49716l18706J245092p82632o4481l57853Q77526o86902j287123J119198
$$ plain form
1659 193835 469027 574765 1590649 779219 723517 1315548 32300 35612 -1271 844560
1649 844560 712439 986044 1217261 364867 129604 1112467 225789 -217714 486939 469752
1639 469752 -82723 -309687 59171 -83939 -1003983 -570696 1120644 1076372 -476017 -118250
1629 -118250 197814 656805 201553 -1144328 -266140 274847 -206486 -796508 184541 -857906
1619 -857906 -504490 403192 358906 668712 661998 -247401 -932837 -828764 -135879 228228
1609 228228 529161 103812 186281 1085291 -433967 -146801 928286 943155 1511796 913414
1599 913414 202190 -90591 161645 499372 774434 1269444 688558 461758 1005880 1314591
1589 1314591 1609596 1673056 387247 -264502 -26692 132023 -571308 97306 254217 -37933
$$ packed form
1659A93835K75192J05738J015884q11430n5702N92031j283248L312l6883Q45831
1649H44560j32121K73605K31217q52394k35263R82863q86678m43503P04653j7187
1639D69752n52475k26964L68858j43110r20044M33287J691340m4272j552389L57767
1629a18250L16064M58991m55252j345881Q78188N40987m81333n90022R81049j042447
1619h57906L53416R07682m4286L09806o714r09399o85436J04073O92885L64107
1609B28228L00933m25349Q2469Q99010j519258K87166J075087J4869N68641n98382
1599I13414p11224k92781K52236L37727K75062M95010n80886k26800N44122L08711
1589A314591K95005O3460j285809o51749K37810J58715p03331O68614J56911k92150
$$ plain form
1579 -37933 583438 -126527 375181 428354 206292 372866 565627 727476 471293 -217989
1569 -217989 814489 693935 -22301 408722 -162942 1084069 1489082 219291 264656
1560 264656 16105 -275365 -12824 -146716 509768 617742 715550 -169323 -986136 -786292
1550 -786292 -183241 -196955 220025 -525534 -565399 766378 684053 882291 986145 292810
1540 292810 96745 -661063 -333432 -290215 982181 1347158 400619 271520 291343 1380082
1530 1380082 835628 518238 415241 1311973 905424 -190221 690238 1305986 1169867
1521 1169867 233360 829323 34012 -26727 108588 180878 -737212 -1015361 -971542 -1047779
1511 -1047779 -550782 190960 263295 74190 -82998 -194446 -246449 887715 1725600 911924
$$ packed form
1579c7933O21371p09965N01708N3173k22062J66574J92761J61849k56183o89282
1569b17989J032478j20554p16236M31023n71664J247011M05013j269791M5365
1560B64656k48551k91470K62541j33892O56484J07974R7808q84873q16813J99844
1550g86292O03051j3714M16980p45559l9865J331777q2325J98238J03854o93335
1540B92810j96065p57808L27631M3217J272396L64977r46539j29099J9823J088739
1530A380082n44454l17390j02997Q96732m06549j095645Q80459O15748j36119
1521A169867r36507N95963p95311o0739J35315P2290r18090k78149M3819p6237
1511a047779M96997P41742P2335j89105j57188j11448n2003J134164Q37885q13676
$$ plain form
1501 911924 775101 -182401 -244772 -906665 -226947 430333 13568 -491558 123553 811443
1491 811443 1726387 1795657 298706 588721 -476860 -929629 -57835 -73541 663273 581066
1481 581066 405887 235615 236528 92060 276790 202967 -108227 66631 695338 -325391
1471 -325391 -475118 -574840 -1304282 -974588 -391538 111959 602697 454771 542742 -243648
1461 -243648 -811929 -454787 -1249232 -1338154 -929041 -635190 261385 983854 949122 58914
1451 58914 304764 506265 -228723 -877539 -123359 206675 897144 619754 701126 231447
1441 231447 250591 -67824 -696943 -287162 -475649 343289 856532 -910271 -1244342 -884528
1431 -884528 70841 274820 -422544 615176 301150 -294460 -785758 -582126 -837270 210463
$$ packed form
1501I11924j36823r57502o2371o61893O79718O57280m16765n05126O15111O87890
1491H11443R14944O9270j496951K90015j065581m52769Q71794j5706P36814q2207
1481E81066j75179j70272R13j44468J84730p3823l11194J74858O28707j020729
1471c25391j49727r9722p29442L29694N83050N03497M90738j47926Q7971p86390
1461b43648n68281L57142p94445q8922M09113K93851Q96575P22469l4732q90208
1451E8914K45850K01501p34988o48816P54180L30034O90469k77390Q1372m69679
1441B31447J9144l18415o29119M09781j88487Q18938N13243j766803l34071L59814
1431h84528R55369K03979o97364J037720l14026n95610m91298K03632k55144J047733
$$ plain form
1421 210463 255330 -143427 -801812 -800257 -624301 124753 293295 175444 -466096 -609452
1411 -609452 513620 1236393 944014 154993 261018 452959 204688 -767453 -684528 1176232
1401 1176232 720718 -345750 209439 -179999 -1254070 -582007 -21919 -314347 -25699
1392 -25699 746013 282777 129148 575959 607829 -205912 -63482 50380 14239 41523
1382 41523 -1278630 -271172 -986631 -732756 -649119 -841087 -298673 -154059 229431 -303798
1372 -303798 -1126031 -969191 -354684 -659284 -406755 -67584 -470870 -590372 1139611 1235116
1362 1235116 277186 734272 496624 -175297 -631615 -1147142 -248564 -409524 118376 -285009
1352 -285009 -738952 -121782 -478070 -595200 -497923 43993 58845 22473 -137933 -1167267
$$ packed form
1421B10463M4867l98757o58385J555J75956P49054J68542j17851o41540j43356
1411f09452J123072P22773k92379p89021J06025J91941k48271r72141Q2925J860760
1401A176232m55514j066468N55189l89438j074071O72063N60088k92428K88648
1392b5699P71712m63236j53629M46811L1870q13741J42430J13862l6141K7284
1382D1523j320153J007458p15459K53875Q3637j91968N42414J44614L83490n33229
1372c03798q22233J56840O14507l04600K52529L39171m03286j19502J729983R5505
1362A235116r57930M57086k37648o71921m56318n15527Q98578j60960N27900m03385
1352b85009m53943O17170l56288j17130R7277N41916J4852l6372j60406j029334
$$ plain form
1342 -1167267 -1082203 -759394 -33944 723314 436070 863769 195147 241350 193033 36954
1332 36954 231714 635941 354106 -179087 79755 209371 305568 540127 -79038 -49262
1322 -49262 141056 -79826 -489378 -93695 -473786 515780 1165091 284705 205402 -7837
1312 -7837 101942 82086 -408794 -475946 -439738 -529741 -8091 466721 -723758 -385999 10668
1301 10668 -751103 -705453 -786993 -985278 -718247 312829 254797 870980 -243650 -217823
1291 -217823 458793 181845 15667 113894 360078 423119 -143775 -184349 499763 862318
1281 862318 327883 731860 25995 241803 -598146 -526835 177882 -347701 -657850 -658086
1271 -658086 -347388 -981922 -61404 723407 1219941 57975 337426 -338948 -916612 -604889
$$ packed form
1342a167267Q5064L22809P25450P57258k87244M27699o68622M6203m8317j56079
1332C6954J94760M04227k81835n33193K58842J29616R6197K34559o19165K9776
1322d9262J90318k20882m09552L95683l80091R89566O49311q80386p9303k13239
1312g837J09779j9856m90880o7152L6208r0003N21650M74812j190479L37759L96667
1301A0668p61771M5650q1540j98285K67031J031076n8032O16183j114630K5827
1291b17823O76616k76948j66178R8227K46184O3041n66894m0574O84112L62555
1281H62318n34435M03977p05865K15808q39949P1311P04717n25583l10149k36
1271f58086L10698o34534R20518P84811M96534j161966K79451o76374n77664L11723
$$ plain form
1261 -604889 -595769 367847 201923 -42616 -270265 301575 320092 -511492 96082 -142940
1251 -142940 516929 770472 764235 -125686 -863345 -851748 -601609 397190 -14601 509773
1241 509773 771563 -357614 -443165 -430036 436417 606063 644296 352180 93615 808315
1231 808315 1068974 94441 380966 531539 -198071 582780 1082776 -282337 -630018 -145068
1221 -145068 -561930 207214 767216 1656856 692761 -1181 -846662 -510245 -72310 364930
1211 364930 277911 -721637 -182838 273625 2278 -29762 -444584 476149 954217 546987
1201 546987 558184 747530 113913 124231 395335 -133916 -283413 -39328 871963 305289
1191 305289 959389 578629 -604923 -130595 -398218 -21053 637664 727739 -211939 504653
$$ packed form
1261f04889R120R63616j65924k44539k27649N71840J8517q31584O07574k39022
1251a42940O59869K53543o237q89921p37659J1597K50139R98799m11791N24374
1241E09773K61790j129177q5551J3129Q66453J69646L8233k92116k58565P14700
1231H08315K60659r74533K86525J50573p29610P80851M99996j365113l47681M84950
1221a45068m16862P69144N60002Q89640r64095o93942q45481L36417M37935M37240
1211C64930q7019r99548N38799M56463k71347l2040m14822R20733M78068m07230
1201E46987J1197J89346o33617J0318K71104n29251j49497K44085R11291n66674
1191C05289O54100l80760j183552M74328k67623L77165O58717R0075r39678P16592
$$ plain form
1181 504653 627591 -926937 -899076 -681588 -811249 -989160 -333752 -107129 2058 303086
1171 303086 174795 -10050 573299 694591 539995 119781 607238 301441 -522116 -367868
1161 -367868 472283 1293841 459732 641132 1042496 627476 -563363 -452210 -542912 -820377
1151 -820377 -586027 -241922 -252174 -676408 111003 26271 -220282 -870331 -1032896 -1134835
1141 -1134835 -1216681 -656565 114731 845612 201482 451350 1520561 992838 558228 1075592
1131 1075592 1087703 -116156 -886922 -498921 176077 439467 -138724 -1022293 -777212 -148005
1121 -148005 -528679 -1072861 -446771 -271013 -652089 -695245 -264937 -144691 580583 -224845
1111 -224845 -573436 -682649 -1153562 -1031989 -541156 -689474 -194877 348509 712295 483221
$$ packed form
1181E04653J22938j554528K7861K17488j29661j77911O55408K26623J09187L01028
1171C03086j28291j84845N83349J21292j54596m20214M87457l05797q23557J54248
1161c67868Q40151Q21558q34109J81400M01364m15020j190839J11153r0702k77465
1151h20377K34350L44105j0252m24234P87411q4732k46553o50049j62565j01939
1141a134835q1846N60116P71296P30881o44130K49868J069211n27723m34610N17364
1131A075592J2111j203859p70766L88001O74998K63390n78191q83569K45081O29207
1121a48005l80674n44182O26090J75758l81076m3156M30308J20246P25274q05428
1111b24845l48591j09213m70913J21573M90833j48318M94597N43386L63786k29074
$$ plain form
1101 483221 79797 -699601 65185 6349 -11065 326389 -5162 173451 340367 -105127
1091 -105127 -699953 -381814 -161421 497265 685040 566381 838907 1319442 425864 706222
1081 706222 43562 90387 995361 692640 1104593 1124174 -214603 -1156905 -998677 -983279
1071 -983279 -904561 -185772 448311 611999 -188143 190327 209363 4182 -82710 -698378
1061 -698378 -977580 -443610 -798377 -131976 -290581 -164084 -695163 199102 831929 59723
1051 59723 -181372 -54709 -295917 -582666 -859683 -342356 8267 -479194 842529 584108
1041 584108 -32152 -386499 -454227 -1286661 -893601 -600201 -708585 -198870 226533 600985
1031 600985 149698 499551 -242467 332743 3836 365457 1098951 339721 301180 608749
$$ packed form
1101D83221m03424p79398P64786n8836j7414L37454l31551J78613J66916m45494
1091a05127n94826L18139K20393O58686J87775j18659K72526M80535q93578K80358
1081G06222o62660M6825R04974l02721M11953J9581j338777r42302J58228J5398
1071i83279P8718P18789O34083J63688q00142L78470J9036k05181q6892o15668
1061f98378k79202N33970l54767O66401j58605J26497n31079Q94265O32827p72206
1051E9723k41095J26663k41208k86749k77017N17327L50623m87461J321723k58421
1041E84108o16260l54347o7728q32434L93060K93400j08384N09715M25403L74452
1031F00985m51287L49853p42018N75210l28907L61621P33494p59230l8541L07569
$$ plain form
1021 608749 -201318 -163683 52618 -3841 -251019 -254692 888948 285844 -470218 -753013
1011 -753013 429361 359269 302068 -308995 -442020 -327044 -1002705 -614150 -229256 -488859
1001 -488859 6948 249212 -113121 31673 -283421 -416347 -681558 -1100368 -573619 204136
991 204136 362544 520428 23318 -196849 -124237 764502 550031 674889 688094 -379978
981 -379978 590426 1132660 556011 292654 150470 823169 -53218 -509295 -304193 -1333713
971 -1333713 -875320 -751155 -678937 302157 875187 -196416 -745962 -161236 14835 28851
961 28851 626001 857046 588544 57220 17364 -76772 138798 718396 233800 -814492
951 -814492 -866181 -487770 85433 200077 405871 111458 208063 -89752 -1140251 -143591
$$ packed form
1021F08749q10067L7635K16301n6459k47178l673J143640o03104p56062k82795
1011g53013J182374p0092n7201o11063j33025J14976o75661L88555L84894k59603
1001d88859M95807K42264l62333J44794l15094j32926k65211m18810N26749P77755
991B04136J58408J57884m97110k20167P2612Q88739k14471J24858J3205j068072
981c79978R70404N42234n76649k63357j42184O72699q76387m56077K05102j029520
971a333713M58393J24165P2218R81094N73030j071603n49546N84726J76071J4016
961B8851N97150K31045k68502n31324l9856r4136K15570N79598m84596j048292
951h14492n1689L78411N73203J14644K05794k94413R6605k97815j050499R96660
$$ plain form
941 -143591 329587 121740 10939 327982 -61416 -958711 -394969 -565724 -155233 -234902
931 -234902 -91469 -144771 478188 324988 -424856 -343336 -472481 -562505 -376529 25805
921 25805 -206587 -270880 255311 460179 79953 415833 401516 -216174 -435983 -134106
911 -134106 488158 608200 21392 297638 960394 706427 -189153 -489120 614542 570507
901 570507 -169276 -116202 -509010 -568697 -592099 -1145608 -612775 -203410 466321 309570
891 309570 97815 77957 1024345 916845 283027 -205087 47547 1116482 -36112 -721732
881 -721732 -1071652 696753 715624 -537842 977954 1164133 684156 -102373 304160 926562
871 926562 914324 798352 731582 -476363 -828107 -577019 -758735 -728796 -533440 824697
$$ packed form
941a43591M73178k07847j10801L17043l89398q97295N63742j70755M10491p9669
931b34902J43433n3302O22959j53200p49844Q1520j29145r0024J85976M02334
921B5805k32392o4293N26191K04868l80226L35880j4317o17690k19809L01877
911a34106O22264J20042n86808K76246O62756k53967q95580k99967J103662m4035
901E70507p39783N3074l92808n9687k3402n53509N32833M09365O69731j56751
891C09570k11755j9858R46388j07500o33818m88114K52634J068935j152594o85620
881g21732l49920J768405J8871j253466J515796J86179m79977p86529M06533O22402
871I26562j2238j15972o6770j207945l51744K51088j81716K9939J95356J358137
$$ plain form
861 824697 265653 514010 498377 711739 258441 -203481 -136992 -96439 -405945 91996
851 91996 708789 561672 73458 -160337 -283966 -59101 1050154 274257 814570 182140
841 182140 -994006 -255789 867096 -202580 -429734 404379 -36115 160832 113200 929081
831 929081 362510 -416701 -626719 264049 182977 639843 474400 1398653 523616 -719158
821 -719158 -215706 348401 578536 427171 505665 23380 -878292 -15964 -56171 -609431
811 -609431 -936141 -768479 -1242771 -653161 352424 41355 341163 970636 760415 -199968
801 -199968 -232509 -143403 -413276 -818828 -739209 -209789 443380 -835209 -729827 858638
791 858638 657271 -187468 -273847 634424 1187498 804012 -173901 15440 -322004 -208098
$$ packed form
861H24697n59044K48357j5633K13362m53298m61922O6489M0553l09506M97941
851I1996O16793j47117m88214k33795j23629K24865J109255p75897N40313o32430
841A82140j176146P38217J122885j069676k27154Q34113m40494J96947m7632Q15881
831I29081n66571p79211k10018Q90768q1072M56866j65443R24253q75037j242774
821g19158N03452N64107K30135j51365P8494m82285r01672Q62328m0207n53260
811f09431l26710J67662m74292N89610J005585l11069K99808O29473k10221r60383
801a99968l2541Q9106k69873m05552P9619N29420O53169j278589J05382J588465
791H58638k01367q44739q6379R08271N53074l83486r77913J89341l37444J13906
$$ plain form
781 -208098 169173 -620102 -58087 -200689 -671681 -796863 -377806 55271 1017078 1158386
771 1158386 937448 575321 150016 110534 154195 610089 -644700 -801650 -28663 368281
761 368281 285256 -718762 -1111206 -734969 274028 -147089 -855983 -543004 241336 -156965
751 -156965 -880224 -552888 211052 460170 119524 -594836 -36457 -311108 -525446 505558
741 505558 562740 251109 103704 -308477 637491 400677 -747757 -491291 354672 401937
731 401937 -559322 -36000 184061 378196 786036 -70235 -844668 -187465 197464 -733099
721 -733099 284804 502245 706828 574664 1095452 -69425 -5296 -605531 -993878 -1075457
711 -1075457 -208865 -280766 -500290 -769841 -991349 -65334 321108 -245958 33083 -43452
$$ packed form
781b08098L77271p89275N62015j42602m70992j25182M19057M33077R61807J41308
771A158386k20938l62127m25305l9482M3661M55894j254789j56950P72987L96944
761C68281q3025j004018l92444L76237J008997m21117p08894L12979P84340l98301
751a56965p23259L27336P63940K49118l40646p14360N58379k74651k14338J031004
741E05558N7182l11631j47405m12181R45968k36814j148434K56466Q45963M7265
731D01937r61259N23322K20061J94135M07840q56271p74433O57203L84929r30563
721g33099J017903K17441K04583j32164N20788j164877O4129o00235l88347q1579
711a075457Q66592p1901k19524k69551k21508R26015L86442n67066K79041p6535
$$ plain form
701 -43452 269452 314513 638146 -173759 -1294954 -973525 -1001732 179634 -40658 96961
691 96961 -534498 -107430 -134510 172836 226597 -1438402 -902893 125785 -23437 -331619
681 -331619 -522286 -403312 -265457 50622 -26746 363591 405251 -621030 -361604 -829830
671 -829830 -1128488 -433951 -238743 219236 125358 230580 -1151982 -799527 -532904 313612
661 313612 23080 414967 -57495 -905732 -569494 -913894 -198969 678001 758381 -32503
651 -32503 -728681 -203238 403226 -57549 -5167 1118463 1721923 566238 264699 -316728
641 -316728 -605706 -7036 658193 403273 -292652 800805 883109 716705 -484941 145392
631 145392 -102247 -422607 -648181 -345331 6291 -138052 -154165 496763 50206 432590
$$ packed form
701d3452L12904M5061L23633q11905j121195L21429k8207J181366k20292J37619
691I6961o31459M27068k7080L07346N3761j664999N35509J028678j49222l08182
681c31619j90667J18974J37855L16079p7368L90337M1660j026281K59426m68226
671h29830k98658O94537J95208M57979r3878J05222j382562L52455K66623Q46516
661C13612k90532L91887m72462q48237L36238l44400P14925Q76970Q0380p90884
651c2503o96178N25443O06464m60775N2382J123630O03460j155685l01539n81427
641c16728k88978N98670O65229k54920o95925J093457Q2304j66404j201646O30333
631A45392k47639l20360k25574L02850L51622j44343j6113O50928m46557L82384
$$ plain form
621 432590 669598 717212 -119152 -1225205 -349266 91549 -607224 105750 822304 1007062
611 1007062 1123390 1060670 775319 454599 62389 212923 310928 192527 392048 -191815
601 -191815 -923 35266 23212 -215138 -553594 -960327 -1039043 -1213422 417176 643027
591 643027 -79683 -304402 -752448 -718854 -1218595 -649901 -722828 -106734 448837 -635303
581 -635303 -593271 912084 92453 -1048683 -1093173 -791410 -179226 491023 883853 522432
571 522432 261888 -268967 -638330 -733057 -669829 -321822 657382 -285660 -549595 -48659
561 -48659 441166 357791 477752 11525 -169299 -836499 -348259 -76133 770123 486417
551 486417 689197 -328143 -664536 -811972 -49186 -779183 -1151318 -256863 42143 664561
$$ packed form
621D32590K37008M7614q36364j106053Q75939M40815o98773P12974P16554J84758
611A007062J16328o2720k85351l20720l92210J50534R8005j18401J99521n83863
601a91815J90892L6189j2054k38350l38456m06733p8716j74379J630598K25851
591F43027p22710k24719m48046L3594m99741N68694p2927O16094N55571j084140
581f35303M2032J505355q19631j141136m4490L01763O12184O70249L92830l61421
571E22432k60544n30855l69363r4727O3228L48007R79204r43042k63935N00936
561d8659M89825q3375J19961m66227j80824o67200M88240K72126Q46256k83706
551D86417K02780j017340l36393j47436P62786p29997l72135Q94455K99006O22418
$$ plain form
541 664561 223509 637050 -853317 -679686 363100 -144001 -504804 -1075834 101007
532 101007 966715 14368 161732 106503 480176 -26553 -765379 12655 -65978 -642041
522 -642041 -97846 87111 136165 30484 -666957 -1193466 -447925 -230207 -662912 -15334
512 -15334 290578 732784 98708 -808158 -863475 -182791 -384460 -1073288 -387153 -608897
502 -608897 -754592 -148053 -1110649 -400064 31650 -201285 -776745 -64041 78327 -835684
492 -835684 -689151 -57606 -300069 -264131 555795 168044 -865614 -1266681 -559720 -1133807
482 -1133807 -1054091 -1063087 -684879 -386576 -359237 -385449 -644366 -433751 -202766 733891 -34829
471 -34829 186373 197679 -572975 -175915 -112068 14664 -762974 305431 -166626 608926
$$ packed form
541F64561m41052M13541j490367J73631J042786n07101l60803n71030J176841
532A01007Q65708r52347J47364n5229L73673n06729p38826P78034p8633n76063
522f42041N44195J84957M9054j05681o97441n26509P45541K17718m32705O47578
512a5334L05912M42206o34076r06866n5317O80684k01669o88828O86135k21744
502f08897j45695O06539r62596P10585M31714k32935n75460P12704J42368r14011
492h35684J46533O31545k42463L5938Q19926l87751j033658m01067P06961n74087
482a133807P9716q996L78208K98303K7339k6212k58917K10615K30985R36657p68720
471c4829K21202J1306p70654L97060O3847J26732p77638J068405m72057P75552
$$ plain form
461 608926 1193405 918998 333397 -500751 18619 92600 154545 -750630 417500 196053
451 196053 -455136 -70459 -39685 -147007 -998986 352050 -126078 152414 -390309 -1080806
441 -1080806 -491226 -397729 -675132 -836995 -205759 -10327 -565033 -597570 -793771 12325
431 12325 -313183 650247 937701 -148205 -601230 130117 260048 163260 258853 -768365
421 -768365 -514470 372166 430376 427395 130818 -166301 -158734 260370 -1084942 -1627285 -1196494
410 -1196494 -458500 168594 11773 -326332 -44006 -59174 -802986 -727482 -754363 145080
400 145080 -815710 -452917 250055 214133 -966381 -1205342 -7508 263163 236230 -522114
390 -522114 -928390 188683 -405104 -927128 -1048788 -956876 -504270 -724529 -1159700 -517628
$$ packed form
461F08926N84479k74407n85601q34148N19370P3981O1945r05175J168130k21447
451A96053o51189L84677L0774j07322q51979J351036m78128K78492n42723o90497
441a080806N89580R3497k77403j61863O31236J95432n54706l2537j96201Q06096
431A2325l25508R63430K87454j085906m53025P31347J29931r6788R5593j027218
421g68365K53895Q86636N8210k981k96577k97119P567M19104j345312n42343M30791
410a196494P37994O27094j56821l38105K82326j5168p43812P5504k6881Q99443
400A45080r60790L62793P02972l5922j180514k38961J197834K70671k6933p58344
390e22114m06276J117073n93787n22024j21660R1912M52606k20259m35171O42072
$$ plain form
380 -517628 -852741 -995461 -546363 62240 344940 -485984 -1242015 -2005830 -1827529 -802223
370 -802223 -1112226 -555557 -1404763 -1608995 -465369 -477045 -11884 66811 -463819 319404
360 319404 -250179 743072 908991 -492176 -377917 -679154 -619362 -1067665 86736 -447760
350 -447760 -501496 127070 17755 29019 347154 726445 64285 -445647 53784 -1178833
340 -1178833 -1314369 -1125827 -452444 -569837 -1026305 -1450624 -1035244 -542296 -757739 -648290
330 -648290 -253279 -424350 -628366 -206899 627362 445462 -6758 -238339 -245682 -85962
320 -85962 -172182 -396682 -1279829 -1417128 -1288533 -665296 -288443 9787 -667902 38521
310 38521 147409 -271916 -429478 -654060 -704254 -302765 -233962 74623 -267107 21043
$$ packed form
380e17628l35113j42720M49098O08603K82700q30924p56031p63815J78301J025306
370h02223l10003N56669q49206k04232J143626j1676M65161P8695n30630P83223
360C19404n69583R93251J65919j401167J14259l01237N9792m48303J154401n34496
350d47760n3736O28566j09315J1264L18135L79291o62160n09932M99431j232617
340a178833j35536J88542O73383j17393m56468m24319M15380M92948k15443J09449
330f48290L95011j71071k04016M21467Q34261j81900m52220k31581p343J59720
320h5962q6220k24500q83147j37299J28595O23237L76853K98230o77689P06423
310C8521J08888m19325j57562k24582n0194M01489O8803L08585l41730K88150
$$ plain form
300 21043 -846425 -712175 -830007 -92752 -313454 -965644 -652288 -712380 -329477 -396426
290 -396426 -1101094 -1644136 -1081562 -1168927 -1109931 -521066 2279 432052 -283890 -610671
280 -610671 -955596 -198265 -23989 -1429989 -1652260 -923472 -69041 -366381 -206898 -726640
270 -726640 -494648 743746 1301527 465219 -271513 -448801 -588447 -485215 -944139 -739454
260 -739454 -588006 -562801 60730 602830 425057 373997 389669 -738180 -551500 -631039
250 -631039 -1150485 -483343 -550349 -624568 -141004 -266488 -666157 -1057456 -758515 -133402
240 -133402 -374702 -988547 -1457312 -898292 -379243 -319641 -66757 -663154 -720987 -565729
230 -565729 -1157564 -901959 -475863 -677342 -567410 -913760 -814014 -586916 -207911 -11207
$$ packed form
300B1043q67468J34250j17832P37255k20702o52190L13356o0092L82903o6949
290c96426p04668n43042N62574q7365N8996N88865N23345M29773p15942l26781
280f10671l44925P57331J74276j406000k22271P28788Q54431k97340J59483n19742
270g26640K31992J238394N57781q36308p36732j77288j39646J03232m58924K04685
260g39454J51448K5205O23531N42100j77773n1060J5672j127849J86680p9539
250f31039n19446O67142o7006p4219M83564j25484l99669l91299K98941O25113
240a33402k41300o13845m68765N59020N19049N9602K52884n96397n7833J55258
230e65729n91835K55605M26096k01479J09932l46350R9746K27098L79005J96704
$$ plain form
220 -11207 -819349 -1125656 -245799 -906387 -1095105 -1722094 -1184500 -1072971 -1359713 -11881
210 -11881 802141 36281 -191468 85002 211228 -215810 410690 -19322 -246841 -821682
200 -821682 -207338 -58070 -184345 -467164 -744222 -591222 -955021 -861010 -945110 -9755
190 -9755 -321304 476266 -354123 -651903 202931 -26960 -667453 -837420 -496894 -58400
180 -58400 309327 -806565 -460646 -433036 -1016023 -586380 -471727 -1025419 -1678133 -331520
170 -331520 -182480 -1247163 -994211 -901266 -1310378 -1073926 -452083 404934 -761986 -1118010
160 -1118010 -637108 -941919 -1207792 -546452 63633 -194717 -886813 -424545 -824719 -12581
150 -12581 196923 -610343 -609097 -37866 116215 -1186010 -816414 -246099 -894266 -1058153
$$ packed form
220a1207q08142l06307Q79857o60588j88718o26989N37594J11529k86742J347832
210a1881Q14022p65860k27749K76470J26226m27038O26500m30012k27519n74841
200h21682O14344J49268j26275k82819k77058J53000l63799R4011q4100R35355
190i755l11549P97570q30389k97780Q54834k29891o40493j69967L40526M38494
180e8400L67727j115892L45919K7610n82987M29643J14653n53692o52714J346613
170c31520J49040j064683K52952R2945m09112K36452O21843Q57017j166920l56024
160a118010M80902l04811k65873O61340O10085k58350o92096M62268m00174Q12138
150a2581K09504q07266J246N71231J54081j302225L69596N70315o48167j63887
$$ plain form
140 -1058153 -602829 -270212 -329714 -984347 -646090 -575909 -479501 -355001 -696743 -1030613
130 -1030613 -1035772 -680528 -776081 -181376 -447871 -164149 -159761 -735746 -135284 -176420 -283976
119 -283976 -648162 -688869 -653203 -32609 -1079160 -1201390 -492205 -633797 -946399 -196554
109 -196554 50208 -924378 -698740 -390058 -2202 -41016 -294627 -1064037 -1038884 -874909
99 -874909 -822236 -1025119 -1083779 -762739 -859344 -1071528 -452904 -59209 519055 268573 -810565
88 -810565 -1146999 -978961 -1309328 -1034353 -239506 36574 -430655 -712150 -617618 -689470
78 -689470 -989668 -951330 -419925 -430031 -607451 -1008542 -903552 -598941 19189 216852
68 216852 -442849 -626309 -70181 -232512 -288235 -933984 -1369165 -850762 215741 192109
$$ packed form
140a058153M55324L32617n9502o54633L38257P0181R6408J24500l41742l33870
130a030613n159L55244r5553N94705k66495K83722M388n75985O00462m1136j07556
119b83976l64186m0707L5666O20594j046551j22230P09185j41592l12602P49845
109a96554K46762r74586K25638L08682L87856l8814k53611p69410K5153J63975
99h74909N2673k02883n8660L21040r6605k12184O18624L93695N78264k50482j079138
88h10565l36434J68038l30367K74975P94847K76080m67229k81495R4532p1852
78f89470l00198L8338N31405j0106j77420m01091J04990L04611O18130J97663
68B16852o59701j83460N56128j62331n5723o45749m35181N18403J066503k3632
$$ plain form
58 192109 -731561 -952483 -879331 -633916 -411982 -574820 -1010337 -1131029 -543361 -707562
48 -707562 4322 444617 73424 -9926 -553409 341965 -310756 -1006626 -778958 -584731
38 -584731 -358241 -401656 -1013915 -573644 -379408 -347332 -617703 -1274741 -732996 -545029
28 -545029 -741773 -751404 -1100261 -668369 -317335 -684544 -1024018 -777274 16051 -359811
18 -359811 -696221 30259 478498 -661835 -527876 -638581 -844675 -517599 -1147412 -1288283
8 -1288283 -853105 -1133269 -740655 160056 174018 -314832 -1257351 -1298517
0 -1298517
$$ packed form
58A92109r23670k20922P3152K45415K21934j62838m35517j20692N87668j64201
48g07562P11884M40295l71193q3350n43483Q95374o52721o95870K27668J94227
38e84731K26490m3415o12259M40271J94236L2076k70371o57038N41745J87967
28e45029j96744r631l48857M31892L51034l67209l39474K46744P93325l75862
18c59811l36410P26480M48239j140333J33959j10705k06094L27076o29813j40871
8a288283M35178k80164L92614R00711J3962m88850r42519m1166
0a298517
$$ Imaginary data points
##PAGE= N=2
##DATA TABLE= (X++(I..I)), XYDATA
$$ plain form
16383 -5442732 -5459688 -6080805 -5944717 -5862299 -5624958 -5868063 -5565539 -5441060 -5119716 -4865729
16373 -4865729 -4719274 -5284984 -5223671 -4626207 -4350655 -4644592 -4275186 -4728872 -4240029 -3738174
16363 -3738174 -3793543 -3645148 -4201349 -4327149 -4404177 -4567078 -3266143 -3499651 -3729207 -3772493
16353 -3772493 -4066495 -4295262 -3925769 -3753321 -3949356 -3745995 -3268369 -2648433 -2294976
16344 -2294976 -1531485 -1742222 -2769736 -3516231 -2881127 -2998199 -3105721 -2594930 -1952626
16335 -1952626 -1853505 -1797036 -1772129 -1728610 -1701218 -1720379 -1690858 -916622 -1119782 -1574304 -957669
16324 -957669 -843087 -842736 -1592455 -2474166 -2450180 -1600508 -1608089 -1902807 -983688 -862909 -557313
16313 -557313 -1222183 -1115200 -1051724 -1017012 -583055 196454 112090 -122700 -725715 -185017
$$ packed form
16383e442732j6956o21117J36088Q2418K37341k43105L02524J24479L21344K53987
16373d865729J46455n65710O1313N97464K75552k93937L69406m53686M88843N01855
16363c738174n5369J48395n56201j25800p7028j62901J300935k33508k29556m3286
16353c772493k94002k28767L69493J72448j96035K03361M77626O19936L53457
16344b294976P63491k10737j027514p46495O35104j17072j07522N10791O42304
16335a952626R9121N6469K4907M3519K7392j9161K9521P74236k03160m54522O16635
16324i57669J14582L51p49719q81711K3986Q49672p581k94718R19119J20779L05596
16313e57313o64870J06983O3476L4712M33957P79509q4364k34790o03015N40698
$$ plain form
16303 -185017 582605 735064 175937 654790 607289 -120164 162681 331240 -134802 -503438
16293 -503438 81067 793047 1136362 974599 484168 627044 646584 453343 785989 788981
16283 788981 1536805 778015 130252 1117040 1707254 2008011 1484516 1727109 1762952 1085465
16273 1085465 1241809 1387472 2121625 2384231 2478019 2511849 2570334 2774813 2599079 2821395
16263 2821395 2977314 2737268 3046218 2414114 2272493 2419539 2404352 3082782 2410608 2477259
$$ packed form
16303a85017P67622J52459n59127M78853m7501p27453K82845J68559m66042l68636
16293e03438N84505P11980L43315j61763m90431J42876J9540j93241L32646K992
16283G88981P47824p58790o47763R86788N90214L00757n23495K42593L5843o77487
16273A085465J56344J45663P34153K62606R3788L3830N8485K04479j75734K22316
16263B821395J55919k40046L08950o32104j41621J47046j5187O78430o72174O6651
$$ [...]
##END NTUPLES=NMR SPECTRUM
##END=
