##TITLE=1H_CA-8887-1
 CDCl3, 8 sc, 
 30.06.2021
##JCAMPDX= 6.0         $$ Bruker NMR JCAMP-DX V2.0
##DATA TYPE= NMR SPECTRUM
##DATA CLASS= NTUPLES
##ORIGIN= UXNMR, Bruker Analytische Messtechnik GmbH
##OWNER= root
$$ XWIN-NMR		Version 3.5
$$ Wed Jun 30 09:18:42 2021 Russian Standard Time (UT+4h)  she@DPX200
##.OBSERVE FREQUENCY= 200.131506
##.OBSERVE NUCLEUS= ^1H
##.ACQUISITION MODE= SIMULTANEOUS
##.ACQUISITION SCHEME= undefined
##.AVERAGES= 8
##.DIGITISER RES= 18
##SPECTROMETER/DATA SYSTEM= spect
##.PULSE SEQUENCE= zg30
##.SOLVENT NAME= CDCl3
##.SHIFT REFERENCE= (INTERNAL, CDCl3, 0, 17.5167)
##AUDIT TRAIL= $$ (NUMBER, WHEN, WHO, WHERE, WHAT)
$$ ##TITLE= Audit trail, XWIN-NMR		Version 3.5
$$ ##JCAMPDX= 5.01
$$ ##ORIGIN= Bruker BioSpin GmbH
$$ ##OWNER= she
$$ F:/spectra/data/she/nmr/H-F/1/pdata/1/auditp.txt
$$ ##AUDIT TRAIL=  $$ (NUMBER, WHEN, WHO, WHERE, WHAT)
(   1,<2021-06-30 09:17:17.35 +0400>,<she>,<DPX200>,
      <created by zg, POWCHK disabled, PULCHK disabled
       configuration hash MD5:
       00 E9 B6 7A A2 85 ED C7 34 08 36 98 17 FE 4E 26
       data hash MD5: 16K
       C9 AF C3 33 13 B3 11 1C 06 E9 B2 20 E7 4D 3D 81>)
(   2,<2021-06-30 09:17:19.96 +0400>,<she>,<DPX200>,
      <Start of raw data processing
       efp BC_mod = 2 LB = 0.24 FT_mod = 6 PKNL = 1 PHC0 = -11918.85 PHC1 = 11.60101 SI = 16K 
       data hash MD5: 16K
       CD 90 FD E0 05 35 D6 20 FB F4 7B B1 FA 6A B7 8B>)
(   3,<2021-06-30 09:17:38.70 +0400>,<she>,<DPX200>,
      <pk PHC0 = 2.025079 PHC1 = 0 
       data hash MD5: 16K
       57 CC DF DD B1 12 06 8A B7 69 04 2F 4D 40 62 5E>)
(   4,<2021-06-30 09:17:42.59 +0400>,<she>,<DPX200>,
      <abs ABSG = 5 
       data hash MD5: 16K
       45 8F A7 09 52 52 92 93 57 35 10 C4 CB 87 41 4E>)
$$ ##END=
$$ 
$$ hash MD5
$$ AA F5 79 55 DD 97 61 1E 1A 93 F9 2C CC 9D FB E8
##$RELAX= 
##$RELAX= 
##$RELAX= 
##$RELAX= 
##$RELAX= 
##$RELAX= 
$$ Bruker specific parameters
$$ --------------------------
##$DU= <F:/spectra>
##$EXPNO= 1
##$NAME= <H-F>
##$PROCNO= 1
##$TYPE= <nmr>
##$USER= <she>
##$AMP= (0..31)
100 100 100 100 100 100 100 100 100 100 100 100 100 100 100 100 100 100 
100 100 100 100 100 100 100 100 100 100 100 100 100 100 
##$AQSEQ= 0
##$AQ_mod= 1
##$AUNM= <au_zg>
##$AUTOPOS= <>
##$BF1= 200.13
##$BF2= 200.13
##$BF3= 200.13
##$BF4= 200.13
##$BF5= 200.13
##$BF6= 200.13
##$BF7= 200.13
##$BF8= 200.13
##$BYTORDA= 1
##$CFDGTYP= 0
##$CFRGTYP= 5
##$CHEMSTR= <none>
##$CNST= (0..31)
1 1 145 1 1 1 1 1 1 1 1 1 1 1 1 1 1 1 1 1 1 1 1 1 1 1 1 1 1 1 1 1 
##$CPDPRG= <>
##$CPDPRG1= <>
##$CPDPRG2= <>
##$CPDPRG3= <>
##$CPDPRG4= <mlev>
##$CPDPRG5= <mlev>
##$CPDPRG6= <mlev>
##$CPDPRG7= <mlev>
##$CPDPRG8= <mlev>
##$CPDPRGB= <>
##$CPDPRGT= <>
##$D= (0..31)
0 1.2 0 0 0 0 0 0 0 0.06 0 0.03 0 0 0 0 0.0002 0 0 0 0 0 0 0 0 0 0 0 0 
0 0 0 
##$DATE= 1625030236
##$DBL= (0..7)
120 120 120 120 120 120 120 120 
##$DBP= (0..7)
150 150 150 150 150 150 150 150 
##$DBP07= 0
##$DBPNAM0= <>
##$DBPNAM1= <>
##$DBPNAM2= <>
##$DBPNAM3= <>
##$DBPNAM4= <>
$$ [...]
##$SUBNAM3= <"">
##$SUBNAM4= <"">
##$SUBNAM5= <"">
##$SUBNAM6= <"">
##$SUBNAM7= <"">
##$SUBNAM8= <"">
##$SUBNAM9= <"">
##$SW= 20.0188882624521
##$SWIBOX= (0..15)
0 0 2 0 0 0 0 0 0 0 0 0 0 0 0 0 
##$SW_h= 4006.41025641026
##$TD= 16384
##$TD0= 1
##$TE= 0
##$TE2= 300
##$TE3= 300
##$TEG= 300
##$TL= (0..7)
0 120 120 120 120 120 120 120 
##$TP= (0..7)
150 150 150 150 150 150 150 150 
##$TP07= 0
##$TPNAME0= <>
##$TPNAME1= <>
##$TPNAME2= <>
##$TPNAME3= <>
##$TPNAME4= <>
##$TPNAME5= <>
##$TPNAME6= <>
##$TPNAME7= <>
##$TPOAL= (0..7)
0.5 0.5 0.5 0.5 0.5 0.5 0.5 0.5 
##$TPOFFS= (0..7)
0 0 0 0 0 0 0 0 
##$TUNHIN= 0
##$TUNHOUT= 0
##$TUNXOUT= 0
##$USERA1= <user>
##$USERA2= <user>
##$USERA3= <user>
##$USERA4= <user>
##$USERA5= <user>
##$V9= 5
##$VALIST= <valist>
##$VCLIST= <CCCCCCCCCCCCCCC>
##$VD= 0
##$VDLIST= <DDDDDDDDDDDDDDD>
##$VPLIST= <PPPPPPPPPPPPPPP>
##$VTLIST= <TTTTTTTTTTTTTTT>
##$WBST= 1024
##$WBSW= 4
##$XGAIN= (0..3)
0 0 0 0 
##$XL= 0
##$YL= 0
##$YMAX_a= 703246
##$YMIN_a= -850323
##$ZGOPTNS= <>
##$ZL1= 120
##$ZL2= 120
##$ZL3= 120
##$ZL4= 120
##$ABSF1= 17.51666
##$ABSF2= -2.502378
##$ABSG= 5
##$ABSL= 3
##$ALPHA= 0
##$AQORDER= 0
##$ASSFAC= 0
##$ASSFACI= 0
##$ASSFACX= 0
##$ASSWID= 0
##$AUNMP= <proc_1d>
##$AZFE= 0.1
##$AZFW= 0.1
##$BCFW= 0
##$BC_mod= 2
##$BYTORDP= 0
##$COROFFS= 0
##$CY= -3
##$DATMOD= 1
##$DC= 0
##$DFILT= <>
##$DTYPP= 0
##$F1P= 0
##$F2P= 0
##$FCOR= 1
##$FTSIZE= 16384
##$FT_mod= 6
##$GAMMA= 0
##$GB= 0
##$INTBC= 1
##$INTSCL= 1.334414e-10
##$ISEN= 128
##$LB= 0.24
##$LEV0= 0
##$LPBIN= 0
##$MAXI= 10000
##$MC2= 0
##$MEAN= 0
##$ME_mod= 0
##$MI= 1.114404
##$NCOEF= 0
##$NC_proc= -6
##$NLEV= 6
##$NOISF1= 3.799351
##$NOISF2= 2.8
##$NSP= 0
##$NTH_PI= 0
##$NZP= 0
##$OFFSET= 17.51666
##$PC= 1
##$PHC0= -11916.82
##$PHC1= 11.60101
##$PH_mod= 1
##$PKNL= yes
##$PPARMOD= 0
##$PSCAL= 0
##$PSIGN= 0
##$REVERSE= no
##$SF= 200.130003596064
##$SI= 16384
##$SIGF1= 3
##$SIGF2= 2
##$SINO= 5.538805
##$SIOLD= 16384
##$SREGLST= <1H.CDCl3>
##$SSB= 0
##$STSI= 16384
##$STSR= 0
##$SW_p= 4006.41025641026
##$SYMM= 0
##$S_DEV= 0
##$TDeff= 16384
##$TDoff= 0
##$TI= <>
##$TILT= no
##$TM1= 0
##$TM2= 0
##$TOPLEV= 0
##$USERP1= <user>
##$USERP2= <user>
##$USERP3= <user>
##$USERP4= <user>
##$USERP5= <user>
##$WDW= 1
##$XDIM= 16384
##$YMAX_p= 424455942
##$YMIN_p= -292815
$$ End of Bruker specific parameters
$$ ---------------------------------
##NTUPLES= NMR SPECTRUM
##VAR_NAME=  FREQUENCY,     SPECTRUM/REAL,   SPECTRUM/IMAG
##SYMBOL=    X,             R,               I
##VAR_TYPE=  INDEPENDENT,   DEPENDENT,       DEPENDENT
##VAR_FORM=  AFFN,          ASDF,            ASDF
##VAR_DIM=   16384,         16384,           16384
##UNITS=     HZ,            ARBITRARY UNITS, ARBITRARY UNITS
##FACTOR=    0.24454680195387, 1,            1
##FIRST=     3505.6093669423, 0,             0
##LAST=      -500.800889467964, 0,           0
##MIN=       -500.800889467964, -292815,     0
##MAX=       3505.6093669423, 424455942,     0
$$ Real data points
##PAGE= N=1
##DATA TABLE= (X++(R..R)), XYDATA
$$ [...]
7595 585172 667943 668703 745173 825727 683917 642468 792160 930847 899816 930966 944861
7584 944861 1019658 1116359 1204298 1329745 1370516 1444642 1402192 1142488 1074667 982477 966487
7573 966487 882311 895072 812618 736635 775224 719715 731606 717376 743823 696798 818786
7562 818786 769625 863895 836342 746539 729913 743014 585473 509578 683808 650413 714322
7551 714322 784740 697297 676266 656307 518041 525921 517570 571406 572529 539084 597745 510002
7539 510002 529919 493972 504781 496681 454699 526433 619311 494052 423810 499933 459639 402961
7527 402961 499591 528927 580508 567463 527061 444929 540692 725298 677943 547163 644300
7516 644300 534975 427048 467001 431728 492216 589642 583272 538883 569497 510341 580851
7505 580851 626358 563989 561354 549350 510720 587383 401277 447225 392298 440680 386653 409843
7493 409843 452669 404526 479963 447705 373184 441150 424276 514351 501940 510269 516396 497551
7481 497551 492657 412083 338930 439988 409488 374693 444303 423352 437241 340928 444909
7470 444909 477805 404930 415822 438075 433199 376613 370624 314001 338570 396828 341505 349952
7458 349952 406975 332713 309708 363059 406146 493984 430886 398999 420614 341814 459584
7447 459584 504349 512271 469132 374097 341797 439682 354107 321332 410882 449645 346829 319582
7435 319582 456009 561059 564382 523830 452272 413491 371308 463743 573254 534700 364800
7424 364800 449777 429713 473210 492792 402282 491163 439855 329462 347694 455436 508297
7413 508297 521914 440421 398109 426229 486751 428699 373095 406439 442619 426320 451284 366505
7401 366505 359995 460267 498064 464951 444507 269332 464409 504162 493469 493341 557401 463201
7389 463201 524918 494485 438126 481304 502301 450124 429183 394698 465986 513542 508763 538034
7377 538034 492988 534550 528821 451894 571185 517196 503588 534910 579760 511930 580499 456958
7365 456958 487395 597015 676777 627265 496081 446633 392720 492026 580779 561210 478527
7354 478527 515392 579150 605094 636046 621614 531336 525833 535307 545261 499337 514175 482075
7342 482075 525892 602963 518089 528499 601080 616531 591677 575518 593285 578784 575586 561735
7330 561735 578520 482631 543197 553242 561046 528702 491989 590579 613074 632716 621725 562214
7318 562214 553562 588237 555307 598742 736200 687987 622554 567789 598246 620586 601531 573782
7306 573782 706460 741027 719853 789355 697410 631998 571548 626262 720252 605824 648155
7295 648155 703186 759607 634785 585212 602968 679147 707176 747026 674565 620215 640283
7284 640283 687102 722480 647271 572396 564296 561371 662831 686387 611962 580683 728533 658808
7272 658808 691934 708361 713812 633387 728991 801158 731803 568794 696468 683814 724427
7261 724427 664368 719239 801073 746656 765934 682037 741828 703512 685871 723610 871906
7250 871906 835513 723646 824349 909909 899246 799692 802603 789444 831519 844338 920219
7239 920219 951984 761877 721020 852011 845770 800719 760072 700485 701335 785294 863119 762163
7227 762163 835063 791459 759739 786812 901987 860734 861001 742980 868322 888435 937743
7216 937743 947548 885142 870364 884935 962922 982558 929888 997140 904469 926101 842523 920277
7204 920277 847482 941003 990730 960271 1061687 1019184 1042747 1071718 903127 990875 1000184
7193 1000184 1040318 946124 1007520 1053931 994216 1041589 1102303 1048360 925268 878802 934220
7182 934220 1010976 923532 1074542 1036370 1051308 1077427 1135210 1211818 1199669 1169272 1240794
7171 1240794 1292753 1267517 1165877 1156665 1168865 1092581 1077000 1066896 1024523 1028298 1140455
7160 1140455 1170188 1292309 1205224 1132522 1146673 1027322 1012338 973532 944558 1040766 994510
7149 994510 1139146 1039271 1018120 1142996 1170969 1135945 1189557 1303338 1245073 1211273 1178800
7138 1178800 1212783 1127396 1127850 1045094 1111324 1058863 1077751 1135383 1132200 1093732 1163343 1163379 1318887
7125 1318887 1193333 1103600 1198448 1200055 1261396 1300607 1157451 1101930 1230425 1209517 1389183
7114 1389183 1406234 1267771 1355934 1260007 1165831 1189763 1330561 1284406 1172258 1315489 1341297
7103 1341297 1254603 1293333 1363968 1533826 1429405 1343662 1418191 1378739 1249431 1331339 1435071
7092 1435071 1442564 1416947 1352626 1372267 1439810 1381955 1368794 1310410 1334963 1307199 1384995 1356287
7080 1356287 1353973 1397696 1523254 1539739 1497637 1394156 1435996 1564915 1375147 1326302 1406986
7069 1406986 1370026 1390072 1344049 1357696 1373196 1406738 1425641 1431196 1477228 1448109 1467745 1495971
7057 1495971 1555788 1469270 1534617 1583023 1516799 1541413 1655025 1564758 1528895 1596726 1581643
7046 1581643 1463284 1469833 1475367 1597787 1704669 1652745 1701637 1722972 1656156 1667349 1638902
7035 1638902 1591899 1648307 1588038 1599015 1601950 1711727 1804611 1752472 1718527 1623599 1709882
7024 1709882 1763726 1571152 1582997 1707502 1610197 1834731 1872805 1838872 1863989 1827342 1795827
7013 1795827 1705918 1719785 1790916 1706356 1656263 1690212 1780996 1815753 1675511 1678539 1933970
7002 1933970 1827767 1925225 1907035 1959483 1885375 1809325 1747643 1876078 1818855 1815866 1872676
6991 1872676 1866448 1846926 1836441 1908352 2014188 1914666 2000856 2097485 1943732 1926678 1953907
6980 1953907 2002109 2021656 2031074 1917485 1948683 2098000 2206479 2132089 1896766 2019862 2081292
6969 2081292 2095956 2273148 2269813 2293490 2174846 2211675 2214878 2156427 2257132 2203714 2270708
6958 2270708 2397199 2289911 2181688 2219158 2270231 2195371 2249276 2307568 2395704 2343269 2361417
6947 2361417 2357846 2399522 2288186 2265796 2285423 2433598 2333684 2312939 2262183 2315325 2377911
6936 2377911 2341218 2365775 2342372 2401584 2445787 2454805 2474002 2440954 2594581 2592075 2398876
6925 2398876 2477344 2353100 2391336 2578044 2554085 2554942 2626429 2625464 2558682 2522127 2502866 2516803
6913 2516803 2469015 2539546 2542996 2519877 2519885 2602692 2604568 2704994 2666962 2676161 2708730 2655215 2678220
6900 2678220 2608824 2604398 2708429 2837682 2841483 2732835 2781459 2660483 2763717 2757974 2781547
6889 2781547 2882820 2831618 2844326 2940614 3005267 3005874 3045186 3215090 3291339 3241415 3240696 3330059
6877 3330059 3298602 3251122 3144383 3042827 3188374 3271328 3268533 3088023 3184422 3209715 3203492
6866 3203492 3134457 3101768 3184694 3246732 3223873 3203610 3133230 3015032 3054227 3265715 3265688 3299105
6854 3299105 3242729 3167667 3279341 3252095 3263651 3296923 3323753 3496719 3479547 3366376 3301950
6843 3301950 3395269 3393482 3428643 3385094 3345706 3361473 3366511 3416462 3390811 3379265 3473304 3425240
6831 3425240 3354058 3361935 3452317 3459012 3434648 3389934 3354311 3341891 3453276 3416383 3462136 3571251
6819 3571251 3570326 3548721 3616095 3631895 3675349 3740147 3800647 3823563 3815497 3799693 3775369 3849946
6807 3849946 3931383 3920890 3859172 3751524 3759375 3952814 4018699 3989645 4127877 3997596 3946266
6796 3946266 3988841 4101977 4088875 3896911 3962111 4002795 3971660 3905070 4067624 4145108 4129186
6785 4129186 4089454 4085629 4107957 4121653 4189402 4227461 4162970 4213778 4256488 4198775 4227738 4298769
6773 4298769 4246131 4297815 4345116 4396618 4421641 4384367 4359891 4372851 4367437 4485063 4517408
6762 4517408 4519239 4549206 4580385 4555747 4485300 4532893 4546347 4626943 4656897 4707570 4659823 4725210
6750 4725210 4926722 4904914 4819054 4738091 4825683 4745516 4771624 4851517 4858003 4869971 4979984
6739 4979984 4858171 4864124 5002692 5098233 5165525 5063112 5098534 5072219 4963585 5041414 5102752
6728 5102752 5099932 5113038 5223814 5213418 5187298 5174600 5263462 5289494 5266265 5330258 5341955
6717 5341955 5393761 5512762 5522322 5382676 5312130 5489086 5572983 5569022 5537754 5644466 5659243
6706 5659243 5637567 5547202 5639670 5495273 5518706 5578788 5561418 5766786 5841170 5819458 5768355
6695 5768355 5753470 5760435 5818701 5879187 5992387 5914714 5964868 6108909 6164527 6044277 6022171
6684 6022171 5917669 5971607 6034915 6091895 6107436 6091620 6057782 6052072 6077366 6222474 6439173
6673 6439173 6538543 6368237 6449687 6590948 6496767 6442566 6517060 6505329 6518859 6601664 6676941
6662 6676941 6674303 6666959 6719283 6787556 6738564 6783761 6750392 6812488 6871552 6924791 6917980 6832475
6650 6832475 6911049 6966283 6995380 7075750 7053515 7131997 7152662 7124083 7023911 7058749 7245427
6639 7245427 7358505 7412566 7451593 7452728 7459259 7480510 7491701 7521520 7486160 7572838 7646525 7627030
6627 7627030 7718927 7794772 7835084 7783294 7884620 7826439 7897271 8042151 8036706 7991850 8092668
6616 8092668 8225187 8159672 8283531 8278002 8345668 8296592 8380476 8431142 8517299 8600846 8677671
6605 8677671 8673516 8735731 8792471 8799136 8864130 9014185 9075295 9105597 9180622 9143076 9143061 9245616
6593 9245616 9339441 9416050 9628151 9775599 9983234 9977772 10003911 10117583 10165061 10302070 10490277
6582 10490277 10652583 10701578 10809819 10971690 11238439 11417574 11746466 11939218 12095597 12160800
6572 12160800 12034923 12014803 12007401 12081650 12181339 12172196 12246457 12417883 12483128 12549338 12666930
6561 12666930 12830130 13030426 13209655 13389094 13466998 13689086 13788238 14027367 14158239 14478173
6551 14478173 14761041 15037223 15439610 15752332 16058480 16474744 16847965 17332069 17740256
6542 17740256 18234764 18791263 19246393 19871004 20596618 21455549 22418396 23556237 24852460
6533 24852460 26457448 28289103 30453689 32848985 35406880 38436319 42083899 46329110
6525 46329110 51400921 57137250 63163843 68726713 72550241 73658800 71735517 67378377
6517 67378377 61954231 56565113 51832274 48118926 45359018 43148477 41562616 40317742
6509 40317742 39250486 38250241 37248969 36046182 34858776 33528230 32090063 30283751
6501 30283751 28336875 26652661 25010402 23643088 22614260 21634647 20749007 20103454 19623381
6492 19623381 19098375 18708698 18411286 17962460 17511962 17207898 16875047 16517695 16178162
6483 16178162 16026498 15863274 15620318 15307386 15082290 14778247 14524192 14165638 13929333
6474 13929333 13652685 13437420 13260076 13057840 12919287 12678123 12617781 12578060 12487129 12381667
6464 12381667 12221932 11943341 11872198 11838029 11800487 11806831 11747685 11621334 11624040 11514809 11552000
6453 11552000 11599822 11467194 11488146 11458143 11309251 11206210 11153918 11139217 11063112 10980419 10930336
6442 10930336 10827660 10814204 10749576 10711314 10640799 10567475 10603804 10420844 10376202 10429298 10497280
6431 10497280 10489853 10380835 10361545 10187502 10240665 10181652 10152871 10163480 9980737 9979357 9980626
6420 9980626 10069867 10014793 9972812 10031158 9962886 9929626 9879061 9851394 9732202 9785399 9961040
6409 9961040 9903922 9835118 9837938 9877419 9792839 9719989 9703955 9724318 9707897 9675382 9684345 9740120
6397 9740120 9752470 9741461 9727086 9619086 9659974 9693199 9704201 9702202 9674192 9672632 9696288 9620087
6385 9620087 9558264 9695934 9670037 9601816 9617425 9561324 9531257 9559166 9478418 9491508 9459379
6374 9459379 9597454 9564272 9566027 9655294 9774511 9741224 9748682 9773662 9749841 9709641 9775165
6363 9775165 9764078 9822487 9787622 9839270 9956928 9974194 10061198 10107103 10292622 10445902 10575343
6352 10575343 10904868 11175199 11417979 11628283 11978371 12171904 12254322 12461912 12562186 12456897
6342 12456897 12186084 11977993 11796418 11406356 11094512 10852335 10645356 10477266 10363091
6333 10363091 10321224 10135652 10107455 10055400 10095712 10020611 10019483 9912812 9832447 9920428 9953596
6322 9953596 10015325 9965829 10026414 10005954 9962675 10007752 10054814 10099977 10061405 10282388 10290484
6311 10290484 10368765 10368296 10250757 10117235 10172159 10128439 10067554 10036721 9935851 9952455 10008169
6300 10008169 9786981 9686545 9546761 9460140 9293772 9200345 9079739 9026526 8970080 8950051
6290 8950051 8845470 8794006 8677150 8574086 8521222 8536704 8579571 8358008 8301352 8321310 8292901
6279 8292901 8211743 8242400 8214806 8165510 8186762 8058606 8014908 8008435 8025100 7967994 7807958
6268 7807958 7713547 7686359 7722439 7725002 7659473 7694181 7736109 7560507 7500958 7648366 7524318
6257 7524318 7397588 7396576 7300125 7357613 7425987 7422912 7369613 7389131 7305449 7328983 7257596 7210570
6245 7210570 7223371 7081973 6973555 7077502 7155745 7192721 7101923 7040162 6969635 6962197 6941749
6234 6941749 7001858 7022476 6937959 6898582 6970894 6942407 6853432 6815324 6815799 6722313 6753764 6683182
6222 6683182 6722611 6846728 6766613 6707003 6674367 6630756 6709296 6603865 6582890 6659443 6645008
6211 6645008 6575492 6688653 6504167 6512909 6538476 6645161 6524718 6363945 6357429 6491346 6577877
6200 6577877 6559763 6539147 6481437 6507050 6578976 6532889 6394097 6421683 6358576 6306696 6308488
6189 6308488 6421500 6260263 6279194 6377226 6370363 6273959 6233698 6261299 6268050 6171401 6152701
6178 6152701 6054493 6218628 6172279 6188999 6075001 6078718 6115599 6207840 6193588 6195563 6139337
6167 6139337 6221026 6155939 6167602 6294168 6188880 6276781 6221295 6192347 6268232 6179517 6108155
6156 6108155 6043529 6076331 6131690 6051823 5917383 5935602 6053740 5986712 5965540 5924746 5944137
6145 5944137 5847587 5843041 5912631 5911267 5880684 5854108 5846404 5768390 5634770 5662919 5681165 5677240
6133 5677240 5668338 5655817 5606213 5618298 5537090 5465769 5400997 5505193 5470103 5527245 5592328
6122 5592328 5508857 5339080 5347752 5421350 5277097 5328785 5408020 5265313 5240569 5322424 5307394
6111 5307394 5352680 5380669 5375808 5345533 5288377 5253876 5171395 5172676 5289999 5245826 5201410 5205184
6099 5205184 5180417 5246599 5323012 5283149 5258796 5156710 5137416 5115069 5165941 5129082 5103932
6088 5103932 5121488 5071373 5209500 5197634 4983752 4969982 4981915 5034606 4974598 4983903 4931180
6077 4931180 4836147 4805852 4801412 4764674 4835911 4887946 4841695 4924819 4997364 4952723 4922219 4835843
6065 4835843 4731566 4809288 4887618 4940361 4971993 5032008 4950358 4900703 4928011 4784275 4725711
6054 4725711 4758888 4780917 4670662 4626956 4628206 4592006 4689754 4772968 4744878 4645380 4704520
6043 4704520 4737807 4791697 4816992 4826231 4840541 4813313 4660295 4632873 4689183 4734096 4710631
6032 4710631 4675906 4695191 4651595 4587115 4627480 4645530 4554520 4596465 4581322 4504721 4464594
6021 4464594 4534782 4507992 4488757 4543595 4632917 4442233 4353594 4490775 4420941 4435331 4471859
6010 4471859 4434060 4377440 4434094 4403753 4370130 4371699 4373474 4426379 4471184 4450964 4488638 4520379
5998 4520379 4499455 4474779 4393322 4389241 4415208 4376109 4376841 4424925 4453176 4386785 4385809 4367921
5986 4367921 4473347 4356637 4366300 4380415 4287351 4268124 4202377 4188972 4263981 4300379 4268024
5975 4268024 4231503 4251700 4243922 4263996 4185587 4183046 4252377 4285023 4264512 4252349 4283448 4200636
5963 4200636 4208575 4215616 4227626 4275961 4172306 4173978 4264970 4063335 4039359 4040373 4026944 4108174
5951 4108174 4077920 4043703 4197410 4108152 4098489 4139725 4030664 4048124 4106267 4098642 4050530
5940 4050530 4046411 4046511 4160524 4158734 4131580 4089369 4059466 4044866 4051094 4053806 4105983 4188410
5928 4188410 4065177 4065137 4041325 4012138 3982722 4037746 3876081 3851903 3903053 3963116 3878249 3920793
5916 3920793 3978875 3879211 3870814 3983332 3887795 3881644 3974879 3979463 3979988 3960909 3950841 3938222
5904 3938222 3896814 3782571 3757864 3903339 3929320 3893474 4019462 3919133 3840964 3854969 3773341
5893 3773341 3716914 3873019 3906941 3758766 3749067 3786563 3826833 3739630 3823629 3898783 3801036
5882 3801036 3762898 3611276 3555559 3649005 3628569 3637488 3679614 3651076 3707657 3726083 3739242
5871 3739242 3697339 3703666 3630976 3714602 3918392 3861142 3769724 3763152 3671713 3699402 3646120 3641323
5859 3641323 3548392 3630058 3747312 3853271 3670423 3615776 3714435 3669352 3623772 3651613 3601754
5848 3601754 3628252 3568248 3696784 3722877 3747486 3776709 3775371 3828178 3747903 3603886 3503747
5837 3503747 3624783 3557814 3673257 3782173 3719325 3755284 3792218 3755793 3669695 3640975 3689813
5826 3689813 3709029 3743057 3659921 3629844 3658312 3633565 3668871 3766717 3857510 3784566 3737846
5815 3737846 3799579 3748171 3728146 3705023 3743109 3774314 3849363 3783590 3726205 3707777 3667290
5804 3667290 3613051 3750450 3679357 3742311 3788226 3680979 3704559 3742785 3708601 3601791 3658555
5793 3658555 3710281 3515509 3574437 3640158 3689501 3767205 3708734 3639555 3749770 3738274 3771168
5782 3771168 3659957 3679155 3624418 3697635 3694564 3632876 3717651 3621857 3648627 3730431 3612973
5771 3612973 3631416 3693615 3659827 3586723 3653577 3679152 3591812 3547525 3558942 3600152 3481148
5760 3481148 3579560 3557340 3594645 3603772 3623604 3584034 3626133 3549713 3495913 3437884 3366632 3473903
5748 3473903 3521296 3508630 3414486 3313773 3448533 3591055 3607071 3494474 3583645 3471111
5738 3471111 3402532 3447644 3648861 3597771 3552170 3509106 3426328 3435347 3502908 3436121 3413489
5727 3413489 3467535 3515521 3594191 3538814 3530543 3485566 3636277 3618155 3443055 3546729 3510352
5716 3510352 3511759 3559325 3522633 3478458 3535030 3497567 3518667 3538225 3557742 3557454 3470879 3484093
5704 3484093 3548236 3627564 3584667 3590075 3544312 3514013 3529636 3443363 3457186 3550728 3543139 3590717
5692 3590717 3622245 3602023 3545402 3549875 3546252 3537394 3506447 3666298 3646922 3588599 3553018 3594500
5680 3594500 3673618 3600768 3496387 3461970 3522179 3638815 3721717 3645392 3515009 3554083 3631637
5669 3631637 3744945 3733656 3557853 3684335 3668008 3656111 3611087 3571805 3665286 3640083 3657309
5658 3657309 3792442 3776519 3803915 3801594 3889148 3923805 3809487 3914013 3924601 3889795 3867478
5647 3867478 3847744 3856549 3981984 3956528 4014954 4058056 4101564 4098277 4124560 4221621 4340143
5636 4340143 4316661 4387335 4481488 4642777 4563245 4492472 4594122 4695519 4762423 4755280 4672813
5625 4672813 4748360 4907458 5018994 5096828 5014683 5074158 5182791 5283159 5346558 5367985 5378138
5614 5378138 5376723 5519647 5583487 5676943 5698243 5691502 5914082 5936612 5940325 6057599 6081055
5603 6081055 6169579 6305343 6460090 6610806 6847230 7102661 7107915 7220214 7410767 7430525
5593 7430525 7375859 7468755 7518454 7494510 7424275 7409217 7386703 7422637 7488501 7542619 7503865
5582 7503865 7522776 7598399 7712935 7787967 7906598 8009372 8180799 8393169 8567921 8762329
5572 8762329 8852038 8980631 8951980 9028200 9064569 9056719 8944927 8700289 8607818 8468371 8434946
5561 8434946 8396277 8160691 8066138 7937465 7809274 7772852 7774660 7765516 7696633 7738549 7860877
5550 7860877 7898477 7913626 7972374 8037797 7941342 7883060 7811096 7701473 7779485 7738509 7618860
5539 7618860 7506879 7384468 7124418 6947234 6768097 6738637 6615104 6516216 6403653 6246230
5529 6246230 6121766 5992908 5899510 5878162 5868710 5852489 5725245 5681728 5773822 5773254 5701432
5518 5701432 5608461 5556358 5665684 5513988 5400792 5332498 5264794 5149067 5170422 5172140 5086261
5507 5086261 5000328 5094019 5047991 4951131 4864216 4788739 4852692 4891653 4939621 4737489 4675674
5496 4675674 4722524 4801682 4728086 4725342 4814588 4881046 4711653 4629310 4654950 4625153 4756643
5485 4756643 4812537 4850556 4770320 4726884 4706351 4699380 4753552 4700054 4821383 4761056 4676820
5474 4676820 4712814 4858689 4801842 4847635 4822272 4777682 4817923 4839930 4950944 5036703 5086945
5463 5086945 4970715 4881489 4863644 4840825 4979493 5131396 5198658 5117386 5150242 5282961 5292101
5452 5292101 5256423 5262558 5210271 5386216 5420412 5373858 5442890 5538626 5549612 5606745 5731881
5441 5731881 5562262 5635667 5706342 5767276 5965089 5973608 6077011 6143166 6237608 6390882 6600185
5430 6600185 6549703 6574412 6605464 6552354 6509881 6608686 6695772 6712908 6850151 6838003 6885076
5419 6885076 7039251 7203806 7414401 7488517 7615898 7852811 7938296 8056627 8196608 8357078
5409 8357078 8524428 8932775 9183769 9420683 9842489 10078997 10265180 10432812 10568730 10636454
5399 10636454 10628646 10612663 10453098 10394463 10399558 10366192 10252830 10280220 10219524 10274582 10231148
5388 10231148 10274454 10359333 10493176 10701456 10826405 10959614 11006669 11264058 11433042 11604671
5378 11604671 11827601 11975904 11984609 12121602 12333923 12516311 12785195 13037278 13098802 13412291
5368 13412291 13711384 13978075 14413553 14727470 15091412 15323061 15769535 16316621 16693893
5359 16693893 17109980 17672256 18159270 18633985 19164185 19933822 20574787 21240249 22068834
5350 22068834 22967553 23928933 25023890 26310746 27737162 29258101 30977867 32822860
5342 32822860 34848614 37121386 39316164 41646439 43936946 46178106 48142402 49789330
5334 49789330 51132822 52257530 53149233 53579926 53955976 54297715 54673447 55109426 56034913
5325 56034913 57215849 58775059 60645615 62941573 65803555 68923639 72435138 75715291
5317 75715291 78651536 81016101 82156385 81704669 79971919 77093319 73387632 69507539
5309 69507539 65656427 62040688 58966742 56111886 53817890 51790322 50097448 48658060
5301 48658060 47239464 46028954 44834233 43864772 43030701 42214064 41537254 41062993 40679808
5292 40679808 40434856 40170600 39915913 39721057 39572579 39429015 39061908 38756861 38493880
5283 38493880 38334935 38180418 37865961 37773743 37650909 37587314 37721365 37907204 38131786 38640897
5273 38640897 38856733 38969819 38865071 38690370 38486977 38203651 37947356 37531938 37282470
5264 37282470 36979592 36653196 36368617 36051612 35742066 35506860 35219908 34877262 34659473
5255 34659473 34299072 33785562 33386243 32936361 32228776 31561589 31089634 30505961 30007939
5246 30007939 29503045 29045221 28695257 28570612 28253599 27934695 27629270 27361620 27177244
5237 27177244 26839965 26440729 25885279 25253517 24815090 24367225 23776969 23113035 22726307
5228 22726307 22293101 21721662 21146182 20800121 20603468 20344403 19960408 19656693 19331921
5219 19331921 19029205 18724334 18416126 18211874 17795119 17421452 17099323 16813140 16412259
5210 16412259 16023653 15645130 15349129 15011495 14720968 14540614 14350516 14219613 13991351
5201 13991351 13740815 13669635 13349376 13109371 12913770 12780364 12561953 12287040 12271360 12060107
5191 12060107 11924261 11756133 11586846 11547108 11484053 11352629 11259970 11132752 10933433 10915157
5181 10915157 10814594 10718581 10705513 10546520 10286404 10196334 10228552 10152412 10117856 9988400
5171 9988400 9890705 9876712 9912922 9805986 9753329 9716828 9684889 9608913 9570213 9537183 9459151
5160 9459151 9407058 9326668 9314110 9242872 9213565 9111550 9019667 9022923 8955571 8885824 8836486
5149 8836486 8799804 8895889 8856208 8787059 8662925 8549651 8547921 8526065 8574571 8628446 8682116
5138 8682116 8519149 8488981 8434777 8407074 8522026 8442173 8374767 8323219 8411533 8313975 8294881
5127 8294881 8284729 8315586 8347971 8228635 8265479 8368190 8305144 8285827 8206407 8179959 8088290
5116 8088290 8181696 8035308 8051238 8116036 8002164 8001601 7937629 7925703 7957193 7949141 7935095 7956921
5104 7956921 7988423 7900347 7909483 7859684 7858985 7945632 8007192 7822315 7708372 7820800 7697974
5093 7697974 7682277 7623259 7529600 7559387 7629752 7672685 7595755 7681179 7709223 7484887 7488606
5082 7488606 7509390 7571053 7568408 7484996 7454677 7394174 7318234 7496694 7397531 7425432 7404416
5071 7404416 7326853 7217847 7334534 7353338 7276393 7430673 7429334 7470328 7451729 7319864 7374440
5060 7374440 7391959 7304411 7358572 7363698 7352652 7429931 7313084 7415175 7449113 7343669 7414747
5049 7414747 7516077 7585750 7481991 7656869 7779834 7778711 7920586 7889551 7958478 8055350 7983305
5038 7983305 7983207 8026555 8007784 7934929 7980801 7999116 8027876 8093999 8162734 8223935 8281200 8315997
5026 8315997 8357616 8337070 8326169 8412882 8506085 8623767 8633464 8502665 8484136 8584577 8608202
5015 8608202 8668545 8673033 8621406 8745295 8770856 8762538 8764561 8931397 9098613 9209702 9384654
5004 9384654 9625490 9889679 10012410 10323720 10561773 10836008 10969793 10940052 10841197 10656003
4994 10656003 10510753 10419077 10301676 10309288 10261593 10351984 10550698 10643569 10821226 10885443 11014395
4983 11014395 11207345 11437130 11690259 12149383 12298094 12256156 12439815 12504889 12463971 12223602
4973 12223602 11994597 11773825 11655916 11439682 11332650 11243255 11058348 11019041 11024471 10958002
4963 10958002 10909827 10766216 10733044 10809636 10861140 10847674 10743451 10753089 10710651 10712009 10771902
4952 10771902 10793564 10809290 10872717 10877539 10912650 10924729 11048142 10994968 10989497 11132655 11312662
4941 11312662 11405073 11546374 11557269 11513388 11781035 11816992 11778762 11804602 11847907 11933113 11957340
4930 11957340 11946402 11881922 11983271 12181623 12387186 12576218 12640704 12635149 13047062 13429859
4920 13429859 13742728 13968679 14433918 14781672 15092991 15292082 15676535 15993159 16214747
4911 16214747 16458268 16601587 16791867 16961029 17129463 17197785 17370298 17431110 17614390 17887397
4901 17887397 17943870 18006114 18204828 18236217 18267421 18442123 18543226 18477530 18588956 18842662
4891 18842662 19091302 19345430 19579195 19935185 20229275 20592763 20931388 21119634 21279062
4882 21279062 21440414 21465647 21497350 21620995 21555730 21407071 21288810 21106331 20777128 20543764
4872 20543764 20242043 19956425 19415113 19151872 18699193 18191863 17785423 17489794 17072512
4863 17072512 16700420 16406535 15934075 15565121 15333763 15220463 15074618 14905367 14829491 14657039
4853 14657039 14514958 14479669 14402954 14272943 14189957 14076885 13931562 13814792 13476175 13160118
4843 13160118 12853772 12508575 12101445 11684470 11308055 10889163 10474702 10117082 9879448
4834 9879448 9612981 9409001 9175195 8840821 8591180 8355964 8280604 8011143 7719776 7562290
4824 7562290 7389025 7221143 7125763 6971687 6808481 6795375 6618161 6519912 6331341 6253670
4814 6253670 6185578 6232697 6228104 6212501 6112549 6013993 6024678 5994694 5825539 5711717 5720928
4803 5720928 5617439 5615161 5527154 5516238 5509238 5523391 5520489 5352563 5340143 5374436 5429469 5381142
4791 5381142 5378463 5466585 5400859 5427789 5442770 5548460 5578370 5683747 5644509 5706449 5750744
4780 5750744 5826667 5943421 6275289 6311701 6330331 6512487 6623967 6893046 7141553 7478812
4770 7478812 7630537 7848716 8173595 8638453 9106266 9446450 9869736 10336744 10711882 11021607
4760 11021607 11258045 11414337 11613268 11678439 11808121 11811731 11690542 11615269 11598465 11415363
4750 11415363 11383713 11407964 11292496 11244291 11227406 11445783 11488597 11514924 11735742 12022121
4740 12022121 12285796 12391476 12592553 12860744 13084974 13255850 13542619 13681560 13714855 13632956
4730 13632956 13626397 13662765 13609998 13515727 13315232 13265491 13150473 13047382 12806661 12682562
4720 12682562 12450214 12209170 11978363 11721087 11468768 11284079 11065508 10770588 10458525
4711 10458525 10374885 10253014 10108813 9976203 9992359 10085084 10006372 10038156 9982714 9945315 9972263
4700 9972263 10067314 10141164 10211797 10093488 9762135 9594336 9377518 9331954 9153123 8769123
4690 8769123 8521328 8124015 7757872 7473382 7256107 6867656 6600060 6498609 6317883 6087037
4680 6087037 5954380 5832429 5613945 5480419 5301713 5246029 5073950 4852599 4873893 4803743
4670 4803743 4815122 4699721 4667141 4536818 4413492 4423475 4446162 4439719 4483061 4402651 4391079
4659 4391079 4381898 4469245 4465449 4393863 4347618 4284573 4302049 4204879 4208122 4245850 4172061 4241011
4647 4241011 4278807 4237376 4264998 4265060 4352660 4368385 4324873 4237422 4278812 4345146 4286646 4235220
4635 4235220 4416347 4418086 4462067 4480888 4456968 4403490 4472048 4486143 4466525 4579166 4497111
4624 4497111 4509553 4639478 4886391 4958056 4879968 4926292 4979547 5007633 5000183 5084346 4991014
4613 4991014 4991124 5121453 5175180 5165971 5133922 5195308 5156088 5011912 4962238 4922180 4948070 4864530
4601 4864530 4904245 4946705 4854429 4763803 4686292 4591962 4496688 4519003 4352686 4386570 4444706
4590 4444706 4342292 4468757 4437837 4347487 4253197 4263389 4250414 4310812 4314240 4363299 4228455
4579 4228455 4258233 4231088 4205241 4164500 4128665 4189585 4233167 4313616 4356250 4296840 4276084
4568 4276084 4205338 4253044 4395256 4297328 4344777 4482270 4645149 4733481 4770579 4725119 4864244
4557 4864244 4995227 5053188 5048557 5167549 5136813 5169583 5129334 5218340 5163359 5243270 5243441 5192308
4545 5192308 5264893 5289837 5142224 5131183 5211009 5108842 5010156 4957175 4828433 4794733 4683898
4534 4683898 4621497 4605622 4573605 4632451 4700947 4611616 4532569 4461036 4393468 4382149 4271905
4523 4271905 4267621 4264794 4242705 4195749 4194195 4126994 4114721 4076336 3946709 4052136 4044701 4090845
4511 4090845 4084579 4004378 4193506 4155223 4077955 4046581 4167121 4190805 4221968 4334337 4423714
4500 4423714 4409198 4359897 4413635 4473850 4579114 4585961 4695759 4675903 4669326 4654804 4697909
4489 4697909 4696744 4725424 4822494 4856969 5001019 5028190 5045318 5072324 5282598 5318488 5338743
4478 5338743 5393399 5409414 5506202 5575560 5643092 5767683 5845540 5890297 5985357 6096501 6254369
4467 6254369 6306766 6435680 6608084 6692039 6820172 6963984 7068691 7171397 7388057 7630758
4457 7630758 7892630 8081582 8379985 8666871 8907399 9076062 9169325 9476744 9835486 10113508
4447 10113508 10543193 10973438 11496900 12194308 12727810 13355769 14219810 15442417 16788344
4438 16788344 18425717 20239420 22231461 24609925 27463741 30763761 35024283 40388589
4430 40388589 46739036 53920049 60760554 64589938 63817398 59092590 51519818 44025061
4422 44025061 37540682 32361999 28617787 25871553 23652129 22009410 20791222 19635104
4414 19635104 18490144 17639612 16944553 16482845 15966550 15632497 15360449 15136763 14887621
4405 14887621 14740946 14657000 14490117 14519787 14582099 14667806 14840787 15017098 15268005 15441389
4395 15441389 15686243 16182706 16454609 16980700 17472448 18149381 19126688 20311653 21632178
4386 21632178 23237718 25151204 27363908 30127478 33530118 37689584 42713170 48750987
4378 48750987 55323846 61501378 64538352 64318888 61220818 54830556 47660271 41141265
4370 41141265 35976544 31895471 28774971 26484511 24837718 23366583 22202527 21188394
4362 21188394 20476366 20001437 19542388 19167156 18791738 18614067 18406865 18316041 18453880 18540676
4352 18540676 18804996 19013364 19314918 19556811 19872798 20278865 20657365 21214998 21593881
4343 21593881 21802713 21900884 21740696 21596658 21398597 21124239 20931602 20767327 20702941 20812418
4333 20812418 20994170 21138595 21279347 21392819 21370229 21346255 21217630 20892929 20305927 19834463
4323 19834463 19467741 18893695 18490740 18069443 17857355 17523799 17313151 17284518 17249618 17201023
4313 17201023 17276122 17380981 17563387 17781724 18190971 18522715 19008964 19489451 20040394 20736824
4303 20736824 21523344 22443539 23296222 24367360 25479247 26590662 27678139 28844022 29885452
4294 29885452 30678293 31170416 31429041 31449250 31350469 30999980 30704904 30463879 30154871 30047468
4284 30047468 29930590 29849733 29821095 29749924 29545003 29109085 28522523 27647390 26611339 25610458
4274 25610458 24414214 23377959 22379562 21397506 20695775 19950793 19246971 18699185 18250675
4265 18250675 17778829 17355966 17291446 17044553 16704775 16516146 16418767 16449637 16358384 16453450
4255 16453450 16611333 16723070 17028832 17421118 17814742 18359888 18830527 19553661 20337012
4246 20337012 21150047 22083152 22896656 23865831 24849572 25542408 26121230 26480437 26412869 26108299
4236 26108299 25502545 24725249 23955211 23047594 22201316 21687230 21361942 20857944 20534088
4227 20534088 20374341 20210472 20141033 20170701 20337029 20625235 20886920 21270091 21673583 22136319
4217 22136319 22688112 23337376 24140711 24975583 25815351 26748999 27716069 28599502 29232703
4208 29232703 29803511 30039570 29939960 29614730 28951276 28208739 27421816 26774612 26050427 25469564
4198 25469564 24995074 24587930 24162000 23896367 23713778 23750014 23668479 23439479 23220681 22858603
4188 22858603 22356683 21790642 21228591 20754004 20179722 19622732 19253694 18902128 18629390
4179 18629390 18286586 18021329 17898066 17805502 17775763 17856548 17878032 17724472 17843727 17983776
4169 17983776 18128168 18211380 18481767 18694058 18899036 18982773 19244881 19556938 19757410 19908756
4159 19908756 19912461 19924646 19544315 19009888 18639655 18225185 17738678 17178679 16714799 16189119
4149 16189119 15735442 15263627 15019528 14747243 14313226 14079767 13747129 13550772 13345499
4140 13345499 12957053 12650245 12459346 12122070 12026261 11838071 11820787 11764525 11719196 11643568
4130 11643568 11457944 11551303 11598620 11646013 11633818 11653466 11560199 11518841 11608557 11575323 11557326
4119 11557326 11433037 11304791 11339081 11310334 11127945 11179700 11250502 11107102 10931002 10851844
4109 10851844 10766164 10751047 10722069 10684792 10617080 10599502 10655281 10751248 10740255 10635233 10760700
4098 10760700 10911679 10851194 10962908 10894484 10974821 10873006 10930456 10865287 10852182 10847238 10746009
4087 10746009 10601790 10622286 10642106 10631183 10676162 10643134 10761777 10884214 10849555 10825655 10834245
4076 10834245 10965013 11069330 11182926 11439943 11498093 11512474 11427553 11417397 11274378 11230830
4066 11230830 11198863 11207556 11117149 11108155 11147336 11183167 11217330 11219018 11260014 11342698 11432443 11343917
4054 11343917 11254548 11328942 11300958 11342544 11331060 11300637 11411536 11398417 11526224 11619139 11723404
4043 11723404 11738225 11727910 11855911 12002882 12048886 12034778 12155806 12168261 12165086 12222245 12261808
4032 12261808 12333250 12430559 12444319 12637039 12894427 12991670 13276468 13489239 13507780 13652128
4022 13652128 13805646 14039773 14128690 14235803 14272249 14487080 14679544 14848807 14913208 15007275
4012 15007275 15087031 15288162 15421491 15446116 15414724 15615797 15838579 16053952 16274804 16466587
4002 16466587 16687836 16893543 17120342 17558433 18020090 18442442 18936830 19463180 19984199
3993 19984199 20581340 21257446 22050166 22984501 24050942 25297554 26758586 28547692 30383212
3984 30383212 32483774 35054890 37958407 41370782 45471796 50042365 54929153 59568527
3976 59568527 63151575 63846280 60978615 56121905 51057362 46031096 41620228 38077097
3968 38077097 35300694 33069630 31259610 29907338 28878903 28058331 27292794 26707823 26262764
3959 26262764 25837584 25437329 25047541 24646209 24399592 24275702 24176847 24089468 24052782 24086769
3949 24086769 24111834 24373497 24611065 24811596 25050996 25381239 25655901 25798576 26206434 26659930
3939 26659930 26928774 27367380 27888035 28448997 28975414 29558765 30192742 30822199 31233905
3930 31233905 31772968 32596657 33244799 33958562 34900157 35868787 36971692 38054916 39363678
3921 39363678 40894649 42573783 44365069 46311894 48535881 50784154 53171672 55580562
3913 55580562 57803160 59900201 61824938 63743054 65955020 68579351 71755790 75703632
3905 75703632 80643636 86396853 92984423 100699156 109760111 120433212 133137193 148088020
3897 148088020 165590408 185491789 206495906 226383987 240504755 244312493 237320172
3890 237320172 223747347 208673785 193996933 180547222 168086590 156108878 144844275
3883 144844275 134456864 125152818 116700275 109415269 103078467 97467067 92866210 88710000
3875 88710000 85002108 81798039 78915540 76379832 73877990 71058023 68206713 65729618
3867 65729618 63605601 61754172 60228314 58841916 57624653 56514462 55754118 55015444
3859 55015444 54326367 53898455 53614710 53489620 53469823 53378192 53385644 52993601 52436993 51615488
3849 51615488 50671532 49650435 48711535 47951980 47422595 47146630 46988986 47060914 47259127
3840 47259127 47691062 48278158 48799393 49465399 50334837 51359433 52555499 53892850 55318657
3831 55318657 56850512 58780038 60805424 63122909 65679749 68341806 70913199 74027404
3823 74027404 77590770 82239897 87972118 94667736 102365811 111589979 122743130 136239948
3815 136239948 152533833 172568863 195728988 221505381 245594908 262128458 260154941
3808 260154941 238856206 211733925 184083533 159757933 140033338 124556808 112511693
3801 112511693 103120942 95741072 89733775 84615084 80365836 76867435 73950301 71551091
3793 71551091 69363871 67475540 66024804 64973348 64348478 63981629 63892997 63806674 63503617
3784 63503617 62900379 61864912 60771051 59716873 58722787 57879755 57237785 56621046 56221182
3775 56221182 56052790 55925269 55957247 56039424 56201714 56585899 57123909 57677147 58428930 59149031
3765 59149031 59816445 60497550 61256853 61997918 62674588 63467452 64350205 65365115 66293191
3756 66293191 67348768 68520134 69740185 70663866 71342386 71686976 71502958 70790221 69593481
3747 69593481 68228947 66712526 65074840 63472666 62051724 60660996 59276071 57834523
3739 57834523 56473193 55114752 53587051 52032120 50497080 48910283 47303944 45708970
3731 45708970 44364351 42990281 41639497 40378573 39088545 38001411 36804089 35528305
3723 35528305 34280808 33044242 31963896 30782635 29543233 28675577 27570536 26483696
3715 26483696 25628371 24877830 24133951 23423609 22616557 21751093 21070224 20423673 19821945
3706 19821945 19319008 18647069 17987183 17536195 17148474 16758717 16166821 15628527 15242641
3697 15242641 14903617 14468480 14002475 13719079 13383739 13115126 12681095 12500089 12108598
3688 12108598 11901118 11774517 11533292 11410512 11223502 11065100 10800293 10580760 10286096
3679 10286096 10084251 9757131 9559511 9286606 9105785 8884537 8659441 8540708 8349984
3670 8349984 8105854 7945508 7747936 7555281 7453618 7431355 7218377 7105131 7060480 6929569
3660 6929569 6696694 6555279 6469610 6439503 6377162 6228363 6032077 6023337 5968821 5886162 5733689
3649 5733689 5694643 5690179 5716484 5693245 5506881 5556948 5496341 5485442 5507522 5440739 5375676
3638 5375676 5293179 5461230 5502206 5512865 5494609 5349775 5442731 5418988 5383707 5295063 5196257
3627 5196257 5070454 4844619 4768935 4767234 4745582 4610318 4396009 4356438 4244626 4324126 4279647
3616 4279647 4135312 4033502 3929152 3930856 3996735 4054136 4005466 3792776 3904768 3989019 3886976
3605 3886976 3774997 3843409 3874531 3897723 4014978 3984674 3951188 3944372 4057999 4218063 4295854
3594 4295854 4390163 4465805 4424579 4408135 4389951 4247869 4081342 3933544 3828954 3712288
3584 3712288 3534975 3375257 3447292 3322690 3244587 3280700 3279622 3141507 3069915 3109836 3036298
3573 3036298 3050893 2935057 2860703 2878461 2726524 2669925 2763577 2748114 2829295 2819501 2884339
3562 2884339 2883235 2823018 2736580 2576895 2660394 2682248 2695079 2781153 2802572 2863724 3012048
3551 3012048 3045410 3119355 3158737 3368886 3519873 3635820 3602947 3467763 3366157 3237766
3541 3237766 2961285 2904516 2858269 2765022 2748886 2683343 2760328 2728478 2667212 2573805 2623788
3530 2623788 2674417 2640215 2664162 2735962 2727564 2869564 2943938 2939021 2891993 2909570 2845597 2873928
3518 2873928 2720030 2691778 2785137 2763228 2714813 2611989 2522184 2561322 2723494 2744041 2526255
3507 2526255 2543592 2678514 2630851 2526278 2571333 2518927 2497693 2534785 2595700 2437056 2484617
3496 2484617 2546894 2544611 2584976 2635831 2614544 2515918 2685175 2646246 2601413 2687942 2647519
3485 2647519 2846108 2876330 2929558 2986366 3075743 3143011 3092818 3300567 3287225 3323817 3464289
3474 3464289 3633333 3703374 3769059 3915462 3923014 4035261 4120650 4194752 4294968 4353282 4289593
3463 4289593 4237400 4345566 4464594 4509832 4570970 4559788 4600021 4546440 4436279 4452239 4402182
3452 4402182 4284622 4183926 4081428 4099667 4034308 3999311 3967657 3743526 3616772 3652920
3442 3652920 3677603 3558539 3606368 3589506 3538521 3603610 3652122 3609834 3577771 3492464 3340226
3431 3340226 3302841 3353321 3416341 3383560 3408828 3513605 3348726 3432977 3467680 3549437 3550200
3420 3550200 3610010 3669892 3621949 3607397 3669142 3671879 3734754 3699781 3717138 3838912 3906886
3409 3906886 3797784 3965488 3933648 4058726 4126786 4161864 4251474 4229617 4254799 4458303 4384418
3398 4384418 4402797 4470498 4539145 4547828 4661059 4734396 4865002 5046347 5072322 5168654 5249226
3387 5249226 5283402 5345719 5502582 5479878 5556805 5854955 5916479 5941330 6091067 6238266 6324934
3376 6324934 6337293 6541963 6660815 6892486 7022735 7208726 7321090 7515619 7681685 7782615
3366 7782615 7938237 8094325 8161182 8352156 8403862 8451088 8352406 8465777 8505505 8567671 8638882
3355 8638882 8537117 8515293 8646833 8666710 8679002 8585652 8535262 8561911 8425842 8394645 8304749
3344 8304749 8220273 8211011 8152170 8231445 8089360 8009383 8059057 8069961 8086883 8208081 8239258
3333 8239258 8236659 8152449 8209380 8398815 8539673 8579327 8502242 8591404 8748278 8775105 8849485
3322 8849485 8988893 9146316 9245823 9351476 9365194 9530069 9715679 10008228 10197586 10327129
3312 10327129 10496035 10807334 11063699 11244523 11556331 11786564 12090872 12328119 12403872 12574617
3302 12574617 12908967 13176615 13277700 13434013 13519257 13589593 13725702 13809411 13942714 13980821
3292 13980821 14048382 14196289 14182568 14201823 14255401 14096409 14202163 14205508 14273469 14159135 14270180
3281 14270180 14231259 14285614 14314812 14403709 14409215 14390724 14439868 14580772 14729398 14816789 14887270
3270 14887270 14915420 15077790 15135803 15279675 15593442 15769489 15909526 16065221 16156593 16399600
3260 16399600 16563445 16855372 16892388 17145667 17380323 17642857 17897278 18045534 18407042 18724931
3250 18724931 19036569 19335857 19728720 20076420 20436428 20849930 21223212 21586743 21985233
3241 21985233 22391454 22779927 23240063 23778869 24199673 24643218 25017476 25351609 25686336
3232 25686336 26113639 26491301 26787987 27109621 27503398 27763040 28095468 28511134 28853700
3223 28853700 29260471 29697701 30147701 30702631 31151871 31674930 32121161 32597775 33147874
3214 33147874 33513135 34003070 34575974 35160848 35708646 36300764 36957170 37718775 38448120
3205 38448120 39301975 40220593 41225953 42243572 43383590 44692085 46142385 47574152
3197 47574152 49068091 50804949 52446929 54399845 56393260 58574299 60887340 63336336
3189 63336336 65957794 68430763 71155130 73727211 76128770 78538801 80736885 82599155
3181 82599155 84004173 85110749 85948533 86220241 86293940 86117872 85819989 85429037 84921748
3172 84921748 84416940 83764212 83048042 82011993 80779816 79221747 77365416 75215427 73029429
3163 73029429 70534146 67826982 65383302 62745314 60219940 57952158 55939622 54061399
3155 54061399 52356853 50862211 49493794 48310415 47396288 46596905 45918274 45336469 44754923
3146 44754923 44281000 43994015 43758988 43597603 43549688 43678050 43819597 43953728 44324807 44741764
3136 44741764 45092879 45506430 45829901 46396710 46945226 47545517 48253753 48989514 49855834
3127 49855834 50712988 51755303 52760050 53831621 55047873 56245127 57544579 58877746
3119 58877746 60129728 61397880 62670392 63834480 65013336 66098849 66936632 67851350
3111 67851350 68633444 69476593 70363709 71389780 72183786 73023386 73978263 75007951 75779762
3102 75779762 76464299 77343651 78142562 79039887 79704149 80491754 81421842 82322523 83232334
3093 83232334 84292764 85603161 86969034 88476174 89909056 91663660 93605129 95683550
3085 95683550 97929654 100284805 102741153 105442168 108518369 111598725 114814726 118343017
3077 118343017 122191914 126202840 130442961 135000346 139926018 145009777 150546999 156256682
3069 156256682 162319859 168539601 174731689 181008490 187068172 192887699 198384972 203260909
3061 203260909 207523452 211417186 214635872 217297026 219678572 221461393 223048359 224101677
3053 224101677 224936620 225324373 225453383 225159248 224600706 223530526 222116971 220415977 218292740
3044 218292740 216135870 213568229 210798605 207849875 205039177 202217164 199468470 196910417
3036 196910417 194523063 192287377 190187987 188336304 186725276 185203192 183981835 182925646
3028 182925646 182131750 181472828 180864305 180486801 180341144 180501729 180665896 180947707 181466460
3019 181466460 182014820 182722370 183448233 184280727 185205832 186209753 187167480 188036777 189019914
3010 189019914 189705572 190275188 190849867 190869208 190749771 190240109 189349977 188163015 186554618
3001 186554618 184473506 181959804 179128464 175800691 172240998 168400191 164358046 160278288
2993 160278288 156245837 152352527 148529823 144816199 141077063 137648646 134227580 130685904
2985 130685904 127255632 124071390 120931042 117868116 114863887 112165854 109475716 106890375
2977 106890375 104446267 102171542 100210656 98205885 96350128 94602126 92873997 91449962
2969 91449962 90023864 88566134 87357263 86327929 85552133 84859728 84444888 84179878 83981046
2960 83981046 83884757 84130344 84535787 85101760 85763068 86608994 87463640 88427803 89649508
2951 89649508 90828414 91830490 93001939 94315770 95475857 96632703 97646612 98889720
2943 98889720 100000263 101001149 101896459 102760945 103377171 104196846 104924952 105545536 106175481
2934 106175481 106741516 107515166 108353909 108990272 109704833 110292591 110650747 111029892 111108403
2925 111108403 111075887 110604193 109939044 109074402 107820467 106424424 104862076 103060843 101203946
2916 101203946 99280162 97406743 95581695 93894832 92252201 90988191 89857404 88848212
2908 88848212 87956540 87273820 86632601 86216057 85851347 85567943 85468379 85422848 85364669 85351447
2898 85351447 85511985 85531933 85483790 85225226 84793098 84187226 83278609 82112809 80770072
2889 80770072 79343510 77548683 75708464 73768937 71873677 69905560 67900341 66025128
2881 66025128 64097776 62344060 60645008 59115191 57689829 56307501 55123698 54058768
2873 54058768 53029933 52021029 51082105 50086046 49262470 48506048 47817469 47154758 46547981
2864 46547981 45889023 45442789 44916329 44427364 44014312 43733763 43510666 43385391 43264945
2855 43264945 43030040 42969888 42844970 42784621 42616179 42482882 42484388 42352247 42077173 41886470
2845 41886470 41459472 41245994 40802082 40328606 39875881 39166369 38503111 37911502 37109441
2836 37109441 36407554 35481621 34719190 33893757 33213311 32586059 31905040 31340555 30761844
2827 30761844 30294866 29828828 29396660 29108783 28831632 28489240 28235386 28100363 27815987
2818 27815987 27480084 27296786 27202559 27040090 26870537 26755231 26660689 26706182 26755607 26945557
2808 26945557 27160236 27326762 27615510 27983137 28445480 28963861 29435305 29998333 30703634
2799 30703634 31571214 32498712 33571263 34484239 34922735 34583310 33706628 32511377 31364241
2790 31364241 30510150 29762202 29097336 28546909 28087485 27840254 27550950 27399633 27297410
2781 27297410 27331304 27310595 27346102 27493343 27597537 27763204 27944385 28376828 28759258 29203845
2771 29203845 29657901 30162831 30788796 31435332 32199064 32968042 33583336 34330254 35125656
2762 35125656 35743650 36410678 36976273 37429114 37962248 38638138 39231969 39984943 40967768
2753 40967768 42050931 42992707 44119493 45529435 47052772 48624202 50191947 51928812
2745 51928812 53877104 55975895 57992458 59888487 61901604 63882255 66058130 68328723
2737 68328723 70806866 73196880 75596300 78019357 80313009 82513339 84817597 87365637
2729 87365637 89938511 92616830 95287149 98105638 100925814 103867141 107307611 111290753
2721 111290753 115683735 120564132 126090885 132375269 139617218 147850184 157187402 167823914
2713 167823914 179687868 193353538 208492691 225337246 243668278 263730333 285450903
2706 285450903 309026928 333986795 359365415 383818789 404863455 419152998 424455942
2699 424455942 420436554 409269326 394373185 378587813 364027614 351669036 342250424
2692 342250424 335162291 329860463 325506703 321054184 315329110 307451202 297146233 284793072
2684 284793072 271127489 257081722 243181692 229829819 217298496 205794105 195570429
2677 195570429 186047300 177353532 169400321 161555801 153952631 146402457 138856692 131580277
2669 131580277 124538834 117803174 111493291 105692355 100372701 95386639 90654919 86442585
2661 86442585 82546354 78868558 75692612 72543521 69709221 67090747 64473143 62113974
2653 62113974 59907767 58027304 56022814 54260578 52742609 51206012 49788424 48476254
2645 48476254 47187130 46119119 44865906 43734731 42785672 41803708 40860536 39838906 38828924
2636 38828924 37982006 37023929 36057242 35244389 34482261 33564958 32642940 31931719 31033800
2627 31033800 30187397 29419524 28649473 27827645 27126932 26394895 25718188 25114500 24579751
2618 24579751 24111512 23786439 23549064 23167437 22664921 22292049 21990793 21503412 20714416
2609 20714416 20055299 19387714 18764174 18073565 17435829 16895727 16572672 16165951 15697859
2600 15697859 15277847 14895663 14433419 14133603 13885386 13544551 13329091 12999044 12800691
2591 12800691 12507203 12183692 11900152 11596548 11525912 11276456 11059608 10928724 10796116 10553619
2581 10553619 10396077 10182316 9947456 9632247 9566923 9396358 9175491 9050820 8936084 8777365
2571 8777365 8619011 8633250 8436604 8212268 8072887 7968424 7775393 7685374 7634445 7548783
2561 7548783 7447095 7327920 7235829 7187616 7011229 6923610 6867445 6673078 6631166 6585651 6481079
2550 6481079 6437910 6270081 6241912 6160152 6093636 6105038 6018561 5908555 5887810 5791089 5748599
2539 5748599 5692548 5537245 5468162 5477126 5396452 5337081 5330226 5283519 5150121 5099517 5107248 4909162
2527 4909162 4854047 4889693 4762854 4675202 4553458 4465649 4459297 4324584 4388204 4350435 4220772
2516 4220772 4249089 4140935 4000418 3966077 3849271 3663590 3714818 3666203 3784326 3666007
2506 3666007 3682616 3639642 3656814 3616215 3458862 3510542 3428790 3326331 3335278 3260665 3313199
2495 3313199 3295168 3168400 3136932 3048558 3040382 3099928 3186778 3164994 3107212 3121117 3076332
2484 3076332 3035534 2958406 3095935 3006573 3024697 3026571 2984147 2955918 2842674 2789379 2870627
2473 2870627 2876550 2870486 2915801 2912477 2847710 2846214 2865841 2750045 2625701 2696351 2825307 2764074
2461 2764074 2799638 2931466 2894766 2782913 2849541 2968657 3140308 3180983 3280946 3365681 3421906
2450 3421906 3585535 3650925 3807252 3884621 3832236 3932772 3924122 3922885 3862316 3776114 3623292
2439 3623292 3459772 3245779 3176204 3257100 3237825 3251263 3254327 3099123 3065142 2902163 2873647
2428 2873647 2802450 2700771 2573971 2658247 2445298 2426092 2449328 2299966 2273890 2206958 2040550
2417 2040550 1929625 1915149 1992955 1927688 2000348 1999740 1874309 1838683 1807842 1764976 1693714
2406 1693714 1595357 1602612 1684854 1645716 1703427 1698119 1693914 1662804 1566701 1433382 1449697 1563358
2394 1563358 1472469 1368297 1429120 1347109 1249399 1233229 1184282 1310674 1353416 1349343 1332185
2383 1332185 1301349 1348757 1232164 1212161 1192110 1098766 1141600 1149857 1205861 1155904 1134519
2372 1134519 1073930 1036108 1093131 1064437 1054265 1037455 1032368 971474 1011142 993118 891454
2361 891454 892697 957742 921688 846040 819555 859929 839533 872068 894887 805655 777848 761190
2349 761190 798185 836504 810616 813779 780044 798828 749997 814559 791277 803927 797928 714109
2337 714109 743858 677611 550137 629729 611642 643710 710746 717051 728986 775620 692471 616393
2325 616393 642495 630210 644982 629687 510624 564597 606701 599399 608930 769634 736385 522217
2313 522217 507187 584516 502923 464792 552527 568004 570404 521467 474912 486554 444999 513438
2301 513438 536970 499843 548187 593796 645931 667536 587759 602701 509869 462844 511840 558536
2289 558536 630794 529844 544596 634835 690702 530224 511609 580062 650199 562824 544313
2278 544313 415538 435653 406685 415341 454287 483219 461842 487095 486158 392153 375414 408054
2266 408054 353335 273019 306821 375513 473363 441545 293270 330574 390827 365796 472384
2255 472384 419078 427767 348478 351124 343294 304931 449192 418988 301523 414977 324610 403428
2243 403428 466588 345920 224847 364421 399255 408528 310213 255985 258448 277150 264611
2232 264611 270168 197033 287111 448581 425413 323974 201460 249391 294083 381277 470710
2221 470710 409707 246106 240554 210666 320301 303405 353091 358398 367675 306174 313108 350334
2209 350334 335689 333160 393756 389996 401543 321476 330078 332707 159872 330205 446821 342251
2197 342251 210091 205605 240618 215126 270921 351755 326164 207893 121813 71085 208756
2186 208756 281241 255141 257522 262343 351195 336150 322168 332054 216358 206159 265645 323449
2174 323449 222480 231723 363794 303987 265538 339550 450116 431584 299932 342688 404800
2163 404800 350063 303834 331561 361245 324863 301048 278998 261380 351051 313798 464484
2152 464484 551924 407112 342695 371631 333465 384359 458334 474701 433677 350176 331659
2141 331659 377968 350016 364589 416114 360210 469603 529058 458656 431067 449003 531285
2130 531285 533941 490021 475525 475445 433479 567522 513022 421012 506445 618341 535142 539608
2118 539608 662655 639418 628892 601485 585786 718967 698963 761616 725259 676520 764267
2107 764267 718804 697314 727012 687794 702059 820440 723005 766074 740727 818803 978627
2096 978627 1154205 1086162 1038606 1029985 1173124 1183725 1201941 1247437 1216158 1284220 1396424
2085 1396424 1355794 1392550 1470227 1535770 1606411 1621760 1721165 1728635 1838825 2092208 2179245
2074 2179245 2257556 2270389 2423245 2550446 2531720 2775926 3037167 3237376 3481969 3760809
2064 3760809 4093274 4462608 4885480 5380193 5971320 6458035 7195790 8025995 9024003 10272722
2054 10272722 11896836 13874225 16460383 19571979 23405902 27193978 29970185 28031373
2046 28031373 23860076 20163205 16370810 13524733 11308565 9781742 8470399 7685164
2038 7685164 6973305 6384775 5887932 5595352 5302146 4908184 4467803 4067940 3634502 3439307
2028 3439307 3174933 2913305 2744278 2637003 2508166 2321021 2139730 2070006 1978875 1918460
2018 1918460 1747927 1741834 1688608 1652054 1487001 1335257 1359059 1354647 1338289 1236379 1361921
2007 1361921 1217572 1035657 1047549 1013457 981214 990330 966732 924029 883461 774209 801653
1996 801653 775707 891337 853442 754470 757685 702050 684483 722176 725431 641875 630670 562655
1984 562655 408511 546668 679532 574566 558828 595122 584270 485827 452772 443187 406785
1973 406785 483775 509492 590722 566072 450278 419655 376773 343712 292183 293145 282040 266813
1961 266813 294704 275135 363689 223347 204878 253436 308621 257421 268356 173755 158712
1950 158712 211357 170963 157082 167206 205085 167066 215759 118747 134364 193652 207124 246869
1938 246869 159908 217499 231381 182943 208218 152026 36348 92702 45789 58408 140761
1927 140761 132688 140842 219078 222189 106563 106670 118485 188597 142769 144208 100983 131474 111419
1914 111419 164262 109563 58628 230633 185993 78566 -2649 -72855 3934 88178 168847
1903 168847 132143 118270 -8770 -953 49303 -1894 32079 56126 62423 48852 -41699 -1266
1891 -1266 57745 40212 21806 152094 164699 152463 135418 28846 28918 73196 230978 238744
1879 238744 158715 148263 -2011 -65525 33654 50951 -43275 -81354 12537 14846 122091
1868 122091 95073 72492 89507 115654 62142 24924 101184 116190 39920 -71247 82858
1857 82858 14745 28921 50041 122177 74949 79781 -4205 81708 -13238 -113300 63819 99094
1845 99094 154367 97533 19636 22362 -3482 -35725 -11239 -4799 109829 1596 -39951 -44704
1833 -44704 23546 -2801 -4021 -3358 -62951 -2286 19095 34370 -89287 -10548 60856 69511
1821 69511 18696 40443 -62946 78910 117029 44354 18075 -114155 -46681 -1854 -66492
1810 -66492 -98158 98145 70160 95131 155343 179082 106174 137672 169702 129361 117599 59206
1798 59206 61261 69586 10329 -105850 -121014 -113476 -77478 -63123 43683 113511 -7942 -88980
1786 -88980 -39072 -15596 -51386 -60303 -93486 -127740 -2501 13549 448 53800 -26125 8383
1774 8383 35805 49294 -42200 -2901 -172181 -100000 28177 73894 54209 -65461 -103721
1763 -103721 -118905 -43108 9273 -24632 52057 64845 33010 33711 85519 52986 -52412 -53709
1751 -53709 -17550 -19021 -181164 -182137 12883 -101353 -86881 1327 -22179 -96555 -158813 -105970
1739 -105970 16727 97403 -34932 8492 -56160 -1133 130970 -117536 -117167 -16709 11
1728 11 -1437 39477 4766 -65576 -34203 99217 120787 -5452 -31252 -20043 -42132 -88545
1716 -88545 -105796 -107589 53863 -16648 -120067 -61943 -55689 -14086 -29556 -13199 -6806 7391
1704 7391 -69102 -31672 85240 -6688 96200 43881 -65880 -35517 31859 -13611 -49833
1693 -49833 -28886 -95192 -60047 120448 97066 28191 47197 96326 -3255 -68600 24673 -69391
1681 -69391 -30148 1325 -65637 -72912 -119775 -112981 -41810 -109666 -66142 -99343 -149868 -103108
1669 -103108 22485 43148 -81219 -41747 -40370 -111537 -41948 79280 -34534 -121005 -215673
1658 -215673 -173887 -49834 38235 -46969 77539 -91804 -159614 -117513 -183784 -266506 -178513
1647 -178513 -46829 -57866 -29272 -113100 -61194 -126132 -173599 -172161 -206512 -141215 -34347
1636 -34347 -17186 -5116 -154281 -140103 -127286 -63960 57645 30568 -12410 -69439 -102853
1625 -102853 -175398 -160974 -85838 -94367 -86697 24885 75953 88259 1865 58073 -25948 -29413
1613 -29413 -82891 -113160 -121394 -107142 -93286 -89813 -154714 -85639 -66415 -120366 -140086 -114706
1601 -114706 7285 12368 -117334 -45361 9076 -26906 52304 -128031 13318 14336 23042
1590 23042 -2075 -90300 -90212 7556 -41188 -90819 -13266 18619 -46793 -143009 -70906 -132718
1578 -132718 -234125 -69972 -121616 -42289 -24808 -65421 -142457 -93092 21611 -109689 -19878
1567 -19878 -106451 -180407 -75899 -63010 -123599 -100073 -33617 -126978 -135488 -147347 -156510 -83879
1555 -83879 -35762 -41101 -113728 -115342 -47886 -31796 -6622 -116312 -123193 -70785 -128224 -68735
1543 -68735 -59761 -52798 -5093 -153396 -223765 -142072 -186599 -269369 -165807 -8225 -30542 -230340
1531 -230340 -212054 -51283 -39732 8140 61461 37873 -23610 -30373 -89291 -141200 -87651 -37038
1519 -37038 -122602 -66469 -72764 23126 67500 75547 13454 -181087 -76104 -37237 -103738 11852
1507 11852 166466 71904 -50461 7300 48672 52529 3109 -44025 -25477 -59766 -94758 24591
1495 24591 41089 -50035 -33146 -66393 -87733 -133748 -19508 30362 -86794 -219308 -151735
1484 -151735 -192298 -158283 -45506 -78792 46214 -27346 -53343 -18222 -22075 -60423 -29892
1473 -29892 -79030 -92235 -93807 -56917 -138859 -182546 -135136 -133434 -27157 -70511 -81086 -40905
1461 -40905 -102765 -153903 -102458 -129775 -103586 -165697 -165002 -26599 20412 -8945 20429 67420
1449 67420 -35710 -52336 47957 13472 -55605 -138109 -53209 -70037 -51808 55919 -12473
1438 -12473 28150 101818 26348 -14915 154613 23259 64451 186418 33819 -3142 -65807
1427 -65807 -85769 -109794 -119652 -167292 -106024 -28181 -76225 -147179 -98730 -73327 35152 -123985
1415 -123985 -75711 -17445 -23984 17157 47273 43767 -39413 -117123 -178033 -86865 34098 32640
1403 32640 -48253 -35655 -121226 -64851 -111268 -129815 -149485 -94102 -106962 -89295 -71696 64547
1391 64547 68685 -12717 -30284 -71710 -93073 -99625 -73063 -37658 -22484 -60193 85054 68197
1379 68197 -61110 21822 -18991 -84961 -179350 -93965 -37109 -3067 -18807 -56026 -215157
1368 -215157 -116303 -73686 -35452 4557 -50354 -18714 -103169 -89321 1376 33236 32140 -5257
1356 -5257 18775 -119000 -134115 -62729 -32311 12466 -25499 -49343 -157097 -127405 -8966
1345 -8966 -49858 -82899 28105 74223 41998 -46075 -82159 -85083 -18323 91345 56134 144012
1333 144012 98395 8894 -39585 -27641 -74874 -134480 -34573 -55482 -77448 -146727 -59066 -119680
1321 -119680 -4578 -19266 -115008 -69962 -28060 -89541 -70731 -89734 -156387 -80959 -100012
1310 -100012 -21805 1057 -45028 -75694 -94846 -49246 44696 22131 -67317 29719 28969 96876
1298 96876 5569 23506 -36661 -17147 -9775 -13383 -81363 -105265 -36883 -183870 -229954 -145750
1286 -145750 -75891 81754 -5400 -18320 7581 -20250 25211 100176 103765 70419 50577 7190
1274 7190 36251 -25219 -29696 -94007 -109813 -130691 51027 212627 53423 11409 99682 -11574
1262 -11574 -68850 -6554 6764 56897 87606 70265 172290 68698 45366 74184 -32866
1251 -32866 80547 49429 -37299 -88465 12605 -134542 -120550 -118765 -171977 -85320 -115655
1240 -115655 -126777 16582 -89555 -125339 -62814 -39299 -81091 -62002 -64801 -61191 -55900 -105591
1228 -105591 -39207 -166828 -60899 15998 77540 34547 -157112 -229745 -193915 -135355 -82436
1217 -82436 -47534 -25183 -141466 -32950 -152079 -156838 -44420 -3908 39032 72915 -23699
1206 -23699 -37766 -55994 8868 25667 7619 31825 -46169 -77279 1447 -43774 -40551 -61190
1194 -61190 -6916 43572 -33323 8192 119327 95392 50295 103719 2244 -48095 -56060 18568
1182 18568 103332 111528 -28088 -74576 -112887 -124829 14934 -72968 -106451 -86544 -18989 -129241
1170 -129241 -84571 92870 91175 -58205 -55870 -107060 -88330 -9344 -31333 -50984 -91257 8318
1158 8318 -13994 34184 135262 74716 21914 -2568 -67306 -133589 -166011 -177229 -192918 -69224
1146 -69224 -10325 -103282 38970 43562 31438 61475 27082 79953 -31401 -84039 -86871 -185028
1134 -185028 -199265 -149941 -88182 79825 112923 -33920 -76604 -63834 -70560 -41805 -56557
1123 -56557 38917 68564 64358 17568 8068 -73657 -27033 40724 41922 74236 -3647 -86029
1111 -86029 -170450 -73609 -186777 -187702 -121417 -40040 -122892 -176118 5069 -48023 -27638 -104961
1099 -104961 -126075 -127141 59820 42365 -9662 -19467 75737 109282 30745 -114791 -78402 -52304
1087 -52304 -75722 45133 43794 -80840 -36407 -95443 -50852 -24664 8270 -60397 37173 -40417
1075 -40417 -83680 65475 12058 19363 -137958 -68115 -46905 -42141 -21456 20845 -66492 -42738
1063 -42738 -8087 -88830 -151454 -215417 -124482 -66097 22702 -26415 33417 -48759 -204395 -234820
1051 -234820 -213133 -110370 -73397 -2311 105504 102840 10420 -6120 -28838 -79675 48564
1040 48564 49326 18370 27839 33507 -16859 -56527 -66869 -163819 -13700 61278 25675 -15611
1028 -15611 9035 52584 -17477 -10474 34589 13317 -10489 -64690 -88852 -6588 87437 -61285
1016 -61285 -170392 -176948 -38774 22361 -36858 -82977 -33175 -88910 -77536 -70527 -49945 -43725
1004 -43725 -55858 -88304 -100926 -108465 -22629 50053 8104 -12025 -33642 -53083 34363 20263
992 20263 57340 46168 -82534 -103498 -69933 -65473 -27205 -3567 50914 40787 19763 22122
980 22122 19544 -43586 -55160 38024 20096 -45502 -11942 -1067 14747 66155 47818 66498
968 66498 91421 51411 -7497 -42598 9056 -35526 15141 46823 51761 -56844 -47512 22688
956 22688 -48557 5956 95727 56124 48313 49795 87923 56186 -34579 -71266 -36298 5561
944 5561 -2503 95087 -54980 -26907 41962 56535 -63158 -20201 35614 163871 98936 16374
932 16374 140190 207372 120948 63803 131019 180043 41308 47009 20707 -2256 52040 39064
920 39064 -612 -110862 -130885 -51494 -13666 76686 178894 72638 21878 -5188 78844
909 78844 7701 22621 76607 124654 129595 97253 104237 90094 3577 -19017 -62289 -25645
897 -25645 -11577 -19567 -47410 -98568 -76948 -23625 -24851 1019 31488 52691 5195 -35831
885 -35831 25480 12522 -9700 -104027 -84550 74389 15451 1021 -25718 -85828 -106505 -52485
873 -52485 9981 -63583 -43048 -101604 -154792 -86652 16949 -35559 -41139 -33376 -58263 21714
861 21714 165246 145260 107737 65276 50693 21261 159274 68330 1700 -21384 77737 128086
849 128086 100732 73549 115864 25514 54527 41850 173404 163706 98838 42153 -43975 -8674
837 -8674 -72799 20430 79024 -6232 -137486 -62604 56984 -58486 -107399 -130309 -81179 -91647
825 -91647 -77882 -26656 -59023 -3235 -14171 -8617 50070 88421 -58105 -58320 -52461 16168 91958
812 91958 23125 -23643 43806 -13665 -39594 -26900 -516 29094 59125 -86176 -76964 31955
800 31955 51228 -30588 -39146 3059 -91320 -186449 -103922 -65019 -28520 -28419 58701 40056 -24220
787 -24220 -31963 37682 59315 14643 61935 116727 172688 65388 4397 -65607 -126701 -22190
775 -22190 -13139 -17604 80711 57213 -100811 7540 39023 -3932 -57929 -86526 -95721 -102759
763 -102759 -25268 104030 142303 -29177 -145764 -94875 6849 40145 81526 45403 -69030
752 -69030 67181 172652 109664 -29470 -46088 -48716 -111154 -116345 -27157 -26003 -21747 41735
740 41735 -57007 -60246 18472 -71639 -22413 117423 18413 -20080 65845 20440 74149 31300
728 31300 -15929 -14536 -111274 -97211 -38662 -14758 -26127 -29398 -7374 -18940 61597 138848
716 138848 39620 -58306 28700 83659 62774 -42617 -59053 -5845 107426 48424 -92147
705 -92147 -40843 21581 -18555 -77790 26299 104818 107725 -25389 35506 60824 78856 81695
693 81695 43147 -1335 -53455 -40698 -37233 -62538 110781 109654 21829 -26684 46307 -14878
681 -14878 -31835 13848 120641 34933 104773 -36130 10355 86778 87601 -37139 -19660 25272
669 25272 28436 18504 52486 61981 -85705 -69513 -53482 -25494 32640 -27466 -19012 144465
657 144465 144842 47671 -26231 37580 -35377 -39410 117448 -33713 -70045 15292 -48433 19151
645 19151 5724 -53366 -71369 -45843 -59502 1770 -25629 -22160 -11598 67977 57189 70404
633 70404 159490 143073 108816 153343 -21847 169 22616 -9209 -33294 5145 40534 36938
621 36938 17241 38389 87651 78144 -23098 38729 49323 111666 98689 91831 133022 3920
609 3920 49077 105420 141059 131831 118566 157809 180167 72126 127362 94874 156417 114363
597 114363 29258 65692 47609 49741 10526 39325 -59814 -62556 63110 53401 -8209 59122
585 59122 5083 87582 214954 186538 186233 85664 -349 18795 7405 46607 86597 147630
573 147630 88144 117422 -41209 -81999 -52354 -71919 125677 91975 -4656 30842 50817
562 50817 61151 44359 -41062 29480 140750 114622 135861 106301 9880 -15634 -70199 -39429
550 -39429 47545 11753 -49594 9173 19290 22500 59513 79435 -50764 -71247 22043 39656
538 39656 75812 136523 79686 17991 88288 132755 128111 103229 -51032 -13108 35655 12325
526 12325 -13700 -21587 20739 30438 -20903 -11044 50789 5578 -51762 -94678 -10426 8420 56116
513 56116 47135 -12306 40423 73809 159830 139155 83994 17190 24699 58092 24166 61806
501 61806 45669 49577 66157 108143 180907 58740 -26534 -8467 26200 86393 161626 246577
489 246577 136741 104040 33206 -496 27959 -71106 22123 -34329 -85034 -32935 50862 67025
477 67025 -56792 -9523 34494 123959 121935 115662 -13659 -93472 40746 41408 87881 34389
465 34389 9632 -13313 108827 34279 38950 33021 32885 147453 100061 80802 19969 8879
453 8879 -9360 -86661 -50791 104817 199002 164937 69270 156856 57152 20683 123164 96649
441 96649 186851 82368 46858 46881 -6175 72536 134052 10625 -38881 -23918 -25762 71410
429 71410 132639 70823 -10670 35768 53394 17585 -39388 -60084 2230 -42020 6401 60685
417 60685 22226 95982 13188 18652 75719 82483 -20121 59124 119718 201315 197367 178618
405 178618 208067 207337 98072 54983 90876 117311 167733 158062 115138 93805 131116 157663
393 157663 165202 99686 85036 175072 192405 166512 95711 95362 190587 25538 133046 118613
381 118613 28342 60672 90228 200597 262875 168049 171203 128599 86220 190704 59429
370 59429 69113 169494 177458 160370 24529 31301 18668 -22514 132692 165574 181801 83793
358 83793 3000 42588 178562 94677 175349 116136 51650 197583 96241 211142 261622
347 261622 228084 207371 30489 -3109 261968 203793 121877 229844 111791 40894 151704
336 151704 168482 260465 226878 177053 289944 187577 111214 202230 140341 183544 182050 126151
324 126151 88433 91947 146176 118525 95580 165646 88620 149805 228459 166857 185472 199884
312 199884 192470 119742 159292 161251 182934 83182 33744 32176 79324 106789 28656 -34155
300 -34155 36226 -36412 61541 183039 155537 74530 51304 84776 118088 99343 63358 20773
288 20773 140495 195419 196556 153267 213011 244550 188226 150345 176671 79524 -75190 10395
276 10395 62019 70056 146725 219506 176308 152720 196177 180097 124663 183127 180137 184207 177217
263 177217 200578 172017 70670 26931 121126 164496 215415 89197 82915 128714 114037 127817
251 127817 241443 186513 270497 199888 266072 315810 278110 164825 129057 161314 172064
240 172064 261412 215513 186439 229727 218492 219167 203763 204278 241791 296866 231479 161658 187207
227 187207 206473 332848 208564 177731 98276 125076 252637 254257 137396 46743 104111
216 104111 196743 177663 181442 221903 239604 117069 135688 154208 121775 63529 81842 151888
204 151888 156695 168524 186559 133695 105248 103439 -4374 69399 74074 104847 154912 212959
192 212959 59540 103386 125342 102170 177578 108964 232611 148604 50136 102851 111250 208467
180 208467 164808 146038 191164 159899 285056 308205 209643 101870 62427 179088 225692
169 225692 208208 205258 182577 85513 22695 54433 60690 89529 58029 2793 -4786 116052
157 116052 220203 177820 120313 180783 165754 137657 95579 71241 74174 63047 61581 210488
145 210488 248222 195565 230256 138133 62209 123391 31749 -8232 109316 127011 68145 113955
133 113955 190967 202297 191822 151045 146469 260750 254902 328499 231313 142119 136555 144825
121 144825 198074 233283 199818 189112 128016 141430 118295 77712 195916 196687 154434 125881
109 125881 68209 104655 89095 103843 221445 210577 226982 177794 159792 211612 163032 106142
97 106142 326293 261726 140583 79137 68449 127390 137008 134241 140089 149529 137486 155826
85 155826 171614 237075 184461 142165 189015 173969 192041 147236 179931 170318 108896 159778
73 159778 162846 195600 247023 253051 257591 203763 159059 211770 263625 232663 263848 235721 225011
60 225011 183644 183603 144396 130766 221837 217726 216180 228886 164008 151142 122566 142900 188431
47 188431 190050 173576 122999 143905 189779 109478 132491 67527 136171 143940 168700 185715
35 185715 142429 88038 156922 167808 147009 165760 258520 227349 189477 272465 201210 163004
23 163004 145263 237512 204265 137355 107926 174587 242281 256042 122176 70259 194165 191241
11 191241 136099 143806 172384 167468 193235 211785 229480 161560 81760 114210 77338
0 77338
$$ Imaginary data points
##PAGE= N=2
##DATA TABLE= (X++(I..I)), XYDATA
16383 -3534889 -3540800 -3590326 -3478128 -3397029 -3400981 -3310042 -3239368 -3082832 -3051451 -3019624 -2968936
16372 -2968936 -2934677 -2837368 -2913552 -2839820 -2754015 -2703570 -2663055 -2691219 -2640989 -2562083 -2487037
16361 -2487037 -2369296 -2313794 -2289840 -2236018 -2179246 -2193679 -2133419 -2015980 -1964526 -1889346 -1906486
16350 -1906486 -1907232 -1896614 -1776033 -1741217 -1683134 -1658791 -1627247 -1532909 -1475472 -1463229 -1353121
16339 -1353121 -1334131 -1299216 -1255290 -1257503 -1125219 -1001880 -1004177 -951936 -858029 -898520 -778982
16328 -778982 -750923 -741674 -655652 -693481 -591469 -575470 -548828 -526435 -487679 -377536 -248589
16317 -248589 -329699 -189846 -152449 -130836 -116170 -134229 -73111 -72079 -90569 52175 102892
16306 102892 205339 367326 390443 293404 321815 358588 349062 392305 422722 510615 544492
16295 544492 529250 670478 767716 749298 812555 813672 913484 913991 932148 964915 954636 1005045
16283 1005045 1051793 1102419 1233479 1221404 1270666 1197293 1316721 1342193 1309777 1299453 1365503
16272 1365503 1450885 1547949 1471394 1543112 1566253 1658807 1644503 1729124 1794864 1814658 1836304
16261 1836304 1833436 1956485 1854976 1822542 1836216 1946090 1972738 1962334 2035769 2123724 2009771
16250 2009771 2043611 2116347 2176324 2318163 2373464 2348320 2339669 2338522 2424888 2412510 2479918
16239 2479918 2469054 2431395 2427132 2602684 2691207 2695623 2650451 2698715 2743658 2791866 2747290
16228 2747290 2769001 2854287 2880882 2829293 2889010 2934965 2931008 2895239 2931477 2993647 2931352
16217 2931352 2990160 3019764 3067401 3036638 3031853 3016955 3060081 3065682 3090703 3118518 3138700 3099645
16205 3099645 3214886 3164152 3095684 3295890 3384054 3402006 3344376 3345121 3391731 3464010 3468999
16194 3468999 3415480 3510139 3485029 3470478 3527578 3478416 3556057 3635731 3573989 3669345 3732099
16183 3732099 3670789 3740651 3709356 3698027 3747133 3825975 3722146 3688133 3683140 3623765 3600934
16172 3600934 3637121 3741193 3730919 3803735 3823591 3853089 3917655 3970937 3902367 3838584 3884920
16161 3884920 3955428 3987580 3992170 3994514 3958171 3916999 3990961 3960768 4021814 4105548 4030712 4005526
16149 4005526 4102022 3970577 3937121 4069367 4045208 4093507 4114526 4070202 3987812 4098459 4199738
16138 4199738 4122114 4091651 4124728 4143237 4075873 4073091 4112126 4095893 4082105 4233697 4213381
16127 4213381 4234887 4239712 4318683 4461889 4362037 4283144 4310229 4315933 4205393 4110691 4228074
16116 4228074 4373852 4339645 4249691 4292765 4314939 4377735 4463668 4445047 4360050 4389161 4336551
16105 4336551 4275736 4235373 4286082 4299146 4340673 4400190 4445380 4450235 4395783 4315591 4290451
16094 4290451 4360594 4428410 4410610 4408131 4477963 4493074 4513455 4477074 4403626 4412265 4435190 4433567
16082 4433567 4433939 4486848 4510034 4451310 4476796 4448596 4437632 4410782 4434874 4390877 4423576 4419036
16070 4419036 4479759 4486421 4445665 4523983 4576307 4484163 4436309 4424248 4445819 4442990 4443497 4418634
16058 4418634 4450720 4411608 4434990 4495078 4573241 4633484 4655286 4552040 4577474 4501967 4418578
16047 4418578 4471056 4465264 4530654 4506018 4491432 4462967 4459010 4549253 4531999 4619538 4535699 4534465
16035 4534465 4581728 4507096 4572086 4610807 4515163 4463479 4380787 4435406 4464532 4497275 4462492
16024 4462492 4547782 4631996 4512446 4542438 4656429 4674528 4540001 4509194 4554378 4590122 4532938
16013 4532938 4517128 4452924 4452099 4522268 4541681 4581360 4547942 4678737 4558029 4620349 4589187
16002 4589187 4506323 4579212 4547305 4454506 4479507 4508573 4581455 4545398 4484246 4459859 4467231
15991 4467231 4556626 4458812 4603665 4573720 4614773 4405783 4502652 4596167 4543486 4482034 4598715
15980 4598715 4582164 4566458 4624584 4621421 4559539 4489081 4566330 4621654 4485147 4446696 4416789
15969 4416789 4554265 4566415 4620780 4607394 4453494 4416434 4324752 4395066 4518418 4580561 4598047
15958 4598047 4587270 4566909 4552981 4489223 4559584 4605876 4568239 4579261 4481692 4491777 4513919
15947 4513919 4494977 4425976 4516498 4695969 4608510 4532742 4626139 4569061 4626131 4688591 4643517
15936 4643517 4578096 4556154 4579014 4585755 4469667 4477499 4599381 4609111 4431178 4556734 4683418
15925 4683418 4571104 4547140 4530061 4634828 4643028 4576674 4601135 4540762 4596949 4622143 4634722
15914 4634722 4571730 4526350 4604344 4528181 4588500 4555153 4539452 4560281 4618225 4618921 4666501 4595310
15902 4595310 4534440 4549810 4533492 4459266 4524855 4584793 4647801 4612187 4616040 4533117 4457270
15891 4457270 4413012 4616886 4663950 4737049 4495710 4413886 4480733 4574686 4585936 4552764 4655473
15880 4655473 4518753 4551145 4671929 4642966 4650943 4751677 4665912 4725996 4606740 4578412 4618491
15869 4618491 4579717 4635149 4536960 4501526 4514318 4487127 4478468 4482038 4454663 4558718 4592144
15858 4592144 4653400 4669431 4628997 4623758 4614576 4605606 4654954 4682427 4689770 4592273 4516942 4582351
15846 4582351 4586094 4543347 4577479 4554073 4503521 4493258 4524018 4548333 4509221 4513488 4546221 4646320
15834 4646320 4684487 4676770 4672436 4641363 4640573 4659931 4649364 4560215 4454988 4508740 4530259 4630880
15822 4630880 4655953 4602756 4568825 4582237 4721444 4617331 4491888 4606965 4657572 4718203
15812 4718203 4652112 4656975 4727550 4722335 4622446 4638932 4645557 4653484 4624308 4664562 4697121 4738916
15800 4738916 4707260 4798025 4701087 4655240 4677188 4629718 4623250 4552469 4665131 4671984 4697587
15789 4697587 4707870 4717558 4708463 4728015 4705375 4577667 4600109 4667574 4714771 4553998 4500279
15778 4500279 4445862 4602963 4597947 4618637 4644913 4441542 4476362 4606814 4593072 4602128 4534772
15767 4534772 4506991 4610191 4616929 4609779 4605944 4661098 4663653 4629881 4589750 4602453 4552676 4625179
15755 4625179 4620665 4590306 4577131 4537189 4495191 4577470 4605025 4675069 4727984 4737395 4687324 4617140
15743 4617140 4514470 4507213 4564361 4721806 4635032 4645056 4746446 4684270 4776164 4754399 4618318
15732 4618318 4659321 4717148 4675169 4611479 4672850 4750038 4774003 4724579 4715061 4615668 4510627
15721 4510627 4567690 4605628 4634010 4575709 4643564 4709434 4691773 4689802 4566596 4626498 4690358
15710 4690358 4589433 4625056 4597128 4611941 4646235 4617439 4670699 4542483 4669797 4694479 4634674
15699 4634674 4729170 4698928 4676884 4711289 4805883 4720930 4708915 4672641 4750567 4698493 4667746
15688 4667746 4694434 4768473 4675690 4622761 4676699 4663538 4609365 4561630 4530786 4585272 4618992
15677 4618992 4727542 4733955 4616671 4549960 4630376 4588357 4593784 4613401 4536460 4765737 4799122
15666 4799122 4799653 4749579 4716163 4659933 4595208 4575381 4666433 4700802 4683473 4800702 4722000
15655 4722000 4709394 4689207 4673069 4680835 4607270 4505700 4569506 4667550 4680369 4695163 4712692
15644 4712692 4759524 4624067 4563728 4702730 4691121 4557816 4527746 4552290 4699405 4736632
15634 4736632 4656568 4668003 4674553 4719490 4686169 4735674 4773760 4773675 4811065 4746793 4709495 4709322
15622 4709322 4776800 4763806 4731455 4651114 4585007 4637694 4665294 4655792 4654086 4624333 4598888 4612977
15610 4612977 4653242 4648087 4674815 4614510 4741795 4773815 4699171 4720705 4788504 4727501 4765681
15599 4765681 4829012 4813219 4820592 4786774 4835520 4726383 4665975 4702911 4679407 4685774 4683703 4625515
15587 4625515 4695453 4669656 4656140 4741242 4726056 4739752 4805656 4671830 4575449 4681831 4626921
15576 4626921 4667511 4643994 4668738 4685236 4692238 4746181 4682029 4645940 4817093 4831824 4782496
15565 4782496 4768364 4722609 4764982 4769408 4629338 4681230 4792935 4702300 4650335 4752546 4737416
15554 4737416 4711588 4848686 4905978 4786658 4678934 4622627 4646551 4702330 4779445 4775001 4678807
15543 4678807 4691872 4666818 4763375 4779923 4785462 4777175 4751118 4736512 4821518 4872865 4851045 4818998
15531 4818998 4742305 4804628 4843697 4762930 4803604 4677350 4723630 4758128 4694338 4581678 4703222
15520 4703222 4792568 4805064 4745983 4680872 4710457 4738466 4762017 4720203 4686209 4769399 4767331
15509 4767331 4711210 4717450 4744757 4776307 4683603 4777890 4861753 4682470 4558188 4563101 4629839
15498 4629839 4589832 4751858 4805813 4668206 4652414 4801748 4771616 4722753 4733750 4744204 4620291
15487 4620291 4743911 4944447 4953893 4810475 4730912 4807050 4693104 4713617 4699610 4706113 4635943
15476 4635943 4651871 4739174 4805170 4747329 4676378 4717135 4836387 4762561 4891559 4859021 4769510
15465 4769510 4786988 4884763 4977785 4972604 4931067 4839489 4733266 4714243 4771331 4863134 4894024
15454 4894024 4765470 4680119 4803447 4886676 4938195 4899501 5035852 4922199 4738830 4745313
15444 4745313 4772864 4724957 4821786 4713372 4633502 4685254 4692722 4814295 4741569 4729089 4751901
15433 4751901 4782554 4748292 4763961 4843366 4839709 4833226 4852542 4817253 4820015 4742499 4627559 4667389
15421 4667389 4729732 4664564 4678738 4683672 4670416 4723570 4680896 4756142 4835738 4786722 4813983
15410 4813983 4810250 4822339 4774079 4841031 4882425 4835682 4828023 4822840 4753362 4820225 4756802 4770801
15398 4770801 4841997 4802853 4693902 4736413 4721879 4776640 4851675 4798813 4775396 4695657 4666531
15387 4666531 4875097 4881604 4802135 4892688 4819740 4783358 4878779 4760928 4782488 4824019 4771120
15376 4771120 4703561 4712951 4824983 4898512 4829890 4763769 4696598 4702204 4786643 4827110 4687526
15365 4687526 4737102 4827544 4820213 4880005 4684639 4837652 4874755 4812859 4954981 4883883 4750561
15354 4750561 4856874 4727769 4653526 4678383 4743902 4823939 4751593 4729610 4878831 4987978
15344 4987978 4964024 4813135 4808901 4811392 4811177 4876363 4925512 4836951 4899719 4824688 4859973 4903310
15332 4903310 4784392 4768806 4788199 4819007 4876084 4852781 4830469 4821395 4728511 4792846 4779112
15321 4779112 4782516 4898823 4890954 4873548 4920579 4943617 4876918 4881668 4843603 4820763 4698656
15310 4698656 4819783 4833744 4897061 4889243 4865960 4868506 4814579 4812257 4704618 4782857 4824693
15299 4824693 4792976 4860537 4983244 4836794 4869346 4819680 4779187 4832441 4984598 4992126 4904865
15288 4904865 4855906 4827582 4846013 4894084 4862302 4930710 4921130 4929023 4939460 4879352 4851898 4836934
15276 4836934 4897761 4929322 4942202 4917925 4868909 4863077 4941892 4854832 4820650 4871780 4821526
15265 4821526 4858951 4814699 4867163 4843793 4846826 4883562 4772279 4815286 4873098 4880377 4934653
15254 4934653 4926982 4873843 4860526 4877139 4775306 4832235 4925025 4892187 4919548 4849730 4918467
15243 4918467 4945685 4823524 4839013 4831267 4840937 4800534 4771383 4848496 4944527 4924763 4904731
15232 4904731 4803120 4828540 4882978 4951035 4832538 4839590 4872568 4839927 4821290 4856235 4893088
15221 4893088 4927213 4845558 4873375 5000252 4946807 4817818 4893544 4887687 4818520 4875213 4865596
15210 4865596 4894593 4864525 4898921 4896758 5014550 4969570 4886649 4826692 4828775 4894267 4932682
15199 4932682 4969813 4964435 4988805 4925411 4841838 4931502 4832437 4830764 4859898 4934906 4847919 4846879
15187 4846879 4800708 4861841 4975235 4914215 4921524 4939548 5014266 4946856 4921016 4892550 4839823
15176 4839823 4947503 4919334 4868757 4879870 4895103 4890642 4932623 4865175 4774546 4744999 4829103
15165 4829103 4843729 4926545 4956619 4974730 4996176 4906065 4924253 4985317 4986756 4905129 4969911
15154 4969911 4938430 4876574 4928616 4910982 4874167 5032089 4955531 4789964 4895867 5002021
15144 5002021 5017143 4926427 4935307 4892275 4815673 4953518 4999228 4958559 4910320 4928333 4867674
15133 4867674 4808043 4799084 4805745 4847198 4910276 4958073 4996320 5112120 5042921 4921519 4843628
15122 4843628 4950745 4957889 4950984 4891928 4833542 4876156 4989381 4891589 4926988 4969491 4884223
15111 4884223 4860043 4834601 4830850 4950240 4936701 4958240 4983430 4945280 4957117 4902855 5043207
15100 5043207 4977624 4956536 5059772 4965747 4833125 4898777 5049595 5041083 5031953 5077337 4917546
15089 4917546 4944863 4987963 4924759 5051751 5096969 4966866 5018760 5000909 5003889 4852911 4884730
15078 4884730 4961981 4931997 5003886 5014941 4985461 5008852 4965138 4973390 4880240 4886321 4933493 5022764
15066 5022764 5006795 4957049 4948688 4939095 5026452 4885775 4917016 4987610 4909662 4802859 4936388
15055 4936388 4995045 4954442 4918684 4852000 4971602 4936292 4902643 5031507 4897652 4882242 5056673
15044 5056673 5043731 5065075 5016661 5007962 4978152 4920619 4938279 4913058 4847155 4974003 5065052
15033 5065052 5023107 4923896 4802541 4874513 4955834 4953059 5007437 5030101 5068695 4981659 4985829
15022 4985829 4989714 5056838 5093932 4988429 4990425 5009142 4992181 5022215 4923175 4980578 4994575
15011 4994575 4953602 4887162 4935113 4948433 4907054 4925862 4940195 4909280 4860558 4913692 4902455
15000 4902455 4911546 4909030 4990528 4977696 5011540 5006436 5043181 4966079 4999036 5016850 4998702 4968221
14988 4968221 4915735 5004333 4923654 4859654 4988307 5028142 5117563 5054329 5139726 5087577 5016571
14977 5016571 5061731 5028523 5060063 5000234 5013379 5021965 4944155 5030977 5014299 4990808 4918957
14966 4918957 5049439 5161480 5120778 5138748 5139278 5150730 5083411 5045882 4957676 5038159 5098727
14955 5098727 5011444 5062279 5113382 5174191 5017265 4979227 4944208 4945096 4962191 5012468 5086274
14944 5086274 5028333 5015031 5092525 5141204 5006512 4916905 4887702 5028892 5064711 5072015 5029772
14933 5029772 4970340 5004894 4957355 4998409 4976062 4992623 4998329 5051301 4982979 4932977 5043221
14922 5043221 4979641 5027157 5031731 5059279 5095790 5115000 5082534 5045952 4970374 5064306 5063057 5025095
14910 5025095 5061694 5126707 4970734 4850453 4933942 4978623 5041144 5141063 4996935 5018922 5014545
14899 5014545 4938108 4980702 5044778 5082543 5032894 5108634 5172644 5142230 5112992 5185355 5127640
14888 5127640 5087298 5033129 5101855 5105895 5126899 5132948 5131586 5224269 5215104 5085929 5111668 5217939
14876 5217939 5267601 5149928 5139769 5162494 5148827 5108982 5152207 5171017 5084892 5043373 5067294
14865 5067294 5138458 5105463 4987857 5015714 5009109 5071046 5040068 5074562 5138794 5056442 5099583
14854 5099583 5116014 5113319 5144754 5068617 5093611 5103919 5036510 5127614 5093985 5132482 5089269
14843 5089269 5055524 5095372 5098191 5129007 5137289 5099559 5121237 5103600 5041344 5093903 5235497
14832 5235497 5180556 5147314 5033710 4986780 5043082 5138960 5207783 5133225 5120796 5164884 5162028
14821 5162028 5193645 5170747 5140956 5203305 5127547 5072589 5162145 5260759 5310681 5199304 5181487
14810 5181487 5103397 5138040 5157734 5160923 5169623 5221510 5141144 5163491 5116425 5136681 5199239 5216726
14798 5216726 5197078 5190224 5242345 5244781 5180778 5104178 5088223 4990287 4881773 5103539 5151546
14787 5151546 5050708 5044455 5112313 5057618 5113482 5149637 5152954 5170379 5252315 5348750 5216227
14776 5216227 5229287 5156688 5180725 5097207 5043761 5074700 5079855 5130449 5126661 5120109 5108830 5142613
14764 5142613 5213082 5110104 5086951 5120128 5169083 5135229 5209940 5230364 5290991 5211630 5274478
14753 5274478 5277378 5199706 5093897 5052461 5074451 5171589 5118110 5182959 5203823 5147060 5197519
14742 5197519 5199978 5092225 5066080 5143466 5161634 5226794 5203280 5162107 5187043 5252923 5354281
14731 5354281 5217626 5134032 5127435 5188880 5130896 5160608 5132457 5055954 5091701 5101502 5176830
14720 5176830 5287515 5279555 5134929 5137021 5196637 5132491 5132730 5177562 5140915 5140618 5210733 5275964
14708 5275964 5178415 5153050 5198047 5230147 5067084 5106393 5133691 5222867 5345616 5244875 5193560
14697 5193560 5206411 5178821 5101621 5137550 5126331 5244127 5196191 5153990 5174002 5102672 5143952
14686 5143952 5164106 5153980 5148145 5083046 5106430 5311872 5256706 5215970 5288851 5163797 5088570
14675 5088570 5286250 5213445 5084891 5121997 5188780 5230842 5190380 5243066 5288792 5205717 5217876
14664 5217876 5220038 5117304 5124385 5203163 5212778 5206645 5278020 5315120 5268323 5239022 5255757 5294864
14652 5294864 5296267 5271227 5108747 5136143 5115855 5125126 5132028 5079953 5136519 5266869 5316693
14641 5316693 5231684 5068620 5108316 5187959 5301838 5228914 5124013 5149857 5214975 5161964 5190731
14630 5190731 5314205 5224983 5145940 5103258 5143101 5116470 5190766 5327810 5317708 5273714 5289717
14619 5289717 5178340 5139601 5250250 5211332 5166629 5231502 5265137 5176917 5160003 5223597 5165493
14608 5165493 5211439 5244900 5275276 5258818 5254088 5270192 5325497 5339296 5284249 5283508 5299679 5312062
14596 5312062 5151367 5118817 5123313 5196135 5201778 5247334 5263423 5294920 5266404 5234328 5184706
14585 5184706 5179196 5159833 5063924 5114605 5166411 5219189 5382077 5353208 5230181 5304460 5319873
14574 5319873 5297142 5317915 5287212 5192889 5197541 5153547 5215465 5276860 5243653 5210793 5248592
14563 5248592 5196400 5158888 5201688 5316602 5405900 5466110 5312161 5295347 5191080 5172039 5218584
14552 5218584 5273694 5254013 5285628 5399441 5314794 5242322 5197534 5254917 5275134 5207481 5304400
14541 5304400 5390370 5468042 5311454 5149387 5215227 5234147 5184152 5233793 5124027 5242209
14531 5242209 5314660 5270378 5295823 5214597 5197319 5272880 5307498 5300439 5289042 5265778 5372234
14520 5372234 5320029 5230559 5119643 5312093 5311632 5263182 5211341 5288662 5274112 5215879 5328870
14509 5328870 5232177 5281891 5333805 5268136 5301259 5296799 5334630 5320365 5405972 5284215 5252987
14498 5252987 5363093 5270250 5423679 5367808 5365480 5263127 5222798 5140322 5097013 5201012 5282541
14487 5282541 5281752 5235069 5330282 5257610 5353382 5332474 5358148 5320437 5374069 5323837 5317376 5339068
14475 5339068 5288251 5224025 5343278 5441687 5439116 5404186 5392288 5417826 5249580 5191265 5229478
14464 5229478 5262259 5236533 5332189 5341217 5362595 5300523 5313122 5286662 5268748 5243628 5314504
14453 5314504 5302063 5262603 5295559 5364645 5297241 5220538 5392873 5364694 5342039 5277273 5342357
14442 5342357 5414410 5369261 5402934 5396457 5435937 5338073 5259325 5266751 5331573 5405510 5345964 5426085
14430 5426085 5419662 5300434 5328033 5280738 5238218 5255434 5352254 5331330 5351303 5378331 5364053
14419 5364053 5394686 5315742 5348586 5354571 5403257 5424095 5378684 5313374 5353516 5369751 5359114
14408 5359114 5393303 5235304 5333549 5361378 5389618 5374646 5334090 5337268 5405465 5363876 5332870
14397 5332870 5359431 5356192 5344958 5295885 5315004 5237786 5209498 5230621 5221023 5413315 5534661
14386 5534661 5464235 5385154 5373647 5519136 5438301 5462267 5425651 5337327 5368585 5356970 5236805
14375 5236805 5422035 5369292 5423415 5441142 5394709 5449562 5455052 5441752 5530007 5547033 5413360
14364 5413360 5362943 5403753 5373157 5401992 5308224 5364601 5394076 5307072 5422042 5491663 5481847
14353 5481847 5484832 5425897 5352141 5416365 5460628 5483468 5543324 5413106 5340313 5308328 5312681
14342 5312681 5394443 5371470 5432466 5447115 5412782 5261228 5231134 5307930 5387110 5411388 5522986
14331 5522986 5505200 5500386 5388903 5366876 5452238 5440784 5402937 5480449 5582802 5659331 5498162
14320 5498162 5472168 5442595 5312380 5266795 5369187 5372749 5392798 5416619 5296762 5463206 5562972
14309 5562972 5418069 5371354 5321793 5391191 5349422 5470034 5512778 5482072 5490025 5566726 5487939
14298 5487939 5498960 5579519 5456185 5449028 5434161 5453366 5446588 5439993 5436131 5403810 5468480 5494075
14286 5494075 5333102 5347439 5464287 5389806 5363643 5466282 5309803 5354428 5372120 5385853
14276 5385853 5471904 5442731 5437266 5382822 5416916 5504954 5522813 5432421 5376231 5527532 5524826
14265 5524826 5464399 5369984 5401970 5448451 5532533 5593793 5522625 5393263 5447995 5514491 5485646
14254 5485646 5389262 5501518 5455624 5403167 5472790 5505352 5474122 5401407 5496340 5435643 5326880
14243 5326880 5424614 5518472 5522215 5448049 5463995 5526883 5514322 5399619 5460919 5432647 5513571
14232 5513571 5581756 5561930 5595628 5541414 5533267 5526540 5540895 5499079 5541744 5536370 5470785 5416337
14220 5416337 5551210 5506802 5449201 5416769 5426935 5416307 5588138 5527561 5405500 5480035 5512239
14209 5512239 5417498 5427912 5459838 5571293 5527501 5439560 5491927 5487754 5473354 5479288 5528439
14198 5528439 5575323 5549506 5519137 5560107 5567725 5543963 5490613 5426864 5500777 5471618 5559321
14187 5559321 5635387 5652311 5566846 5577033 5552058 5449926 5474034 5481088 5418716 5367193 5433459
14176 5433459 5442360 5631335 5536585 5561473 5527579 5490477 5620260 5591155 5438367 5444516 5537637
14165 5537637 5498234 5544594 5494388 5431011 5471997 5517211 5477237 5371054 5404507 5464561 5464024
14154 5464024 5502885 5610973 5509768 5644376 5667427 5682773 5676276 5560303 5516902 5474163 5457062
14143 5457062 5548336 5595344 5605568 5544824 5571969 5521912 5480782 5526136 5462625 5552454 5390380
14132 5390380 5384691 5501265 5490483 5529479 5496195 5488019 5579306 5471430 5407169 5534091 5519943
14121 5519943 5469062 5516523 5487145 5445534 5501847 5571770 5535818 5389244 5431822 5396441 5438174
14110 5438174 5545503 5499093 5467345 5578865 5518795 5561960 5590706 5611784 5550936 5490089 5593457
14099 5593457 5547058 5460484 5471321 5555453 5537207 5674280 5546024 5484740 5534035 5543546 5688519
14088 5688519 5605637 5463374 5505145 5436502 5496890 5543266 5560022 5618361 5572912 5597501 5622943
14077 5622943 5461319 5473862 5438949 5572047 5583778 5449911 5404570 5400252 5467516 5636301 5739219
14066 5739219 5635287 5596489 5543183 5561151 5568444 5549111 5616455 5541332 5572707 5602146 5453279
14055 5453279 5375777 5460731 5475598 5474290 5566951 5601353 5578947 5606825 5715522 5585349 5532338
14044 5532338 5612779 5602920 5574739 5531264 5491735 5609875 5516655 5561105 5623475 5579744 5698706
14033 5698706 5612209 5594494 5622833 5550107 5545329 5598175 5634558 5541093 5556681 5617394 5575128
14022 5575128 5681765 5671792 5567910 5594616 5471227 5488363 5450559 5572641 5610307 5549321 5694996
14011 5694996 5659869 5555294 5646978 5685519 5644973 5672262 5656863 5727274 5589816 5594722 5630248
14000 5630248 5556503 5481113 5609637 5616962 5613589 5568415 5551148 5617387 5671181 5698438 5674171
13989 5674171 5669188 5754578 5774419 5677808 5667186 5692286 5723200 5615934 5604588 5600091 5577518
13978 5577518 5601819 5637182 5643644 5647806 5572974 5590319 5539346 5583596 5636066 5709358 5575522
13967 5575522 5516717 5602864 5637017 5639241 5723602 5683228 5666028 5680069 5560382 5685157 5671024
13956 5671024 5572809 5647909 5752229 5677694 5660634 5766360 5853780 5798973 5718977 5735259 5746276
13945 5746276 5656845 5621752 5686624 5762897 5686553 5653787 5600010 5597324 5685821 5685594 5673551 5728892
13933 5728892 5523310 5441910 5568681 5564439 5640971 5675570 5676550 5672958 5686628 5656776 5625557 5673632
13921 5673632 5673957 5593882 5557171 5537717 5556283 5705591 5822047 5827681 5775643 5663629 5607397
13910 5607397 5542523 5672719 5713442 5687887 5609272 5608492 5672364 5684514 5695091 5732114 5764877
13899 5764877 5774455 5744781 5628384 5635104 5614070 5601838 5614338 5602057 5636638 5596881 5659049
13888 5659049 5778375 5683306 5764798 5750328 5572307 5528877 5537542 5547664 5643644 5600679 5612417
13877 5612417 5564300 5626417 5697864 5719521 5754345 5746703 5673686 5679619 5758027 5664943 5706396 5832079
13865 5832079 5788908 5765769 5737803 5802155 5770081 5649428 5677176 5576692 5650796 5583262 5567426
13854 5567426 5608658 5676467 5666934 5710123 5721190 5737900 5769822 5746685 5683684 5787176 5857318
13843 5857318 5877580 5782152 5695498 5653971 5726975 5818232 5707795 5764017 5838372 5680460 5677711
13832 5677711 5737379 5662735 5670824 5696428 5700959 5600311 5661516 5637248 5701614 5665283 5640695
13821 5640695 5720998 5760226 5765207 5703261 5757601 5750832 5765133 5805867 5784131 5781365 5719741 5666657
13809 5666657 5689109 5720332 5677211 5713770 5718095 5704260 5757560 5885892 5802149 5732440 5646070
13798 5646070 5647962 5759815 5797787 5767059 5705842 5660952 5599720 5601922 5831820 5864298 5871617
13787 5871617 5888791 5795708 5689674 5663372 5690541 5699604 5690842 5735735 5751372 5752347 5663148 5595718
13775 5595718 5708752 5760684 5803582 5850951 5865012 5809096 5748318 5703454 5752834 5766726 5776039
13764 5776039 5764839 5812978 5696030 5669994 5717415 5682286 5707989 5817459 5828196 5850982 5928180
13753 5928180 5938090 5946163 5848232 5686145 5725851 5793044 5834644 5779689 5885251 5842384 5800906
13742 5800906 5870092 5784553 5817914 5756517 5759013 5815357 5837447 5892510 5837219 5873352 5833917
13731 5833917 5844354 5813890 5811058 5840679 5817240 5788183 5781283 5791982 5761328 5853470 5834039 5909258
13719 5909258 5905347 5881988 5996853 5924749 5815441 5834529 5832960 5767295 5790823 5831582 5890379
$$ [...]
##END NTUPLES=NMR SPECTRUM
##END=
