##TITLE=1H_CA-8886-1
 CDCl3, 8 sc, 
 29.06.2021
##JCAMPDX= 6.0         $$ Bruker NMR JCAMP-DX V2.0
##DATA TYPE= NMR SPECTRUM
##DATA CLASS= NTUPLES
##ORIGIN= UXNMR, Bruker Analytische Messtechnik GmbH
##OWNER= root
$$ XWIN-NMR		Version 3.5
$$ Tue Jun 29 08:51:21 2021 Russian Standard Time (UT+4h)  she@DPX200
##.OBSERVE FREQUENCY= 200.131506
##.OBSERVE NUCLEUS= ^1H
##.ACQUISITION MODE= SIMULTANEOUS
##.ACQUISITION SCHEME= undefined
##.AVERAGES= 8
##.DIGITISER RES= 18
##SPECTROMETER/DATA SYSTEM= spect
##.PULSE SEQUENCE= zg30
##.SOLVENT NAME= CDCl3
##.SHIFT REFERENCE= (INTERNAL, CDCl3, 0, 17.524)
##AUDIT TRAIL= $$ (NUMBER, WHEN, WHO, WHERE, WHAT)
$$ ##TITLE= Audit trail, XWIN-NMR		Version 3.5
$$ ##JCAMPDX= 5.01
$$ ##ORIGIN= Bruker BioSpin GmbH
$$ ##OWNER= she
$$ F:/spectra/data/she/nmr/H-F/1/pdata/1/auditp.txt
$$ ##AUDIT TRAIL=  $$ (NUMBER, WHEN, WHO, WHERE, WHAT)
(   1,<2021-06-29 08:50:07.48 +0400>,<she>,<DPX200>,
      <created by zg, POWCHK disabled, PULCHK disabled
       configuration hash MD5:
       00 E9 B6 7A A2 85 ED C7 34 08 36 98 17 FE 4E 26
       data hash MD5: 16K
       47 B8 AE 61 1F 0F 85 1C 6D D2 42 3F D0 82 7E 31>)
(   2,<2021-06-29 08:50:09.85 +0400>,<she>,<DPX200>,
      <Start of raw data processing
       efp BC_mod = 2 LB = 0.24 FT_mod = 6 PKNL = 1 PHC0 = -11568.96 PHC1 = 8.001012 SI = 16K 
       data hash MD5: 16K
       82 F8 E6 A4 34 DD 58 C1 EF E7 C1 F0 A7 67 C0 EF>)
(   3,<2021-06-29 08:50:33.14 +0400>,<she>,<DPX200>,
      <pk PHC0 = 1.386374 PHC1 = 0 
       data hash MD5: 16K
       8D 69 79 41 04 50 A7 FA 90 70 21 86 D0 7D AC 6D>)
(   4,<2021-06-29 08:50:36.15 +0400>,<she>,<DPX200>,
      <abs ABSG = 5 
       data hash MD5: 16K
       75 36 AE FE D7 0F 5C C8 7D A0 BA 18 3E A2 1B 3E>)
$$ ##END=
$$ 
$$ hash MD5
$$ 29 54 30 86 1D 54 C3 D2 70 5E 42 04 69 18 93 35
##$RELAX= 
##$RELAX= 
##$RELAX= 
##$RELAX= 
##$RELAX= 
##$RELAX= 
$$ Bruker specific parameters
$$ --------------------------
##$DU= <F:/spectra>
##$EXPNO= 1
##$NAME= <H-F>
##$PROCNO= 1
##$TYPE= <nmr>
##$USER= <she>
##$AMP= (0..31)
100 100 100 100 100 100 100 100 100 100 100 100 100 100 100 100 100 100 
100 100 100 100 100 100 100 100 100 100 100 100 100 100 
##$AQSEQ= 0
##$AQ_mod= 1
##$AUNM= <au_zg>
##$AUTOPOS= <>
##$BF1= 200.13
##$BF2= 200.13
##$BF3= 200.13
##$BF4= 200.13
##$BF5= 200.13
##$BF6= 200.13
##$BF7= 200.13
##$BF8= 200.13
##$BYTORDA= 1
##$CFDGTYP= 0
##$CFRGTYP= 5
##$CHEMSTR= <none>
##$CNST= (0..31)
1 1 145 1 1 1 1 1 1 1 1 1 1 1 1 1 1 1 1 1 1 1 1 1 1 1 1 1 1 1 1 1 
##$CPDPRG= <>
##$CPDPRG1= <>
##$CPDPRG2= <>
##$CPDPRG3= <>
##$CPDPRG4= <mlev>
##$CPDPRG5= <mlev>
##$CPDPRG6= <mlev>
##$CPDPRG7= <mlev>
##$CPDPRG8= <mlev>
##$CPDPRGB= <>
##$CPDPRGT= <>
##$D= (0..31)
0 1.2 0 0 0 0 0 0 0 0.06 0 0.03 0 0 0 0 0.0002 0 0 0 0 0 0 0 0 0 0 0 0 
0 0 0 
##$DATE= 1624942206
##$DBL= (0..7)
120 120 120 120 120 120 120 120 
##$DBP= (0..7)
150 150 150 150 150 150 150 150 
##$DBP07= 0
##$DBPNAM0= <>
##$DBPNAM1= <>
##$DBPNAM2= <>
##$DBPNAM3= <>
##$DBPNAM4= <>
$$ [...]
##$SUBNAM3= <"">
##$SUBNAM4= <"">
##$SUBNAM5= <"">
##$SUBNAM6= <"">
##$SUBNAM7= <"">
##$SUBNAM8= <"">
##$SUBNAM9= <"">
##$SW= 20.0188882624521
##$SWIBOX= (0..15)
0 0 2 0 0 0 0 0 0 0 0 0 0 0 0 0 
##$SW_h= 4006.41025641026
##$TD= 16384
##$TD0= 1
##$TE= 0
##$TE2= 300
##$TE3= 300
##$TEG= 300
##$TL= (0..7)
0 120 120 120 120 120 120 120 
##$TP= (0..7)
150 150 150 150 150 150 150 150 
##$TP07= 0
##$TPNAME0= <>
##$TPNAME1= <>
##$TPNAME2= <>
##$TPNAME3= <>
##$TPNAME4= <>
##$TPNAME5= <>
##$TPNAME6= <>
##$TPNAME7= <>
##$TPOAL= (0..7)
0.5 0.5 0.5 0.5 0.5 0.5 0.5 0.5 
##$TPOFFS= (0..7)
0 0 0 0 0 0 0 0 
##$TUNHIN= 0
##$TUNHOUT= 0
##$TUNXOUT= 0
##$USERA1= <user>
##$USERA2= <user>
##$USERA3= <user>
##$USERA4= <user>
##$USERA5= <user>
##$V9= 5
##$VALIST= <valist>
##$VCLIST= <CCCCCCCCCCCCCCC>
##$VD= 0
##$VDLIST= <DDDDDDDDDDDDDDD>
##$VPLIST= <PPPPPPPPPPPPPPP>
##$VTLIST= <TTTTTTTTTTTTTTT>
##$WBST= 1024
##$WBSW= 4
##$XGAIN= (0..3)
0 0 0 0 
##$XL= 0
##$YL= 0
##$YMAX_a= 755468
##$YMIN_a= -785285
##$ZGOPTNS= <>
##$ZL1= 120
##$ZL2= 120
##$ZL3= 120
##$ZL4= 120
##$ABSF1= 17.50078
##$ABSF2= -2.518259
##$ABSG= 5
##$ABSL= 3
##$ALPHA= 0
##$AQORDER= 0
##$ASSFAC= 0
##$ASSFACI= 0
##$ASSFACX= 0
##$ASSWID= 0
##$AUNMP= <proc_1d>
##$AZFE= 0.1
##$AZFW= 0.1
##$BCFW= 0
##$BC_mod= 2
##$BYTORDP= 0
##$COROFFS= 0
##$CY= -3
##$DATMOD= 1
##$DC= 0
##$DFILT= <>
##$DTYPP= 0
##$F1P= 0
##$F2P= 0
##$FCOR= 1
##$FTSIZE= 16384
##$FT_mod= 6
##$GAMMA= 0
##$GB= 0
##$INTBC= 1
##$INTSCL= 1.334414e-10
##$ISEN= 128
##$LB= 0.24
##$LEV0= 0
##$LPBIN= 0
##$MAXI= 10000
##$MC2= 0
##$MEAN= 0
##$ME_mod= 0
##$MI= 1.114404
##$NCOEF= 0
##$NC_proc= -5
##$NLEV= 6
##$NOISF1= 3.799351
##$NOISF2= 2.8
##$NSP= 0
##$NTH_PI= 0
##$NZP= 0
##$OFFSET= 17.52399
##$PC= 1
##$PHC0= -11567.57
##$PHC1= 8.001012
##$PH_mod= 1
##$PKNL= yes
##$PPARMOD= 0
##$PSCAL= 0
##$PSIGN= 0
##$REVERSE= no
##$SF= 200.130002129429
##$SI= 16384
##$SIGF1= 3
##$SIGF2= 2
##$SINO= 5.538805
##$SIOLD= 16384
##$SREGLST= <1H.CDCl3>
##$SSB= 0
##$STSI= 16384
##$STSR= 0
##$SW_p= 4006.41025641026
##$SYMM= 0
##$S_DEV= 0
##$TDeff= 16384
##$TDoff= 0
##$TI= <>
##$TILT= no
##$TM1= 0
##$TM2= 0
##$TOPLEV= 0
##$USERP1= <user>
##$USERP2= <user>
##$USERP3= <user>
##$USERP4= <user>
##$USERP5= <user>
##$WDW= 1
##$XDIM= 16384
##$YMAX_p= 282201884
##$YMIN_p= -233008
$$ End of Bruker specific parameters
$$ ---------------------------------
##NTUPLES= NMR SPECTRUM
##VAR_NAME=  FREQUENCY,     SPECTRUM/REAL,   SPECTRUM/IMAG
##SYMBOL=    X,             R,               I
##VAR_TYPE=  INDEPENDENT,   DEPENDENT,       DEPENDENT
##VAR_FORM=  AFFN,          ASDF,            ASDF
##VAR_DIM=   16384,         16384,           16384
##UNITS=     HZ,            ARBITRARY UNITS, ARBITRARY UNITS
##FACTOR=    0.24454680195387, 1,            1
##FIRST=     3507.07628231884, 0,            0
##LAST=      -499.33397409142, 0,            0
##MIN=       -499.33397409142, -233008,      0
##MAX=       3507.07628231884, 282201884,    0
$$ Real data points
##PAGE= N=1
##DATA TABLE= (X++(R..R)), XYDATA
$$ [...]
5588F763495J83280J44535P5567M0249R011Q0860L68k2152j8544j2391Q2290P3811
5576G400379K3215O2070J82614J37617K05941J90404K40398L21350L01317K01854
5566I267159J94077K01344K05013J65986O4497l632j20813j91302j85286j76817
5556I420226k07707k71068k77804k09223k03071j29613j67866o8295n8623m3078
5546G783878o2564K3490N7401N2420J5979N4504Q0261J8114j5926j11476j35439
5535G760642j11686j84796k50629k29468k78624k61946k68182k30299k37622k19332
5525E488058k29716k18525j10684j28755j14484j49613j10353j26547j34432l8920
5515D126029k055n4961j39187p0703p5102o4651j38610j55865j12916p4111j30962
$$ y = [6763495, 6946775, 7091310, 7166877, 7207126, 7216137, 7296997, 7297365, 7275213, 7256669, 7244278, 7326568, 7400379, 7423594, 7485664, 7668278, 7805895, 8011836, 8202240, 8442638, 8763988, 9065305, 9267159, 9461236, 9662580, 9867593, 10033579, 10098076, 10094444, 9973631, 9782329, 9597043, 9420226, 9212519, 8941451, 8663647, 8454424, 8251353, 8121740, 7953874, 7885579, 7826956, 7783878, 7721314, 7744804, 7802205, 7854625, 7870604, 7925108, 8005369, 8023483, 8007557, 7896081, 7760642, 7648956, 7464160, 7213531, 6984063, 6705439, 6443493, 6175311, 5945012, 5707390, 5488058, 5258342, 5039817, 4929133, 4800378, 4685894, 4536281, 4425928, 4299381, 4164949, 4126029, 4123974, 4069013, 3929826, 3859123, 3784021, 3719370, 3580760, 3424895, 3311979, 3237868, 3106906]
5504C106906j03975j33190n4347q6403j01626o6321p2035j02081o2140p4579j16504
5493B133705p3570m8627n2798j8326l59j7330n9968L2935n2478n4970k677m290
5481A781247J5838p1359j7177m6455r84r533r1978m349j7825m1370l5901j0928
5469A449226k6744O590O2955k0750j6359n9781m0631K74l9767M1906l8388k8965
5457A289566l2578j885O432k558n5025l0595M1898J4007J1020j5079r165j4360
5445A201678J6495M5009q503j5707k730p25N152o64m795N562J7385K482K7832
5432A288471L5587m4551J4042K6482K0697L0317l9753P0778P972j1081K6279J4229
5420A439469k3687Q5755M0812K9673k708m9645J01223P8425j9356K8656J4265
$$ y = [3106906, 3002931, 2869741, 2815394, 2728991, 2627365, 2561044, 2489009, 2386928, 2324788, 2250209, 2133705, 2060135, 2011508, 1958710, 1940384, 1940025, 1922695, 1862727, 1895662, 1843184, 1788214, 1785537, 1781247, 1797085, 1725726, 1708549, 1662094, 1661110, 1651577, 1559599, 1555250, 1537425, 1496055, 1460154, 1449226, 1422482, 1429072, 1492027, 1471277, 1454918, 1395137, 1354506, 1354780, 1315013, 1356919, 1318531, 1289566, 1256988, 1255103, 1261535, 1258977, 1203952, 1173357, 1215255, 1229262, 1240282, 1225203, 1216038, 1201678, 1218173, 1263182, 1254679, 1238972, 1236242, 1235517, 1240669, 1240005, 1235210, 1240772, 1258157, 1260639, 1288471, 1324058, 1279507, 1293549, 1320031, 1340728, 1371045, 1331292, 1402070, 1410042, 1398961, 1425240, 1439469, 1415782, 1501537, 1542349, 1572022, 1569314, 1519669, 1620892, 1699317, 1679961, 1708617, 1722882]
5409A722882J24376O4846L5779J13082K9475R6444N0793P4966Q1215J08789J25853
5398B628500Q6575J1620k8490M0981K1868k930o0545k4065j299K2763n78Q140
5386B702540o6376j7144N2131j7525O9182R9995J6637L5847K7236J12106O6287
5375C080916L7756P2188n192Q6989Q2110L8435Q1721J03281N2053O8512R9562
5364C798331J25561J20900R2434J20084J47385K41804J84153J62580J60701J84675
5354E338608K65551K51512K55843K98369K89495K61868L61548L99417L44531M56342
5344H523084M91692N57069N95697P77945P74856Q13013Q38272Q62668R04189P32126
5334A5870611N42197M07296J51709L610R556j57772j55737q9986l5387Q9198J57976
$$ y = [1722882, 1847258, 1912104, 1947883, 2060965, 2090440, 2186884, 2237677, 2312643, 2393858, 2502647, 2628500, 2715075, 2726695, 2698205, 2739186, 2761054, 2758124, 2697579, 2673514, 2672215, 2694978, 2694400, 2702540, 2636164, 2619020, 2671151, 2653626, 2722808, 2822803, 2839440, 2875287, 2902523, 3014629, 3080916, 3118672, 3190860, 3185668, 3272657, 3354767, 3393202, 3474923, 3578204, 3630257, 3698769, 3798331, 3923892, 4044792, 4137226, 4257310, 4404695, 4646499, 4830652, 4993232, 5153933, 5338608, 5604159, 5855671, 6111514, 6409883, 6699378, 6961246, 7322794, 7722211, 8066742, 8523084, 9014776, 9571845, 10167542, 10945487, 11720343, 12533356, 13371628, 14234296, 15138485, 15870611, 16412808, 16820104, 16971813, 16975423, 16984979, 16827207, 16671470, 16581484, 16546097, 16635295, 16793271]
5323A6793271L33859N27691N58849N96430Q23267Q73041Q48505Q69355N95770
5314B2820038K19457k26239n04259q38989j017691j138018j145805j062706r35579
5305A6170209q53849p57969p32626n79461n41413m92004l51377l52985k55927
5296A1252598k32459j86571j57060j37992n5076o8033m8793k1028j31003r5197
5286A0119386n1011r0595J4630j21211l9541J2707m200N432k4976J2998N1419
5275I885038L3540N4799O0866J28172J21940J12989J08155J2824K4234L8268O7297
5264A0648122m3748O6381L5009L033M8464Q6156J31641J22868O3663R4630P4929
5253A1331148P4831O4420L1999m6791j08588r1654j02702r3520j21447p9660q4623
$$ y = [16793271, 17127130, 17654821, 18213670, 18810100, 19633367, 20506408, 21354913, 22224268, 22820038, 23039495, 22813256, 22308997, 21470008, 20452317, 19314299, 18168494, 17105788, 16170209, 15316360, 14558391, 13825765, 13246304, 12704891, 12212887, 11861510, 11508525, 11252598, 11020139, 10833568, 10676508, 10538516, 10483440, 10415407, 10366614, 10345586, 10214583, 10119386, 10068375, 9977780, 9992410, 9871199, 9831658, 9844365, 9840165, 9845597, 9820621, 9833619, 9885038, 9918578, 9973377, 10034243, 10162415, 10284355, 10397344, 10505499, 10518323, 10542557, 10580825, 10648122, 10604374, 10670755, 10705764, 10708797, 10757261, 10843417, 10975058, 11097926, 11161589, 11256219, 11331148, 11405979, 11470399, 11502398, 11455607, 11347019, 11255365, 11152663, 11059143, 10937696, 10858036, 10773413]
5242A0773413k0082m3346k1125j9563L5620J3651J7745P3330q1387k2736q8046
5231A0617474j22794n6358p7929l2870q0300o9284m4045m3665o4244n1448l0898
5220I943639J8901j26812r0010j92342j74046j38840k19629j99773k10930j84827
5210H425331j90086j62465j89611j78244j13165p1365p6874j26488r7690r6264
5200G123079j35501j96846k01875j70660j83015j97737k39218j91810j51995j64686
5190E289736j73247j68019j21932r1865j17234j15616q5902o8135k9436r2290
5180D226060j54254r9642j15407j01758j18284n4504j09492n2852q3815k8846
5170C307206m0997q3683j21724j6056n6250p7916k9819k7769j14112n0899k9615
$$ y = [10773413, 10753331, 10709985, 10688860, 10669297, 10704917, 10718568, 10736313, 10809643, 10728256, 10705520, 10617474, 10494680, 10438322, 10360393, 10327523, 10247223, 10177939, 10133894, 10090229, 10025985, 9974537, 9943639, 9962540, 9835728, 9745718, 9553376, 9379330, 9240490, 9020861, 8821088, 8610158, 8425331, 8235245, 8072780, 7883169, 7704925, 7591760, 7520395, 7443521, 7317033, 7219343, 7123079, 6987578, 6790732, 6588857, 6418197, 6235182, 6037445, 5798227, 5606417, 5454422, 5289736, 5116489, 4948470, 4826538, 4734673, 4617439, 4501823, 4415921, 4347786, 4318350, 4226060, 4071806, 3972164, 3856757, 3754999, 3636715, 3582211, 3472719, 3419867, 3336052, 3307206, 3266209, 3182526, 3060802, 3044746, 2988496, 2910580, 2880761, 2852992, 2738880, 2687981, 2658366]
5159B658366L4983l4173q0178k9335k6850L0528M640n1994l1038m2103p086K0752
5147B446512l0623k8842q5482J9294J3149j7060k2138k6963p9208O991J1915l890
5135B203655k7213m7576K4178r635l0873K0290k2914M7924J9418r525o272k5218
5123B136239k2733P0533k111r249l4777K3953J1184o453M6910K7286j03325K8728
5111B166185N7900r2650M234K8254N0485k113j149j0491K7318R849O844J6994
5099B261660j4149J5330J7206j0806O8026p094M8150J9122l841k6325R0025L3513
5087B490817L3720k0457N5465N4028o652P3685J3291j4791Q199J7616j8479m196
5075B682246j9443L9070K7819l886k6950O6331K1056L4021k5255K7936K2316J6520
$$ y = [2658366, 2693349, 2659176, 2578998, 2549663, 2522813, 2553341, 2557981, 2505987, 2474949, 2432846, 2425760, 2446512, 2415889, 2387047, 2301565, 2320859, 2334008, 2316948, 2294810, 2267847, 2188639, 2195630, 2207545, 2203655, 2176442, 2128866, 2153044, 2143409, 2112536, 2132826, 2109912, 2157836, 2177254, 2167729, 2161457, 2136239, 2113506, 2184039, 2181928, 2172679, 2137902, 2161855, 2173039, 2166586, 2213496, 2240782, 2137457, 2166185, 2224085, 2131435, 2135669, 2163923, 2214408, 2212295, 2211146, 2200655, 2227973, 2237822, 2244666, 2261660, 2247511, 2262841, 2280047, 2269241, 2337267, 2330173, 2378323, 2397445, 2393604, 2367279, 2457304, 2490817, 2524537, 2504080, 2559545, 2613573, 2606921, 2680606, 2693897, 2679106, 2687305, 2704921, 2686442, 2682246, 2662803, 2701873, 2729692, 2725806, 2698856, 2765187, 2786243, 2820264, 2795009, 2822945, 2845261, 2861781]
5063B861781O3203K8144N509L0843J0415p966l3534l9364M2842M4745k0696L4646
5051C020568P7052r067L7129L0140n652P5125L3423J8381l6418m970J2517P388
5039C255616J6008p0649J2589K9098K0965j3907m5228K3277L1503j5005K8124
5028C272391j9849k5508k2942N0788N3311L2474L3717J994O054k980j4937k7929
5016C336584O0243K674j7139L650k2327j8098k8202K304K5120k0249l8507j8544
5004C267509n826k6714L0441n631K1058k1812m9218O0297Q8146R187k7930L2997
4992C372504q756Q6413N4191O4620L9063j8042J17511K6695J00405Q9090M6287
4981C969981k541N5578j858m7887o2202N0423k7889J2745L252o3297L4415K9926
$$ y = [2861781, 2924984, 2953128, 2958637, 2989480, 2999895, 2991929, 2958395, 2919031, 2961873, 3006618, 2985922, 3020568, 3097620, 3088553, 3125682, 3155822, 3150170, 3225295, 3258718, 3277099, 3240681, 3235711, 3248228, 3255616, 3271624, 3200975, 3213564, 3242662, 3263627, 3249720, 3204492, 3227769, 3259272, 3244267, 3272391, 3252542, 3227034, 3204092, 3254880, 3308191, 3340665, 3374382, 3376376, 3382430, 3379450, 3364513, 3336584, 3396827, 3399501, 3382362, 3386012, 3363685, 3345587, 3317385, 3319689, 3344809, 3324560, 3286053, 3267509, 3261683, 3234969, 3265410, 3259779, 3280837, 3259025, 3209807, 3270104, 3358250, 3367437, 3339507, 3372504, 3363748, 3450161, 3504352, 3568972, 3608035, 3589993, 3707504, 3734199, 3834604, 3923694, 3969981, 3967440, 4023018, 4021160, 3973273, 3911071, 3961494, 3933605, 3946350, 3949602, 3886305, 3920720, 3950646]
4969C950646j6418j2855P8170J5132N8355L8984J4081L6065Q3293l8742K1730
4958D228441N4212K00p608K3232Q784P226Q3056l876N5647J2929j7586M3051M5741
4945D533449M0240N0189P9560M2387M080K9158K7802r4634k3619n6283L555m9630
4933D586254n0230J6084m7091M75M7224k9640P0453O7878N3379J11362j384L7373
4921D862137J05388O7324M8447O7501Q4114N3277n597n7838J780R4219N0052Q5325
4909E456129M3226Q5969J07036O4038J75240N4817N8637J46932J22786M8853J12991
4898F476654J42311R2372K2121J794P7158N4161M8339N5483R6958R7122N6236
4887G220709J47247J17917J80528J75654K11914K29897K09835K62961L29524L68529
$$ y = [3950646, 3934228, 3921373, 3999543, 4014675, 4073030, 4112014, 4126095, 4162160, 4245453, 4206711, 4228441, 4282653, 4282853, 4275245, 4298477, 4307261, 4314487, 4397543, 4393667, 4449314, 4462243, 4444657, 4487708, 4533449, 4573689, 4623878, 4703438, 4745825, 4749905, 4779063, 4806865, 4712231, 4688612, 4632329, 4635884, 4586254, 4536024, 4552108, 4505017, 4505492, 4552716, 4523076, 4593529, 4661407, 4714786, 4826148, 4824764, 4862137, 4967525, 5034849, 5083296, 5150797, 5234911, 5288188, 5282591, 5224753, 5226533, 5320752, 5370804, 5456129, 5499355, 5585324, 5692360, 5756398, 5931638, 5986455, 6045092, 6192024, 6314810, 6363663, 6476654, 6618965, 6711337, 6733458, 6735252, 6812410, 6866571, 6914910, 6970393, 7067351, 7164473, 7220709, 7367956, 7485873, 7666401, 7842055, 8053969, 8283866, 8493701, 8756662, 9086186, 9454715]
4877I454715L61126L52870L92757M04353M29073M66848M28054M36253M00218K64106
4867A3390373L13689K89614J59608O5609N4067O0851K4009M1301J9355N5152r941
4856A4463687M986J44397J63700J84667K30738K81419L48127L75063M34266M83512
4846A7114562M54460N29071N80553N18973M69386M75463M08480L84729L66368
4837B1302045K87562K02964R4011J43631K4633p6889j58184k19830k68663l99325
4827B0931955m26825m56315n36318n20724n08786m66833m64531l47124l47744
4818A6856755k50520k32638j36692q1223p4629l4138q4127N7378M8314m1850m3184
4807A5983446l1626j00849j39291k35783l61632l52905m66224n88227n61037n50691
$$ y = [9454715, 9815841, 10168711, 10561468, 10965821, 11394894, 11861742, 12289796, 12726049, 13126267, 13390373, 13704062, 13993676, 14153284, 14218893, 14272960, 14333811, 14357820, 14399121, 14418476, 14473628, 14463687, 14468673, 14613070, 14776770, 14961437, 15192175, 15473594, 15821721, 16196784, 16631050, 17114562, 17569022, 18098093, 18678646, 19197619, 19667005, 20142468, 20550948, 20935677, 21302045, 21589607, 21792571, 21886582, 22030213, 22054846, 21977957, 21819773, 21599943, 21331280, 20931955, 20505130, 20048815, 19512497, 18991773, 18482987, 18016154, 17551623, 17204499, 16856755, 16606235, 16373597, 16236905, 16155682, 16081053, 16046915, 15962788, 16020166, 16068480, 16026630, 15983446, 15951820, 15850971, 15711680, 15475897, 15114265, 14761360, 14295136, 13706909, 13145872, 12595181]
4797A2595181n66135o19718n87946n21494n11918m76510m97544m11169m05500
4788G997247l38187k86366l20397l01584k38964k31094k32506j51676j79660k43853
4778E472960j59800j70439j42026j37917j05234j64361j22308j24353q3766m0284
4768D222472o6103j29982k8542n8946o6534n9869m3404p5694m5909l0911p2855
4757C543723p0331q596n682p8129J7956o2866j5666L0745m6732Q837J1989o866
4745C318382q060J825M5620L890N2676N371J3160M6205J3377P856J2972L5717
4733C548991P3470L6266N0915O2379P7369J15013P5550R6904O7230P9281Q9947
4722D373315J31016J68420N1053J38588J19331N3563N8144J55470R1364J43968
$$ y = [12595181, 12029046, 11409328, 10821382, 10299888, 9787970, 9311460, 8813916, 8402747, 7997247, 7659060, 7372694, 7052297, 6750713, 6511749, 6280655, 6048149, 5896473, 5716813, 5472960, 5313160, 5142721, 5000695, 4862778, 4757544, 4593183, 4470875, 4346522, 4262756, 4222472, 4156369, 4026387, 3997845, 3938899, 3872365, 3812496, 3769092, 3693398, 3647489, 3616578, 3543723, 3473392, 3464796, 3459114, 3380985, 3398941, 3336075, 3320409, 3351154, 3304422, 3313259, 3325248, 3318382, 3310322, 3312147, 3357767, 3361657, 3414333, 3419704, 3432864, 3479069, 3492446, 3500302, 3513274, 3548991, 3622461, 3658727, 3709642, 3772021, 3849390, 3964403, 4039953, 4136857, 4204087, 4283368, 4373315, 4504331, 4672751, 4723804, 4862392, 4981723, 5035286, 5093430, 5248900, 5340264, 5484232]
4712E484232J94417J01406J51510K49830J91054K56447K13053K88829L07297L28479
4702G766554L49027M21079M14158M38062N34803N73768M70442O04261O18234O41283
4692A2831671O83361P01743O14358N73759M55641M15631K78106J60783Q2957P3204
4682A6871214k7633r2975l2053j19727o8810J9803m888N0105R7016J53972J92515
4671A7038539K33872M10251M17175M54387M49720M80650N16657M28890L97340
4662B0827481L82241K13354J81262Q2730N1j19157j24593j23579j24880k63602
4652B0931308l19242l19615l86854m78710n51195n80422n66295n71936n27626
4643A6629413m69944m99292l71484l29451k89216k03883j94007j15569j53973
$$ y = [5484232, 5678649, 5780055, 5931565, 6181395, 6372449, 6628896, 6841949, 7130778, 7438075, 7766554, 8115581, 8536660, 8950818, 9388880, 9923683, 10497451, 10967893, 11572154, 12190388, 12831671, 13515032, 14216775, 14831133, 15404892, 15860533, 16276164, 16554270, 16715053, 16798010, 16871214, 16843581, 16750606, 16718553, 16598826, 16530016, 16549819, 16544931, 16595036, 16692052, 16846024, 17038539, 17272411, 17682662, 18099837, 18554224, 19003944, 19484594, 20001251, 20430141, 20827481, 21209722, 21423076, 21604338, 21687068, 21687119, 21567962, 21443369, 21319790, 21194910, 20931308, 20612066, 20292451, 19905597, 19426887, 18875692, 18295270, 17728975, 17157039, 16629413, 16159469, 15660177, 15288693, 14959242, 14670026, 14466143, 14272136, 14156567, 14002594]
4634A4002594j5641m4963J1056N8580M4299n5836R116r6749k81398k71220l21719
4623A3038119l59864m74637n18100n59036o23608n36226m89708m19580m36655
4614H620705m67192l81111l04754l53166k88455k70056k34712k43143k28772k16986
4604E632358k23505j57671j68844j28228j39128j45116j70801j27341r2992o5962
4594D212770n0234q7267o1818n4446j23721q0743n7442j5265q8062j05254r503
4583C479015q5394q8017l3908l3475j0517n9590n2543R177K3730N81k6434j1565
4571C111060Q257J533n718j582j1425l4263K5516J1856o3667o5076l5320L2722
4559B973893k7627n4300o2872n206m6005o4542Q584m1024j05298k9269p8083j3131
$$ y = [14002594, 13986953, 13941990, 13953046, 14011626, 14055925, 14000089, 14009205, 13912456, 13631058, 13359838, 13038119, 12678255, 12203618, 11685518, 11126482, 10502874, 9966648, 9476940, 9057360, 8620705, 8153513, 7772402, 7467648, 7114482, 6826027, 6555971, 6321259, 6078116, 5849344, 5632358, 5408853, 5251182, 5082338, 4954110, 4814982, 4669866, 4499065, 4371724, 4278732, 4212770, 4162536, 4075269, 4013451, 3959005, 3835284, 3754541, 3697099, 3681834, 3593772, 3488518, 3479015, 3393621, 3305604, 3271696, 3238221, 3227704, 3168114, 3115571, 3124748, 3148478, 3149059, 3122625, 3111060, 3119317, 3120850, 3115132, 3113550, 3102125, 3067862, 3093378, 3105234, 3041567, 2976491, 2941171, 2973893, 2946266, 2891966, 2829094, 2823888, 2777883, 2713341, 2721925, 2680901, 2575603, 2546334, 2468251, 2455120]
4547B455120l7689n0901l3390R049l0546l8436J559k3009m6436l1700m388l1324
4535B137909j4023P001o4076R627J3855L6614p922K626p610l5212J4025k1934
4523B070880l7949j7231Q5580L2206M1388j9602O6740K6813j0638j687N6846p141
4511B286205K1997J6730j0759K2184M9732K0727o0981o8897k1035J5739L920k2424
4499B253138m551l5669P0945k7302J3681m0535K4824K9625l2061l5817m9651j0210
4487B156417p0605n9297l4320m3066R769p0296K8505p8859o2528J2016j4393K3709
4475A797052R519K765j5743J0796m668N6674l3547j3344J5070j0292L4247M9670
4463A898199k0767o546O3015O823J469r843K3922J9561O262K5075m4372J6619
$$ y = [2455120, 2417431, 2366530, 2333140, 2342189, 2311643, 2273207, 2274766, 2251757, 2205321, 2173621, 2169233, 2137909, 2123886, 2130887, 2066811, 2076438, 2090293, 2126907, 2118985, 2121611, 2114001, 2078789, 2092814, 2070880, 2032931, 2015700, 2101280, 2133486, 2174874, 2155272, 2222012, 2248825, 2238187, 2236500, 2293346, 2286205, 2308202, 2324932, 2314173, 2336357, 2386089, 2406816, 2345835, 2276938, 2255903, 2271642, 2275562, 2253138, 2248587, 2212918, 2283863, 2256561, 2270242, 2229707, 2254531, 2284156, 2252095, 2216278, 2166627, 2156417, 2085812, 2026515, 1992195, 1949129, 1958898, 1888602, 1917107, 1838248, 1775720, 1787736, 1773343, 1797052, 1806571, 1809336, 1793593, 1804389, 1799721, 1856395, 1822848, 1809504, 1824574, 1814282, 1848529, 1898199, 1877432, 1870886, 1933901, 1940724, 1942193, 1932350, 1956272, 1975833, 1982095, 2007170, 1962798, 1979417]
4451A979417N8077L3428O9852K6236M2944M6276R5413N6593J21195R3321O8012
4440B690764J00231J19694J14536J39518K48490K44320K68516L47942M91413O02571
4430E367995O15953M76071K24116j91534m94733o12636n69160n00998l64061k69735
4420C681278j63407j71722j63515o2466n9181j13020l5639o8993l9214p5281P159
4409B735999k1519o707N3432K0119l1467P120j9242L0131O0282M9969M1839O07
4397B920563q281Q9298j9117k6777P7996Q4411k654n354J04504R3546J18029J68751
4385C594915J80526J57025J95230J96314L18624L44385M11276M97711N62750N14073
4375F972829K77723P9181l45583n18904n49940m96693l80859k97823k89189j48400
$$ y = [1979417, 2037494, 2070922, 2140774, 2167010, 2209954, 2256230, 2351643, 2408236, 2529431, 2622752, 2690764, 2790995, 2910689, 3025225, 3164743, 3413233, 3657553, 3926069, 4274011, 4765424, 5367995, 5983948, 6460019, 6684135, 6492601, 5997868, 5385232, 4816072, 4315074, 3951013, 3681278, 3517871, 3346149, 3182634, 3120168, 3060987, 2947967, 2912328, 2843335, 2804121, 2728840, 2735999, 2714480, 2707773, 2761205, 2781324, 2749857, 2756977, 2737735, 2767866, 2828148, 2878117, 2919956, 2920563, 2912282, 3001580, 2982463, 2955686, 3033682, 3118093, 3115439, 3110085, 3214589, 3308135, 3426164, 3594915, 3775441, 3932466, 4127696, 4324010, 4642634, 4987019, 5398295, 5896006, 6458756, 6972829, 7250552, 7329733, 6984150, 6465246, 5915306, 5418613, 5037754, 4739931, 4450742, 4302342]
4365D302342m8802m2443m2142j2700o4917j4954j7115N6368N653K1407Q7591J664
4353D231952j8859L4516O9234L6212O6616J5303j8453M3505Q5283N281N1161O5632
4341D667383J49903N2862N1256J79724J83412J41936J03697J95856J66296K02083
4331F094408K48833J79820J62978K16575J77288J24919P2790J3544k0533n3959
4321G216663m4903p2824K7J5138J0621L4088J06371K3545R1149O2299J05358Q389
4309G555921K5504l4146r7632j41624j12703r9110j22980j31939o7621q337o5682
4298F699651n8005R290k7423J9378N3492J20446P0325J04489J53845J44336J40883
4287G430707J50432J92479K31619K27418L14429K68850L56955L78450J85050J34079
$$ y = [4302342, 4253540, 4211097, 4168955, 4156255, 4091338, 4076384, 4059269, 4115637, 4121290, 4142697, 4230288, 4231952, 4213093, 4247609, 4316843, 4353055, 4419671, 4434974, 4416521, 4460026, 4545309, 4550590, 4601751, 4667383, 4817286, 4870148, 4921404, 5101128, 5284540, 5426476, 5530173, 5726029, 5892325, 6094408, 6343241, 6523061, 6686039, 6902614, 7079902, 7204821, 7277611, 7291155, 7270622, 7216663, 7171760, 7098936, 7098963, 7114101, 7124722, 7158810, 7265181, 7288726, 7379875, 7442174, 7547532, 7555921, 7581425, 7547279, 7449647, 7308023, 7195320, 7096210, 6973230, 6841291, 6773670, 6765333, 6699651, 6641646, 6650936, 6623513, 6642891, 6696383, 6816829, 6887154, 6991643, 7145488, 7289824, 7430707, 7581139, 7773618, 8005237, 8232655, 8547084, 8815934, 9172889, 9551339, 9736389, 9870468]
4277I870468K04520J4048q3858j19427j30831j04759j77771l3306m0662k0396
4267I378026N2900K6229O1835M6872j3992j8167j25171j88616k99990k56873k74320
4256H388733l69360k84824k78355k49260k13129k01983j32570j42450j28228p9025
4246F309549m8322o5131k0707N887K1964M9827J15988N1042J32176J13866J58419
4235F824558J54636K06709K39072K02686K53763K83437K74018K22491J58063P9809
4225H899242l3506j26930j51236k46505k42193k09723j79478j75644j43972m9678
4215G340377o2059q5178o8980L662J7077m767N2331J34965J23056J46256J86152
4204G782892J87696J56497K52621K17578L03598K07824K03127K60813J80162J30879
$$ y = [9870468, 10074988, 10089036, 10005178, 9885751, 9754920, 9650161, 9472390, 9439084, 9398422, 9378026, 9430926, 9457155, 9518990, 9565862, 9551870, 9533703, 9408532, 9219916, 8919926, 8663053, 8388733, 8019373, 7734549, 7456194, 7206934, 6993805, 6791822, 6659252, 6516802, 6388574, 6309549, 6261227, 6196096, 6175389, 6181276, 6203240, 6253067, 6369055, 6420097, 6552273, 6666139, 6824558, 6979194, 7185903, 7424975, 7627661, 7881424, 8164861, 8438879, 8661370, 8819433, 8899242, 8865736, 8738806, 8587570, 8341065, 8098872, 7889149, 7709671, 7534027, 7390055, 7340377, 7278318, 7193140, 7124160, 7127822, 7144899, 7140132, 7192463, 7327428, 7450484, 7596740, 7782892, 7970588, 8127085, 8379706, 8597284, 8900882, 9108706, 9311833, 9572646, 9752808, 9883687]
4194I883687O6185n7907r8403j75953k26351j88738j70701j84748j61901o2120
4184H623050o4554n2956M4847L120J07541J00866L2915l1188k0787m6936j2401
4173H683517k7314q6223j602j4564M2579Q5544J20994J44294O9396J21363J52446
4162I290430J03663J39900J10841J19417J25895J19639R7374J13833J14239J11731
4152A0446962R4235J53789P9995O3414L1698Q3744n061j03910n3175j60124k60960
4141A0370607k20626k19943k15182k30962j71035j70283k00497j55977j26455
4132H659647j31355l6157j23716l4630j43879j64016j12824j79852n8922j16860
4122G557436j23434j16226j05332j11380r6318j07387j32263j33052j71025n2189
$$ y = [9883687, 9949872, 9891965, 9793562, 9617609, 9391258, 9202520, 9031819, 8847071, 8685170, 8623050, 8558496, 8505540, 8550387, 8553507, 8661048, 8761914, 8794829, 8763641, 8742854, 8695918, 8683517, 8656203, 8569980, 8568378, 8553814, 8596393, 8681937, 8802931, 8947225, 9016621, 9137984, 9290430, 9394093, 9533993, 9644834, 9764251, 9890146, 10009785, 10107159, 10220992, 10335231, 10446962, 10541197, 10694986, 10774981, 10838395, 10870093, 10953837, 10948776, 10844866, 10791691, 10631567, 10370607, 10149981, 9930038, 9714856, 9483894, 9312859, 9142576, 8942079, 8786102, 8659647, 8528292, 8492135, 8368419, 8333789, 8189910, 8025894, 7913070, 7733218, 7674296, 7557436, 7434002, 7317776, 7212444, 7101064, 7004746, 6897359, 6765096, 6632044, 6461019, 6408830]
4112F408830j15362r4652M5070j7669n6802m6849q2242p0549m1661p4513m2984
4101E810617k4344j28828l3907l8373N632p7957j17787o4587r9425m4075m1372
4090E145594M8921o1870o7552m4900l6822j4398K0788l9146q8064J7621m1974
4079D838198l427L9435L699q538L14n274n4848p023J4477M0043P3262M4084J6676
4066D991078N5642K6919k7003j776j950K5229k5638o7010o177q201o2144n41m9456
4053D848972k4240J9636k5346l4405j3748m8139J5846j726O484r848o0248l2816
4041D640422Q494P7394O767l3247K6239M8381J7443J6492j8507L1674K481L4532
4029D858565m3689M1080L5570O3631K8291k6892L0008J5781M8596R2587j9255
$$ y = [6408830, 6293468, 6198816, 6243886, 6226217, 6169415, 6122566, 6040324, 5969775, 5928114, 5853601, 5810617, 5786273, 5657445, 5623538, 5585165, 5590797, 5512840, 5395053, 5330466, 5231041, 5186966, 5145594, 5194515, 5132645, 5065093, 5020193, 4983371, 4968973, 4989761, 4950615, 4862551, 4880172, 4838198, 4834771, 4874206, 4877905, 4869367, 4869681, 4864407, 4809559, 4802536, 4817013, 4857056, 4930318, 4974402, 4991078, 5046720, 5073639, 5046636, 5044860, 5042910, 5068139, 5042501, 4975491, 4969314, 4961113, 4898969, 4898428, 4848972, 4824732, 4844368, 4819022, 4784617, 4770869, 4722730, 4738576, 4736850, 4743334, 4733486, 4673238, 4640422, 4648916, 4726310, 4733077, 4699830, 4726069, 4774450, 4791893, 4808385, 4789878, 4821552, 4824033, 4858565, 4814876, 4855956, 4891526, 4955157, 4983448, 4956556, 4986564, 5002345, 5050941, 5143528, 5124273]
4018E124273R131R9863N0869k5827L2837K9770P5398N1407O4707O6688J60294
4007E739410M8342J02937J09654J32663K01736J79451J93874K19637K53524K62239
3997G443467L99636L87562M51676N35845N44624P28966P65880P47730N97863J46985
3987A2750234k36155n69750p42354p69870o73276n66349m53368m12993k77912
3978H048207l40052k58486j64241j61781j17295j09192p9960q8444l1230j8915
3968F678611l2098n470r265k8013l3121m0168j5148L7977j4392N2845j4146R206
3956F586818P3055O0463L7764Q0687N6622P1084L2412J09247M2435R4172J67024
3945G411783J25574J03909J00732J74495J42231J93866J41492J46958J88749J63650
$$ y = [5124273, 5133404, 5233267, 5284136, 5258309, 5291146, 5320916, 5396314, 5447721, 5512428, 5579116, 5739410, 5787752, 5890689, 6000343, 6133006, 6334742, 6514193, 6708067, 6927704, 7181228, 7443467, 7843103, 8230665, 8682341, 9218186, 9762810, 10491776, 11257656, 12005386, 12603249, 12750234, 12514079, 11944329, 11201975, 10432105, 9758829, 9192480, 8739112, 8326119, 8048207, 7708155, 7449669, 7285428, 7123647, 7006352, 6897160, 6817200, 6728756, 6697526, 6678611, 6646513, 6641043, 6631778, 6603765, 6570644, 6530476, 6515328, 6553305, 6538913, 6591758, 6577612, 6586818, 6659873, 6720336, 6758100, 6838787, 6895409, 6966493, 6998905, 7108152, 7150587, 7244759, 7411783, 7537357, 7641266, 7741998, 7916493, 8058724, 8252590, 8394082, 8541040, 8729789, 8893439]
3935H893439J21457K23665J85025J69681K05997K28582K58294K81314L14536L13178
3925A1195168L70320L91191M52146M72576N65034O09664O69343P15516P02402
3916A6143360O43141N10054L68069K57682R1360L5173J9561R9373J54139L24208
3906A8646120M68736N64861P18137Q68923J004844J208051J409546J538354J827012
3897B8254584K084538K380907K860051L305994L930185M664493N453066O389595
3889E9323413P111115P687451P632783N640964K328113r41578l185770m511712
3881H1084779n275567n302110n169702m931324m565629m045537l630663l124304
3873D5039943k602586k177371j760274j404084j137379j137521j223499j108045
$$ y = [8893439, 9014896, 9238561, 9423586, 9593267, 9799264, 10027846, 10286140, 10567454, 10881990, 11195168, 11565488, 11956679, 12408825, 12881401, 13446435, 14056099, 14725442, 15440958, 16143360, 16786501, 17296555, 17664624, 17922306, 18013666, 18048839, 18068400, 18167773, 18321912, 18646120, 19114856, 19679717, 20397854, 21266777, 22271621, 23479672, 24889218, 26427572, 28254584, 30339122, 32720029, 35580080, 38886074, 42816259, 47480752, 52933818, 59323413, 66434528, 74121979, 81754762, 87395726, 89723839, 88782261, 85596491, 81084779, 75809212, 70507102, 65337400, 60406076, 55840447, 51794910, 48164247, 45039943, 42437357, 40259986, 38499712, 37095628, 35958249, 34820728, 33597229, 32489184]
3865C2489184j073829r44436q65381p20752o40496m85134m13618l55231k61427
3856B6728880l0565O2369K75725L73386N07303O10983O46514P21526O24603M84656
3846C1005380O9352m41223q23276j076168j150570j105887r38300q24541p13670
3837B4001097n32272l48462j76092j01138J42331K08369L05272M49249M64200
3828B4412554L16762q1531k59612k91345l16071j84670m3948J65542L51022O29284
3818B4697987Q67571R92570J296517J594195J880517K245079K779409L267954
3810C9621799L703409L857075K906989L44156j953990l079806l741530l698707
3802C7959395l137732k468703j956125j512264j142713r82633p16041n27429m76881
$$ y = [32489184, 31415355, 30470919, 29605538, 28884786, 28244290, 27759156, 27345538, 26990307, 26728880, 26698315, 26760684, 27036409, 27409795, 27917098, 28528081, 29174595, 29896121, 30520724, 31005380, 31074732, 30633509, 29810233, 28734065, 27583495, 26477608, 25539308, 24714767, 24001097, 23468825, 23120363, 22944271, 22843133, 22985464, 23193833, 23499105, 23948354, 24412554, 24729316, 24647785, 24388173, 24096828, 23780757, 23596087, 23552139, 23717681, 24068703, 24697987, 25565558, 26558128, 27854645, 29448840, 31329357, 33574436, 36353845, 39621799, 43325208, 47182283, 50089272, 50433428, 48479438, 45399632, 41658102, 37959395, 34821663, 32352960, 30396835, 28884571, 27741858, 26759225, 26043184, 25515755, 25038874]
3793B5038874k82351j90193o5733m3778J18403J02726K61526K89394M13117N51973
3783B6193958O39380P55833R23764J056011J137250J249280J395381J441164J303599
3774C6095620J158133J035297Q79121Q49661R82031R91957J037846J207040J244179
3765D5480885J163644R77887O35337K40751j83463n03806p69238q94785r31412
3756D5215800r07194q36717p14029n47414m78887l65414k96775l26282k88132
3747D0454956l11522l25672l44268l11333k56702k26569k79998k58187k91250
3738C7849455l00946l50387m21680m59364n13175n86971p26199o52703o59559
3729C3178471p00684o88180o28650o99835o67657p10860p53902p85511p77313
$$ y = [25038874, 24756523, 24566330, 24500597, 24456819, 24575222, 24677948, 24939474, 25228868, 25641985, 26193958, 26833338, 27589171, 28512935, 29568946, 30706196, 31955476, 33350857, 34792021, 36095620, 37253753, 38289050, 39168171, 40017832, 40999863, 41991820, 43029666, 44236706, 45480885, 46644529, 47622416, 48257753, 48498504, 48315041, 47811235, 47041997, 46147212, 45215800, 44308606, 43471889, 42757860, 42210446, 41731559, 41366145, 41069370, 40743088, 40454956, 40143434, 39817762, 39473494, 39162161, 38905459, 38678890, 38398892, 38140705, 37849455, 37548509, 37198122, 36776442, 36317078, 35803903, 35216932, 34490733, 33838030, 33178471, 32477787, 31789607, 31160957, 30461122, 29793465, 29082605, 28328703, 27543192, 26765879]
3720B6765879q28696q40345q30882q89614q14657p80108q17509p09809o57516
3711A9596743p31440o78162o65965o77551o18606o65642o11522n56823n94037
3702A3796995m72976n15311m70046m37674m11967l96771m45288l99612l57267
3693I890083l27692k74454k92264k53104k55601k71611k70666j76649j79103k64956
3683G323983k57244j31725j17223j47752k05752j90599j58401j41195j06752j17834
3673E749506j95676j03833j11787j09765q0723j39569j05719p5656p5929j37788
3663D613061j61586m7418l0844n7665j06090j06714l6914p8336j02276n3568n2256
3652C779394o0071q1215q1327j5678o4419n5549k1033j17339n0119l2360j8232
$$ y = [26765879, 25937183, 25096838, 24265956, 23376342, 22561685, 21781577, 20964068, 20254259, 19596743, 18865303, 18187141, 17521176, 16843625, 16225019, 15559377, 14947855, 14391032, 13796995, 13324019, 12808708, 12338662, 11900988, 11489021, 11092250, 10646962, 10247350, 9890083, 9562391, 9287937, 8995673, 8742569, 8486968, 8215357, 7944691, 7768042, 7588939, 7323983, 7066739, 6935014, 6817791, 6670039, 6464287, 6273688, 6115287, 5974092, 5867340, 5749506, 5553830, 5449997, 5338210, 5228445, 5147722, 5008153, 4902434, 4826778, 4750849, 4613061, 4451475, 4404057, 4373213, 4315548, 4209458, 4102744, 4065830, 3987494, 3885218, 3831650, 3779394, 3719323, 3638108, 3556781, 3541103, 3476684, 3421135, 3400102, 3282763, 3232644, 3200284, 3182052]
3641C182052l2629m0245k6786q652p9077m7006k4388m3851N119r1302O0602P540
3629B861377k4469M8341K1497N1841J3706L004k7733k0455p6905j5186o464l2006
3617B796548n2767l9135l0013k7797n022l1177l4828l6875J1697M330M5548l8824
3605B561685N0907M7558j8542j7574K8352O8545J6407L4421M5659O0476L3159
3594B911053L5387R9846J13040J23343K03159J43578J79843L05452K39736L31911
3584D686348L46354L77471M33801M65486M31912K62790p2493l04360l98536n16660
3574E712113n31594m90161l68683l32055l04710j93515k58755j74211j29907j67806
3564B760716o3617q6170j16647q4893p5969j04553q2345J2466j8808p4144r4721
$$ y = [3182052, 3149423, 3109178, 3082392, 3073740, 2994663, 2947657, 2923269, 2879418, 2884537, 2793235, 2853837, 2861377, 2836908, 2885249, 2906746, 2958587, 2972293, 2975297, 2947564, 2927109, 2850204, 2835018, 2828554, 2796548, 2743781, 2704646, 2674633, 2646836, 2641814, 2610637, 2575809, 2538934, 2550631, 2554961, 2600509, 2561685, 2612592, 2660150, 2641608, 2624034, 2652386, 2720931, 2737338, 2771759, 2817418, 2877894, 2911053, 2946440, 3046286, 3159326, 3282669, 3485828, 3629406, 3809249, 4114701, 4354437, 4686348, 5032702, 5410173, 5843974, 6309460, 6741372, 7004162, 6931669, 6627309, 6228773, 5712113, 5180519, 4690358, 4321675, 3989620, 3684910, 3491395, 3232640, 3058429, 2928522, 2760716, 2697099, 2610929, 2494282, 2409389, 2333420, 2228867, 2146522, 2158988, 2140180, 2066036, 1971315]
3553A971315m2243l2051M155m5036O777n6480J0037K3612j9971K439k8222o0125
3541A734207n1732n7847n5737R723m5054l2529j1990j1856j4055j5503K974j8209
3529A432392L6109k157k5613J9907P1401k5525n7507l4262J1875j0461n374K6980
3517A437765M7212j4873K3922L0872m0312n1680j8754J8945o208K0802m4276o3442
3505A339973o080R3847k6723j2721m0489J6942q418j8306N875k0882l2882K6184
3493A316320k693l2009J2940O5941J7956J3380J042K9491J3284j9231j5390K4080
3481A425111L4268N5788M7519N9604K6421J5329K8445N6835K9371K328R268J31333
3469A921620P0818Q2520o99o5810J9495J0379l6802l0965O5609M1210k0379j1825
$$ y = [1971315, 1929072, 1897021, 1901176, 1856140, 1862917, 1806437, 1816474, 1840086, 1820115, 1822554, 1794332, 1734207, 1682475, 1624628, 1568891, 1578614, 1533560, 1501031, 1489041, 1477185, 1463130, 1447627, 1450601, 1432392, 1468501, 1466344, 1440731, 1460638, 1532039, 1506514, 1449007, 1414745, 1426620, 1416159, 1410785, 1437765, 1484977, 1470104, 1494026, 1524898, 1484586, 1432906, 1414152, 1433097, 1426889, 1447691, 1403415, 1339973, 1333893, 1427740, 1401017, 1388296, 1347807, 1364749, 1356331, 1338025, 1343900, 1323018, 1290136, 1316320, 1313627, 1281618, 1294558, 1360499, 1378455, 1391835, 1392877, 1422368, 1435652, 1416421, 1401031, 1425111, 1459379, 1515167, 1562686, 1622290, 1648711, 1664040, 1692485, 1749320, 1778691, 1781019, 1790287, 1921620, 1992438, 2074958, 2074259, 2008449, 2027944, 2038323, 2001521, 1970556, 2036165, 2077375, 2056996, 2045171]
3457B045171k3119P2415q277n4791o3977k1313k9845j23k8458m0514M3121k7415
3445A862875m0993o0086n7058n0090J3139L3304m3762j2604J3472k7398J7744
3434A648543k8290M4104J9012L3366j1477l6026K0238Q1966m0826J1262J014l4413
3422A708473L2810L9272M2821K2408N5015J4718N1209M209n0950l412J6616L2992
3410A966181P673L92M6671k1215P55j7685N3345K8358Q612j1428n2282Q2461N0916
3397B142754L8444L6939K433o5626P4218O2840M1855K8999M9936L9325O7831N1977
3385B571925l410M0371M9890j5548O3620R5779K6787p79N7662P4116J10901Q1020
3373C152334O9890R3831R9232O3559J16715Q9546Q1561M8344M4844O8404J06364
$$ y = [2045171, 2022052, 2094467, 2086190, 2031399, 1967422, 1946109, 1916264, 1916141, 1887683, 1847169, 1890290, 1862875, 1821882, 1761796, 1704738, 1654648, 1667787, 1701091, 1657329, 1644725, 1658197, 1630799, 1648543, 1620253, 1664357, 1683369, 1716735, 1705258, 1669232, 1689470, 1771436, 1730610, 1741872, 1742886, 1708473, 1741283, 1780555, 1823376, 1845784, 1900799, 1915517, 1966726, 1970935, 1919985, 1916573, 1933189, 1966181, 1973854, 1974246, 2020917, 1999702, 2000457, 1982772, 2036117, 2064475, 2073087, 2061659, 2009377, 2091838, 2142754, 2181198, 2218137, 2220570, 2154944, 2229162, 2292002, 2333857, 2362856, 2412792, 2452117, 2519948, 2571925, 2568515, 2608886, 2658776, 2643228, 2706848, 2802627, 2829414, 2828635, 2886297, 2960413, 3071314, 3152334, 3222224, 3316055, 3415287, 3478846, 3595561, 3685107, 3766668, 3815012, 3859856, 3928260, 4034624]
3362D034624J17447J01300K6789L5194M3380J3167Q3046k91m1331Q2621J003K4516
3350D521465N8191k8027j0871p4672j7302N9101N4644n2342m1041o3217J8862
3339D424791K2128p8443l4472n9715j3120L0391J4587K6391k1185m0M9283k711
3327D357885M1012K2178j8941N5253j3812M3376N4646R9240j0994p443R1100K6343
3315D739843Q0023M5844Q4689P7239R6878J17507P5406J22814R4342J80553J17737
3304E832875R5051Q9492J45971J08278N0425Q0259L8521M2005O5544Q8860M8256
3293F685537L736J3078M7302K6389J7422j684j6164k1878L3863k1201k7169P040
3281F746271n0334j2699m5926j5435p5993K7253n0575k1789L8793L1727r473O4034
$$ y = [4034624, 4152071, 4253371, 4280160, 4315354, 4358734, 4371901, 4454947, 4454656, 4413325, 4495946, 4496949, 4521465, 4579656, 4551629, 4540758, 4466086, 4448784, 4507885, 4562529, 4510187, 4469146, 4405929, 4424791, 4446919, 4368476, 4334004, 4274289, 4261169, 4291560, 4306147, 4332538, 4311353, 4311313, 4360596, 4357885, 4398897, 4421075, 4402134, 4457387, 4443575, 4486951, 4541597, 4640837, 4629843, 4622400, 4713500, 4739843, 4819866, 4865710, 4950399, 5027638, 5124516, 5242023, 5317429, 5440243, 5534585, 5715138, 5832875, 5927926, 6017418, 6163389, 6271667, 6322092, 6402351, 6440872, 6482877, 6548421, 6637281, 6685537, 6689273, 6702351, 6749653, 6776042, 6793464, 6791780, 6775616, 6753738, 6787601, 6766400, 6739231, 6746271, 6695937, 6683238, 6637312, 6621877, 6545884, 6573137, 6522562, 6500773, 6539566, 6571293, 6561820, 6625854]
3269F625854P1206M3541L9500K1475L1043Q4240J00603P5985L4274O2742J07304
3258G297767N4251J05745J07633O4111N2885R1425Q2931J00083J14180J33213
3248H204224J07171J01038J84825Q5469J01526J21242P9455J13976J26623J60753
3238I386302J12331J96751J45396J31511J44288K05474J92444J54753J67822K23080
3228A1060152K00860J78579K28387K90205K22432K24627K50559K54552K30021
3219A3140374K37947K66294K50558K96058K34853J67791K74524J85993J56139
3210A5210531K09539K58765J78811J31575K12682J36932J92155J92066K15748
3201A6938804K43374K45772L02821K50731L02979K82233L62962L82084L52275
$$ y = [6625854, 6697060, 6740601, 6780101, 6801576, 6832619, 6916859, 7017462, 7093447, 7127721, 7190463, 7297767, 7352018, 7457763, 7565396, 7629507, 7682392, 7773817, 7856748, 7956831, 8071011, 8204224, 8311395, 8412433, 8597258, 8682727, 8784253, 8905495, 8984950, 9098926, 9225549, 9386302, 9498633, 9695384, 9840780, 9972291, 10116579, 10322053, 10514497, 10669250, 10837072, 11060152, 11261012, 11439591, 11667978, 11958183, 12180615, 12405242, 12655801, 12910353, 13140374, 13378321, 13644615, 13895173, 14191231, 14426084, 14593875, 14868399, 15054392, 15210531, 15420070, 15678835, 15857646, 15989221, 16201903, 16338835, 16530990, 16723056, 16938804, 17182178, 17427950, 17730771, 17981502, 18284481, 18566714, 18929676, 19311760, 19664035]
3192A9664035M59307M97711M78046M96806N96174P05630P01499P11542P53551
3183B5064301P44250Q04050P88908P58807Q03716Q14885Q38403Q55185Q68314
3174C2340819Q89007Q93925R37884R56507Q81201Q21023P96242O81674N75036
3165C9773318M35340K92204R4709j9450o8431j36862k90232l55499l92256l58356
3155C8974485m25334m58712n56402n91596o19023p37930p58500q73427q77773
3146C3075788q12805q18557p71812p77070p19563o06176m92557m04869l79630
3137B7292749k29972j95268j27345j21336j1495O7614J28382J37241J37434J71371
3127B7249375K84977L00864M14185M38258L93615N22288O15028O06487O17993
$$ y = [19664035, 20123342, 20621053, 21099099, 21595905, 22192079, 22897709, 23599208, 24310750, 25064301, 25808551, 26612601, 27401509, 28160316, 28964032, 29778917, 30617320, 31472505, 32340819, 33229826, 34123751, 35061635, 36018142, 36899343, 37720366, 38516608, 39198282, 39773318, 40208658, 40500862, 40595571, 40576121, 40507690, 40370828, 40080596, 39725097, 39332841, 38974485, 38549151, 38090439, 37534037, 36942441, 36323418, 35585488, 34826988, 33953561, 33075788, 32262983, 31444426, 30672614, 29895544, 29175981, 28569805, 28077248, 27672379, 27292749, 27062777, 26867509, 26740164, 26618828, 26607333, 26674947, 26803329, 26940570, 27078004, 27249375, 27534352, 27835216, 28249401, 28687659, 29081274, 29603562, 30218590, 30825077, 31443070]
3118C1443070O80562P63868Q38140R38443R51823J029599J123517J149496J241877
3109D0160395J386106J487645J520860J661586J705727J730803J755612J797646
3101E3206380J732640J689730J568860J476486J364777J248033J155809J100588
3093F4543303J092822J005467J004920R79842R24393Q12644P21147O62643O48943
3084G2396124N89542M24022M32487M65841M68632M62040N00342O12610P23491
3075G7075131Q25215R74084J131359J344277J446486J632329J786146J966993
3067H8182020K019718K080546K088786K054442J905534J822636J743080J603594
3059A03500356J488520J453174J435191J287112J374409J430313J398308J314908
$$ y = [31443070, 32123632, 32887500, 33725640, 34664083, 35615906, 36645505, 37769022, 38918518, 40160395, 41546501, 43034146, 44555006, 46216592, 47922319, 49653122, 51408734, 53206380, 54939020, 56628750, 58197610, 59674096, 61038873, 62286906, 63442715, 64543303, 65636125, 66641592, 67646512, 68626354, 69550747, 70363391, 71084538, 71747181, 72396124, 72985666, 73409688, 73842175, 74308016, 74776648, 75238688, 75739030, 76351640, 77075131, 77900346, 78874430, 80005789, 81350066, 82796552, 84428881, 86215027, 88182020, 90201738, 92282284, 94371070, 96425512, 98331046, 100153682, 101896762, 103500356, 104988876, 106442050, 107877241, 109164353, 110538762, 111969075, 113367383, 114682291]
3051A14682291J326186J299349J200823J093026J013169J001596R54653R91541
3043A23562634R82428J027155J048686R88670R58241R50641Q47583P16846N98319
3034A31681203L84478K41977J27304k2592k24953l19883n35628p48529q13605
3025A29769772j115243j320560j456152j689687j793625j968563k023444k020330
3017A16382168k068863k027841k033478j919667j812809j831720j720069j639385
3009A01328336j515119j396350j254808j154173j092268r45522q51957p53497
3001I2364642o31570m45120l97258l67646l59298k94808k17935k73969k00904
2992H9176134j82906k73399l17605k93211l54042n62058o77726p42709r48723
$$ y = [114682291, 116008477, 117307826, 118508649, 119601675, 120614844, 121616440, 122571093, 123562634, 124545062, 125572217, 126620903, 127609573, 128567814, 129518455, 130366038, 131082884, 131681203, 132065681, 132307658, 132434962, 132412370, 132187417, 131867534, 131331906, 130583377, 129769772, 128654529, 127333969, 125877817, 124188130, 122394505, 120425942, 118402498, 116382168, 114313305, 112285464, 110251986, 108332319, 106519510, 104687790, 102967721, 101328336, 99813217, 98416867, 97162059, 96007886, 94915618, 93970096, 93118139, 92364642, 91733072, 91287952, 90890694, 90523048, 90163750, 89868942, 89651007, 89377038, 89176134, 88993228, 88719829, 88402224, 88109013, 87754971, 87192913, 86515187, 85772478, 84823755]
2983H4823755j096880j114657j167119j267973j333610j241877j269250j297279
2975G5035110j286379j325225j269323j326318j258299j167529j200542j187699
2967F5013796j025682r75670q72737q10252o59411n55743m39179k65076k01111
2958E9208935q6246j6512J04538K63153K75860L29262M89055N19317N68960P15844
2948F2372166P94772R76127J156481J256784J333892J650312J755723J918151
2940G3214408K129314K179581K219365K258598K250021K224990K075694J956377
2932I0508348J862700J678140J443099J259791J092638R38782P41417M44079K51687
2923A00220681L1523j67220m92112p26581j034731j206561j395791j662835j760227
$$ y = [84823755, 83726875, 82612218, 81445099, 80177126, 78843516, 77601639, 76332389, 75035110, 73748731, 72423506, 71154183, 69827865, 68569566, 67402037, 66201495, 65013796, 63988114, 63012444, 62139707, 61329455, 60670044, 60114301, 59675122, 59410046, 59208935, 59122689, 59106177, 59210715, 59473868, 59749728, 60078990, 60568045, 61087362, 61656322, 62372166, 63166938, 64143065, 65299546, 66556330, 67890222, 69540534, 71296257, 73214408, 75343722, 77523303, 79742668, 82001266, 84251287, 86476277, 88551971, 90508348, 92371048, 94049188, 95492287, 96752078, 97844716, 98783498, 99524915, 99968994, 100220681, 100252204, 100084984, 99592872, 98866291, 97831560, 96624999, 95229208, 93566373, 91806146]
2914I1806146j734263j722047j753974j695699j526646j483401j354833j249420
2906G9285863j227555j194714j187500j155878j204389j253307j283053j379540
2898F9399927j434770j406454j392541j499913j367290j387535j406506j370138
2890E8134780j300697j282769j221731j130427j057558r86019q52864p88868n74248
2881D8939599n35600m23432k04594r7596j874k2668J1615J24732M6780j4808o4281
2870D7757873k72275k25993l84952n56178o68376q40176r59872j015137j130881
2861D1704033j175322j206248j243667j168412j145098j126846j067382j017445
2853C2553613r61248q81958q10207p83878o77589n82931n50989n52828n19589
$$ y = [91806146, 90071883, 88349836, 86595862, 84900163, 83373517, 81890116, 80535283, 79285863, 78058308, 76863594, 75676094, 74520216, 73315827, 72062520, 70779467, 69399927, 67965157, 66558703, 65166162, 63666249, 62298959, 60911424, 59504918, 58134780, 56834083, 55551314, 54329583, 53199156, 52141598, 51155579, 50302715, 49513847, 48939599, 48403999, 47980567, 47775973, 47678377, 47676503, 47653835, 47665450, 47790182, 47836962, 47822154, 47757873, 47485598, 47259605, 46874653, 46318475, 45650099, 44809923, 43850051, 42834914, 41704033, 40528711, 39322463, 38078796, 36910384, 35765286, 34638440, 33571058, 32553613, 31592365, 30710407, 29900200, 29116322, 28438733, 27855802, 27304813, 26751985, 26232396]
2844B6232396n24785n24614m74113m70356m67179m07983m40339m06038m08827
2835B2108162l35581l26373k97363k50495k23057k08188j15593j52497m4225p7849
2825B0076941l3781l6566N8676M2644k3877O6638M56q7273n5616l9669j09202
2814A9859371j37973j46446j76368k43584k53837l08421k37789k45472k88686
2805A7820795k22186j40038k06123j53173j32038m4853K6102P4573J33338K07897
2795A7364294K99912L69622L35132K9595j91229l46428m91337m89675m39357k82519
2785A6158010k24374j55732j72862n2763q1307j2674j7409L804J2409M3581J20259
2774A5620942L6813J19287J53239K32747J96485J93991K21868K97750L07882K86923
$$ y = [26232396, 25707611, 25182997, 24708884, 24238528, 23771349, 23363366, 22923027, 22516989, 22108162, 21772581, 21446208, 21148845, 20898350, 20675293, 20467105, 20351512, 20199015, 20154790, 20076941, 20043160, 20006594, 20065270, 20107914, 20084037, 20150675, 20151131, 20063858, 20008242, 19968573, 19859371, 19721398, 19574952, 19398584, 19155000, 18901163, 18592742, 18354953, 18109481, 17820795, 17598609, 17458571, 17252448, 17099275, 16967237, 16922384, 16948486, 17023059, 17156397, 17364294, 17664206, 18033828, 18368960, 18398555, 18207326, 17860898, 17369561, 16879886, 16440529, 16158010, 15933636, 15777904, 15605042, 15552279, 15470972, 15458298, 15440889, 15444693, 15457102, 15500683, 15620942, 15657755, 15777042, 15930281, 16163028, 16359513, 16553504, 16775372, 17073122, 17381004, 17667927]
2764A7667927L54034M03510L84011M66784N20258L63944M92296M44635L83889
2755B1481288L81832M51255M33450M68515N68793N81092P13089P32098P21619
2746B6533031Q24195R29126J064134J061560J119126J154142J110326J200873
2738C4996513J317981J432962J517462J658647J669874J603917J579581J563729
2730D7340666J483906J506572J640914J729862J957617K154267K199135K263526
2722F2276465K353896K352552K427288K690217K881689L124818L397990L828033
2714H5332948M301230M880823N576429O239822O953272P817774Q658644R765088
2706A39526030J1062653J2478521J3952852J5329767J6106564J5919374J4180881
$$ y = [17667927, 18021961, 18425471, 18809482, 19276266, 19796524, 20160468, 20652764, 21097399, 21481288, 21863120, 22314375, 22747825, 23216340, 23785133, 24366225, 25079314, 25811412, 26533031, 27357226, 28286352, 29350486, 30412046, 31531172, 32685314, 33795640, 34996513, 36314494, 37747456, 39264918, 40923565, 42593439, 44197356, 45776937, 47340666, 48824572, 50331144, 51972058, 53701920, 55659537, 57813804, 60012939, 62276465, 64630361, 66982913, 69410201, 72100418, 74982107, 78106925, 81504915, 85332948, 89634178, 94515001, 100091430, 106331252, 113284524, 121102298, 129760942, 139526030, 150588683, 163067204, 177020056, 192349823, 208456387, 224375761, 238556642]
2699B38556642J1481611Q811350O870138N832105N060528L893290J696220j957526
2691B80244358o092256r646215j2191274j3635737j4022300j3732841j2789131
2684A98134604j1674953j0600580r420354q489292p716370p078817o648673o485628
2676A30019937o483511o559392o445781o199084n607573n167435m553841l938282
2668H5065038l616739l326286l099272k970156k966511k855478k827684k856082
2660F0546830k755431k655816k482144k254946k206228k002400j842486j731100
2652D2616279j688805j530670j429469j373029j244245j185708j097427j030370
2644C2036556r73261r39031r16684p79337o81579o91663o76615n77887m99925
$$ y = [238556642, 250038253, 258849603, 265719741, 271551846, 276612374, 280505664, 282201884, 280244358, 274152102, 264505887, 252314613, 238678876, 224656576, 210923735, 198134604, 186459651, 175859071, 166438717, 157949425, 150233055, 143154238, 136505565, 130019937, 123536426, 116977034, 110531253, 104332169, 98724596, 93557161, 89003320, 85065038, 81448299, 78122013, 75022741, 72052585, 69086074, 66230596, 63402912, 60546830, 57791399, 55135583, 52653439, 50398493, 48192265, 46189865, 44347379, 42616279, 40927474, 39396804, 37967335, 36594306, 35350061, 34164353, 33066926, 32036556, 31063295, 30124264, 29207580, 28428243, 27746664, 27055001, 26378386, 25800499, 25300574]
2635B5300574n60692n22319n35399m92683m98995m35710n03555m79873m23227
2626B0848121l61216m81330l33524l80113m30228l90789l55062l80965l22169
2617A7412725k94575l09151l10353k97588k22878k78863k07701j40863j34243
2608A5216510k41943k64460l73411l82868m71051m48113m22047m84584m24684
2599A1703349l44549k96496l35838l46915l11580l04898k33005k48709k42510
2590I038849j65822k33603j92311j74150j68130j97858k13523j81924j89781j20018
2580G201729j45167j79344j94908o5683p3392j35260j24974j18377r2623r8146
2570E973855j54378q1759j13493j59164p0160r5740j01290j16792r4335o5480
$$ y = [25300574, 24739882, 24217563, 23682164, 23189481, 22690486, 22254776, 21751221, 21271348, 20848121, 20486905, 20005575, 19672051, 19291938, 18861710, 18470921, 18115859, 17734894, 17412725, 17118150, 16808999, 16498646, 16201058, 15978180, 15699317, 15491616, 15350753, 15216510, 14974567, 14710107, 14336696, 13953828, 13482777, 13034664, 12612617, 12128033, 11703349, 11358800, 11062304, 10726466, 10379551, 10067971, 9763073, 9530068, 9281359, 9038849, 8873027, 8639424, 8447113, 8272963, 8104833, 7906975, 7693452, 7511528, 7321747, 7201729, 7056562, 6877218, 6682310, 6616627, 6543235, 6407975, 6283001, 6164624, 6072001, 5973855, 5819477, 5737718, 5624225, 5465061, 5394901, 5299161, 5197871, 5081079, 4986744, 4921264]
2560D921264r6089r8707j08617o1947q2188r3915l6131q2288o0339l5077j13875
2549D052091j17123o0967o5133l4697n5965r4447m9983o1320r2256r4486k2837
2538C302877j02505o3758n817m8789m0051n8102p4724k7429j2837o4516k7980
2527B776369m3381o2973j5472n2112n0093M0147j09952p381m1381L3213o004j02942
2515B358038k9226k7235n474L4929l7259o6019k2066m6018o088m4295k5108k0974
2503B063205L6328j1174j8421r9864q3546O602R070j4260R719k4473l5224m5753
2491A792209l3487Q543J6430k2041m0964m8197J1007q692O5534n0103j6499M8700
2479A722440l2316j6135M1417k4486P057j6718k4565j842J8321N1146m9971M9025
$$ y = [4921264, 4825175, 4726468, 4617851, 4555904, 4473716, 4379801, 4343670, 4261382, 4201043, 4165966, 4052091, 3934968, 3874001, 3808868, 3774171, 3718206, 3623759, 3573776, 3512456, 3420200, 3325714, 3302877, 3200372, 3136614, 3130797, 3082008, 3041957, 2983855, 2909131, 2881702, 2868865, 2804349, 2776369, 2732988, 2670015, 2654543, 2602431, 2552338, 2592485, 2482533, 2475152, 2433771, 2466984, 2460980, 2358038, 2328812, 2301577, 2296103, 2331032, 2293773, 2227754, 2205688, 2159670, 2153582, 2109287, 2084179, 2063205, 2099533, 2088359, 2069938, 1970074, 1886528, 1893130, 1902200, 1887940, 1897659, 1873186, 1837962, 1792209, 1758722, 1767265, 1783695, 1761654, 1720690, 1672493, 1683500, 1674808, 1740342, 1690239, 1673740, 1722440, 1690124, 1673989, 1715406, 1690920, 1697977, 1681259, 1656694, 1654852, 1673173, 1724319, 1674348, 1723373]
2467A723373K937m5714k2915m5338l3533J8242p0796L7063O7713R158k8052K1693
2455A633831P1507N1908R910K0256K592M1362L6839N8949L8227M0667J20021M7632
2443B173701p907K8902M7336j9620M485m5083M049J6804n2045m2522p6342q5537
2431A946221p3430N40n4754j18708n7778k4204l6106p4833l5444l1997j08977
2420A330530j7452j4131j0723n3914o7438P939o1064k3828o3158l5201O225J277
2408I99062k6501p7567O757j7689j6636l1680j2490l2471l5488o0390j6019O055
2396F84943k9764K6595K7993m542o9609n835J0480J1689l3416k9802j006o979
2384E80747j4470n753K1095O179k5537j360k6140m8000o277p253k4027P442N2641
$$ y = [1723373, 1726310, 1680596, 1657681, 1612343, 1578810, 1597052, 1526256, 1563319, 1631032, 1640190, 1612138, 1633831, 1705338, 1757246, 1767156, 1787412, 1790004, 1831366, 1868205, 1927154, 1965381, 2006048, 2126069, 2173701, 2165794, 2194696, 2242032, 2222412, 2226897, 2181814, 2185863, 2202667, 2150622, 2108100, 2031758, 1946221, 1872791, 1873331, 1818577, 1699869, 1642091, 1617887, 1581781, 1506948, 1471504, 1439507, 1330530, 1313078, 1298947, 1288224, 1234310, 1166872, 1174811, 1113747, 1089919, 1026761, 991560, 997785, 999062, 972561, 894994, 901751, 884062, 867426, 835746, 823256, 790785, 755297, 694907, 678888, 684943, 655179, 681774, 709767, 705225, 635616, 629781, 640261, 651950, 618534, 588732, 587726, 580747, 566277, 560524, 581619, 587798, 562261, 560901, 534761, 486761, 480484, 473231, 449204, 456646, 509287]
2371E09287J6132k0191l0323j2723M3281n685l2655K2989J3646j6778m1211J6804
2359D62573J7477j3743r875j6810p3122J6593M8114l4096n0670k918j7180L991
2347C30334k7098q46j1854N092K723K2473K3391Q905m7943k2489L068J8398J1316
2334C15470r118q499j813l3705j2720K6274o6885M109J3596L1379L6870j1031
2322B83927m6920L249j6674K6613j7659M417k9982k2131K6973Q051o5294L1676
2310A86246j05k26J5469M1199j9930n8512k1769L6335L6660j8233j0192k9696
2298A57246o9K5587J1653l9852J4916M419J4299K9820L4237q2965l4793M8452
2286A82950L2689o76l5488j1254J7107J4278M662p851q577q660L6815J45m8094
$$ y = [509287, 525419, 505228, 474905, 462182, 505463, 499778, 467123, 490112, 503758, 486980, 445769, 462573, 480050, 466307, 456432, 439622, 366500, 383093, 431207, 397111, 346441, 343523, 326343, 330334, 303236, 302390, 290536, 295628, 298351, 320824, 344215, 353120, 305177, 282688, 285756, 304154, 315470, 306352, 297853, 296040, 262335, 249615, 275889, 209004, 213113, 226709, 258088, 294958, 283927, 237007, 240256, 223582, 250195, 232536, 236953, 206971, 184840, 211813, 219864, 154570, 186246, 186141, 185915, 201384, 242583, 222653, 164141, 142372, 178707, 215367, 197134, 186942, 157246, 157177, 182764, 194417, 154565, 169481, 173900, 188199, 218019, 252256, 169291, 134498, 182950, 215639, 214963, 179475, 168221, 185328, 199606, 204268, 196417, 187840, 179180, 215995, 216140, 168046]
2273A68046k4502k4413J3460K6130L5901l7190P163J087r902J0917O286j0266
2261A62717L6711m7719k4091K640n371J5787m5602k8199j4472J450L1779m524
2249H1106o6738J4432L5896p667K6958L430m1779K9780j4391n1091M5025k018
2237E2943k5787J3510Q078N1798j8542j6497n361o8341r838k6037q837O8018K2135
2224C7242m663l9389J6232L2582Jk3247L7062O315M0737k6060l3690j9562j8897
2211D663k4727k7337M8437J0305O950K1886P804q404l4088K9852k0767j2504J1319
2198A3389m746Q985j7563L1991K2315J0453l0494j4111l919n568j387p364N3024
2185E5005k8024l1822J5405k7637m5734J2002Q5312L76n838J1771k678k3324O0504
$$ y = [168046, 143544, 119131, 132591, 158721, 194622, 157432, 164595, 165682, 155780, 166697, 172983, 162717, 199428, 151709, 127618, 130258, 124887, 140674, 95072, 66873, 52401, 53851, 85630, 81106, 14368, 28800, 64696, 57029, 83987, 87417, 45638, 75418, 61027, 9936, 54961, 52943, 27156, 40666, 48744, 100542, 82000, 65503, 60142, -8199, -18037, -44074, -52911, 15107, 37242, 32579, -6810, 9422, 42004, 42005, 18758, 55820, 62135, 102872, 76812, 43122, 23560, 4663, -20064, -47401, 1036, 11341, 18291, 40177, 47981, 39577, 5489, 35341, 14574, 2070, 13389, 8643, 17628, 65, 32056, 54371, 64824, 34330, 20219, 16300, 10732, 9345, 1981, 55005, 26981, -4841, 10564, -17073, -62807, -50805, 34507, 34883, 29045, 40816, 38138, 14814, 75318]
2172G5318q13m7401l3631L5184l4k3973M3725k1340M82k8468j1886K7736l3330
2159a8431L8148J6797O908L1875j4136L3226m2179K2271j5414J0845O715n8347
2147A8278j2010P4243K8020m3389o647K5231L8330m1152j9913J5699j4681J5046
2135G7055L2618j2040j8602n7447L6253L769j9011K9826j33P350K227k1770p559
2122E2536J1784n8642K9223M9145k3016l120j334l122K0257J8290M8382K86l0368
2109A10301k252J1303K1619k0274L8153j3486J4398J6209p016K0001M490j0326
2097A83120j6569N6463K8120m6534N2080l2878k3633M3148J8894Q66K6048L6014
2085C25139l7538M2080k4900O291O4523L2598N806m107J0374R488K8546J6590
$$ y = [75318, 74505, 27104, -6527, 28657, 28623, 4650, 48375, 27035, 27517, -951, -12837, 14899, -18431, 19717, 36514, 43422, 75297, 61161, 94387, 52208, 74479, 59065, 69910, 76625, 18278, 6268, 80511, 108531, 65142, 58495, 83726, 122056, 80904, 60991, 76690, 62009, 77055, 109673, 97633, 79031, 21584, 57837, 61606, 42595, 72421, 72288, 79638, 81865, 60095, 52536, 64320, 5678, 34901, 84046, 61030, 57910, 56576, 53454, 73711, 92001, 140383, 140669, 110301, 108049, 119352, 140971, 120697, 158850, 145364, 159762, 175971, 168955, 188956, 193446, 183120, 166551, 223014, 251134, 204600, 256680, 223802, 200169, 243317, 262211, 263077, 289125, 325139, 287601, 329681, 304781, 311072, 375595, 408193, 413999, 409892, 420266, 429754, 458300, 474890]
2073D74890J7416Q8741M6297L5074M5009k0620N1788M7787L6066J839P2430J02998
2061I99715J01307J29012J54623Q6005J38666K16350J81367J89347J33461K45014
2051B574867L15403L32102M37402N64238O15545Q28485J068128J428160J999861
2042A0164191K216583K25847j351755j384191j682052j613927j270544q01618
2034D502534o41106m29618l36771l10347k43866j52720j67978j79790k19009j63885
2024A657444j09812r5122j33184m4063q0696j11130o2292j00891r7358l5351l6909
2013G50636J8231n1215o1213j8612j4614q553n2044l6670R419L8609m8693k6152
2001D99129m0284J2516m4180k0556j13k7084n9770m1376N644J9893m6544l1769
$$ y = [474890, 492306, 581047, 627344, 662418, 707427, 686807, 738595, 786382, 822448, 824287, 896717, 999715, 1101022, 1230034, 1384657, 1470662, 1609328, 1825678, 2007045, 2196392, 2329853, 2574867, 2890270, 3222372, 3659774, 4224012, 4839557, 5668042, 6736170, 8164330, 10164191, 12380774, 12606621, 11254866, 9870675, 8188623, 6574696, 5304152, 4502534, 3861428, 3431810, 3095039, 2784692, 2540826, 2388106, 2220128, 2040338, 1821329, 1657444, 1547632, 1452510, 1319326, 1275263, 1194567, 1083437, 1021145, 920254, 822896, 787545, 750636, 768867, 717652, 656439, 637827, 623213, 614660, 562616, 525946, 535365, 573974, 525281, 499129, 458845, 471361, 427181, 406625, 406512, 379428, 319658, 278282, 283926, 303819, 257275, 225506]
1989B25506q902J9574k686k1267J3665O6016l2322l9612R844k8509l0807J3484
1977A83984K3442r976k6720j4946k0735m0099P394j7907K5625K3574j9047j7604
1965I6985l1594j0308l7397p896L2237j6607N779J3799k9178L6906J1098p219
1953E6605l5759J1828j4163j1250j5163j4408O4501l3443K1025m8453m5355m94
1941f4529j6456L811L4098L5731n487R962m0267r871j6946j8481L0698L6509k6971
1928d8199N74N191o117k2068K6438J830m4285j8247Q2025J7672o2781M5080J1565
1915a1322l7810j8186J1364l2053l5979N6096o584m7659K3316J8897J7532k0260
1903h2648L074l4974j0308J00089m4820j4717k9804k8311L4402J5840J4238q046
$$ y = [225506, 216604, 236178, 233492, 212225, 225890, 291906, 259584, 219972, 229816, 201307, 170500, 183984, 207426, 197450, 170730, 155784, 135049, 94950, 102344, 84437, 110062, 133636, 114589, 96985, 65391, 55083, 17686, 9790, 42027, 25420, 31199, 44998, 15820, 52726, 63824, 56605, 20846, 32674, 18511, 7261, -7902, -22310, 42191, 8748, 29773, -18680, -64035, -64529, -80985, -77174, -43076, -7345, -12832, -2870, -43137, -53008, -69954, -88435, -57737, -21228, -48199, -47625, -42434, -48551, -70619, -44181, -42351, -86636, -104883, -22858, -5186, -67967, -22887, -11322, -49132, -67318, -55954, -88007, -123986, -67890, -74474, -122133, -98817, -79920, -62388, -82648, -79574, -114548, -124856, -24767, -69587, -84304, -114108, -142419, -108017, -92177, -77939, -85985]
1891h5985K1529l3438M4227o6521K7370L2800o2130R161K0143k8540j7313M4411
1879i4286o784P604N7966O414j8540J4595j5042J4170j4821o0509k6526j4887
1867a50646N5285O056m809J8094r758m2627o236N6487n903k3921L2250k198j0087
1854h8013J602M4158k6433m2324l8734J9706J9290k3173J5135M2560j2571j0124
1842i8921L9831p137J1063q2855J987M8234M258k3727l8344j064J9587M4014n6735
1829a39809J0972J1074K7935j9652k1264K8739q515j6175L0189k768l3763P627
1817a25410j3243L9103k227p618l0170j0396J5217j7368N5787m7150K8518K8604
1805h6353J528J4391R210N2264j4463n3064L140J0831L7812K5758l6269k2398
$$ y = [-85985, -64456, -97894, -53667, -120188, -92818, -60018, -122148, -112987, -92844, -121384, -138697, -94286, -101070, -93466, -35500, -29086, -47626, -33031, -48073, -33903, -48724, -109233, -135759, -150646, -95361, -89305, -94114, -76020, -85778, -128405, -134641, -78154, -84057, -107978, -75728, -77926, -88013, -86411, -42253, -68686, -111010, -149744, -130038, -110748, -133921, -118786, -76226, -88797, -98921, -59090, -66227, -55164, -138019, -136032, -87798, -83540, -107267, -145611, -146675, -127088, -83074, -139809, -128837, -117763, -89828, -109480, -130744, -102005, -110520, -126695, -96506, -99274, -133037, -125410, -138653, -99550, -101777, -109395, -139565, -149961, -134744, -152112, -96325, -143475, -114957, -86353, -84825, -70434, -61224, -8960, -23423, -76487, -73347, -62516, -24704, 1054, -35215, -57613]
1793e7613k3280R948k4381R330j0489j8601j6110K4606M433J2884j6950k7664
1781a33887j3451L5327N2582K1766m8346m4160m4519N2975J1153K3004J6342J8690
1769e2524k8417L77L2736l5586p413J324J8125L3401k8797J3675j2712J6429k3303
1756g2685K1998j1171m8937J737J9483K2744R78L874m333k2504k1895j4545j9302
1743a44558j1682K3387k8823k341N0552l0331K726K3953J3061L658K2121J0547
1731f7730R464n9268J4625o2911O3226K8887m9297M4857p536n433L8441l4093
1719h6768n8975Q714O0256n7148L1669J0024j238K174m2555K5809k2499J0538
1707a19999L0728m0950n571M5920M992m1928j9191J8567J0349N302o607J0299
$$ y = [-57613, -80893, -70945, -95326, -85996, -96485, -115086, -131196, -106590, -102157, -89273, -106223, -133887, -147338, -112011, -59429, -37663, -86009, -130169, -174688, -121713, -110560, -87556, -71214, -52524, -80941, -80564, -47828, -83414, -90827, -89503, -71378, -37977, -66774, -53099, -65811, -49382, -72685, -50687, -61858, -110795, -109058, -89575, -66831, -65853, -61979, -66312, -88816, -110711, -125256, -144558, -156240, -132853, -161676, -164017, -113465, -143796, -141070, -117117, -104056, -100398, -78277, -67730, -58266, -117534, -102909, -165820, -102594, -73707, -123004, -78147, -85683, -91116, -52675, -86768, -145743, -137029, -76773, -133921, -102252, -92228, -93466, -91292, -133847, -108038, -130537, -119999, -89271, -130221, -135792, -89872, -84880, -126808, -145999, -127432, -117083, -111781, -118388, -108089]
1695a08089J6061k0867O657J277P655N3908J6470j9845j13543P036N0197j4808
1683a17891m339R071L7949l2708k0727k2958K9935N2203l3427k5605K7675J2083
1671h8739k6099j0092K8617j8733K2858j1592o9298N1279M150J024M9481m3697
1659a10841L580K5132P241j8411j457N238n3322L2969m9487N3636K5932K413k1832
1646i9209j944k7248l4227n77j1042L2231J8125L0798l129R277m2169K5J5573
1633a13516p287k168k370k9656M572J4327L8126n7546K0058K9888K1255j5140
1621i9457l6198M6670K0261j1832R109p3417K9814K5479L0079R584J3559M0317
1609C968n5107p5393J6008K1169k7979K0345m9585r531M6895N285l7109R9585
$$ y = [-108089, -92028, -112895, -106238, -104961, -97306, -43398, -26928, -46773, -160316, -153280, -103083, -117891, -122230, -113159, -75210, -107918, -128645, -151603, -121668, -69465, -102892, -128497, -100822, -88739, -114838, -124930, -96313, -115046, -92188, -103780, -173078, -121799, -117649, -116625, -67144, -110841, -107261, -82129, -74888, -93299, -94756, -89518, -142840, -109871, -159358, -105722, -79790, -77377, -99209, -101153, -128401, -162628, -163205, -174247, -142016, -123891, -93093, -96222, -86945, -129114, -129089, -113516, -120803, -122971, -125341, -154997, -150425, -136098, -97972, -155518, -135460, -105572, -84317, -99457, -135655, -88985, -68724, -80556, -71447, -144864, -115050, -89571, -59492, -49908, -36349, 3968, -51139, -126532, -110524, -89355, -117334, -96989, -146574, -156105, -109210, -103925, -141034, -41449]
1597d1449n8296j5452j2037J7318k991K9338J4508m1589Q81k2057n614N9254N9230
1584a8956k9613l2092l3434K0461K613k6249J004n491q057m963q624k36L9995
1571a03642k9743K7217n0443K2939O1187m7293k617J5009q117l0965m5792m0748
1559b33008P4882O4704k3020j2762J0128j8780N7953J7070J7960o3849q0210J4603
1547a74329J3235L5434N8887l5445J8144J6352j0039O965K4611k6111k7101J8514
1535h0883n0039J4076n953p553K9265l4876n6507L2239L7988K4642j6011m0726
1523a54338j4335L0499M0986L4005k1420l1725L32P546k5732K8033K8241l6030
1511a13938K4250N759J9901k8603k4702K3179M598P850O590K2100n5454l5549
$$ y = [-41449, -99745, -115197, -127234, -109916, -112907, -83569, -69061, -110650, -109769, -131826, -137440, -78186, -18956, -48569, -80661, -114095, -93634, -91021, -117270, -116266, -121757, -129814, -134777, -143401, -143637, -103642, -133385, -106168, -156611, -133672, -72485, -119778, -122395, -107386, -115503, -146468, -192260, -233008, -158126, -93422, -116442, -129204, -119076, -137856, -79903, -62833, -44873, -108722, -188932, -174329, -161094, -125660, -66773, -102218, -84074, -67722, -77761, -70796, -46185, -72296, -99397, -80883, -130922, -116846, -122799, -130352, -101087, -135963, -192470, -160231, -122243, -97601, -113612, -154338, -168673, -138174, -97188, -63183, -84603, -116328, -115996, -108450, -134182, -106149, -77908, -113938, -89688, -83929, -64028, -92631, -117333, -94154, -89556, -81706, -75116, -53016, -108470, -144019]
1499a44019o581n810L400L8919r234k1509K0134l9104m190K7429K1389K83K4024
1486i4869k2876m2244M374M2620M8518j5056l2326l5764K8991J3991j2353J849
1474a15145j4103L8289j1556p052m969J4490K4150j941l1524K0181J9227j1313
1462h1266j7744J1047l6879J2591k1771N622J9929k1960k1290M9029M1478j6884
1450g8098p452j2467M3557J094p6783J6219N1484o7948n337L1043m2474K6655
1438a20507L3519j7846k0726K3170M74L3951P332j3379k4272l2568l949L11M8570
1425h5920K9112l593k5982J8479L819j5502K3061N903l2627K4412m4534k7277
1413a30649J7136J3382J4028P781N752M4162q459l1201K0537j9077m8875L6598
$$ y = [-144019, -150600, -156410, -153010, -114091, -123325, -144834, -124700, -163804, -167994, -140565, -119176, -118893, -94869, -117745, -159989, -155615, -112995, -64477, -79533, -111859, -147623, -118632, -104641, -116994, -115145, -129248, -90959, -102515, -109567, -114536, -100046, -75896, -77837, -109361, -89180, -69953, -81266, -99010, -87963, -124842, -112251, -134022, -128400, -108471, -130431, -151721, -102692, -61214, -78098, -85550, -98017, -54460, -53366, -130149, -113930, -62446, -130394, -135731, -104688, -147162, -120507, -86988, -104834, -125560, -102390, -101916, -67965, -60633, -74012, -98284, -130852, -134801, -134490, -85920, -56808, -60401, -86383, -67904, -64085, -79587, -56526, -50623, -83250, -58838, -103372, -130649, -113513, -100131, -86103, -78322, -72570, -28408, -36867, -68068, -47531, -66608, -115483, -78885]
1401g8885J2798K098n2950p832L1230M1822j9883J7917n8838J3667r046N2430
1389e5472K0214k9758M3016m232k8188L300j2819n2606L809J6211J8462k5643
1377a03706l6282L3883K3739N241l6355M2389j0197j7461O626M39K047p302J2533
1364h4406l3023J6952K1794L7162n4824r31j1832O987R913J4100q5061L7892M9457
1351g5820P921j8237j4639N3036K139n995m4447j3735N146M886K6453j3907k3164
1338a10363Q16L7651M901M4199k345m3662k0214K0108j5855k2999K6657l245k6560
1325a10911K9884Q611M1055M610j5854O156j3416p499k9029l1708N363m7874K277
1312a58335j0407N1493K5107j9034K0179j9150j0469j3308Q661N1199k5556l126
$$ y = [-78885, -66087, -63989, -116939, -124771, -93541, -51719, -71602, -53685, -112523, -98856, -107902, -55472, -35258, -65016, -22000, -26232, -54420, -51120, -63939, -116545, -112736, -96525, -78063, -103706, -139988, -106105, -82366, -77125, -113480, -71091, -81288, -98749, -92123, -91684, -89637, -96939, -84406, -117429, -100477, -78683, -41521, -96345, -97276, -109108, -102121, -92208, -78108, -163169, -125277, -75820, -67899, -86136, -100775, -47739, -45600, -51595, -96042, -109777, -104631, -99745, -73292, -87199, -110363, -109547, -71896, -66995, -22796, -25141, -68803, -89017, -68909, -84764, -107763, -81106, -84351, -110911, -81027, -72416, -31361, -26751, -42605, -36449, -49865, -57364, -86393, -118101, -112738, -160612, -158335, -168742, -117249, -92142, -111176, -90997, -110147, -120616, -133924, -125263, -74064, -99620, -102746]
1300a02746j4646j5728K2108M9873o939O140j0623J5108Q396j6237L987k9328
1288i0635l0478l7163P451K5960J1437O5157J5404m0502K9364J0713k0243n6945
1276a10480M7698o7630K1672N2457j3104R198j8722R497L215k5419j9073K5269
1264h5422L5294k5583j0917n295P3868o645J4897q5092j0175P06O8050k168n2492
1251i0974o034J1553J0172K1548k8577k537L1518o592j1546J2978l8865k6756
1239a24112N5746j4849j0328O391l2712l7156L9477K7803j9422K4504L0078l9065
1227i3645n0067L6970K5934j7694Q790N8662j2952k2566j4017J7405J3247l3441
1215h3374m8792k7851O1414J717m5067o954O4365L0525M5046j7930l2103l8668
$$ y = [-102746, -117392, -133120, -111012, -61139, -68078, -61938, -72561, -57453, -49057, -65294, -61307, -90635, -121113, -158276, -150825, -124865, -113428, -48271, -32867, -73369, -44005, -33292, -53535, -110480, -62782, -130412, -108740, -56283, -69387, -60189, -78911, -69414, -66199, -91618, -110691, -85422, -50128, -75711, -86628, -91923, -18055, -24700, -9803, -94895, -105070, -104364, -36314, -38482, -90974, -97008, -85455, -75283, -53735, -82312, -84849, -53331, -59923, -71469, -58491, -97356, -124112, -68366, -83215, -93543, -87152, -119864, -157020, -117543, -89740, -109162, -84658, -54580, -93645, -143712, -106742, -80808, -98502, -89712, -31050, -44002, -66568, -80585, -63180, -49933, -83374, -132166, -160017, -98603, -96886, -141953, -148907, -84542, -54017, -8971, -26901, -59004, -97672]
1203i7672O000N1887m5724k7878L1257K649j3141L2495k8092m1862M2321O9967
1191a7793J224l8816L1187j6292J5248p7591L1528M038N24J0865L337J568K2873
1178b8100q098K1694k2200n1989J6331L6021k4073r890q942j866K4592K8743J5457
1165a2320l6772N621J6075l008q2m7624K5081P54J3762M9500l3544k3028j3342
1152e8927K927J1282k639J5328p901K8704m3758k4388J9151k543q426J8103m7404
1139a00491k8071K8180J1014o706L0343J3107J5773N7565o5918M7717R855o7522
1127e5154r038k2181J605O8479j3446M3778J8937j9787n1596k2982L976P173o467
1114e6703j0557n0376N0678M8052k1635l6612J1114M6566j210L2051L3181m2619
$$ y = [-97672, -91672, -39785, -85509, -113387, -82130, -79481, -92622, -60127, -88219, -130081, -87760, -17793, -16569, -55385, -24198, -40490, -25242, -102833, -71305, -67267, -66743, -55878, -52541, -50973, -28100, -36198, -14504, -36704, -88693, -72362, -36341, -60414, -70304, -79246, -81112, -56520, -27777, -12320, -49092, -43471, -27396, -30404, -30486, -78110, -53029, -52275, -38513, 10987, -22557, -45585, -58927, -56000, -44718, -47357, -32029, -39930, -11226, -54984, -79372, -60221, -62764, -71190, -53087, -100491, -128562, -100382, -89368, -96074, -65731, -52624, -36851, 20714, -45204, 2513, 12368, -55154, -64192, -86373, -84768, -16289, -29735, 14043, 32980, 13193, -38403, -61385, -57409, -50236, -56703, -67260, -117636, -66958, -18906, -40541, -77153, -66039, -19473, -20683, 11368, 44549, 1930]
1102A930n7500K2162O383J0629l0880Q371M9255j9784k3807J6759j3089l5567
1090f5138r750J0397P0776L2517m6851j7755R1955p2991l4670j4877N516Q82m2493
1077i2482l1303L1719L5318K0483J0432J3544k3864p3o969J863k7117M276J7229
1064d6944k5300j7978K7259M048l6980M817N5661K0780n7623L2123l5401k4706
1052a00244M2418Q711J4673p25J3220L2560J0872P652q0421K1672k7469J726n094
1039f0449P807k1636J9436r583l7548M4959L6784m13j5852j8030J0815k4328N4298
1026a3740K0300n7619L6875n052K0671K2262j4382j5386p0116K0697M7157k4002
1014c2335l9239q418M7826l406J5149j6871P582L1888l2800l0186n708J3119k3342
$$ y = [1930, -55570, -33408, -27025, -16396, -47276, -38905, 10350, -9434, -33241, -16482, -29571, -65138, -74888, -64491, 6285, 38802, -8049, -25804, 66151, -6840, -41510, -56387, -50871, -49989, -92482, -123785, -92066, -56748, -36265, -25833, -12289, -36153, -36226, -43195, -41332, -68449, -64173, -46944, -72244, -90222, -62963, -58915, -95895, -91078, -35417, -14637, -72260, -40137, -75538, -100244, -57826, -49115, -34442, -35167, -21947, 10613, 21485, 29137, -51284, -29612, -57081, -55355, -60449, -52642, -74278, -54842, -64425, -101973, -57014, -20230, -20643, -36495, -54525, -43710, -68038, -13740, 6560, -51059, -14184, -19236, 1435, 23697, 9315, -6071, -76187, -55490, -8333, -32335, -71574, -79992, -32166, -35572, -20423, -37294, -29712, 2176, -30624, -60810, -66518, -53399, -76741]
1001g6741k2274J5222K2754q350J2998M827k4781K8908N9757K2208k8776j8502
989a2750n2013j2873K8110J6674l3376K145L0629Q549J1398l2860K2934m9037
977g2470M4828J9468k5833J8265p1231N9430Q867O060m120j8019k9386K6313K4988
964a2840j1258j4916N0329k1519j6803L0757l981n011l8974J094k9478M8101J9551
951d948K5855m6540K8877M1081j8655o0640k8848r879J7321M1221N5682k6683
939A3844m7453o1643J9156M9629J4750J662o5425J5674P266M4702M4339j7567
927A8934J1678m8420q5907O4548J746J2828N0871P812k6344Q563j9863k7500K3377
914g677o676l8615L6734j154n7083r219K0224j2175O2205K3131J9968j3493m2628
$$ y = [-76741, -99015, -83793, -61039, -69389, -56391, -51564, -76345, -47437, 12320, 34528, 5752, -12750, -64763, -77636, -49526, -32852, -66228, -64083, -33454, -24905, -13507, -46367, -23433, -72470, -27642, -8174, -34007, -15742, -86973, -27543, -18676, -12616, -16736, -34755, -64141, -37828, -12840, -24098, -39014, 11315, -10204, -27007, 3750, -231, -5242, -44216, -43122, -72600, -24499, -4948, 20907, -25633, 3244, 44325, 25670, -34970, -63818, -73697, -56376, -15155, 40527, 13844, -33609, -95252, -76096, -26467, -11717, -10055, -75480, -59806, -52540, -7838, 36501, 18934, 30612, -17808, -103715, -39167, -37421, -24593, 26278, 34090, 7746, 16309, -3554, -31054, -7677, -14353, -52968, -16234, -17388, -74471, -83690, -63466, -75641, -13436, 9695, 29663, 16170, -26458]
901b6458n575m7065J9877m4563N2420K6314O171j7051j9626L8698l9992k7173
889h4023N6419K0223M009j3571k3536j914p134K9473n3529L3476K0478J0759J9198
876A0328n371L0412N190k2103L410l0427Q94o509p476K3690m2182m5922k391Q9848
862A391l2046k5913M9600j8893M0263k0403n6114K4114M273K5212k8551J3084
850b3983L8481Q718J036j672m954J128j3735o15M8249r7068L5067n477L2321J9987
836C7483r207r867L38J9864O839k1007l5916k4084o25K9546L1971k7405M213J7878
822B0021n9451K6416J2078o9000j4890L2397J4191Q1537n4855n9869M753N0202
810a6470k4755n507M4766J3288k4047J5720p192k402K1562j0006k779j2888M573
$$ y = [-26458, -32033, -79098, -59221, -103784, -51364, -25050, -18879, -35930, -55556, -16858, -56850, -84023, -27604, -7381, -3372, -16943, -40479, -42393, -49527, -20054, -73583, -40107, -19629, -8870, 10328, 4957, 35369, 40559, 18456, 21866, -8561, -7667, -14176, -21652, 2038, -40144, -86066, -88457, 1391, -30655, -56568, -6968, -25861, 14402, -6001, -62115, -38001, -33728, -8516, -37067, -23983, 14498, 23216, 24252, 22580, 17626, 18754, 5019, 4404, 52653, -44415, -9348, -14825, 17496, 37483, 28276, 18409, 18747, 38611, 45450, 24443, -11473, -35557, -36182, -6636, 25335, -2070, 2143, 20021, -39430, -13014, -936, -69936, -84826, -52429, -38238, 43299, -11556, -71425, -66672, -16470, -41225, -46732, -1966, 11322, -12725, 2995, -4197, -6599, 14963, 4957, 2178, -10710, -6137]
797f137M9341l2147j421n2235K6316L1586J9431k9891n8144P1438K4904m2019
785A022R794R098k7299o2812Q301O4127l4557k4601N4351L0997m4649J6888K0567
772B1227o0979K0626K8413k8435j5535P9555K025p1471J441K4442J4384L4852
760E0545M359o8634Q187J8040P109n9492K5868j265L6916J4324m3886J204O1516
747E4791m5570K6031J4131q6926K1998l0693P746q803J1589p487J8134K1266j1170
734a4963O873Q63J0889k6320K001R553o840J6968J0608J6387K7832n5040l544
721d733L4866K7961o820m2704J8355J0320j5747j1848r036k2738l479Q603j723
708a8723K3954l427k1062j1718K3244k9187O419j7221j3155K7038O2620m3615
$$ y = [-6137, 43204, 11057, 9636, -42599, -16283, 15303, 34734, 4843, -53301, 18137, 43041, 1022, 10816, 19914, -7385, -70197, -61896, 2231, -32326, -56927, -2576, 28421, -16228, 660, 21227, -39752, -19126, 9287, -19148, -34683, 44872, 46897, -24574, -23133, 1309, 15693, 50545, 54904, -13730, -5543, 12497, 19606, -39886, -14018, -15283, 21633, 35957, -7929, -6725, 54791, 9221, 35252, 49383, -37543, -15545, -46238, -38492, -47295, -35706, -43193, -25059, -3793, -14963, -8090, -7227, 3662, -22658, -20657, -11104, -17944, -976, 9632, 26019, 53851, -1189, -4733, 30133, 58094, 51274, 8570, 26925, 37245, 21498, 9650, 614, -22124, -25603, -17000, -18723, 5231, 1804, -19258, -30976, -7732, -36919, -30500, -47721, -60876, -33838, 28782, -14833]
696a4833P945R485N1481J3046o0202o739O559k8664l558K6941l592P352l7836
683c2615j6826N0021j8151K1937J2479m8721K7088L0729J9412p855j550k801L7118
670G0265q0356j0021J1098J6984M036R22j5285J1089J6564k7705M8132J772m2344
657E151j161O846J399j7899J2956m115j6098Q837M9883k5823l1477K8412M994
644B1905j0868K7667j1610m4576j1895P4276j9080l2957j8083K1301L0470J2007
632C8557l297l0097k7296M219N8872j9723l8306K7345l9657M897K4001J2649L6360
619D8524k9949k706J1760j3440r122K5051L423j1939k5557j0698J9674K1125j6055
606A0091K0171k8893j1626K8348M2054J5698l5682L2101k7664l4943M9960m5454
$$ y = [-14833, -6888, 2597, 54078, 67124, 6922, 183, 6742, -21922, -25480, 1461, -2131, 5221, -32615, -49441, 580, -17571, 4366, 16845, -31876, -4788, 25941, 45353, 37498, 35948, 33147, 70265, -10091, -20112, -9014, 7970, 12006, 12928, -2357, 8732, 25296, -2409, 45723, 47495, 5151, 3990, 10836, 12235, -5664, 7292, 3177, -12921, -4084, 45799, 19976, -11501, 16911, 21905, 11037, 38704, 27094, -17482, -29377, 44899, 25819, -7138, -25221, -3920, 26550, 38557, 35260, 5163, -22133, -17914, 40958, 21235, -17071, 10274, -29383, -24486, -485, 12164, 48524, 18575, 15869, 27629, 14189, 5067, 30118, 33541, 21602, -3955, -14653, 5021, 26146, 10091, 30262, 1369, -10257, 18091, 60145, 75843, 40161, 72262, 44598, 9655, 59615, 14161]
594A4161L0382J1930n4751j6392K0907m5109l6589K9030K8360k376k4660M5614
582E07l6879J828K2547p322L2217j1155j3356M5966J6015K132k2961K5349P6k9055
568B5909k7190Q1917k738n0754L0637k1838K7144m4971K9883j0241q1657j8515
556f2414Q7941M2763j6436o634l5317j6244N0616K564K987j4884n0086K8351l166
543A0041K6354K6068Q459j5546l2432k9647J1676J1115l1591M8712K0380L603
531E7192J847j316j7218J4463L0377m6367N95J4736m9900k6518M8277J8430K8275
518G2873n1315j4855n757J6494P6392m507k6314k2849K7661k5920j4215k9300
506a612P3761K8585l7341J4103J6214n6983Q274j7129K8140j2086k4431J837j0560
$$ y = [14161, 44543, 56473, 1722, -14670, 6237, -38872, -75461, -46431, -18071, -20447, -45107, 507, -36372, -34544, -11997, -19319, 12898, 1743, -11613, 34353, 50368, 52500, 29539, 54888, 54964, 25909, -1281, 80636, 77898, 27144, 57781, 35943, 63087, 18116, 47999, 37758, -43899, -62414, 25527, 68290, 51854, 45220, 9903, -6341, 44275, 46839, 49826, 34942, -15144, 13207, 10041, 36395, 62463, 70922, 55376, 22944, -6703, 4973, 16088, -15503, 33209, 53589, 57192, 59039, 57723, 40505, 54968, 85345, 38978, 39573, 54309, 4409, -22109, 26168, 44598, 72873, 21558, 6703, 946, 17440, 93832, 89325, 63011, 40162, 67823, 41903, 27688, -1612, 72149, 100734, 63393, 77496, 93710, 36727, 45001, 27872, 56012, 43926, 19495, 21332, 10772]
493A0772l8743k109P3600L7516O153k510m4315k7246J497m190J1672l213r176
480I708j6481J5206O0260K8239n8928q976M3669p0425l0772J6283Q576K2456j1798
467G017O5823L765k5672k1668L1174K063J4285k3078M221m2660M2047J9983R515
454H6815J2944p8258L3139J8103m840N4390o7213R470K7054o16n1801J7923O0461
441A17571m8952j0280L851m702n6948J8540K9798J2898l8551j5940n273j8596
429a6584J6586N2562L3358m5214L448j3781P260M4787m7340j3630J6960n2639
417a4227M5591J387N6745p206l4868K9071J0149n9099J6873J718k0079k2176K9515
404C3394n1386M7455k6791o6256M3117J1905K2645K1637j7530m519P3564p869
$$ y = [10772, -27971, -30080, 43520, 81036, 87189, 84679, 40364, 13118, 14615, 10425, 22097, 18884, 9708, -6773, 8433, 68693, 96932, 38004, 29028, 72697, 2272, -28500, -12217, -3641, 18815, 7017, 72840, 76605, 50933, 29265, 60439, 62502, 76787, 53709, 57930, 15270, 57317, 77300, 86815, 99759, 21501, 54640, 72743, 67903, 122293, 55080, 64550, 91604, 90988, 39187, 57110, 117571, 68619, 58339, 62190, 57488, 540, 19080, 48878, 61776, 23225, 7285, 2012, -16584, 2, 52564, 85922, 40708, 44156, 30375, 37635, 82422, 35082, 21452, 38412, -14227, 31364, 32751, 89496, 82290, 47422, 76493, 86642, 27543, 44416, 46134, 26055, 3879, 33394, -17992, 29463, 2672, -63584, -20467, -8562, 14083, 35720, 18190, 13671, 87235, 79366]
392G9366m9829m9444N5781k0240O7651N6601q8191k3900O8021k926n359r689k387
379G5455n2860q207N3768P1048p8548J6345J4265j5118J3969n5874N78P3385l9274
366F8932K4056K4252m2440k2402m8940K9260M953M2606j3764O39Q987j6888J0982
353G0233j1923J1142j853N734O706n049K9856J531q962k572p7138J2645M413K26
339C4989J4495l3734l6417L0206J6962K9142K6138J2700k3957l0115K7185j7017
327E0577j1005p176o762L7995j0998j1645L7710m809j2955j1736q436k3392L6744
314E4112L4830q309o4912r649J04300m3172m3137j399P478j3696L6797j7104l6739
301f00L4284M1979k4493j1995L6995n044j7848p763j181j45L7597J9389j867j1957
$$ y = [79366, 29537, -19907, 35874, 15634, 83285, 139886, 51695, 27795, 95816, 92890, 87531, 77842, 75455, 22595, 14388, 68156, 139204, 60656, 77001, 91266, 76148, 90117, 34243, 34821, 108206, 68932, 92988, 117240, 74800, 52398, 3458, 32718, 37671, 80277, 66513, 67152, 76139, 59251, 70233, 58310, 69452, 67599, 73333, 80039, 74990, 104846, 106377, 97415, 94843, 17705, 30350, 34763, 34989, 49484, 15750, -20667, 9539, 26501, 55643, 81781, 94481, 70524, 40409, 67594, 50577, 39572, 32396, 25634, 63629, 52631, 40986, 78696, 73887, 60932, 49196, 40760, 17368, 54112, 88942, 80633, 15721, 6072, 110372, 67200, 24063, 22664, 30142, 16446, 53243, 36139, -600, 33684, 75663, 51170, 39175, 76170, 71126, 53278, 45515, 44334, 44189, 81786, 101175, 99308, 87351]
287H7351k9640J3975j7321k8603M9813m448k660q145j2019J4122q258m8715M4996
274E0448L4597l1176j0796k6244K1561K5625j5927K3759K1891l9850J3134L5564
262A02586o7233o198K238L361o906K1013K4435m625K0688M5982l1445n4938L2815
249H1773o7440p645K7518K1780J747o909J2529o758J9531l2101K1097m3669N6885
236G8338J7347p713o035k8152L0200o4353k4511K6903J3024M7256q420K0317o12
223I3589k3932j3526j9464k2973L4297j7387o068J6563K7946n6007l0240r383
211b6585P4110L6583l1414K1370L053j7649P091k7278R148J2673K049M9708p3673
198C9186O14K6433m5132O8886M3393o3852j9261N3075J2960J8412l2447l5032
$$ y = [87351, 57711, 71686, 54365, 25762, 75575, 71127, 68467, 60322, 48303, 62425, 54167, 5452, 50448, 85045, 53869, 43073, 16829, 38390, 64015, 48088, 71847, 93738, 53888, 67022, 102586, 35353, 29155, 31393, 34754, 27848, 48861, 73296, 68671, 89359, 135341, 103896, 48958, 81773, 14333, 6688, 34206, 55986, 57733, 50824, 63353, 56595, 76126, 44025, 65122, 21453, 78338, 95685, 87972, 81937, 53785, 83985, 19632, -4879, 22024, 35048, 82304, 73884, 94201, 93589, 69657, 56131, 36667, 13694, 47991, 30604, 24536, 41099, 69045, 13038, -17202, -26585, 47525, 84108, 52694, 74064, 77117, 59468, 66559, 39281, 48429, 61102, 63151, 112859, 39186, 39800, 66233, 21101, 89987, 133380, 69528, 50267, 103342, 116302, 134714, 102267, 67235]
186F7235k2579j4484K1907M162L8665n4814l0274O3894N4368k5110j1564o0999
174C0407M194O2210M3648n3438m8022M683j1022K221j9688K0122J3198K7965k3324
161E3154k054j7425m4224P0918K0837m929m5676L133K298N4323p933j1046k1357
148E0019M1231j0369l6665j2309k1310j2791M3171K0357k5465J2595m962L662
136D7164J7543n3759K4559m98J8423k4527L6933n734N000k8191J3430K0400n3885
123A6858K9039O884k3744j8386M1259K9445o0037q09L6036m118j0645Q288K3256
110G3326m643J1602r320l1813o2680M8820L5626j0357k2370j7302M218j0275k8476
97b3644o910M2940k844R399L6459l6585l100K717m4879L4145K507J578J1078j774
$$ y = [67235, 44656, 30172, 52079, 56241, 94906, 40092, 9818, 73712, 128080, 102970, 91406, 30407, 34601, 96811, 140459, 87021, 38999, 43682, 32660, 34881, 15193, 35315, 48513, 76478, 53154, 51100, 33675, -10549, 60369, 81206, 76277, 30601, 33734, 36032, 90355, 82422, 71376, 50019, 91250, 80881, 44216, 31907, 10597, -2194, 40977, 61334, 35869, 48464, 43502, 47164, 64707, 10948, 35507, 35009, 53432, 28905, 65838, 60104, 65104, 36913, 50343, 70743, 16858, 45897, 52781, 29037, 10651, 51910, 81355, 21318, 20509, 56545, 52427, 41782, 50070, 73326, 68683, 80285, 70965, 39152, -23528, 25292, 60918, 50561, 28191, 10889, 15107, 4832, -23644, -30554, 12386, 9542, 18941, 55400, 18815, 15715, 18432, -26447, 7698, 10205, 11783, 22861, 21087]
83B1087O249J0848J8936l1255M9276M158k3798n0822o315N142l2756r191L1140
70g301q435M0529j9482l207k9364N1860K8695m7280n1747P1432o49j3770p645
57C636m1264K1986R212l4676L9687K6500j2699o1804K527K7711J8141l6091M083
44c3051N8287m0446k698n113L1843j3386j1712k6334Q075j594J6408j0305q24
31c0850O626j7521j7961K4690R566K099K9004j9991K144M307n6150J5236J9754
18b9047l7298L1440J1251K3023k2328j3736k0149q133q352j342L2609m0854j5521
5i8437J9452J2012Q626M583J1079
0d2685
$$ y = [21087, 27336, 38184, 57120, 25865, 75141, 79299, 55501, 4679, -1636, 3506, -29250, -38441, -7301, -15736, 24793, 5311, 2104, -27260, 24600, 53295, 6015, -45732, 25700, 25051, 11281, 3636, -37628, -15642, -6430, -41106, -1419, 25081, 12382, -49422, -46895, -19184, -1043, -37134, -33051, 25236, -15210, -17908, -23021, 8822, -4564, -16276, -42610, -34535, -36129, -19721, -30026, -30850, -24224, -41745, -59706, -35016, -25450, -23351, 5653, -14338, -12194, -7887, -64037, -48801, -29047, -66345, -34905, -23654, -631, -22959, -36695, -56844, -64977, -73329, -74671, -42062, -82916, -98437, -78985, -66973, -58347, -53764, -42685]
$$ Imaginary data points
##PAGE= N=2
##DATA TABLE= (X++(I..I)), XYDATA
16383b123849L7528j970L6694k5977J9286O8433M3171K8561L9418O439K3602L5602
16371a813062M3228n998n177N2161N3138L6156L9724K5633L8526J0485L7754J5331
16359a472101J1686J7981J5860K9900N5019K0556n565L114M8202N8058M5489L4130
16347a137671P842L5194K275j4497J5917M0196L1929L1178L0249K6557j6893M2513
16335i05211O5394L3871M9183J2555O126J4849M2283k3678Q051O2966J4840J4549
16323f04222L3379N8834J0946J6045J5529N1578K9497J2632M848M7729K5589M1388
16311b56228J4261Q491L2627J9565k28L9975l979L3519K624j1214J7164J1552
16299i1871O2182L6678M0340J1153K9377N1852K3194k0183J8700M8532k8839K9872
$$ y = [-2123849, -2086321, -2088291, -2051597, -2077574, -2058288, -1989855, -1946684, -1918123, -1878705, -1872266, -1848664, -1813062, -1769834, -1775832, -1781009, -1728848, -1675710, -1639554, -1599830, -1574197, -1535671, -1525186, -1487432, -1472101, -1460415, -1442434, -1426574, -1396674, -1341655, -1321099, -1326664, -1323550, -1275348, -1217290, -1171801, -1137671, -1129829, -1094635, -1092360, -1106857, -1090940, -1050744, -1018815, -987637, -957388, -930831, -947724, -905211, -839817, -805946, -756763, -744208, -738082, -723233, -680950, -704628, -696577, -633611, -618771, -604222, -570843, -512009, -501063, -485018, -469489, -417911, -388414, -375782, -370934, -323205, -297616, -256228, -241967, -233476, -200849, -181284, -181512, -141537, -145516, -111997, -109373, -120587, -103423, -91871, -29689, 6989, 47329, 58482, 87859, 139711, 162905, 142722, 161422, 209954, 181115, 210987]
16287B10987N0776K0074K0044K4317k0552k849O851Q1573M5928j1081K6142K3330
16275D75540M8671j7009J9529J1868q901M2154M6242M0685O445j9914N324J7568
16263F68202K2913L0952L4494o638N515K0034K9844M2935k90J5147K926J6726
16251H82760L0501l5427r343K0014M5700O5853L0951J3584J280K1379k3484q828
16239A034940K2225N697L9230K9474L6586K0010k514k3524J4524L2504k0575O7832
16227A256409M806k8924M5452N3141j2471O371L261M9325k2484O7m624K1106L8468
16214A409903J6509J992k5021Q235J54P3955k8333L7737m2099M7583l722J1136
16202A508029l800k7508M3069N465J3820l634K2078L8885k4851N0739k6693k902
$$ y = [210987, 261763, 281837, 301881, 326198, 305646, 302797, 309648, 391221, 437149, 426068, 452210, 475540, 524211, 507202, 526731, 538599, 529698, 571852, 618094, 658779, 665224, 645310, 650634, 668202, 691115, 722067, 756561, 749923, 755438, 775472, 805316, 848251, 847961, 863108, 866034, 882760, 913261, 877834, 868491, 888505, 934205, 1000058, 1031009, 1044593, 1045873, 1067252, 1043768, 1034940, 1057165, 1062862, 1102092, 1131566, 1168152, 1188162, 1185648, 1162124, 1176648, 1209152, 1188577, 1256409, 1261215, 1232291, 1277743, 1330884, 1318413, 1324784, 1328045, 1377370, 1354886, 1354953, 1350329, 1371435, 1409903, 1426412, 1428404, 1403383, 1411618, 1411772, 1485727, 1457394, 1495131, 1453032, 1500615, 1496893, 1508029, 1504229, 1476721, 1519790, 1525255, 1539075, 1535441, 1557519, 1596404, 1571553, 1622292, 1595599, 1592697]
16190A592697M7019l163K8077r446j9602M4694m3137J2219K0903J3971M2496J4340
16178A741068k9743L9696M2417o8936L8442l2320O992K0858M2359L0144j2364
16167A818613J6931L6507j0802N740k9782k1450J9867K015k404Q374l3694M0587
16155A850502N6258l9421r190J3931K1345k0127K005O1743l9167k1822j9525J8105
16143A874637J3911N1290J7322r40k3386R324K5213L8455j6408p4710M8942j3709
16131A949941k8503N1730J5948l0974L9383K3624j1003l050l06K7499j1721j4687
16119B007881R341Q248J9519K1899J8534o6307k2000J616k2019k797K5544O0401
16107B059860m9900K1439L2868l0243L7272N391K356l6818L291Q973K0535J4686
$$ y = [1592697, 1639716, 1636553, 1664630, 1655184, 1635582, 1680276, 1637139, 1649358, 1670261, 1684232, 1726728, 1741068, 1711325, 1751021, 1793438, 1724502, 1762944, 1730624, 1737616, 1758474, 1800833, 1830977, 1818613, 1835544, 1872051, 1861249, 1866989, 1837207, 1815757, 1835624, 1837639, 1835235, 1843609, 1809915, 1850502, 1906760, 1867339, 1858149, 1872080, 1893425, 1873298, 1875303, 1937046, 1897879, 1876057, 1856532, 1874637, 1888548, 1939838, 1957160, 1956220, 1932834, 1942158, 1967371, 2005826, 1989418, 1914708, 1963650, 1949941, 1921438, 1973168, 1989116, 1958142, 1997525, 2021149, 2010146, 2007096, 2006790, 2034289, 2022568, 2007881, 2017222, 2025470, 2044989, 2066888, 2085422, 2019115, 1997115, 1998731, 1976712, 1973915, 1999459, 2059860, 2009960, 2031399, 2064267, 2034024, 2071296, 2076687, 2079043, 2042225, 2045516, 2054489, 2075024, 2089710]
16095B089710k4530N5578J603n7312j2534P49L9362R228K3837j1253l6427m541
16083B073470L1104Q481n5020N4699m5958J9964L6410J0816j7821j241J1399L150
16071B129453J9137l3107k5967l2801R0560j2264k0068k8815J4567r820K5305
16060B116180j7240q162M454N7376O1667j8736n3959n7030M401J1922j7223J8719
16048B102369J7369j2340J2887K4178m8207K9092L5667M335k3025N859L7669l5648
16036B150205o3599J0724M7575k289P232L9548k4458l7930j8400k0297K1548N171
16024B115030J0831j4393N2241R449J7346m7741L547P895q562J6458L5250K23
16012B197574k9838K9363m1690P37J4296p369L0197k4558L4226n4620k0638o536
$$ y = [2089710, 2065180, 2120758, 2122361, 2065049, 2052515, 2053264, 2092626, 2101854, 2125691, 2114438, 2078011, 2073470, 2104574, 2113055, 2058035, 2112734, 2066776, 2086740, 2123150, 2133966, 2116145, 2114904, 2126303, 2129453, 2148590, 2115483, 2089516, 2056715, 2147275, 2135011, 2114943, 2086128, 2100695, 2090875, 2116180, 2098940, 2090778, 2095232, 2152608, 2214275, 2195539, 2141580, 2084550, 2088951, 2100873, 2083650, 2102369, 2119738, 2107398, 2120285, 2144463, 2096256, 2125348, 2161015, 2165350, 2142325, 2148184, 2185853, 2150205, 2086606, 2097330, 2144905, 2142616, 2149848, 2189396, 2164938, 2127008, 2108608, 2088311, 2109859, 2115030, 2125861, 2111468, 2163709, 2173158, 2190504, 2142763, 2146310, 2154205, 2145643, 2162101, 2197351, 2197574, 2167736, 2197099, 2155409, 2156146, 2170442, 2163073, 2193270, 2168712, 2202938, 2148318, 2127680, 2121144]
16000B121144K8559L5791m8436k5823N158J941N9493l1141m497M842n5086L0206
15988B122151M022K5267M1387J0515l9413k2935Q809K7387j1958M6051k6915k1975
15976B162393k7456k824M588k5970K5417o970N3012p860j0358J1357j6260j125
15964B157944K3799J2098j9557j0562M2124q146j9632j0610N1031o0005J0558
15953B169042j7579l4851M8710j8323k5375P2168L471l7240k7102K1209N7769
15942B211899k0158K3319k8986m2619p487k8886O594M6738M8734o437k6668L1917
15930B207960J6005m8050m4058K1037l0214K2977O263m5968M8862n100l2214P3453
15918B190953j7603m8252J3331O4862j9019l623L8145n4662j5591n247j22Q1448
$$ y = [2121144, 2149703, 2185494, 2137058, 2111235, 2116393, 2118334, 2177827, 2146686, 2142189, 2147031, 2091945, 2122151, 2126173, 2151440, 2192827, 2203342, 2163929, 2140994, 2149803, 2177190, 2165232, 2211283, 2184368, 2162393, 2134937, 2132113, 2136701, 2110731, 2136148, 2129178, 2182190, 2174330, 2163972, 2175329, 2159069, 2157944, 2181743, 2193841, 2174284, 2163722, 2205846, 2197700, 2178068, 2167458, 2218489, 2158484, 2169042, 2151463, 2116612, 2165322, 2146999, 2121624, 2193792, 2197263, 2160023, 2132921, 2154130, 2211899, 2191741, 2215060, 2186074, 2143455, 2135968, 2107082, 2113676, 2160414, 2209148, 2202711, 2176043, 2207960, 2223965, 2175915, 2131857, 2152894, 2122680, 2145657, 2151920, 2105952, 2154814, 2149714, 2117500, 2190953, 2173350, 2125098, 2138429, 2203291, 2184272, 2180649, 2218794, 2164132, 2148541, 2143294, 2143172, 2224620]
15906B224620j0215l8358Q771k4676m2300K2966J7076L2633l1776K6480k5293
15895B159928k4986K0700J3687M3523J3228Q865j2073k9029j7321j6840J0310
15884B169992l016L8649l6027k3198J4764N7637m6768k2745l2800Q598M9219l2725
15872B141580K388m1558M4806K4048k0008M7774r398k3758O70m5608K9274K3927
15860B174137K5164l6777j8639M7684N7496k7780n0162R56J1706l0231K8161N051
15848B186766m131K0888K0962q99r767k4707o33j511j922J2975m1911J8398O412
15835B180920M1205k7561K158m0182k1323J2723r423N6274J1193p638m2927K0110
15823B175529k7359J6668L3442m491K619J2583r252m197J2429l2702m023o50l0300
$$ y = [2224620, 2214405, 2176047, 2184818, 2160142, 2117842, 2140808, 2157884, 2190517, 2158741, 2185221, 2159928, 2134942, 2155642, 2169329, 2212852, 2226080, 2234945, 2222872, 2193843, 2176522, 2159682, 2169992, 2166976, 2205625, 2169598, 2146400, 2161164, 2218801, 2172033, 2149288, 2116488, 2125086, 2174305, 2141580, 2143968, 2102410, 2147216, 2171264, 2151256, 2199030, 2189632, 2165874, 2166544, 2120936, 2150210, 2174137, 2199301, 2162524, 2143885, 2191569, 2249065, 2221285, 2171123, 2172079, 2183785, 2153554, 2181715, 2186766, 2182635, 2203523, 2224485, 2223586, 2213819, 2189112, 2188479, 2186968, 2185046, 2198021, 2156110, 2174508, 2180920, 2222125, 2194564, 2196722, 2156540, 2135217, 2147940, 2138517, 2194791, 2205984, 2198346, 2155419, 2175529, 2148170, 2164838, 2198280, 2193789, 2196408, 2208991, 2199739, 2195542, 2207971, 2175269, 2171246, 2170596, 2140296]
15810B140296K2215K2966L5505l1914j5532N217N43j3238P780L1567m9642k8686
15798B127077N3555L3831m1873K8794k9149J5049J997l1984L7961K111k8420n252
15786B163697M5818M6916J6n8638l4614M6422p754n7378k8494L5456K1747J5981
15774B189175J5394m0542q958K5713P531M8839M5116n1076l6141k665L0196l7069
15762B185513O313M767L0092l8420l4271J6477J1133K0795L993J0287m0952L0998
15750B206725L2015k3363K3514j5679p3355m2565N5996J7825k2167j1814j1813
15739B135319K7577P5851j3831n505m5960j0359K6788R628j3284L607L4288o035
15727B218084k9767K1710k7078l5331J8210K2834J7290L9227o5187k1060j3721
$$ y = [2140296, 2162511, 2185477, 2220982, 2189068, 2173536, 2178753, 2179296, 2166058, 2173838, 2205405, 2155763, 2127077, 2180632, 2214463, 2172590, 2201384, 2172235, 2187284, 2189281, 2157297, 2195258, 2197369, 2168949, 2163697, 2209515, 2256431, 2256447, 2197809, 2163195, 2209617, 2201863, 2144485, 2115991, 2151447, 2173194, 2189175, 2204569, 2164027, 2155069, 2180782, 2188313, 2237152, 2282268, 2231192, 2195051, 2192386, 2222582, 2185513, 2191826, 2196593, 2226685, 2188265, 2153994, 2170471, 2181604, 2202399, 2206392, 2216679, 2175727, 2206725, 2238740, 2215377, 2238891, 2223212, 2149857, 2107292, 2163288, 2181113, 2158946, 2147132, 2135319, 2162896, 2238747, 2224916, 2219411, 2173451, 2163092, 2189880, 2199508, 2186224, 2189831, 2224119, 2218084, 2188317, 2210027, 2182949, 2147618, 2165828, 2188662, 2205952, 2245179, 2179992, 2158932, 2145211]
$$ [...]
##END NTUPLES=NMR SPECTRUM
##END=
