##TITLE=1H_CA-8882-2x
 CDCl3, 8 sc, 
 29.06.2021
##JCAMPDX= 6.0         $$ Bruker NMR JCAMP-DX V2.0
##DATA TYPE= NMR SPECTRUM
##DATA CLASS= NTUPLES
##ORIGIN= UXNMR, Bruker Analytische Messtechnik GmbH
##OWNER= root
$$ XWIN-NMR		Version 3.5
$$ Tue Jun 29 08:57:55 2021 Russian Standard Time (UT+4h)  she@DPX200
##.OBSERVE FREQUENCY= 200.131506
##.OBSERVE NUCLEUS= ^1H
##.ACQUISITION MODE= SIMULTANEOUS
##.ACQUISITION SCHEME= undefined
##.AVERAGES= 8
##.DIGITISER RES= 18
##SPECTROMETER/DATA SYSTEM= spect
##.PULSE SEQUENCE= zg30
##.SOLVENT NAME= CDCl3
##.SHIFT REFERENCE= (INTERNAL, CDCl3, 0, 17.827)
##AUDIT TRAIL= $$ (NUMBER, WHEN, WHO, WHERE, WHAT)
$$ ##TITLE= Audit trail, XWIN-NMR		Version 3.5
$$ ##JCAMPDX= 5.01
$$ ##ORIGIN= Bruker BioSpin GmbH
$$ ##OWNER= she
$$ F:/spectra/data/she/nmr/H-F/1/pdata/1/auditp.txt
$$ ##AUDIT TRAIL=  $$ (NUMBER, WHEN, WHO, WHERE, WHAT)
(   1,<2021-06-29 08:56:39.37 +0400>,<she>,<DPX200>,
      <created by zg, POWCHK disabled, PULCHK disabled
       configuration hash MD5:
       00 E9 B6 7A A2 85 ED C7 34 08 36 98 17 FE 4E 26
       data hash MD5: 16K
       0F D0 A3 12 7C 02 98 7E CE 02 5C DE 55 22 1F 73>)
(   2,<2021-06-29 08:56:41.68 +0400>,<she>,<DPX200>,
      <Start of raw data processing
       efp BC_mod = 2 LB = 0.24 FT_mod = 6 PKNL = 1 PHC0 = -11567.57 PHC1 = 8.001012 SI = 16K 
       data hash MD5: 16K
       1C 8E D1 D0 0F C1 5F 82 1B 77 77 B3 9E 56 C4 E0>)
(   3,<2021-06-29 08:57:07.40 +0400>,<she>,<DPX200>,
      <pk PHC0 = -6.48609 PHC1 = 7.600001 
       data hash MD5: 16K
       2D E8 6F 2D 61 F1 B8 59 42 21 DA D2 D2 02 D5 98>)
(   4,<2021-06-29 08:57:10.59 +0400>,<she>,<DPX200>,
      <abs ABSG = 5 
       data hash MD5: 16K
       9A 27 42 08 A6 62 41 57 67 6B 97 28 C1 06 A3 5B>)
$$ ##END=
$$ 
$$ hash MD5
$$ 65 2E C3 62 2B AE 37 0A 8B EC FE D4 94 88 67 1F
##$RELAX= 
##$RELAX= 
##$RELAX= 
##$RELAX= 
##$RELAX= 
##$RELAX= 
$$ Bruker specific parameters
$$ --------------------------
##$DU= <F:/spectra>
##$EXPNO= 1
##$NAME= <H-F>
##$PROCNO= 1
##$TYPE= <nmr>
##$USER= <she>
##$AMP= (0..31)
100 100 100 100 100 100 100 100 100 100 100 100 100 100 100 100 100 100 
100 100 100 100 100 100 100 100 100 100 100 100 100 100 
##$AQSEQ= 0
##$AQ_mod= 1
##$AUNM= <au_zg>
##$AUTOPOS= <>
##$BF1= 200.13
##$BF2= 200.13
##$BF3= 200.13
##$BF4= 200.13
##$BF5= 200.13
##$BF6= 200.13
##$BF7= 200.13
##$BF8= 200.13
##$BYTORDA= 1
##$CFDGTYP= 0
##$CFRGTYP= 5
##$CHEMSTR= <none>
##$CNST= (0..31)
1 1 145 1 1 1 1 1 1 1 1 1 1 1 1 1 1 1 1 1 1 1 1 1 1 1 1 1 1 1 1 1 
##$CPDPRG= <>
##$CPDPRG1= <>
##$CPDPRG2= <>
##$CPDPRG3= <>
##$CPDPRG4= <mlev>
##$CPDPRG5= <mlev>
##$CPDPRG6= <mlev>
##$CPDPRG7= <mlev>
##$CPDPRG8= <mlev>
##$CPDPRGB= <>
##$CPDPRGT= <>
##$D= (0..31)
0 1.2 0 0 0 0 0 0 0 0.06 0 0.03 0 0 0 0 0.0002 0 0 0 0 0 0 0 0 0 0 0 0 
0 0 0 
##$DATE= 1624942598
##$DBL= (0..7)
120 120 120 120 120 120 120 120 
##$DBP= (0..7)
150 150 150 150 150 150 150 150 
##$DBP07= 0
##$DBPNAM0= <>
##$DBPNAM1= <>
##$DBPNAM2= <>
##$DBPNAM3= <>
##$DBPNAM4= <>
$$ [...]
##$SUBNAM3= <"">
##$SUBNAM4= <"">
##$SUBNAM5= <"">
##$SUBNAM6= <"">
##$SUBNAM7= <"">
##$SUBNAM8= <"">
##$SUBNAM9= <"">
##$SW= 20.0188882624521
##$SWIBOX= (0..15)
0 0 2 0 0 0 0 0 0 0 0 0 0 0 0 0 
##$SW_h= 4006.41025641026
##$TD= 16384
##$TD0= 1
##$TE= 0
##$TE2= 300
##$TE3= 300
##$TEG= 300
##$TL= (0..7)
0 120 120 120 120 120 120 120 
##$TP= (0..7)
150 150 150 150 150 150 150 150 
##$TP07= 0
##$TPNAME0= <>
##$TPNAME1= <>
##$TPNAME2= <>
##$TPNAME3= <>
##$TPNAME4= <>
##$TPNAME5= <>
##$TPNAME6= <>
##$TPNAME7= <>
##$TPOAL= (0..7)
0.5 0.5 0.5 0.5 0.5 0.5 0.5 0.5 
##$TPOFFS= (0..7)
0 0 0 0 0 0 0 0 
##$TUNHIN= 0
##$TUNHOUT= 0
##$TUNXOUT= 0
##$USERA1= <user>
##$USERA2= <user>
##$USERA3= <user>
##$USERA4= <user>
##$USERA5= <user>
##$V9= 5
##$VALIST= <valist>
##$VCLIST= <CCCCCCCCCCCCCCC>
##$VD= 0
##$VDLIST= <DDDDDDDDDDDDDDD>
##$VPLIST= <PPPPPPPPPPPPPPP>
##$VTLIST= <TTTTTTTTTTTTTTT>
##$WBST= 1024
##$WBSW= 4
##$XGAIN= (0..3)
0 0 0 0 
##$XL= 0
##$YL= 0
##$YMAX_a= 113555
##$YMIN_a= -146687
##$ZGOPTNS= <>
##$ZL1= 120
##$ZL2= 120
##$ZL3= 120
##$ZL4= 120
##$ABSF1= 17.52399
##$ABSF2= -2.495049
##$ABSG= 5
##$ABSL= 3
##$ALPHA= 0
##$AQORDER= 0
##$ASSFAC= 0
##$ASSFACI= 0
##$ASSFACX= 0
##$ASSWID= 0
##$AUNMP= <proc_1d>
##$AZFE= 0.1
##$AZFW= 0.1
##$BCFW= 0
##$BC_mod= 2
##$BYTORDP= 0
##$COROFFS= 0
##$CY= -3
##$DATMOD= 1
##$DC= 0
##$DFILT= <>
##$DTYPP= 0
##$F1P= 0
##$F2P= 0
##$FCOR= 1
##$FTSIZE= 16384
##$FT_mod= 6
##$GAMMA= 0
##$GB= 0
##$INTBC= 1
##$INTSCL= 1.334414e-10
##$ISEN= 128
##$LB= 0.24
##$LEV0= 0
##$LPBIN= 0
##$MAXI= 10000
##$MC2= 0
##$MEAN= 0
##$ME_mod= 0
##$MI= 1.114404
##$NCOEF= 0
##$NC_proc= -8
##$NLEV= 6
##$NOISF1= 3.799351
##$NOISF2= 2.8
##$NSP= 0
##$NTH_PI= 0
##$NZP= 0
##$OFFSET= 17.82702
##$PC= 1
##$PHC0= -11574.06
##$PHC1= 15.60101
##$PH_mod= 1
##$PKNL= yes
##$PPARMOD= 0
##$PSCAL= 0
##$PSIGN= 0
##$REVERSE= no
##$SF= 200.12994148564
##$SI= 16384
##$SIGF1= 3
##$SIGF2= 2
##$SINO= 5.538805
##$SIOLD= 16384
##$SREGLST= <1H.CDCl3>
##$SSB= 0
##$STSI= 16384
##$STSR= 0
##$SW_p= 4006.41025641026
##$SYMM= 0
##$S_DEV= 0
##$TDeff= 16384
##$TDoff= 0
##$TI= <>
##$TILT= no
##$TM1= 0
##$TM2= 0
##$TOPLEV= 0
##$USERP1= <user>
##$USERP2= <user>
##$USERP3= <user>
##$USERP4= <user>
##$USERP5= <user>
##$WDW= 1
##$XDIM= 16384
##$YMAX_p= 291793790
##$YMIN_p= -1023047
$$ End of Bruker specific parameters
$$ ---------------------------------
##NTUPLES= NMR SPECTRUM
##VAR_NAME=  FREQUENCY,     SPECTRUM/REAL,   SPECTRUM/IMAG
##SYMBOL=    X,             R,               I
##VAR_TYPE=  INDEPENDENT,   DEPENDENT,       DEPENDENT
##VAR_FORM=  AFFN,          ASDF,            ASDF
##VAR_DIM=   16384,         16384,           16384
##UNITS=     HZ,            ARBITRARY UNITS, ARBITRARY UNITS
##FACTOR=    0.24454680195387, 1,            1
##FIRST=     3567.72059857548, 0,            0
##LAST=      -438.689657834775, 0,           0
##MIN=       -438.689657834775, -1023047,    0
##MAX=       3567.72059857548, 291793790,    0
$$ Real data points
##PAGE= N=1
##DATA TABLE= (X++(R..R)), XYDATA
$$ [...]
5942E6900j54654J50543k01231K91253j68312J17784J63550J28174l26450k861
5932E4696K08659J51985k07731M0702j84083j91407j51988L99095K67305J6600
5922D03833j23400j90780N0040N4319J24143k32841q3072k46804M44094J45317
5912C44849L3459k46939L8887M02322j15331l94531K89333k84010Q4017J56491
5902C08547q7144n3157J76990o8088j23851r8756L79519l2959n9123M2535l9567
5891C44946k75823k67757o5123K44240K85536m7881K15267k89421q8279M57415
5881E13120L2048n80168L34611L72894n73403k6308J92649L30277j15422k36103
5871B44195j88703p9483k83489L23457K86736O8713r6029M9418J05025o02471
$$ y = [56900, -97754, 52789, -148442, 142811, -25501, 92283, 255833, 384007, 57557, 54696, 263355, 415340, 207609, 248311, 64228, -127179, -279167, 119928, 387233, 403833, 280433, 89653, 139693, 194012, 318155, 85314, 2242, -244562, 199532, 344849, 378308, 131369, 170256, 572578, 457247, 62716, 352049, 68039, 152056, 308547, 221403, 168246, 345236, 277148, 153297, 54541, 434060, 401101, 341978, 384513, 344946, 69123, -198634, -263757, -19517, 266019, 218138, 433405, 143984, 55705, 513120, 545168, -35000, 299611, 672505, 99102, 72794, 265443, 595720, 480298, 244195, 55492, -23991, -307480, 15977, 302713, 371426, 275397, 324815, 429840, -172631]
5861a72631J5145J14603K12744K33551N0735J3270J19721j39914J59283J4048
5851F20555J81744p59572j79307L09666J57975k10158J55652K29675l59023K69875
5841D17082K96120l55526n9920Q4839m3430L050j04628J51170j49106p0330k16449
5830d7128L89199J58746k67769j38185n9410L44672j64192r0571k7217k12515
5820a14370J78446N39529l38779j94013O00409L30806l34885k67141j88801K08085
5810D19286M32657m67736r7185M2420P6946n4589K0503r8394m40653o0223L83214
5799A56246L65738K32733k3179k9951m9153k7758l48284L937J81868J92919k19258
5788D35858p6730M0710m06540J20975j43327M77960L93696m43566l26828K57625
$$ y = [-172631, -157486, -42883, 169861, 403412, 454147, 467417, 587138, 447224, 606507, 620555, 802299, 42727, -136580, 173086, 331061, 120903, 276555, 506230, 147207, 417082, 713202, 357676, 297756, 382595, 339165, 342215, 237587, 388757, 239651, 169321, -47128, 342071, 500817, 233048, 94863, 35453, 380125, 215933, 125362, 98145, -114370, 64076, 603605, 264826, 70813, 671222, 1002028, 667143, 400002, 211201, 419286, 851943, 384207, 287022, 329442, 406388, 351799, 372302, 273908, -166745, -226968, 156246, 521984, 754717, 731538, 701587, 652434, 624676, 276392, 280329, 462197, 655116, 435858, 359128, 399838, -6702, 114273, -29054, 448906, 842602, 399036, 72208, 329833]
5778C29833K65523l44969K72573J40912O9912J19654m64737l6210N26318j37633
5768G41176k4753Q0466k09886j76153j80395J04740L1819j0970k78734l39561
5758b62251k3904N66172L55597l01791K27328J60690k64999J60835l5958k62416
5748C19303J03708l40673L59525K37894l25781L54907r7408j01214J60750l9977
5738F31034j87341k08048N09503J14673o41245j43550M1586M0210L76302p8079
5728D55045L24788J00985n16698J1590L73527K60107k16881k01714n5353L39113
5718H74509J772l23807j12681K20325j98626J39850J96169o5710K75150l42738
5708F64213L30628j78429k22706J28654J63440k69670L85774l6588n79444P04029
$$ y = [329833, 595356, 250387, 522960, 663872, 733784, 853438, 388701, 352491, 878809, 741176, 716423, 796889, 587003, 410850, 230455, 335195, 367014, 356044, 77310, -262251, -286155, 280017, 635614, 333823, 561151, 721841, 456842, 617677, 581719, 319303, 423011, 82338, 441863, 679757, 353976, 708883, 611475, 510261, 671011, 631034, 443693, 235645, 745148, 859821, 218576, 75026, 116612, 156822, 533124, 455045, 779833, 880818, 364120, 375710, 749237, 1009344, 792463, 590749, 535396, 874509, 876281, 552474, 439793, 660118, 461492, 601342, 797511, 731801, 1006951, 664213, 994841, 816412, 593706, 722360, 885800, 616130, 1001904, 965316, 385872, 1089901]
5698A089901j99617j63960j75156K02264o9425l3862j35864L67129J58653k5039
5688A015024R0352l46345j08926j8657j10221L9250O5932L06K56276R3247n2230
5677I24008k6312J17216k96393k2003n8629K28302K85958K68119q4689o89830
5667F45747q739O8235O2448L4071J92404j93206K43998l09651K04443M21351k24451
5656A136650O8882m94709L53787L91606k35713l37154L19274R3451J58309j44644
5646A309739k94885M28490k3262o8321k39535o5716L6902j94347J64314J26343
5636A179722K19268L37105j41465K84503j10320l42822j51001k6404J13555L01694
5626A663835K2130j68205J46696J6038J53843J21005R1439N5701k8463K20971
$$ y = [1089901, 890284, 726324, 551168, 753432, 684007, 650145, 514281, 881410, 1040063, 1015024, 1105376, 759031, 650105, 631448, 521227, 560477, 626409, 626715, 882991, 976238, 924008, 897696, 1014912, 718519, 696516, 637887, 866189, 1152147, 1420266, 1335577, 645747, 637008, 705243, 767691, 801762, 994166, 800960, 1044958, 735307, 939750, 1361101, 1136650, 1205532, 710823, 1064610, 1456216, 1220503, 883349, 1202623, 1296074, 1454383, 1309739, 1014854, 1443344, 1420082, 1351761, 1112226, 1046510, 1083412, 889065, 1053379, 1179722, 1398990, 1736095, 1594630, 1879133, 1768813, 1425991, 1274990, 1248586, 1362141, 1663835, 1685965, 1517760, 1664456, 1680494, 1834337, 1955342, 2046781, 2102482, 2074019, 2294990]
5616B294990k1800p5235P2913l46076p6630m826r7063K93079j22082L38394M08058
5605B663722j88357J11344m9648N64058k07554m28814R3330J27969l17285k14553
5595B154212J91151K9982K47859p6200m7113Q4643m46478j46868L61824L39497
5585B692509o03584k61028J58200K49143K68836L24305k61331J00654l42894j71012
5575B153798M57420j74364n26525j96416M92552R4394l42499K89338n5781n80815
5565A611102K40705J2745L5513l11053j20838J11310N26628o51970k92378N2362
5555A214126L7633K36292k13059j19492K48751R3299R3840J97012m4556k88300
5545A455546j40742O4377K58248J22519l38455k43210N6899Q0664m34224J16193
$$ y = [2294990, 2273190, 2197955, 2270868, 1924792, 1848162, 1843336, 1746273, 2039352, 1917270, 2255664, 2663722, 2475365, 2586709, 2537061, 3101119, 2893565, 2464751, 2558081, 2686050, 2368765, 2154212, 2345363, 2375345, 2623204, 2547004, 2499891, 2584534, 2138056, 1991188, 2353012, 2692509, 2088925, 1827897, 1986097, 2235240, 2504076, 2828381, 2567050, 2667704, 2324810, 2153798, 2611218, 2436854, 1910329, 1713913, 2206465, 2300859, 1958360, 2247698, 2191917, 1611102, 1851807, 1864552, 1900065, 1589012, 1468174, 1579484, 2106112, 1454142, 1161764, 1214126, 1251759, 1488051, 1274992, 1155500, 1404251, 1497550, 1591390, 1788402, 1743846, 1455546, 1314804, 1379181, 1637429, 1759948, 1421493, 1178283, 1235182, 1315846, 881622, 997815]
5535I97815L71927k49400m5318L04117J41284K23247K66823n51583P8103j6721
5525A520294k88575J06332R2007P1793K2168l53558J67084j10153r3380m02675
5515G31337J53116O36180m06217K46150r0091j46358K10481J91406M2661k73538
5505A295127q4650J76546l0428l2010j9938P9389k006j70913k65786K54247o0255
5494A139323K75034j04807j7538K2081K7933L95547j79147k78890k25165J44857
5484A199228K63371M9182k11595k81269J25387M11485K92544m64670Q2295J73419
5474A639377k17128K36698N530P0788J07712J23396k45665O426J51804j21361
5464A757577k73268J6415L1212N645L73659j34068N31426k9728m24911r1682K43504
$$ y = [997815, 1369742, 1120342, 1075024, 1379141, 1520425, 1743672, 2010495, 1458912, 1537015, 1520294, 1231719, 1338051, 1430058, 1501851, 1524019, 1170461, 1337545, 1227392, 1134012, 731337, 884453, 1520633, 1114416, 1360566, 1270475, 1124117, 1334598, 1526004, 1568665, 1295127, 1210477, 1387023, 1356595, 1324585, 1304647, 1384036, 1382030, 1211117, 945331, 1199578, 1139323, 1414357, 1309550, 1292012, 1314093, 1342026, 1737573, 1558426, 1279536, 1054371, 1199228, 1462599, 1511781, 1300186, 1018917, 1144304, 1555789, 1848333, 1383663, 1465958, 1639377, 1422249, 1658947, 1664477, 1735265, 1842977, 1966373, 1720708, 1727134, 1878938, 1757577, 1484309, 1500724, 1531936, 1537581, 1911240, 1777172, 2308598, 2278870, 1853959, 1762277, 2005781]
5453B005781J06931k8614j66823K73414l72409J18274K26274k44743J18046j19591
5443A916540K82070M40839n64968k42133L63369K99212j17910R0312Q4123Q1232
5433B632686q5872R1769j67794J61538j49925K8428P20297o08330l71922O83564
5423B934439J99887k10281j28145j56479M22725M3150j90042R7000L25638m6360
5413C291532n645r956n8126j99016N8327k6569N86922k9145k20577L88566M6715
5402C823028l76833j6174j84265J86580j62073L49283j07197m15460O58139L54277
5392D109305l69193J87740k47379N490j97422K89289m1591k95143J64739N70215
5382D176050j97367r7555l55587j66391J66911O42494K32511n48684J4771N8097
$$ y = [2005781, 2112712, 2084098, 1917275, 2190689, 1818280, 1936554, 2162828, 1918085, 2036131, 1916540, 2198610, 2639449, 2074481, 1832348, 2195717, 2494929, 2377019, 2467331, 2551454, 2632686, 2546814, 2638583, 2470789, 2632327, 2482402, 2510830, 3231127, 2622797, 2250875, 2934439, 3134326, 2924045, 2795900, 2639421, 3062146, 3105296, 2915254, 3012254, 3337892, 3291532, 3285887, 3275931, 3217805, 3018789, 3077116, 3050547, 3637469, 3608324, 3387747, 3776313, 3823028, 3446195, 3430021, 3245756, 3432336, 3270263, 3619546, 3512349, 3096889, 3755028, 4109305, 3740112, 3927852, 3680473, 3685963, 3488541, 3777830, 3736239, 3441096, 3605835, 4176050, 3978683, 3881128, 3525541, 3359150, 3526061, 4168555, 4401066, 3852382, 3867153, 3925250]
5372C925250J90636J45351J58216l03634j5733J42761q9057k9279J13910j2643
5362D225778n9609K49067j34097k14260K18334k69339J42909J54151K60208k56079
5352D317063Q8803L56714k921j70630M09453k85437l46292J44729L9509j78976
5342D372015j54527j49079J86881K81020n1989j74265K75214L10001r4714k70229
5332D530328k60438M10263K83829k23109J73920r2955p3198L48276l61900J38735
5322D873751L4809K93134J15353k52102n873O1484K22860k35174M73432N88859
5312F170533K40876k16375M79539j99552J1453L13180k30734L4549q3716p030
5302F512723M10146J94668L11367L30132j71738n0820L94709K50996L74733L6020
$$ y = [3925250, 4115886, 4261237, 4419453, 4115819, 4100086, 4242847, 4153790, 4124511, 4238421, 4225778, 4166169, 4415236, 4281139, 4066879, 4285213, 4015874, 4158783, 4312934, 4573142, 4317063, 4405866, 4762580, 4759659, 4589029, 4998482, 4713045, 4366753, 4511482, 4550991, 4372015, 4217488, 4068409, 4255290, 4536310, 4484321, 4310056, 4585270, 4895271, 4800557, 4530328, 4269890, 4680153, 4963982, 4740873, 4914793, 4821838, 4748640, 5096916, 4735016, 4873751, 4908560, 5201694, 5317047, 5064945, 5059072, 5120556, 5343416, 5108242, 5581674, 6170533, 6411409, 6195034, 6674573, 6475021, 6486474, 6799654, 6568920, 6603469, 6519753, 6512723, 6922869, 7117537, 7428904, 7759036, 7587298, 7536478, 7931187, 8182183, 8556916, 8592936]
5292H592936J85982J00226J38393O04795L44920l2761j45135L04775N12818M10909
5282A1017858j28887J33579N65435O06257K21243J2353j1581O73883Q22179L71341
5272A4283660L25339N87226M53321K14295M02819M51672J61037K06532K94229
5263A7380130J59837K89291M00933P98801J84187L94844K44542K37721M53178
5254B0543464M58363K49356Q87519K97546J39131M13856K13834L34638N06344
5245B4044051K05821K82633M21797R8228K25530M32889j67552J81284N49542k90731
5235B5983492j4540J73470L26745l8969m30097k94139L06379j8978r4456J89646
5225B6088553q1013l84414J01909R9624k69814o06318j07519m26882n4307m88716
$$ y = [8592936, 8778918, 8879144, 9017537, 9622332, 9967252, 9934491, 9789356, 10094131, 10606949, 11017858, 10888971, 11022550, 11587985, 12194242, 12415485, 12427838, 12416257, 13090140, 13912319, 14283660, 14608999, 15196225, 15649546, 15863841, 16266660, 16718332, 16879369, 17085901, 17380130, 17539967, 17829258, 18230191, 19028992, 19213179, 19608023, 19852565, 20090286, 20543464, 21001827, 21251183, 22138702, 22436248, 22575379, 22989235, 23203069, 23537707, 24044051, 24249872, 24532505, 24954302, 25052530, 25278060, 25710949, 25543397, 25724681, 26274223, 25983492, 25968952, 26142422, 26469167, 26430198, 26000101, 25705962, 26012341, 25993363, 25898907, 26088553, 26007540, 25623126, 25725035, 25824659, 25554845, 24948527, 24841008, 24414126, 24359819, 23871103]
5215B3871103n73849k8532k47365j65332n14298n67796j32637n59652m00733l51514
5205B0329395n3219m03451l05904n85611n79311k44191P0736m00583j43911n55160
5195A7128790m22662j97634k45441m91969J23890l97807j90039m33491n75008
5186A4298629o26200k73880j45322j50516n9824k89972L45262o89422j14460k18654
5176A2075641k32159l34091M6801J0949j94765j75155J45583O3331n052l43045
5166A1058038J09167J75007k59477J28145l60889m14833L08479j04314L49885
5157A0989208M4769r4194L99376N9850j77954j24047R1247J75465m6734K89494
5147A1606480p7757k02173J15114j9004N67L80658j57936L36384Q133J20750J58411
$$ y = [23871103, 23297254, 23268722, 23021357, 22856025, 22341727, 21773931, 21641294, 21081642, 20680909, 20329395, 20276176, 19872725, 19566821, 18981210, 18401899, 18157708, 18228444, 17827861, 17683950, 17128790, 16706128, 16508494, 16263053, 15771084, 15894974, 15497167, 15307128, 14873637, 14298629, 13672429, 13398549, 13253227, 13102711, 13042887, 12752915, 13098177, 12408755, 12294295, 12075641, 11843482, 11509391, 11556192, 11567141, 11372376, 11197221, 11342804, 11406135, 11401083, 11058038, 11167205, 11342212, 11082735, 11210880, 10849991, 10435158, 10743637, 10639323, 10989208, 11033977, 10939783, 11339159, 11399009, 11221055, 11097008, 11188255, 11363720, 11316986, 11606480, 11528723, 11326550, 11441664, 11422660, 11423227, 11803885, 11645949, 11982333, 11990466, 12111216, 12269627]
5136A2269627l57754j43373J19697J45670L73126k60681R642J29016j3806Q3703
5126A2354867j52272K56173j0571k35078J88606N4916O84677k04090Q3714M82652
5116A3503594m68477J33776J603K12933L73676k57871k69179L11289j96441K25210
5106A3570113j1748j0113K71875l96480J61664J07558l8136J61020J06044k18592
5096A3703205k7226J36833P1224K34524Q3950O5588k18853K67953K47207j05085
5086A4459320l90799M76028j93433J7410k3458K6584Q9773K70729l25491K79144
5076A4685807k88236Q290M20283j24189N42548l60060l07711N51319L56266k1230
5066A5463087P50923L61037k38796K23187j12255l64081N03012L10688l93869
$$ y = [12269627, 11911873, 11768500, 11888197, 12033867, 12406993, 12146312, 12155954, 12284970, 12271164, 12354867, 12202595, 12458768, 12448197, 12213119, 12401725, 12456641, 13141318, 12937228, 13020942, 13503594, 13035117, 13168893, 13170496, 13383429, 13757105, 13499234, 13230055, 13541344, 13344903, 13570113, 13558365, 13548252, 13820127, 13423647, 13585311, 13692869, 13654733, 13815753, 13921797, 13703205, 13675979, 13812812, 13884036, 14118560, 14202510, 14268098, 14049245, 14317198, 14564405, 14459320, 14068521, 14544549, 14351116, 14368526, 14345068, 14371652, 14461425, 14732154, 14406663, 14685807, 14397571, 14405861, 14826144, 14701955, 15244503, 14884443, 14576732, 15128051, 15484317, 15463087, 16214010, 16575047, 16336251, 16559438, 16447183, 16083102, 16586114, 16896802, 16502933]
5057A6502933J84617j35646K36577M64872J5043P2531l00894L4700R6927l3296
5047A7138364N14715M5201K50640Q8478l71399N3733l2318N21955k23708r696
5037A7975965Q5529K2109o1480k886j70416k3017k92580k72098O9058Q3578K16100
5026A7629862R2737k00651k09368N63206l32515k13508M48273j79906l83047p33311
5016A6481772L32046J04795J49653m79828n76630j98515J99602J24752l07599
5007A5830048j25879l33285k71292n8069m4403l00478l64875L8069j9279n9325
4997A4291232k71038n64542J21310j97285N0124j79042n38828k68601j52746L46628
4987A2637212m92830j05688l8751m8693J58532l98029k09541n13650J21135r2391
$$ y = [16502933, 16687550, 16551904, 16788481, 17253353, 17268396, 17340927, 17040033, 17074733, 17171660, 17138364, 17653079, 17698280, 17948920, 18037398, 17665999, 17719732, 17687414, 18209369, 17985661, 17975965, 18061494, 18083603, 18022123, 18019237, 17848821, 17825804, 17533224, 17261126, 17330184, 17413762, 17629862, 17722599, 17521948, 17312580, 17875786, 17543271, 17329763, 17778036, 17598130, 17215083, 16481772, 16813818, 16918613, 17068266, 16588438, 16011808, 15813293, 16012895, 16137647, 15830048, 15704169, 15370884, 15099592, 15041523, 14997120, 14696642, 14331767, 14369836, 14350557, 14291232, 14020194, 13455652, 13576962, 13379677, 13429801, 13250759, 12711931, 12443330, 12290584, 12637212, 12144382, 12038694, 11999943, 11951250, 12109782, 11711753, 11502212, 10988562, 11109697, 11017306]
4977A1017306j89644K1500K40846o41560l79398O27439j89898m53777r8588L52439
4967A0306665l3603L8423j70912n21927l81067j83411k80619Q4960N40117j66005
4957I232621k34345L01485l37874L69751L29357m03927j76833K07657M44645k37031
4947I495506O890j35204o3556P7705J18205n09765K17725m20684K52714L71276
4937I410812j31001J97181q4210L31361k31881q1116m5326L76079J65211m2139
4927I864971l7402j62351l5433m05082M52704O18821J38710L8053L99515J15476
4917A0987982p42675L2171K70222K63525N51808L2168o77340N21593L20885J42774
4907A1703113N71077j32714K7328k7603K81125J58952K78534L9477R1280J02480
$$ y = [11017306, 10827662, 10849162, 11090008, 10448448, 10069050, 10696489, 10506591, 10052814, 9954226, 10306665, 10273062, 10311485, 10140573, 9618646, 9237579, 9054168, 8773549, 8858509, 9398626, 9232621, 8998276, 9299761, 8961887, 9331638, 9660995, 9257068, 9080235, 9287892, 9732537, 9495506, 9502396, 9367192, 9303636, 9381341, 9499546, 8989781, 9207506, 8786822, 9039536, 9410812, 9279811, 9476992, 9392782, 9724143, 9492262, 9411146, 9365820, 9741899, 9907110, 9864971, 9827569, 9665218, 9629785, 9224703, 9677407, 10296228, 10434938, 10472991, 10872506, 10987982, 10245307, 10277478, 10547700, 10811225, 11363033, 11395201, 10717861, 11239454, 11560339, 11703113, 12274190, 12141476, 12168804, 12141201, 12422326, 12581278, 12859812, 12899289, 12990569, 13093049]
4897A3093049J50703R1784K53112P1359M93J28757M83416M17521q2496M0324N44238
4886A5192260J27385J24316J62286p2796N01042M95692l02970K22829P73717N41212
4876A7764973K75722K61208N49447O8672J38550J58323N26908O02584O77644L63267
4866B1387298L55897N48833J92927N15924N96583K61958K94443N30831M21743
4857B5106437J70126K66023O25048J73248L45629M66042P58712O25132k4881R5951
4847B8607467O47592l2283M2361L31472L28094L71847N03415Q07695j53526m23950
4837C1030184J6675M45625J16539K72558r8807j6405j71623K37839k67003J51077
4827C1716659m59339p01196J0234L18867r2718o84664K01330J18009n50358L1126
$$ y = [13093049, 13243752, 13335536, 13588648, 13660007, 13660500, 13789257, 14272673, 14690194, 14607698, 14648022, 15192260, 15319645, 15443961, 15606247, 15533451, 16034493, 16530185, 16227215, 16450044, 17223761, 17764973, 18040695, 18301903, 18851350, 18920022, 19058572, 19216895, 19743803, 20346387, 21024031, 21387298, 21743195, 22292028, 22484955, 23000879, 23597462, 23859420, 24153863, 24684694, 25106437, 25276563, 25542586, 26167634, 26340882, 26686511, 27152553, 27911265, 28536397, 28511516, 28607467, 29255059, 29222776, 29265137, 29596609, 29924703, 30296550, 30799965, 31607660, 31454134, 31030184, 31046859, 31492484, 31609023, 31881581, 31782774, 31766369, 31594746, 31832585, 31565582, 31716659, 31257320, 30556124, 30566358, 30885225, 30792507, 30107843, 30309173, 30427182, 29876824, 29907950]
4817B9907950K29695j76754j30924r7470o1979k16620k9415J54027l39487k97374
4807B8941649m7244k54465M486J02054n08846o29340j49442J37993j106338q4629
4797B6405878J09737r07916m78177m88271j49793J50122K6840K11624o02804l93119
4787B3884121k19897l28115m5181J94622l47945l57007L31540M67460j054l77394
4777B3201150k25337m27284L28663K8932l87247J12363k41391L27922J50171l05084
4767B2562858K96j84600k33249J77144j15498l64866m8516J27552J9186k73277
4757B1667030m6452o54939k46996J38563J049k27729k69224l38854J12359M4411
4747B0179218j1203n80870l34583Q1470n79275J33014L52177j55037j52240l38037
$$ y = [29907950, 30137645, 29960891, 29829967, 29732497, 29670518, 29453898, 29424483, 29578510, 29239023, 28941649, 28894405, 28639940, 28644426, 28746480, 28237634, 27608294, 27458852, 27596845, 26490507, 26405878, 26515615, 25607699, 25129522, 24641251, 24491458, 24641580, 24668420, 24880044, 24277240, 23884121, 23664224, 23336109, 23290928, 23485550, 23137605, 22780598, 23112138, 23579598, 23578544, 23201150, 22975813, 22548529, 22877192, 22906124, 22518877, 22631240, 22389849, 22717771, 22867942, 22562858, 22563154, 22378554, 22145305, 22322449, 22206951, 21842085, 21793569, 21921121, 21940307, 21667030, 21620578, 20965639, 20718643, 20857206, 20858255, 20630526, 20361302, 20022448, 20134807, 20179218, 20168015, 19587145, 19252562, 19334032, 18754757, 18887771, 19239948, 19084911, 18932671, 18594634]
4737A8594634M7327k10539j35365l66473M8056m39875j24193k22619q5166j38770
4727A6967017n68091o83661J80J69772l40343l17225M20437j42185n85864l8943
4717A4881094N84110k02838m32783j35556l09552J9489k35996k90177J18255K25061
4707A4221107q7027J28973j93071j09133k54964J12270N3306J97399J00375k05105
4697A3964130J67060j24337p3263J59050J52261j06488j63930J64356K44305k8780
4687A4354364k67175j44536K86492O3802L26721K1034l74399j80463L84695K08335
4677A4678870L2505K64575J20506k09922j33247M45553l80732M46007L56964J60314
4667A5781393k16796M7635J28973q0177N4863P2627j39455k06O31296j87654Q1553
$$ y = [18594634, 18641961, 18431422, 18296057, 17929584, 17977640, 17537765, 17413572, 17190953, 17105787, 16967017, 16398926, 15715265, 15715445, 15885217, 15544874, 15227649, 15648086, 15505901, 14920037, 14881094, 15465204, 15262366, 14829583, 14694027, 14384475, 14403964, 14167968, 13877791, 13996046, 14221107, 14134080, 14263053, 14069982, 13960849, 13705885, 13818155, 13871461, 14068860, 14169235, 13964130, 14131190, 14006853, 13933590, 14092640, 14244901, 14138413, 13974483, 14138839, 14383144, 14354364, 14087189, 13942653, 14229145, 14292947, 14619668, 14640702, 14266303, 14085840, 14470535, 14678870, 14711375, 14975950, 15096456, 14886534, 14753287, 15198840, 14818108, 15264115, 15621079, 15781393, 15564597, 15612232, 15741205, 15661028, 15715891, 15788518, 15649063, 15648857, 16280153, 16092499, 16174052]
4656A6174052M29473J43305j16294P6717Q6675q4605K04009J95689j2470J32577
4646A7229128K64064j05447O34633J33312N1434j44469j95012M14873J19347o8282
4636A8333581O20553L1667L807j14790J75415O59949K44490j53178j71500K11377
4626A9841371K45558J6957N25937K60581j77370L85086K38477k26122L64457L13133
4616B1788065n62429K80111n315L88376L25186K21099J30955J09131J51916L92057
4606B3219152M75006k76577M86386L63463K71853M28790J824o4480J13821J45833
4596B5165071L42773K21770L82391O02624J37240l79576J5782R53911K37026L8877
4586B7717889N27476L79501J53939j32813P2340J45486N81632K03142M37783M13525
$$ y = [16174052, 16603525, 16746830, 16630536, 16707253, 16793928, 16709323, 16913332, 17109021, 17096551, 17229128, 17493192, 17387745, 18022378, 18155690, 18207124, 18062655, 17867643, 18282516, 18401863, 18333581, 18954134, 18985801, 18989608, 18874818, 19050233, 19710182, 19954672, 19801494, 19629994, 19841371, 20086929, 20103886, 20629823, 20890404, 20713034, 21098120, 21336597, 21110475, 21474932, 21788065, 21225636, 21505747, 21500432, 21888808, 22213994, 22435093, 22566048, 22675179, 22827095, 23219152, 23694158, 23417581, 23903967, 24267430, 24539283, 24968073, 24969897, 24905417, 25019238, 25165071, 25507844, 25729614, 26112005, 26714629, 26851869, 26472293, 26488075, 27441986, 27679012, 27717889, 28245365, 28624866, 28778805, 28645992, 28718332, 28863818, 29445450, 29648592, 30086375, 30499900]
4576C0499900K637K30934J69809L31688K56152N17925K05478K52061J46015J1293
4566C2623892L96476N27687L16988m7196J9831K50056Q39480J28143J60413N3309
4556C5269079O28896M25223K77694L75000J8382p248L60150K91754M66754O26137
4546C8731821K84729K95114P4134M33805Q2278O45543m6374N9466L07585J43055
4536D1011156N02118M8470K59386L30781m1886O46179L97963J30535K19671M85885
4526D3990258M98694K43094M37402K17356o6895M80302q4384L66690K15757L16452
4516D6614726M15035L30665K83638J39185O6404L83016J63396J64195J50657K64910
4506D8975827k2331L78821L96685j731K58064J67457M08216k78256Q7758m5414
$$ y = [30499900, 30502537, 30733471, 30903280, 31234968, 31491120, 32009045, 32214523, 32466584, 32612599, 32623892, 33020368, 33548055, 33865043, 33817847, 33837678, 34087734, 34927214, 35055357, 35215770, 35269079, 35897975, 36323198, 36600892, 36975892, 36994274, 36987026, 37347176, 37638930, 38105684, 38731821, 39016550, 39311664, 39385798, 39819603, 39901881, 40547424, 40501050, 40560516, 40868101, 41011156, 41513274, 41561744, 41821130, 42151911, 42110025, 42756204, 43154167, 43284702, 43504373, 43990258, 44488952, 44732046, 45169448, 45386804, 45319909, 45800211, 45715827, 46082517, 46298274, 46614726, 47029761, 47360426, 47644064, 47783249, 47849653, 48232669, 48396065, 48560260, 48710917, 48975827, 48953496, 49332317, 49729002, 49727271, 49985335, 50152792, 50561008, 50282752, 50370510, 50325096]
4496E0325096J20969J53112N1701r3086Q9172J08122L22235m4524J51983m6433
4486E1138347j73329J15404j44545j4123N00275K3401J63665J6623k20972N5513
4476E1460259l97454p0446m1133m7561j98493J07458J15784R6196k89137M742
4466E0740215n09068l87000j777M8298l58009k53695R825n27007m63643J67464
4456D8465603m05061J27842O4464j18050k46557l58318J5693k57709j29412m21355
4446D6737140k97809J81674q4741q40254O5845o11388k07963k19141n90187o4164
4436D4069012Q8284k62913o23919j77236j88589n59860l67842r7809k48729j85805
4426D1444594n51511l56634l88510j25410n04094k26478L1480n52519k66146N1914
$$ y = [50325096, 50446065, 50599177, 50650878, 50557792, 50646964, 50755086, 51077321, 51032797, 51184780, 51138347, 50965018, 51080422, 50935877, 50921754, 51422029, 51445430, 51609095, 51625718, 51404746, 51460259, 51062805, 50992359, 50951226, 50903665, 50705172, 50812630, 50928414, 51024610, 50735473, 50740215, 50231147, 49844147, 49842370, 49890668, 49532659, 49278964, 49288789, 48761782, 48298139, 48465603, 48060542, 48188384, 48252848, 48134798, 47888241, 47529923, 47545616, 47287907, 47158495, 46737140, 46439331, 46621005, 46536264, 45696010, 45761855, 45150467, 44942504, 44723363, 44133176, 44069012, 44157296, 43894383, 43270464, 43093228, 42904639, 42344779, 41976937, 41879128, 41630399, 41444594, 40893083, 40536449, 40147939, 40022529, 39518435, 39291957, 39323437, 38770918, 38504772, 38556686]
4416C8556686k22258m27830k95105k75340j50564j65929l06890n70699L6900n97244
4406C5581727m33791l89811n15905l59048J93895q429l49286l40436j63756k06314
4396C3008846k93513o18927j12271l01769k87431J67977k75827p68858n24290
4387B9993937m22175L67960o1232k67925l49132l71592k06312m59269J79282K13735
4377B8617277j62821p71100J06254m06607l94617J5006o17558k72365k24365j47546
4367B5741558k41894j24305k26224k42620j50302k22927n81079j54908m8806j98109
4357B3550384o8989l25145j33787j17746k31550k21428j87859p5943J41843l64512
4347B1965268j92396J67205n240k1631m36629k4837K414n36017M7961k11729k66922
$$ y = [38556686, 38334428, 37906598, 37611493, 37336153, 37185589, 37019660, 36712770, 36142071, 36178971, 35581727, 35147936, 34758125, 34242220, 33883172, 34077067, 34068638, 33719352, 33378916, 33215160, 33008846, 32715333, 32096406, 31984135, 31682366, 31394935, 31562912, 31287085, 30518227, 29993937, 29571762, 29939722, 29878490, 29610565, 29261433, 28889841, 28683529, 28224260, 28403542, 28617277, 28454456, 27683356, 27789610, 27383003, 26988386, 27003392, 26385834, 26113469, 25889104, 25741558, 25499664, 25375359, 25149135, 24906515, 24756213, 24533286, 23952207, 23797299, 23748493, 23550384, 23481395, 23156250, 23022463, 22904717, 22673167, 22451739, 22263880, 22187937, 22329780, 21965268, 21772872, 21940077, 21934837, 21913206, 21476577, 21451740, 21454154, 20918137, 20966098, 20754369, 20487447]
4336B0487447j68876m49204k36054O7157L14190l91280k09362q1684m06305J39483
4326A9065512j77416K29470o0850o3854o29328O11039J2071l22366m62702k27427
4316A7974149q5466k61284j89511k56183n5623K5482P5464O2382K2998K18436
4306A7530844J04621m49654j5787l52317k47024j42129K07019l29342J19031L6806
4296A6462068k01785p2822j2955M9384m31359l31407K22004J33126l49537k22718
4286A5243999K75942M8644k53162P7614l65320r9441j03484L8405l85980m0302
4276A4436915J33516K4839J27824k38934p4317K12395l6163j31653l6288m42513
4266A3975621l87537N47915K16226n52739J12772Q5813j6772p4388k6954j18685
$$ y = [20487447, 20318571, 19869367, 19633313, 19700470, 20014660, 19623380, 19414018, 19332334, 18926029, 19065512, 18888096, 19117566, 19056716, 18992862, 18363534, 18974573, 18986644, 18664278, 18201576, 17974149, 17888683, 17627399, 17437888, 17181705, 17126082, 17151564, 17227028, 17289410, 17312408, 17530844, 17635465, 17185811, 17170024, 16817707, 16570683, 16428554, 16635573, 16306231, 16425262, 16462068, 16260283, 16187461, 16174506, 16223890, 15792531, 15461124, 15683128, 15816254, 15466717, 15243999, 15519941, 15568585, 15315423, 15393037, 15027717, 14928276, 14824792, 14863197, 14477217, 14436915, 14570431, 14595270, 14723094, 14484160, 14409843, 14622238, 14586075, 14454422, 14418134, 13975621, 13588084, 14135999, 14352225, 13799486, 13912258, 13998071, 13981299, 13906911, 13879957, 13761272]
4256A3761272P7775K1514k5898J25392P8175j48300R1769L057m28697J70873J24724
4245A3851656J07646j57199l85913K35174K1568j88147K35472k5860q8169j20248
4235A3485980j43566J82636J5362N8747n2874M323k7027j86547L06578N22404
4225A4166016L5703n13722j20580O15685m63480j29191l174K21211K28340k62154
4215A3774654j11305k00213O735N15696J7530m94755K01588L79562j03983j92244
4205A3793265J58806j46093K89J90219q5936L28300P4630l82269J51548M49857
4195A4532616O7479l10424N02061j06022k44816J96813K07108k9809j79770L51704
4185A4986940l5105K14581K7234o23748J54298O05280n703m99290M49922J39330
$$ y = [13761272, 13839047, 13860561, 13834663, 13960055, 14038230, 13889930, 13981699, 13984756, 13556059, 13726932, 13851656, 13959302, 13802103, 13416190, 13651364, 13672932, 13484785, 13720257, 13694397, 13606228, 13485980, 13342414, 13525050, 13540412, 13599159, 13546285, 13550608, 13523581, 13337034, 13643612, 14166016, 14201719, 13687997, 13567417, 14183102, 13719622, 13590431, 13587257, 13808468, 14036808, 13774654, 13663349, 13463136, 13469871, 13985567, 14003097, 13508342, 13709930, 14089492, 13985509, 13793265, 13952071, 13805978, 13806267, 13996486, 13910550, 14238850, 14313480, 13931211, 14082759, 14532616, 14600095, 14289671, 14791732, 14685710, 14440894, 14637707, 14844815, 14815006, 14635236, 14986940, 14951835, 15166416, 15193650, 14569902, 14724200, 15329480, 15323777, 14824487, 15274409, 15413739]
4175A5413739K03093m924n2001N51298j96882j46281o2423K10618K32374K46951
4165A6395562Q584J95714j22377J11674l02658J01870k2375o263J19874n7955
4155A6421650J71768k0066J43323M7186o854j38828J57242J87287m00761k32384
4145A6329563p1020J73113J57883K3612m8767j33044n4174l43810k0046J84865
4135A6198175k26565J44371J18164M97940k3051k16181j62250R6838l6333l57910
4125A6033198j72373J10538J21161j61408K99985J35929J71853k26757J53189
4116A6465315L15184L71029k67385k4237R4305K90617O8887Q5912p6205j44835
4106A7178587O91996M9691m9896N94846k8574L39120N81811J44774K19746R9536
$$ y = [15413739, 15616832, 15611908, 15559907, 16111205, 15914323, 15768042, 15705619, 15916237, 16148611, 16395562, 16404146, 16599860, 16477483, 16589157, 16286499, 16388369, 16365994, 16359731, 16479605, 16421650, 16593418, 16573352, 16716675, 16763861, 16757007, 16618179, 16775421, 16962708, 16561947, 16329563, 16258543, 16431656, 16589539, 16613151, 16564384, 16431340, 16377166, 16033356, 16013310, 16198175, 15971610, 16115981, 16234145, 16732085, 16709034, 16492853, 16330603, 16427441, 16391108, 16033198, 15860825, 15971363, 16092524, 15931116, 16231101, 16367030, 16538883, 16312126, 16465315, 16780499, 17151528, 16884143, 16859906, 16954211, 17244828, 17313715, 17399627, 17323422, 17178587, 17870583, 17920274, 17870378, 18465224, 18436650, 18775770, 19357581, 19502355, 19722101, 19821637]
4096A9821637o34845o0541M05476j02433J79852L34150j10074Q8845M86894r694
4086B0399267K03162r9085l45J62241J43901L1419Q7880Q9806J44472n464K69186
4075B1426440J54482l70086k03437Q5736N19644O5944K1302j47788K26680r4446
4065B1684471L68599L49690k47302j30337l00174l05928j4231R5678L56724N9413
4055B1916603k4150k55209k9042k70329n281r2721j71007N318j20072K71957N25069
4044B1751136m14704n29410K63477K95073l40336p190L51422m3238j37574j34692
4034B1053964m8103j34679L46352K0573J42737m05322n5307o8648n5134O16779
4024B1413212K08728m90626K04137M38448M0652K64151p4108q191n2565P6797
$$ y = [19821637, 19186792, 19126251, 19531727, 19429294, 19609146, 19943296, 19833222, 19922067, 20408961, 20399267, 20602429, 20503344, 20502999, 20665240, 20809141, 20840560, 20928440, 21018246, 21162718, 21157254, 21426440, 21580922, 21210836, 21007399, 21093135, 21612779, 21678723, 21700025, 21552237, 21778917, 21684471, 22053070, 22402760, 22155458, 22025121, 21724947, 21419019, 21404788, 21500466, 21857190, 21916603, 21892453, 21637244, 21608202, 21337873, 21332592, 21239871, 21068864, 21074182, 20954110, 21226067, 21751136, 21336432, 20807022, 21070499, 21365572, 21025236, 21018046, 21369468, 21326230, 21188656, 21053964, 21005861, 20871182, 21217534, 21238107, 21380844, 20975522, 20920215, 20851567, 20796433, 21413212, 21621940, 21131314, 21335451, 21773899, 21814551, 22078702, 22004594, 21996403, 21943838, 22020635]
4014B2020635K5388L79208N47270L76500o62736k94471M11589L01203L93571K69375
4004B3767532K55290l76142O58684p8053P1460L71778O63399j17860k2940K18216
3994B5411364J71746O4305K30040J35873M98481M93878j03321L44021J51745M32148
3984B7830280L83344P71196J78082K42013L64918l8443k1177N55517L12302K1300
3974C0599332L96850L88109N7961j70387N93474P84826K29233K13818j14961L64108
3964C3342363L95273L4954O21420O15536r336r7631m135J40930L45076L44172
3954C5728622P86988o1511L46969M57578J19421k45041K04175M29095j24823M2894
3944C7684367K89396J50529J59746j80880L15549K53283N64659M07979O6754k880
$$ y = [22020635, 22046023, 22425231, 22972501, 23349001, 22686265, 22391794, 22803383, 23104586, 23498157, 23767532, 24022822, 23646680, 24305364, 24227311, 24298771, 24670549, 25333948, 25216088, 25193148, 25411364, 25583110, 25647415, 25877455, 26013328, 26511809, 27005687, 26902366, 27246387, 27398132, 27830280, 28213624, 28984820, 29162902, 29404915, 29769833, 29731390, 29710213, 30265730, 30578032, 30599332, 30996182, 31384291, 31442252, 31271865, 31865339, 32650165, 32879398, 33093216, 32978255, 33342363, 33737636, 33772590, 34394010, 35009546, 35000210, 34902579, 34898444, 35039374, 35384450, 35728622, 36515610, 36454099, 36801068, 37258646, 37378067, 37133026, 37337201, 37766296, 37641473, 37684367, 37973763, 38124292, 38284038, 38103158, 38418707, 38671990, 39236649, 39644628, 39711382, 39708502]
3934C9708502R3172K38772K50711M35397J68058J68387N33450K87423j73670M65291
3924D2175493J74049L01569L37736m86531k6062M33637J25109j19807j82427m3693
3914D2689073L77900J58373m52751m33432j47506q2979k19892R6975J4286K74857
3904D2274904o9317o14657m71070J31968l19480J52076L6054m69231k54418j47128
3894D0249701k35161o5346n03120k03590j80198k94686m22377J86440j54747m64628
3884C7912288o02085l7591J88655r3310l27093J46103p1484m61334l36868P0904
3874C6388185K7423J67109k00636m2530j15562l53742r92m6987R6485p07636L4230
3863C5245347L46368K40719p136o68067K86253J25168J70912j82278l2054K52574
$$ y = [39708502, 39801674, 40040446, 40291157, 40726554, 40894612, 41062999, 41596449, 41883872, 41710202, 42175493, 42349542, 42651111, 42988847, 42502316, 42476254, 42909891, 43035000, 42915193, 42732766, 42689073, 43066973, 43225346, 42772595, 42339163, 42191657, 42108678, 41888786, 41985761, 42000047, 42274904, 42205587, 41590930, 41119860, 41251828, 40932348, 41084424, 41120478, 40651247, 40396829, 40249701, 40014540, 39949194, 39446074, 39242484, 39062286, 38767600, 38345223, 38531663, 38376916, 37912288, 37310203, 37272612, 37461267, 37367957, 37040864, 37186967, 37115483, 36654149, 36317281, 36388185, 36415608, 36582717, 36382081, 36339551, 36223989, 35870247, 35869255, 35822268, 35918753, 35211117, 35245347, 35591715, 35832434, 35825298, 35157231, 35443484, 35568652, 35739564, 35557286, 35525232, 35777806]
3853C5777806J4883O7787l07328K19030l10469n3388q2336J94126j15605m16424
3843C4988082j31956j13189n11363m01414J70626n45167k68629J32324j64973
3834C3154341k03249L04867l79012J8510K527j40953M23263l30047j60942K7476
3824C2716781j02260k20204K77696P3986o18763k93827j62986j7179k08544p34162
3814C0710538J68112l45599O3949k33113k19640j41783M65911j02134L18480M00227
3804C1084948K24984k06981L95458N9815J29928L96582K42428k39784K1585n7948
3794C2051015J50487p0820k99538M04920L48410j17868m7116K65165n5545J55183
3784C2784293p09198M43285j80079l03574L39571P8439l57122l6209L29587r0583
$$ y = [35777806, 35792689, 35860476, 35553148, 35772178, 35461709, 35408321, 35325985, 35520111, 35404506, 34988082, 34856126, 34742937, 34231574, 33830160, 34000786, 33455619, 33186990, 33319314, 33154341, 32951092, 33255959, 32876947, 32895457, 32897984, 32757031, 33180294, 32850247, 32689305, 32716781, 32614521, 32394317, 32672013, 32745999, 32127236, 31833409, 31670423, 31653244, 31444700, 30710538, 30878650, 30533051, 30597000, 30363887, 30144247, 30002464, 30468375, 30366241, 30684721, 31084948, 31309932, 31102951, 31498409, 31558224, 31688152, 32084734, 32327162, 32087378, 32108963, 32051015, 32201502, 32130682, 31831144, 32236064, 32584474, 32466606, 32419490, 32684655, 32629110, 32784293, 32075095, 32518380, 32338301, 32034727, 32374298, 32452737, 32095615, 32059406, 32388993, 32298410]
3774C2298410j02648K1512L4259k82712k45971L10273l34143k25527m59861m04741
3764C0608851k49276k82741K53654l46616j77225j15691k77295j57645m17988
3755B8838028k68700R8033O1083l07729l28231q5942q6710L0199j12302m66910
3745B7370819j13161k00203j54584R5568K44486m0354m27543j16491J89438m03634
3735B6444341k74994P3267j84102j30237O0509R0187M29853j7856N2658L22790
3725B6866416M23252L33752L53810P59954N03460J32564M42353Q35668K53328
3716C0904557K35857M82026O54736J012663K67449M94868j03342O62916L90769
3707C5002499Q10116M07868K27997P10491L13491J76814N30042P21470P17521
$$ y = [32298410, 32195762, 32217274, 32251533, 31968821, 31722850, 32033123, 31698980, 31473453, 31013592, 30608851, 30359575, 30076834, 30330488, 29983872, 29806647, 29690956, 29413661, 29256016, 28838028, 28569328, 28667361, 28728444, 28420715, 28092484, 28006542, 27919832, 27950031, 27837729, 27370819, 27257658, 27057455, 26902871, 26998439, 27242925, 27202571, 26775028, 26658537, 26847975, 26444341, 26169347, 26242614, 26058512, 25928275, 25988784, 26078971, 26508824, 26490968, 26543626, 26866416, 27289668, 27623420, 27977230, 28737184, 29240644, 29373208, 29815561, 30651229, 30904557, 31140414, 31622440, 32277176, 33289839, 33557288, 34052156, 33948814, 34611730, 35002499, 35812615, 36220483, 36448480, 37158971, 37472462, 37649276, 38179318, 38900788, 39618309]
3698C9618309Q08279M58613N83483P07423K29056L34277L60771l82481R7253k95075
3688D2519908Q4784J21844J72582J88995l22095L3139m98767k59269j55821r85714
3678D0899586j26138k20712m94177j86135n4982n70155m54171j49902o02649j53308
3668C7887257M559l87348n27287j69119q58377p61777j18387m94297n64302p06561
3658C3304361p22494r72951o23745q99971o71222j156562m88837j278925r27497
3649B5562157q98238r19834o62028r05066n09263l68416p39633j64360k94879
3640B0100440o39105m86826q44013J31282m50495m23970m1232m71173k80532n29888
3630A6064488q0074m75724N6349R4170n52266j20313j60514k65785o51510K34599
$$ y = [39618309, 40426588, 40885201, 41468684, 42176107, 42405163, 42739440, 43100211, 42717730, 42814983, 42519908, 42604692, 42726536, 42899118, 43088113, 42766018, 42799157, 42300390, 42041121, 41885300, 40899586, 40773448, 40552736, 40058559, 39872424, 39817442, 39247287, 38793116, 38643214, 38040565, 37887257, 37891816, 37504468, 36977181, 36808062, 35949685, 35187908, 35069521, 34575224, 34010922, 33304361, 32581867, 31608916, 30985171, 30085200, 29413978, 28257416, 27768579, 26489654, 25562157, 24663919, 23744085, 23082057, 22176991, 21667728, 21299312, 20559679, 20395319, 20100440, 19461335, 18974509, 18130496, 18261778, 17811283, 17387313, 17346081, 16874908, 16594376, 16064488, 15984414, 15508690, 15565039, 15659209, 15106943, 14986630, 14826116, 14560331, 13908821, 14143420]
3620A4143420j47195J07630k05188j58300J37589n10445M39038j20361j46141
3611A3540047M6392M9954q2356m56857O6585R9741M28099j47762k55347j06448
3601A3182048k26296M7805L97777K51244n3377j70304p4784l93213r1245P808
3591A2877463L03056j08933l56769J77661k31786K91486l45986J91142M36600
3582A3233934m74488L09854J15597o49750k88840J66046M4502k82363K56814J5279
3572A2446585q7518K40267L17873l11899p80947L13700l3830K62010j01373k51695
3562A2013173O46464o614k48730J56972n54971J72127M3147J83704M53977J63350
3552A3022599L3682P845L01437N83998K43576L2252K86801N20121j08876L87881
$$ y = [14143420, 13996225, 14103855, 13898667, 13740367, 13877956, 13367511, 13806549, 13686188, 13540047, 13586439, 13636393, 13554037, 13097180, 13163765, 13263506, 13691605, 13543843, 13288496, 13182048, 12955752, 13003557, 13401334, 13652578, 13599201, 13428897, 13354113, 12960900, 12869655, 12877463, 13180519, 13071586, 12714817, 12892478, 12660692, 12952178, 12606192, 12797334, 13233934, 12759446, 13069300, 13184897, 12535147, 12246307, 12412353, 12456855, 12174492, 12431306, 12446585, 12359067, 12599334, 12917207, 12605308, 11824361, 12138061, 12104231, 12366241, 12264868, 12013173, 12659637, 12653023, 12404293, 12561265, 12006294, 12178421, 12221568, 12405272, 12859249, 13022599, 13056281, 13064126, 13365563, 13949561, 14193137, 14225389, 14512190, 15032311, 14923435, 15311316]
3542A5311316O55388M87005o2196O15663N26323m4223M44571J34296O29347N54136
3532A9251626R33289R32444P48235O40613N93341Q31943Q45975Q35783J076271
3523B6689520Q56309R32202R78880J129037J336066J068534Q97199J103236J414587
3514C6405570J367493J413196J475366J479411J613057J459538J055366J589930
3506D7858927J866406J447577J819800J463540J931170K130757J886600J731941
3498F2136718K201409J708765J873658J608583J639115J639523J653717J576369
3490G6037857J826047J520350J675299J492100J390883J611688J586329J164198
3482H8304751J392645P15972N27978J080310J295419J056236N45392O86350L39023
$$ y = [15311316, 15966704, 16453709, 16391513, 17007176, 17533499, 17489276, 17933847, 18068143, 18697490, 19251626, 20184915, 21117359, 21865594, 22506207, 23099548, 23931491, 24777466, 25613249, 26689520, 27545829, 28478031, 29456911, 30585948, 31922014, 32990548, 33887747, 34990983, 36405570, 37773063, 39186259, 40661625, 42141036, 43754093, 45213631, 46268997, 47858927, 49725333, 51172910, 52992710, 54456250, 56387420, 58518177, 60404777, 62136718, 64338127, 66046892, 67920550, 69529133, 71168248, 72807771, 74461488, 76037857, 77863904, 79384254, 81059553, 82551653, 83942536, 85554224, 87140553, 88304751, 89697396, 90413368, 90941346, 92021656, 93317075, 94373311, 94918703, 95605053, 95944076]
3473I5944076M84814L66925O81721L31032r544k87864n06831j78081R403o40327
3463I6195324l36810p18597q18816p21760p73927j089758r26513j080190j138653
3454H8590300j286553j624906j951088j088187r19848j833068j648361j798143
3446G6440146j734573j156279j355126j980864j681805j767664k001321j874524
3438F2887990j616076j376249j893838j313556k264351j620656j738363j610511
3430D9454390j777116j999799j517820q99250j349662j749960j560874j088315
3422C7511594r20595j453701j252370j528614q05706j120240j173883p01847q49782
3413B7704856j601208p04938m85047n76456m12278r90519p54309p81951p77026
$$ y = [95944076, 96428890, 96795815, 97477536, 97808568, 97799024, 97511160, 97004329, 96826248, 96835651, 96195324, 95858514, 95139917, 94321101, 93599341, 92825414, 91735656, 90809143, 89728953, 88590300, 87303747, 85678841, 83727753, 82639566, 81719718, 79886650, 78238289, 76440146, 74705573, 73549294, 72194168, 70213304, 68531499, 66763835, 64762514, 62887990, 61271914, 59895665, 58001827, 56688271, 54423920, 52803264, 51064901, 49454390, 47677274, 45677475, 44159655, 43260405, 41910743, 40160783, 38599909, 37511594, 36590999, 35137298, 33884928, 32356314, 31550608, 30430368, 29256485, 28554638, 27704856, 26103648, 25398710, 24913663, 24337207, 23924929, 22934410, 22180101, 21398150, 20621124]
3404B0621124j14386o21770q91058m08184n15744n33634l62923n65383k60745
3395A6347297l27545k04284j00367j55953p15165L452l65876m28595l00310k59737
3385A3492917k34567l2026m32930l53461O3607m6490p7859l38868r2639j56785
3375A1790899p0792l09903L47587q6635N6982l7369m75940j03368k36282J92191
3365A1067370K39847m25227j75336J3739j84865j79518k86428J2903k43552J69646
3355A0008579J04569k1189m83649k64552J6164l98462j5717k04344j80217J34648
3345H695830q8930K0602K61055P8663J30231k36931m43523j16665m1161j67507
3335H091664P8824j73413j39166J82784r3659J70600r92j19917l8789r4435J39044
$$ y = [20621124, 20506738, 19884968, 18993910, 18585726, 18069982, 17536348, 17173425, 16608042, 16347297, 16019752, 15815468, 15715101, 15559148, 14843983, 14847435, 14481559, 14052964, 13752654, 13492917, 13258350, 13226324, 12793394, 12439933, 12503540, 12457050, 12379191, 12040323, 11947684, 11790899, 11720107, 11410204, 11757791, 11671156, 11728138, 11690769, 11214829, 11111461, 10875179, 11067370, 11307217, 10881990, 10706654, 10720393, 10535528, 10356010, 10069582, 10082485, 9838933, 10008579, 10113148, 10091959, 9608310, 9343758, 9359922, 8961460, 8945743, 8741399, 8561182, 8695830, 8606900, 8627502, 8888557, 8967220, 9097451, 8860520, 8416997, 8300332, 8259171, 8091664, 8170488, 7997075, 7857909, 8040693, 7947034, 8117634, 8116642, 7996725, 7957936, 7863501, 8002545]
3324H002545k65188K23307j02227j8570j9228L37225o37860K25219j77054j93854
3314G374315K56005j56207j05107j69469J75328Q5367J82588N2300Q9058k78638
3304G505540J23135r4774m8590q4927J75059k04391P6750o162j59844n5312n3680
3293G172804M1655L4643J41786R5426J29048M47380m76920J31778L4568P3041
3283G825209Q2043p8219K13584J07429k92814L59306M21309j98627l2730k74452
3273H132038O93324j86499K91554K42463m20579m62044L72345M60585r9115K14634
3263I238706m91293K39363K42437j88916K89622K50908q3000J19534J66933K68848
3253A0053142j94398N47340L41666J14095J41256J52029P6396J66763N16666L14494
$$ y = [8002545, 7737357, 7960664, 7858437, 7839867, 7820639, 8157864, 7520004, 7745223, 7568169, 7374315, 7630320, 7474113, 7369006, 7199537, 7374865, 7460232, 7642820, 7695120, 7784178, 7505540, 7628675, 7533901, 7485311, 7400384, 7575443, 7371052, 7447802, 7441640, 7281796, 7226484, 7172804, 7214459, 7249102, 7390888, 7486314, 7615362, 8062742, 7585822, 7717600, 7752168, 7825209, 7907252, 7829033, 8042617, 8150046, 7857232, 8216538, 8637847, 8439220, 8406490, 8132038, 8825362, 8638863, 8930417, 9172880, 8752301, 8290257, 8662602, 9123187, 9024072, 9238706, 8747413, 8986776, 9229213, 9040297, 9329919, 9580827, 9497827, 9617361, 9784294, 10053142, 9858744, 10406084, 10747750, 10861845, 11003101, 11155130, 11231526, 11398289, 11914955, 12229449]
3243A2229449J17440n2765M27302J43401N95579K39338M2761K53923L27281L15856
3233A4639565L99132n6647J181832K71309L46910N03039K83545M09267O78177
3224A8656129O73477N22230P96086N05439L42262Q18986Q24026N67347O62854
3215B4368836P20275P33507O71254L71118O17678J015630R21539P40529J058229
3206C1218595J247144L95150J424232R57495O20228J052206J245068R19799J224980
3197D0304897J455712J013025J042285J378589J313531J794194J329219J162501
3189E0793953J126135J254235J766922J182691J454034J747732J823059J353488
3181F2502249J469209K100721J606781J544260K063420J922105J886351J761455
$$ y = [12229449, 12346889, 12294124, 12721426, 12864827, 13460406, 13699744, 13742505, 13996428, 14323709, 14639565, 15038697, 14982050, 16163882, 16435191, 16782101, 17285140, 17568685, 17977952, 18656129, 19329606, 19851836, 20647922, 21153361, 21495623, 22314609, 23138635, 23705982, 24368836, 25089111, 25822618, 26493872, 26864990, 27482668, 28498298, 29419837, 30160366, 31218595, 32465739, 32860889, 34285121, 35242616, 35862844, 36915050, 38160118, 39079917, 40304897, 41760609, 42773634, 43815919, 45194508, 46508039, 48302233, 49631452, 50793953, 51920088, 53174323, 54941245, 56123936, 57577970, 59325702, 61148761, 62502249, 63971458, 66072179, 67678960, 69223220, 71286640, 73208745, 75095096, 76856551]
3173G6856551K146218K132192K366168K699510K170697K480157K341962K174278
3165I5367733K390028K821238K938658L173162K617925K900205K991522K854685
3157A18055156L407245L361961K886299L468826L416479L085958L842954L616058
3149A45140936L687750L581917L783550L971746L806582L684820M219211L776133
3141A75652645L649258M018472L602887L679707M032361M038873L665116M061086
3133B06400405L875058L949370L681214L853987M206159L390989L668874M094905
3125B37120961L613332M034970L422386L105773L489086L123750K749261L181731
3117B63841250K605782K797457K991611K618963K439210K426281J823070J632176
$$ y = [76856551, 79002769, 81134961, 83501129, 86200639, 88371336, 90851493, 93193455, 95367733, 97757761, 100578999, 103517657, 106690819, 109308744, 112208949, 115200471, 118055156, 121462401, 124824362, 127710661, 131179487, 134595966, 137681924, 141524878, 145140936, 148828686, 152410603, 156194153, 160165899, 163972481, 167657301, 171876512, 175652645, 179301903, 183320375, 186923262, 190602969, 194635330, 198674203, 202339319, 206400405, 210275463, 214224833, 217906047, 221760034, 225966193, 229357182, 233026056, 237120961, 240734293, 244769263, 248191649, 251297422, 254786508, 257910258, 260659519, 263841250, 266447032, 269244489, 272236100, 274855063, 277294273, 279720554, 281543624, 283175800]
3109B83175800J694469J361510J500567J161570J348922O51504N42664N7938K98846
3100B91793790n22375J71276o07472n60063n72759j475008j074735j716939j424364
3091B84011351k358867j733360j748370k361391k529538k386770k805807k984573
3083B65102675k988718l425332l314623l394511l588685l402844l279342l819302
3075B37889318l968717l935695l798120m189655m233594m383096m363903m353292
3067B04663246m562558m278795m324316m355807m583595m629357m467671m097096
3059A69364051m358492m444759m284060m091912l971891m311200m053001m309949
3051A35538787l843583l651690l541922l613517l680872l642314l230409l342661
$$ y = [283175800, 284870269, 286231779, 287732346, 288893916, 290242838, 290894342, 291437006, 291494944, 291793790, 291271415, 291442691, 290835219, 290275156, 289702397, 288227389, 287152654, 285435715, 284011351, 281652484, 279919124, 278170754, 275809363, 273279825, 270893055, 268087248, 265102675, 262113957, 258688625, 255374002, 251979491, 248390806, 244987962, 241708620, 237889318, 233920601, 229984906, 226186786, 221997131, 217763537, 213380441, 209016538, 204663246, 200100688, 195821893, 191497577, 187141770, 182558175, 177928818, 173461147, 169364051, 165005559, 160560800, 156276740, 152184828, 148212937, 143901737, 139848736, 135538787, 131695204, 128043514, 124501592, 120888075, 117207203, 113564889, 110334480, 106991819]
3043A06991819l515498k807631k856345l208413k635327l169922k952429k435682
3035H3410572k522065k388913k612864k442591k107854k267982j996157k211572
3027F4860574j593217j741832j380417j739476k025740j792769j493822j615012
3019E1478289j799191q43042j166229j435741j415442j079397j139432j133602
3011D1466213j029799j255899j067193j072652j485654o68162j145785q45708
3003C2895361r39664o42288q33136q29242q19874p64145m33647p97624p60064
2994B6075677q38363p19559o52059j82122j59405r43171m09694l15471m52548
2985B1403285j018396l98115j04859l34011j34332l63576j002574N8177j3037
$$ y = [106991819, 103476321, 100668690, 97812345, 94603932, 91968605, 88798683, 85846254, 83410572, 80888507, 78499594, 75886730, 73444139, 71336285, 69068303, 67072146, 64860574, 63267357, 61525525, 60145108, 58405632, 56379892, 54587123, 53093301, 51478289, 49679098, 48836056, 47669827, 46234086, 44818644, 43739247, 42599815, 41466213, 40436414, 39180515, 38113322, 37040670, 35555016, 34886854, 33741069, 32895361, 31955697, 31313409, 30480273, 29651031, 28831157, 28067012, 27633365, 26835741, 26075677, 25237314, 24517755, 23865696, 23683574, 23524169, 22580998, 22171304, 21855833, 21403285, 20384889, 19986774, 19881915, 19547904, 19413572, 19049996, 18047422, 18105599, 18092562]
2976A8092562n60918k06623n52538K7994o62605m19003J37689l23597l6866n21734
2966A4974361j98230m19412l64705k24034j49952K12214k50501m65774k17676
2957A2896291j43380q8563J23145k82990L06287l11321l93020q43155K35267K45801
2947A1744362m82752l80045o5170k78650L5148J45399k76817j63413l28986J26612
2937A0075688j52498n23745K38613K87659j24954j45299m58255m4996j50019n97350
2927H404844L00061L11478m43o8425l10389j92149m864p6062q943J38039R4545
2916H587692k88316l74225J73444o9662j30426L8385K62108j20605j83803k31461
2906G663131k99466l93253J14061P6568R6931m49586K24003N169p1310L29551
$$ y = [18092562, 17531644, 17325021, 16772483, 16800477, 16137872, 15718869, 15856558, 15532961, 15496095, 14974361, 14776131, 14356719, 13992014, 13767980, 13618028, 13830242, 13579741, 13113967, 12896291, 12752911, 12664348, 12787493, 12504503, 12810790, 12499469, 12106449, 11263294, 11498561, 11744362, 11261610, 10881565, 10816395, 10537745, 10572893, 10718292, 10441475, 10278062, 9949076, 10075688, 9923190, 9399445, 9638058, 9925717, 9800763, 9655464, 9197209, 9152213, 9002194, 8404844, 8704905, 9016383, 9015940, 8947515, 8637126, 8444977, 8440113, 8364051, 8355108, 8493147, 8587692, 8299376, 7925151, 8098595, 8028933, 7898507, 7936892, 8199000, 8078395, 7894592, 7663131, 7363665, 6970412, 7084473, 7161041, 7257972, 6808386, 7032389, 7037558, 6966248, 7295799]
2896G295799Q7285k31965o70821K79215l82610M5071n6208q1738K18917j35554
2886F367391P5834k29357j02615J62914L87831P131J49517o1313o29351j16285
2876F011697K5940q6402k7144O5072M85499l3261o6830k47573j26678N2788J54499
2865F207607l36122k05927J02600J04586L82729m08003J17066j00750K30857l41828
2855E752815j15317N27K33444j22487m4688j39287q1668K46232k32175K11184
2845E708580L47194k71991j70241K46190q2030K54337J76736p61667k08626Q3498
2835E321980K92121L92090m53623k43589R4234j9167k37628L47569K0670k23073
2825E291584K70534j37792l60069J05104k32789m4424O4952J87970K97802k99376
$$ y = [7295799, 7383084, 7151119, 6480298, 6759513, 6376903, 6421974, 6365766, 6284028, 6502945, 6367391, 6443225, 6213868, 6111253, 6274167, 6661998, 6669129, 6818646, 6757333, 6127982, 6011697, 6037637, 5951235, 5924091, 5989163, 6474662, 6441401, 6374571, 6126998, 6000320, 6053108, 6207607, 5871485, 5665558, 5768158, 5872744, 6255473, 5847470, 5964536, 5863786, 6094643, 5752815, 5637498, 5638025, 5871469, 5748982, 5704294, 5565007, 5483339, 5729571, 5497396, 5708580, 6055774, 5783783, 5613542, 5859732, 5777702, 6032039, 6208775, 5447108, 5238482, 5321980, 5614101, 6006191, 5552568, 5308979, 5403213, 5384046, 5146418, 5493987, 5514657, 5291584, 5562118, 5424326, 5064257, 5169361, 4936572, 4892148, 4957100, 5145070, 5442872, 5143496]
2815E143496r1329J67101j56746j55438o3848K03513L4418l93512l7435j932R9728
2804D748016k1695l16825k8454o0054L11287q2458k85419j4494M69752N8785m11186
2793D367255j43084J38607o0633k79022k95248k55221j30784q276M17125l823
2783C746896K6373L8553l95756o3734m24153K32826J14690P1506Q2349j836o3939
2772C363775j6592o1930n02707l18225J56252K40973p1954o33687L62474K34632
2762B753011m8289q471k43877N80409L0492l34860k35079l49856J65795J32956
2752B442231m15985K70134n26315O2144K19595M4680j54052K71654k91002M3202
2742A966286m20868p3092M58578k61981L32268L9911j26774o80849Q0332M29270
$$ y = [5143496, 5052167, 5219268, 5062522, 4907084, 4843236, 5046749, 5081167, 4687655, 4650220, 4648288, 4748016, 4726321, 4409496, 4381042, 4320988, 4632275, 4549817, 4264398, 4249904, 4719656, 4778441, 4367255, 4224171, 4362778, 4302145, 4023123, 3727875, 3472654, 3341870, 3333594, 3750719, 3746896, 3773269, 3811822, 3416066, 3352332, 2928179, 3161005, 3275695, 3347201, 3429550, 3427714, 3363775, 3347183, 3285253, 2782546, 2464321, 2620573, 2861546, 2789592, 2155905, 2518379, 2753011, 2704722, 2696251, 2452374, 3032783, 3063275, 2728415, 2493336, 2143480, 2309275, 2442231, 2026246, 2296380, 1770065, 1832209, 2051804, 2096484, 1942432, 2214086, 1923084, 1966286, 1545418, 1472326, 1930904, 1668923, 2001191, 2041102, 1914328, 1233479, 1313811, 1743081]
2732A743081l02363K45609j99347K12647J49368Q0984K7698n28902p8115Q8553
2722A439213k79702J08691p9101Q3845K17903m58606j33489j92607J13082O88991
2712A508220j42850j14660j11312j23667J71392k61740k32387L78624p6748J23744
2702A118616Q9061L05273k45356m29262o1966j32835J6791M59170k34503l86574
2692D98415L89268K85777J42808n14534M38637k45083j60670K903K84717j91681
2682I30557N6242o7286J91801k9943j00993r1677n35101J73214L60105J00189
2672I87108L03895l25141k73673j90031J00088j89156p7921L14779k23521m6966
2662C79461L67247j71582K30291m49934o1708L13115r5664L72441k65651L115
$$ y = [1743081, 1440718, 1686327, 1486980, 1699627, 1848995, 1929979, 1957677, 1428775, 1350660, 1439213, 1159511, 1268202, 1189101, 1272946, 1490849, 1032243, 898754, 706147, 819229, 1508220, 1365370, 1250710, 1139398, 1015731, 1187123, 925383, 692996, 1071620, 994872, 1118616, 1207677, 1512950, 1267594, 838332, 776366, 643531, 660322, 1119492, 884989, 498415, 887683, 1173460, 1316268, 801734, 1240371, 995288, 834618, 837521, 1122238, 930557, 986799, 919513, 1111314, 1081371, 980378, 888701, 353600, 526814, 886919, 987108, 1291003, 965862, 692189, 502158, 602246, 413090, 335169, 649948, 426427, 379461, 746708, 575126, 805417, 355483, 293775, 606890, 511226, 883667, 618016, 621131]
2652F21131N4183n58126k50336L55043N12095J77352l17957k34243K46347k32013
2642C73476J88888l28541j46490L4305K86277J33590N2109K01477P8664J21231
2632I94986j8823k50400k24237j09403k53800j48080J66142J49788J5535J14921
2622D36629m124j60403P7907R5760l10348J52737M7071J59289j07892j544l4624
2611C50458J24793k52009R8007j95098P2648m34498j40898J54251M34271k22430
2601a0505L55948K94595l61549q4505L32610j41677k67777K28991J6060K31310
2591E93501l04860j13414Q4912j76224K62150J85579k30497J76624M85914m06733
2581E56952K34106J26468p03807J3030J43093o382k90575K20766l8121K32124
$$ y = [621131, 675314, 117188, -133148, 221895, 733990, 911342, 593385, 359142, 605489, 373476, 562364, 233823, 87333, 121638, 407915, 541505, 593614, 795091, 873755, 994986, 976163, 725763, 501526, 392123, 138323, -9757, 156385, 306173, 321708, 436629, 432505, 272102, 350009, 445769, 135421, 288158, 335229, 494518, 386626, 385082, 350458, 475251, 223242, 321249, 126151, 198799, -235699, -376597, -222346, 211925, -10505, 345443, 640038, 278489, 193984, 526594, 384917, 117140, 346131, 362191, 593501, 288641, 175227, 260139, 83915, 346065, 531644, 301147, 477771, 963685, 556952, 791058, 917526, 213719, 226749, 369842, 363460, 72885, 293651, 255530, 487654]
2571D87654L10068n04394J98000k81760K30012o7760J17442o0246k80118l7627
2561A11271K95515j92119R7463L73910L86240k58761n77414P6073k04361k89465
2551a81648J33044L14794K29199j59160N9464K00547L9930j84187J46913N5327
2541F54223m03462j05021m62176M69202K3917J74018K12625O0491k85919N15937
2531H53835J51472o28485J02357J82479j60334j72200n0455j38811J51766J32262
2521D23886j98326k88154M03097M96583k93463j67293L26657L43409r04068M02139
2511E44467L27286k86443j6271R9368Q7069N7995k64773l33639l62590M66795
2501C19264Q7692q6159p2377j16165K34651Q5965j88668J48186j1133L03859K9564
$$ y = [487654, 797722, 293328, 491328, 209568, 439580, 371820, 489262, 429016, 148898, 111271, 406786, 214667, 312130, 686040, 1072280, 813519, 236105, 312178, 107817, -181648, -48604, 266190, 495389, 336229, 395693, 596240, 636170, 451983, 598896, 654223, 250761, 145740, -316436, 152766, 176683, 350701, 563326, 623817, 337898, 853835, 1005307, 376822, 479179, 661658, 501324, 329124, 278669, 139858, 291624, 423886, 225560, -62594, 340503, 837086, 543623, 376330, 702987, 1046396, 142328, 544467, 871753, 585310, 569039, 668407, 755476, 813471, 548698, 215059, -147531, 319264, 406956, 320797, 248420, 132255, 366906, 452871, 264203, 412389, 401256, 705115, 734679]
2490G34679J19180J28039j97726j63537Q5589l95775l20762N31816K92645j35129
2480F79019J13381P9436k47290p8252J95118J16492j18576j2764j28101K1063
2470F19526L16711L01061l45226j52246o23355J64580J51567P5759l38920K09777
2460C79234L05303K79014m27414m40719K30797m7273l46409O03605J14302n02287
2450A48153J94705j50289O32156K10996m06680k37384L05722p08762l350J12158
2440I7425J90463l0586n09989K70739p6765K87755J42390k19222J97128j14687
2430B34651n505k34200j90753k1920J46079j64055L32547L34296k39934J64714
2420C55920j85387j78535J8820K30609l93630N8341N6746L70586l88840j29859
$$ y = [734679, 853859, 981898, 784172, 620635, 706224, 310449, -10313, 521503, 814148, 679019, 792400, 871836, 624546, 546294, 741412, 857904, 739328, 726564, 598463, 619526, 936237, 1237298, 892072, 739826, 116471, 281051, 432618, 508377, 169457, 379234, 684537, 963551, 536137, 95418, 326215, 278942, -67467, 536138, 650440, 148153, 342858, 192569, 824725, 1035721, 629041, 391657, 697379, -11383, -14733, 97425, 287888, 257302, -252687, 18052, -58713, 229042, 371432, 152210, 349338, 234651, 229146, -5054, -195807, -217727, -71648, -235703, 96844, 431140, 191206, 355920, 170533, -8002, 10818, 241427, -152203, -93862, -37116, 333470, -55370, -185229]
2410a85229K49710j25269r0070k7374r7395J41394Q1808j01757L24061J0494m46784
2399b66411j24816j35181K10755J85328n6209K63340K70555m46511P5940k48843
2389b72053l3289k7262J78259M86552k53993n8195p5387j57938K93045K92991
2379C72730k66406l08079K44246K55755j65612K99851r0806Q6680m01279m19667
2369c92587J52073n73264K00135J87173j90655L18032J13232j12304j99348M55990
2359d1523j28294J76655P8508j36460j73850J00438K62194q8510J29383m2985
2349A35556j8822p7294J4575n3462K10595m8809J32335k56430L9173J446k50937
2338a72074q3852j54862J66946R2566J03307R5952m00003o4101L15360m5546J74056
$$ y = [-185229, 64481, -60788, -150858, -178232, -275627, -134233, -52425, -154182, 169879, 180373, -266411, -391227, -526408, -315653, -130325, -186534, 76806, 347361, -99150, -23210, -272053, -305342, -332604, -154345, 332207, 78214, 20019, -55368, -213306, 79739, 372730, 106324, -201755, 42491, 298246, 132634, 432485, 341679, 428359, 27080, -392587, -240514, -813778, -613643, -426470, -617125, -299093, -185861, -298165, -497513, -41523, -169817, 6838, 85346, -51114, -224964, -124526, 137668, 49158, 178541, 135556, 116734, 39440, 54015, 553, 211148, 162339, 294674, 38244, 77417, 78863, -172074, -255926, -410788, -243842, -151276, -47969, 47983, -352020, -416121, -100761, -146307, 27749]
2327B7749L11588k74958O7693L23495J1826k52302J29525j29379k44585J12657
2317H3309n1151m56566k52537J85092J13951J20513J2840j61018m81567L45855
2307e41279J16608n8925K40175K32392l1383K82020j05521l7764j68710M5469
2297b6918k06803q5955n4138K82205L9713J52261j07232k21501l53123j08602
2287f90093j3414L58147l49051K14805L99918R5072J09007m86979K63391J24328
2277B5131R2219m4639o4460K46897k93554L6592M74570m91316M57359l93993L7560
2266H2366J35623k19372l67669Q5295J39101M680J29142k13694r6843l3361M5080
2255c09652j40437N14280J68610l77094j05330r5179k95119R251R4905K55504
$$ y = [27749, 339337, 64379, 132072, 455567, 467393, 215091, 344616, 215237, -29348, 83309, 32158, -424408, -676945, -491853, -377902, -257389, -244549, -405567, -887134, -541279, -424671, -483596, -243421, -11029, -42412, 239608, 134087, 96323, -72387, -26918, -233721, -319676, -373814, -91609, -51896, 100365, -6867, -228368, -581491, -690093, -703507, -345360, -694411, -479606, -79688, 15384, 124391, -362588, -99197, 25131, 117350, 72711, 8251, 255148, -38406, -1814, 472756, -18560, 438799, 44806, 82366, 217989, -1383, -369052, -283757, -144656, -139976, -10834, -224528, -321371, -354732, -309652, -450089, 64191, 232801, -144293, -249623, -344802, -639921, -630670, -535765, -280261]
2245b80261l1156M0003K81531L678K08542Q5463m56943J42655j91017l12964k58766
2234g69235J08333L13680M29992J82368N090j46094m05739j84259k09761K23106
2224d52519j86308K90140m189K14435l87402O9340J16310l53231K24738M84271
2214A5585k55793q3406K83674K04950j42386j10254j64232n4694k8305o3111N15816
2203A17844o69499K98685J94668m2070K23894L10694j37291m03138m061j89563
2193b99837J70928J3391P6545j22039N69934n98940l18994N56024j53220l64030
2183d70238M40065j39879p2694J1227R0382j23400l90354K53689l04008N1056
2173f54154M14678P7109r8272o9684k0192l2287J71144P1847M52311J88188l90349
$$ y = [-280261, -311417, -271414, 10117, 13795, 222337, 307800, -149143, -6488, -197505, -510469, -769235, -660902, -347222, 82770, 265138, 270228, 124134, -281605, -465864, -675625, -452519, -638827, -348687, -352876, -138441, -525843, -456503, -340193, -693424, -468686, 15585, -240208, -323614, -39940, 165010, 22624, -87630, -251862, -306556, -334861, -397972, 117844, -551655, -252970, -58302, -100372, 123522, 434216, 296925, -106213, -110274, -299837, -128909, -115518, -38973, -161012, 408922, -190018, -509012, 47012, -106208, -470238, -30173, -170052, -242746, -231519, -141137, -264537, -654891, -401202, -705210, -654154, -239476, -162367, -260639, -330323, -350515, -382802, -211658, -139811, 312500, 500688, 110339]
2162A10339r8337j94815j2460K02544j718L6496l3844l861m64060k88623N63656
2151a84683Q4836n6003l08696J74874r3910j37969p3819K43191l00643L56637
2141b96185L32033k6363j18200J41259p1784J44480J04120R6213k04795p2106
2131B8672J31671j69243J47692k2438l57035K32779j62416R9479R0478k84845
2121b65206K38895k80558l21274K22366K90942k12122k16280M5037K33021j22294
2111c87473j08747J24542K38935k00630J17061k5582L42910m2654m62631J52739
2101b51530L80109O5710q15369P2792J44349o4492P35620k63231j186j47170l76909
2090e21307k932R8763J73396J91029N5197j1087j18600q1080N24092m2661j58594
$$ y = [110339, 12002, -182813, -195273, 7271, 5553, 42049, 8205, 4344, -459716, -748339, -184683, -99847, -155850, -464546, -289672, -383582, -521551, -595370, -352179, -652822, -296185, 35848, 9485, -108715, 32544, -39240, 105240, 209360, 305573, 100778, 28672, 160343, -8900, 138792, 116354, -240681, -7902, -170318, -70839, 19639, -265206, -26311, -306869, -628143, -405777, -114835, -326957, -543237, -498200, -265179, -387473, -496220, -371678, -132743, -333373, -216312, -241894, 101016, 58362, -404269, -251530, 128579, 194289, -621080, -548288, -403939, -468431, 267189, 3958, 2772, -144398, -521307, -524239, -425476, -252080, -61051, -5854, -16941, -135541, -216621, 307471, 264810, 106216]
2079A06216J02828j73674j77377J24601K13661m35317k26195K79220J82042k43545
2069b47540Q9707J2472J64801j6085K24998O9360J01628j19390m15846L29915
2059A94020Q1504k31599J59144l22318o5378J03647J47984k20918J04019L85426
2049C35531r1862o5238q8156m17545K56163L65457j33958l12054r5463K90762
2039D3637j50096L856j5879J51020J25058l9805n2953o8601j55612o3708K46302
2028B3219M83981j23497k55064L289L39955j25563L26883k74036n39720k38575
2018c79128N54919K22013k20684p8453j96415M75529L1053q2127k47459N589K12233
2007B97070K0419K2501L11055k62342p2988L30397M8371j92077m35293J99596
$$ y = [106216, 209044, 35370, -142007, -17406, 196255, -239062, -465257, -186037, -3995, -247540, -157833, -145361, 19440, 3355, 228353, 297713, 399341, 279951, -135895, 194020, 275524, 43925, 203069, -119249, -184627, -80980, 67004, -153914, -49895, 335531, 243669, 178431, 90275, -327270, -71107, 294350, 160392, -151662, -247125, 43637, -106459, -102603, -118482, 32538, 157596, 117791, 64838, -3763, -159375, -223083, 23219, 507200, 383703, 128639, 131928, 471883, 346320, 673203, 399167, -140553, -379128, 175791, 397804, 177120, 98667, -97748, 377781, 408834, 326707, 79248, 84837, 297070, 317489, 339990, 651045, 388703, 315715, 646112, 694483, 502406, 67113, 266709]
1997B66709k71908l03226J06004N28329J91441j28173n51686j0257Q0422M10094
1987C17749J96071l90275j71944k34319m77250K40686K67658K20734J71820k44359
1977a03429l67174o7174M21735j84112J52922L07579Q8145l94081k92409J56411
1967b81587P4207K76801k38195l55962K49497O68320j08028l63346o9992K6781
1957a21504P772L77001K76310r1919k29218K66401j26187m2924Q7837k54329L44278
1946D93518l83229k3990R7013J90262J03107j60360M1504O4987J32384m761o60
1935E49775o23904j76610L62756K89600j26359K59664K4334k78580J18501m58473
1925e9296K62070j01432K55980j43551j72344n9704K74238K37466J72402l6773
$$ y = [266709, -5199, -308425, -202421, 325908, 517349, 389176, -162510, -172767, -92345, 317749, 513820, 123545, -48399, -282718, -759968, -519282, -251624, -30890, 140930, -103429, -470603, -537777, -116042, -300154, -147232, 160347, 248492, -145589, -437998, -281587, -207380, 69421, -168774, -524736, -275239, 393081, 285053, -78293, -148285, -121504, -113732, 263269, 539579, 447660, 218442, 484843, 358656, 315732, 403569, 149240, 493518, 110289, 86299, 183312, 373574, 476681, 316321, 357825, 422812, 555196, 550435, 549775, -74129, -250739, 112017, 401617, 275258, 534922, 559256, 280676, 399177, -59296, 202774, 101342, 357322, 213771, 41427, -18277, 255961, 493427, 665829, 629056]
1915F29056J33901k53567j32728n9075l88117P9002N68663j25132l58062J48175
1905B42116K58272J98135j69144J58517j01071K89190P9040L6263r496l24741
1895F57081K12104J64592P1104O8909q1028M1921J49607m90949j59198L01072
1885I35215J02189m2655K55117j54540N24080j01719n8825L00491L49892l1057
1875B078188n48373k86004L52363j37616m07964K30364O63673k52998L7368N98327
1865B327328K38054R5421k30009l5750j78491M80701M6131m1542J38925K50927
1855C091695L24135K16018P6683L34547M581L30813j57764J46536o1681O65625
1845D971188N08321L9411J33325K37410O58042M75702M17747L56789K36883N12168
$$ y = [629056, 762957, 509390, 376662, 317587, -70530, 8472, 577135, 452003, 93941, 242116, 500388, 698523, 529379, 687896, 586825, 876015, 955055, 991318, 981822, 657081, 869185, 1033777, 1104881, 1173790, 1092762, 1134683, 1284290, 793341, 634143, 935215, 1037404, 994749, 1249866, 1095326, 1619406, 1517687, 1458862, 1759353, 2109245, 2078188, 1529815, 1243811, 1596174, 1458558, 1050594, 1280958, 1944631, 1691633, 1729001, 2327328, 2565382, 2660803, 2430794, 2395044, 2216553, 2697254, 2743385, 2701843, 2840768, 3091695, 3415830, 3631848, 3708531, 4043078, 4047659, 4378472, 4220708, 4367244, 4305563, 4971188, 5479509, 5518920, 5652245, 5889655, 6547697, 7023399, 7441146, 7797935, 8034818, 8546986]
1835H546986O75975Q70533O41844N58848P63607N59462L62685R22408J412046
1826A5314394R42382J116327J191089J269300J769797J834678J756132J500497
1818B6694596N31658P28046L73284Q54441J033068J453111R64395K58710O86016
1809C3577325J030685J701096J983428J598664K51440Q21905R61164K116388J503799
1800D5545894J227499M34200m21001j168025j490146j031882r55680P50331J507738
1791D4398928J318581l57880k011698j808854j197792n97705m42341j143218j734275
1782C6423746p24299M55853J59839n44811m03420p33162p73763m26077L05660
1773C3739566l0146m89778m65566q96727j413953p35776m71208j249747j228160
$$ y = [8546986, 9222961, 10093494, 10735338, 11294186, 12057793, 12617255, 12979940, 13902348, 15314394, 16256776, 17373103, 18564192, 19833492, 21603289, 23437967, 25194099, 26694596, 27226254, 27954300, 28327584, 29182025, 30215093, 31668204, 32632599, 32891309, 33577325, 34608010, 36309106, 38292534, 39891198, 40142638, 40964543, 41925707, 44042095, 45545894, 46773393, 47207593, 46786592, 45618567, 44128421, 43096539, 42140859, 42891190, 44398928, 45717509, 45359629, 43347931, 41539077, 40341285, 39743580, 39301239, 38158021, 36423746, 35699447, 36155300, 36315139, 35770328, 35366908, 34633746, 33859983, 33433906, 33739566, 33709420, 33219642, 32754076, 31857349, 30443396, 29707620, 29236412, 27986665, 26758505]
1764B6758505k371080k541158j973522j642929j528951j135064j248860r12051
1756A3404890o57680o90713r28115j188484m55443R0909m25137m20799k75734
1747H453694o91366o50435m69669L7492q0774j54166l88848l11382m10821j756
1737E331969l72760n37543K0756J3745j58916j8890k3940j01332j18912n95606
1727C438571m28608L7267L24187k85011Q766k75172K6885P9305K96705m10441
1717B812454j87163j66529j06882M8128l37810l9018m06796p1622j863l08814
1707A234085K18101O9145j5462M56005K44914r8479j15076l29948n50075Q0993
1697A194203j63154k82714K16816J53817j23063K20653j5132l50954k063J20250
$$ y = [26758505, 24387425, 21846267, 19872745, 18229816, 16700865, 15565801, 14316941, 13404890, 12747210, 12056497, 11128382, 9939898, 9484455, 9575364, 9150227, 8729428, 8453694, 7762328, 7111893, 6642224, 6679716, 6598942, 6444776, 6055928, 5744546, 5333725, 5331969, 4959209, 4421666, 4442422, 4456167, 4297251, 4278361, 4254421, 4153089, 4034177, 3438571, 3009963, 3047230, 3371417, 3086406, 3095172, 2820000, 2846885, 2926190, 3222895, 2812454, 2625291, 2458762, 2351880, 2400008, 2062198, 2023180, 1616384, 1544762, 1542899, 1234085, 1452186, 1521331, 1505869, 1961874, 2206788, 2108309, 1993233, 1663285, 1113210, 1194203, 1031049, 748335, 965151, 1118968, 995905, 1216558, 1201426, 850472, 848409, 968659]
1687I68659o8106k590Q7947r5862J24971L137J04982j31702j23592o0002k27585
1676E80257m1190Q1660m80517j40917L9923L52741J98454Q7933j99941K42810
1666G21213j53421p744K9944J39237J41756j94258q237L1442l90362J77299N26118
1655A012987m37518j28831l53174k84789M98049J70116k15320j09461M0808p7170
1645A15697k35477L26322J5764l3080J3129J94700N9531l1236j07194M48387P0195
1634H36738k26988j22353K10397j40561o36469L81464M19851j36959n41281J25926
1624A69765L10350L85487j39205l99773j79195j58111M07929O4122R0380p88901
1614b37152K27299M02544N9670l43327p8700j00229K40403M95012j34585o8884
$$ y = [968659, 900553, 897963, 985910, 890048, 1015019, 1018156, 1123138, 991436, 867844, 807842, 580257, 539067, 620727, 140210, -707, 39216, 391957, 590411, 678344, 478403, 721213, 567792, 560048, 589992, 729229, 870985, 676727, 668490, 699932, 309570, 486869, 1012987, 575469, 446638, 93464, -191325, 306724, 476840, 261520, 152059, 192867, 115697, -119780, 206542, 222306, 189226, 202355, 397055, 456586, 425350, 318156, 766543, 836738, 609750, 487397, 697794, 557233, -79236, 302228, 722079, 585120, 43839, 169765, 480115, 865602, 726397, 326624, 147429, -10682, 397247, 461369, 551749, -237152, -9853, 392691, 452361, 109034, 30334, -69895, 170508, 665520, 530935, 462051]
1604D62051l38959l61606R6964L51880j47452N103K480J16275k07936K74094k98320
1593d5426Q6502N16507m01276r6931j9315k75686p1457K82447m07473M17370J53434
1582A38696J76825L8068M2134k4783j82714k45908J80264K71543J27365k04075
1572C17415m55145K35051N75163J02955l17199j54338J42817J8576k46106j4647
1562B04542J66062Q7070J76369K0862n00260l9592O8870K850J73481j49915L16492
1551E26831m53669j87656J65283m7545J67683L8418L2352J50327k48293n0717
1541I3014O1990J00142L78412l1084l31698m25948R9186j08928N6548j01055K89867
1530H0446L63537q9192p11744j04061K37440L09902J78097k738n8063m7186L3666
$$ y = [462051, 123092, -238514, -141550, 210330, 62878, 67981, 70461, 186736, -21200, 252894, -45426, 41076, 557583, 156307, 59376, 40061, -235625, -307082, -24635, -432108, -14738, 138696, 315521, 353589, 395723, 370940, 188226, -57682, 122582, 394125, 521490, 317415, -137730, 97321, 672484, 775439, 458240, 303902, 446719, 465295, 219189, 204542, 370604, 457674, 634043, 654905, 154645, 115053, 183923, 186773, 360254, 210339, 526831, 73162, -114494, 50789, 3244, 170927, 209345, 241697, 392024, 143731, 93014, 155004, 255146, 633558, 602474, 270776, -155172, -55986, -164914, -108366, -209421, 80446, 443983, 354791, -356953, -461014, -223574, 86328, 264425, 261687, 203624, 156438, 190104]
1519A90104L17939l7191n97007N5930k25859J45365L52386j51047l30013j43292
1509d22685L46823j30917N935K8503K87384l02094O5140K70673j81295o3266K81583
1498A85784l77718L71856M72143q5921l586o38602k97382j58138L31368N17319
1488C17123o8222k62331k21423J83306M64961J64011l39123J60043k05749l25860
1478a33264K63992J00930p9536J02071k4291o4743k55629k3258K3450j9403j00580
1467b10261J18605K8885J19240P1918m93901J37753O36278J11344n24428M5268
1457D0701j21876n4974J52449k16213L1167K91549K9158j16041L23553j22268
1447B37205o8627l65926l79703L37564J97638j42622n78896L20528l0039J4581
$$ y = [190104, 508043, 470852, -126155, -70225, -296084, -150719, 201667, 50620, -279393, -422685, -75862, -206779, -200844, -172341, 115043, -187051, -121911, 148762, -32533, -95799, 185784, -191934, 179922, 652065, 566144, 562558, -76044, -373426, -531564, -200196, 317123, 248901, -13430, -234853, -51547, 413414, 577425, 238302, 398345, 192596, -133264, 130728, 231658, 152122, 254193, 229902, 165159, -90470, -113728, -90278, -109681, -210261, -91656, -62771, 56469, 128387, -365514, -227761, 408517, 519861, -4567, 40701, -81175, -136149, 16300, -199913, -168746, 122803, 151961, 35920, 359473, 237205, 168578, -197348, -577051, -239487, -41849, -184471, -763367, -442839, -472878, -458297]
1437d58297M30596l32524J03986P2342J2723o736j47413M04934k14768K32290
1427I7133L1156m95443J34710J97076l35142J22320m9916r123j87199p4844L22990
1416b46282L0178K781k50199K07384J98792o7833Q6298K41995j15418j98549R3537
1405a7316k36562r9240L83449m0551j47997R6855K7805j29570k93368O7689J46561
1394b42245j60598l1285j67016Q7550J11501L25719J53996l40698j45108K74584
1384a33600M34791l16222m28251J12581L41247j88866K1621j67166J46271O877
1374a70717j2241L81389l13887j36103M2926j94449L47851K56308L41779p2966
1364D69890j87178k91399K90419j03089l66088p0350l51692j46839P29549J67917
$$ y = [-458297, -27701, -360225, -256239, -183897, -171174, -177910, -325323, 79611, -135157, 97133, 128289, -367154, -232444, -35368, -370510, -248190, -298106, -307229, -494428, -569272, -246282, -216104, -213323, -463522, -256138, -57346, -125179, -38881, 203114, 87696, -110853, -17316, -253878, -353118, 30331, -10220, -158217, -61362, -33557, -163127, -456495, -388806, -242245, -402843, -434128, -601144, -513594, -402093, -76374, 77622, -263076, -408184, -133600, 301191, -15031, -443282, -330701, 10546, -178320, -156699, -323865, -177594, -170717, -182958, 198431, -115456, -251559, -208633, -403082, -55231, 201077, 542856, 469890, 282712, -8687, 281732, 178643, -187445, -257795, -609487, -756326, -26777, 141140]
1354A41140J35422k02212l58430J36989L1418J03653j9246J9886j09310K10791
1344I0101J21665L33555j4526k38268j54567l39574j72643K94218M51415j3152
1334C58224j41693k18015j04744J27563o8309j95356J19328N52403k8914k54373
1324A46114K60766j72651l59307P6517l01858k40052K33774K69072J21676J99192
1314B33243m40591k94084k0349K03121J84602o2709j01819J37288m05705R4451
1304d72552N29508j26142N8328J21269j12648o9955K85079j64935k20957K10123
1294C7118q6661J21802k56223R8393K40548r7017J53729N5982k52426j63177k47544
1283c95476K09427j09347J18533L60574j3025K84237l89482n34229L06649M01574
$$ y = [141140, 276562, 74350, -284080, -147091, -115673, -12020, -31266, -11380, -120690, 90101, 211766, 545321, 530795, 292527, 137960, -201614, -374257, -80039, 371376, 358224, 216531, -1484, -106228, 21335, -46974, -242330, -123002, 429401, 400487, 146114, 406880, 234229, -125078, -48561, -350419, -590471, -356697, -87625, 34051, 233243, -207348, -501432, -521781, -318660, -134058, -196767, -298586, -161298, -567003, -472552, 56956, -69186, -10858, 110411, -2237, -72192, 212887, 47952, -173005, 37118, -49543, 72259, -183964, -85571, 154977, 57960, 211689, 267671, 15245, -147932, -395476, -186049, -295396, -176863, 183711, 170686, 454923, 65441, -468788, -162139, 239435]
1273B39435R9751k8579l64728l24477Q9848K18797L00122j36270p3883J38350
1263A58366N7925p5962j31438n9959K8021j50318J39928K27234R6908j44949j34053
1252A1703k78169N96225l60957m78246J00192P5738j62679m0311J20388p9882
1242d95998J80695K68675o1477k54940J64950k21208J77540K2117J60383J21615
1232F2352k50140j76726L94360j69K98080k2245l94608J8250P13772j57011o08783
1221a22868m09956M35672R1289l22794J75421K58986k43285q9110J93398J62282
1211A29035J86818m5268m25282m9525M35905j93113j52801j79082j27647K01921
1201b19039k3969J60851J18082m7042k87840J22291k21230j10149K67067K5211
$$ y = [239435, 339186, 310607, -54121, -378598, -288750, -69953, 230169, 93899, 20016, 158366, 216291, 140329, 8891, -51068, -23047, -173365, -33437, 193797, 290705, 145756, 11703, -266466, 329759, -31198, -509444, -409252, -333514, -496193, -536504, -416116, -495998, -315303, -46628, -108105, -363045, -198095, -419303, -241763, -219646, -59263, 62352, -187788, -364514, 29846, 29677, 327757, 305512, -89096, -70846, 642926, 485915, -122868, -532824, -97152, -5863, -328657, -153236, 105750, -137535, -226645, -33247, 129035, 315853, 270585, -154697, -204222, 231683, 38570, -114231, -293313, -420960, -219039, -243008, -82157, 35925, -11117, -298957, -176666, -397896, -508045, -240978, -215767]
1191b15767L36834K14227k67504l88744l2711J82437j13827M4777N77471m5585
1181B91608l72634j0963K54640j10624m67151M62656M84156m53343k41474n9027
1171b22156J9294L23919J26151n4208J30851k99667J51432m55215m28457R5831
1161f12225L92721K18118J56584o41670K9498L68850J81728j56700o32948O19505
1151g6539l17285r0933N08763M19178k95971k84173K44201L2344Q2433o45113
1141d23095l40166O90690N8546J33709J72231n06732j36122O06082r9020j87494
1131c1371J4416j60612L69523j50006J0990j98601j46432L00884L4147n78773
1121e35835R3358l0436J24359j90896p7000M50878k9954o9184j10324n0492K13988
$$ y = [-215767, 121067, 335294, 67790, -320954, -353665, -171228, -285055, -240278, 337193, 291608, -81026, -91989, 162651, 52027, -415124, 47532, 531688, 78345, -163129, -222156, -202862, 121057, 247208, 193000, 323851, 24184, 175616, -279599, -708056, -612225, -219504, -1386, 155198, -486472, -456974, -88124, 93604, -63096, -696044, -76539, -393824, -484757, 24006, 443184, 147213, -136960, 107241, 139585, 222018, -423095, -763261, -72571, -14025, 119684, 291915, -214817, -350939, 255143, 156123, -31371, -16955, -177567, 191956, 41950, 52940, -145661, -292093, 8791, 42938, -535835, -442477, -472913, -348554, -539450, -616450, -165572, -195526, -264710, -375034, -425526, -211538]
1110b11538K11293l47927L86095J98360k54788j25491J89865j71392j55768J89395
1100i1896J48001j36228r6730J1968j16544j33333J69807k5425R003M568P470
1089b49339j15204L59585l37368N9581M7005j19789K57654k0077j7327K71722
1079A36443J87097l69152J23232l76048n3410M63649L02454K6695q2083j35560
1069B23317j08975J13973j51791k40136O12673m31516l41795J50543k04835l74643
1059g53185N65145K21576n9551m1778K02615l48827K01546K504j03938J03959
1049i934M81525N7468l83966K9996k73887j60956j25174J58124m22586j11n9064
1038g08565O08285j87663J91134q6860J90235J8830l36103j46530J41074J9328
$$ y = [-211538, -245, -348172, 37923, 236283, -18505, -143996, 45869, -125523, -281291, -91896, 56105, -80123, -176853, -164885, -281429, -414762, -244955, -270380, -261377, -256809, -249339, -364543, -4958, -342326, -282745, -235740, -355529, -97875, -117952, -135279, 136443, 323540, -45612, 77620, -298428, -351838, 111811, 414265, 440960, 358877, 223317, 114342, 228315, 76524, -163612, 449061, 17545, -324250, -173707, -378542, -753185, -188040, 33536, -26015, -67793, 134822, -214005, -12459, -9955, -113893, -9934, 471591, 529059, 145093, 175089, -98798, -259754, -384928, -226804, -649390, -649501, -708565, -100280, -287943, -96809, -183669, 6566, 25396, -310707, -457237, -316163, -296835]
1028b96835O6894l94901J87518P81058j80400J43668k59373j50074M5656m11224
1018d68013J68036j32984K52137K10947l93811L34935J27323o3664M6977o0292
1008B1591J01246p4854k15854N19291l53194J51198l01248K1891L57913k88895
998f0915q8612j65876K77148j8027k58750p4697L33485k45122n932M60447m54951
987c01802K25262M80148l24192j27124J3624k99375J60675J45948n1932J09438
977C0670j69572K1710j06415j93164J60589L9014Q5552K50256J82708m29245j78736
966c06633N0189K58579j57530J5949L44653j03864m3915k17011K87525J90727
956C18669r7960n9093n937K49917m05503L0269K63974l21942k1556J48291m02960
$$ y = [-296835, -229941, -624842, -437324, 343734, 163334, 307002, 47629, -102445, -56789, -468013, -299977, -432961, -180824, 30123, -363688, -28753, 98570, 34906, 81883, 21591, 122837, 47983, -167871, 351420, -1774, 149424, -151824, -129933, 227980, -60915, -149527, -315403, -38255, -56282, -315032, -389729, -56244, -301366, -307298, 153149, -301802, -76540, 403608, 79416, -47708, -34084, -333459, -172784, -26836, -78768, 30670, -138902, -117192, -223607, -416771, -256182, -217168, -131616, 118640, 301348, -127897, -306633, -256444, 2135, -155395, -139446, 205207, 101343, 57428, -159583, 127942, 318669, 220709, 161616, 155679, 405596, 93, 30362, 294336, -27606, -49162, 99129, -303831]
945c03831j76698J41511J79750M50299r2032l21339L01773p9061P5247m7198l66978
934b38557K68679K96616m2441l26908L49468K41603j76212m18393r5506J92336
924E0685K59564o05069j54970K19759m78763N77418N3504M0135j41422r0218q4917
913c54294J65040N5753j83982J69236L826J43462J25889m3353j8253j52816K03327
902A13835j62152j73962j81930O5293J64239N9496K06921j81540J46892M9440
892A06532M57692o08285J56309K6132p9392o8438J33728J12914k54941K01299
882A83550L33266n13613k73359j15060N58941j05127r4816l43828k45712K06754
872d09004n5924M3529N21057O05371n40198l62518J21858o9211K29581M68883
$$ y = [-303831, -480529, -339018, -159268, 291031, 198999, -122340, 179433, 100372, 175619, 128421, -238557, 30122, 326738, 284297, -42611, 306857, 548460, 372248, -46145, -141651, 50685, 310249, -294820, -449790, -230031, -708794, -131376, -77872, -37737, -179159, -269377, -354294, -189254, -133501, -317483, -148247, -144421, -959, 124930, 81577, 63324, -89492, 113835, -48317, -222279, -404209, -338916, -174677, -115181, 91740, -89800, 57092, 106532, 564224, -44061, 112248, 138380, 58988, -9450, 124278, 237192, -17749, 183550, 516816, 3203, -270156, -385216, 173725, 68598, -26218, -370046, -615758, -409004, -464928, -421399, 99658, 705029, 164831, -197687, -75829, -145040, 84541, 553424]
862E53424k28598m07906J55914j15713k45700K93015J83160L56107l15338k3739
852B04626k00152n9523K85740j46543m06813o6398k34284M09153k00457M0708
842c73943J71946J86963q6075p1490J28903K13617J4037k36213M628J8183K13196
831A83752o5240k00374N09472p7681k43677J33142m95274K96539j00106J00908
821D1461R4457m743l56423K09912J3276l67471j73996l8067J91733J65209J63041
810f1611L72363j31622l20299J28480J45454n6922k60541N49470j30913r9847
800A34012l007J14348r2171j84964P6916j78166j9439k21061K29479k322j39312
789b85687J90794j30559L53086J81251K32016j23509j41046k03619o8892j20637
$$ y = [553424, 324826, -83080, 72834, -42879, -288579, 4436, 187596, 543703, 228365, 204626, 4474, -55049, 230691, 84148, -322665, -389063, -623347, -214194, -414651, -373943, -201997, -15034, -101109, -172599, -43696, 169921, 183958, -52255, -47627, -29444, 183752, 118512, -81862, 427610, 349929, 106252, 239394, -255880, 40659, -59447, 41461, 135918, 131175, -225248, -15336, -2060, -369531, -543527, -581594, -389861, -224652, -61611, 310752, 179130, -141169, -12689, 132765, 75843, -184698, 364772, 233859, 134012, 131005, 245353, 153182, -31782, 45134, -133032, -152471, -373532, -144053, -146375, -285687, -94893, -225452, 127634, 308885, 540901, 417392, 276346, 72727, 3835, -116802]
779a16802l10095N36003j6228J46469J90794j81401j74764j46301L15847l5783
769B07739m10394J25019j0689m13108K37362M08899j84504j41409J12374m8902
759a17613M40406l19154k82291o3412L49054n2198j29125J60020p3034n3325M4078
748i6594j49722N1445M25570q4546K9561L30189p4015p26357R7342L7721P5745
737h3661K70468J76363m03580q1057M44712j68519l54627K32311K3193K29173
727B84776J1745j95671m29383k41878N23680k36586J03327J75479J39178n43087
717d08420P2251M96516l14559J89660O0399m82444J75490R7595L9093j0335J03529
706A8775l8851J36611j34313k20723R6377q9226J90229l33256L58897K22869k33808
$$ y = [-116802, -426897, 109106, 92878, 239347, 430141, 248740, 73976, -72325, 243522, 207739, -202655, -77636, -88325, -501433, -264071, 144828, -39676, -181085, -68711, -117613, 322793, 3639, -278652, -342064, 6990, -45208, -174333, -14313, -87347, -140672, -96594, -246316, -194871, 230699, 146153, 175714, 505903, 431888, -294469, -197127, -159406, -83661, 186807, 363170, -40410, -121467, 323245, 154726, -199901, 32410, 55603, 284776, 296521, 100850, -328533, -570411, -46731, -283317, -179990, -4511, 134667, -408420, -336169, 160347, -154212, 35448, 95847, -386597, -211107, -113512, -74419, -84754, 18775, -20076, 116535, -17778, -238501, -142124, -231350, -41121, -374377, -15480, 207389, -26419]
695b6419j69185k11782K57175M616J6196O2743K637o774j60466J81803n1667K81844
683A80721K4087j40653n22823M51340M46459j06267p5949n8444J81328k43458
673A36341j78081K70744J04387j53190K56894k03739k80294l1342o3087L50159
663B08792l0085j40844Q7609k35655Q7320N31092l87662N381l48802J43621j7829
652i7062k87063R60720K09310k04760n98362L2521m07647j49144N72287L64861
642C95661l2759l2886J61028k53682O8395j7860J29960m39222J03699j44470J57337
631I5201L04519q7702j14527k54290K91080M21051n41193j33556J01532J44461
621B26576L53532n76001r6560K77884j15665k13297J43936K4371k6542j29495
$$ y = [-26419, -195604, -407386, -150211, -145595, -129399, -66656, -64019, -70793, -231259, -49456, -101123, 180721, 204808, 64155, -458668, -7328, 439131, 332864, 256915, 198471, 379799, 136341, -41740, 229004, 333391, 180201, 437095, 233356, -46938, -78280, -141367, 208792, 178707, 37863, 125472, -110183, -22863, 508229, 120567, 125948, -222854, -79233, -97062, -384125, 576595, 785905, 581145, -17217, 15304, -392343, -541487, 30800, 395661, 362902, 330016, 491044, 237362, 305757, 287897, 417857, -21365, 82334, -62136, 95201, 399720, 312018, 197491, -56799, 234281, 655332, 114139, -19417, 82115, 226576, 580108, 4107, -92453, 185431, 69766, -143531, 405, 24776, -1766, -131261]
611a31261M67302j19858j2456Q3027l65350J48988M5467k6270Q9878K17899J37772
600E35138l41387l03933K64529J45774m91619J27446M207K01167k29618l19284
590d07580K98396J3340M20557k59034R9361J59433j18102m1864J12957j89875
580H7589o30989R9802L33556l73638M80004L65346J6088K6738p42659K49223L30928
569B41988J4202J92428Q7417k00440r6580j26840K5725K18803o9535l8894K39829
558D88103l24593J66628j80625k25958j80704K26966p8357n6166j49569J90039
548a24236J16609o5321L13849J53355m43314k9049M36349J0886L15626r9970m73998
537A10786k13952M14411J28792j20178j75623l88494K97687p4157M09863N0770
$$ y = [-131261, 336041, 216183, 203727, 286754, -78596, 70392, 115859, 89589, 179467, 397366, 535138, 193751, -110182, 154347, 300121, -191498, -64052, -59845, 141322, -88296, -407580, -109184, -95844, 324713, 65679, 165040, 324473, 206371, 164507, 277464, 87589, -543400, -443598, -110042, -483680, -3676, 361670, 377758, 404496, -338163, -88940, 241988, 256190, 448618, 536035, 335595, 239015, 112175, 137900, 356703, 287168, 248274, 488103, 163510, 330138, 149513, -76445, -257149, -30183, -108540, -164706, -314275, -124236, -7627, -72948, 240901, 394256, -49058, -78107, 358242, 369128, 684754, 584784, 110786, -103166, 311245, 440037, 319859, 144236, -244258, 53429, -20728, 389135, 439905]
527D39905l54306j20175r0639j47807M07968J77614Q855j55603m55860j18223
517d08271J98253L19220K79395l75578J09237O9798O3108k10680m59919J07016
507c08421L22581Q3516l47726L78171j13773K42443J09106l33785l4221J40257
497A38148j76283Q1492l14648K53520J1642j3241m2755K8702l28484J71281J71679
486a8947R6104p240L29005k42795p4627l52463L40761K64367j44392M318j48641
475D5450K35126j53584K6278L35462m42519k37701K74683r8348n6752k0571J99901
464A07425J14848k82142j38564j07539j21488L47368L36958o8901j5534j76857
454d426L50101o7644j01983k31224K9526P5047k70571Q8398r2165Q1239q5942
$$ y = [439905, 85599, -34576, -125215, -273022, 134946, 312560, 321415, 165812, -290048, -408271, -210018, 109202, 388597, 13019, 122256, 192054, 255162, 44482, -415437, -308421, 14160, 97676, -250050, 128121, 14348, 256791, 365897, 32112, -2109, 138148, -38135, 43357, -271291, -17771, -6129, -19370, -62125, -33423, -361907, -190626, -18947, 77157, 69917, 398922, 156127, 81500, -270963, 69798, 334165, 189773, 194091, 45450, 280576, 126992, 153270, 488732, 46213, -191488, 83195, -15153, -71905, -92476, 107425, 222273, -59869, -198433, -305972, -427460, -80092, 256866, 187965, 172431, -4426, 345675, 278031, 176048, -55176, -25650, 49397, -221174, -132776, -224941, -143702, -229644]
443b29644M77922k08808K96635l08546m84379O40010K4472q4837J14515o5854
433A71486l51511o91276O40181K97826J26045L31860k72806k65491N6020j38785
423i6451J55455J50576l10774J38300k04840Q2100L6368J76190j88510L52285
413B90699M96761k4314j49111m8850m7093j25003O2646j03091j68115j50371K66379
402C00537j68080K42358k35758k55764J28268M07034L7051L4832k50506k48965
392h993J57661j7123J82070K77573j34516j74272k08121n0142K07963J76541M8104
381D56745n26642L10995J52839k20775n6830J12648K3906N64340M31515n69135
371F79606k62028n03155J66244q9906l00159L93750K8302J11151o9584n8637L59228
$$ y = [-229644, 248278, 39470, 336105, 27559, -456820, 183190, 207662, 122825, 237340, 171486, -180025, -871301, -231120, 66706, 192751, 524611, 251805, -13686, 42334, -96451, 59004, 209580, -101194, 37106, -167734, -85634, -49266, 126924, -61586, 290699, 787460, 763146, 614035, 565185, 518092, 393089, 455735, 352644, 184529, 34158, 300537, 132457, 374815, 139057, -116707, 11561, 418595, 455646, 490478, 239972, -8993, 148668, 131545, 313615, 591188, 456672, 282400, 74279, 24137, 232100, 408641, 456745, -69897, 241098, 393937, 173162, 116332, 228980, 252886, 817226, 1248741, 679606, 417578, -85577, 80667, -9239, -309398, 84352, 112654, 223805, 154221, 95584, 454812]
360D54812m70466K51869R7367k28538L84964l31136n28905L23290J40071J33773
350B27101j47195l37094L15521q8101k3599J17739L72335q9043k67308k77390
340a97034P9766k768K25017j39962j96545K20781j49959L62029m27625j18355
330c44655K40401J63255K35164j90310j29669L18528j20703J07729n8293J20040
320C41487l41227j76224M74763o9374J19882J89854j50266k3988p5195L9026M3052
309C71790m2343M53877L573n59762n0070K02245j8332j34958k57949J65961j23536
298A0496J03161j94068o1874J7665k05288k52615M99544M79755k46833k20802
288g0859J85574l08845j35085M03067K88059l26118R9494J65565r9710J94723
$$ y = [454812, -15654, 236215, 333582, 105044, 490008, 158872, -370033, -46743, 93328, 227101, 79906, -257188, 58333, -29768, -53367, 64372, 436707, 347664, 80356, -197034, -117268, -120036, 104981, -34981, -231526, -10745, -160704, 201325, -226300, -344655, -104254, 59001, 294165, 103855, -25814, 292714, 172011, 279740, 221447, 341487, 260, -175964, 298799, 229425, 349307, 539161, 388895, 364907, 289712, 328738, 371790, 329447, 783324, 786897, 227135, 177065, 379310, 360978, 226020, -31929, 134032, 10496, 113657, -80411, -142285, -124620, -329908, -582523, -82979, 396776, 149943, -70859, 114715, -194130, -329215, 73852, 361911, 35793, 135287, 300852, 201142, 395865]
278C95865m0446R3676m13169j88614J20425k73313j05763M68055q1214j90186
268b14684J92333L7463N4321l5952K14859r0858m28898K22323n166J35004N7037
257A37782j64356o9249J09206J1000l54609q9363J06581L34019J64663k7258j87363
246b8947O1207j95159L2337K68688J15881l04479k6626M07914m2721p4840j580
235B11675j9804j3139k92677l1992K95585L79371N3402k39075K5624j24453m53561
224b09044m2234Q8474N040J98087k9833m02208K90083j36302M99847j56823r6450
213H637K56082l10240n2046n7003j10305K57276J89193r7034j8495O39056Q27
202G05948k79237q7809m17006p4884J58644N5395k4240K51006J69676Q0468l59062
$$ y = [395865, 355419, 449095, 35926, -152688, -32263, -305576, -411339, 56716, -24498, -214684, -22351, 15112, 69433, 33481, 248340, 157482, -271416, -49093, -54259, 80745, 137782, -26574, -95823, 13383, 24383, -330226, -419589, -313008, 21011, 185674, 158416, -28947, 32260, -162899, -130562, 138126, 254007, -50472, -77098, 330816, 288095, 213255, 211675, 191871, 178732, -113945, -145937, 149648, 529019, 582421, 343346, 368970, 244517, -209044, -251278, -162804, -157764, 40323, 10490, -391718, -101635, -237937, 261910, 105087, 8637, 264719, -45521, -97567, -154570, -264875, -7599, 181594, 84560, 66065, 705121, 705948, 426711, 338902, -78104, -152988, 5656, 61051, 36811, 287817, 457493, 537961, 178899]
191A78899k27k99104J44021M77784k96918N2692N2299l40315K030r7851Q1457
180d5233k72609K51456L08279P5953k19122K74017n11296O3007M09142m60097
170a26503l40433L58720r9662J88616K28196q1808l00729M26955j03645k29654
$$ y = [178899, 178672, -120432, 23589, 501373, 204455, 257147, 309446, -30869, -28839, -126690, -45233, -317842, -66386, 241893, 317846, 98724, 372741, -138555, -75548, 333594, -126503, -466936, -108216, -207878, -19262, 208934, 127126, -173603, 253352, 149707, -79947]
$$ [...]
##END NTUPLES=NMR SPECTRUM
##END=
