##TITLE=1H_CA-8881x
 DMSO, 8 sc, 
 7.07.2021
##JCAMPDX= 6.0         $$ Bruker NMR JCAMP-DX V2.0
##DATA TYPE= NMR SPECTRUM
##DATA CLASS= NTUPLES
##ORIGIN= UXNMR, Bruker Analytische Messtechnik GmbH
##OWNER= root
$$ XWIN-NMR		Version 3.5
$$ Thu Jul  8 08:47:13 2021 Russian Standard Time (UT+4h)  she@DPX200
##.OBSERVE FREQUENCY= 200.131506
##.OBSERVE NUCLEUS= ^1H
##.ACQUISITION MODE= SIMULTANEOUS
##.ACQUISITION SCHEME= undefined
##.AVERAGES= 8
##.DIGITISER RES= 18
##SPECTROMETER/DATA SYSTEM= spect
##.PULSE SEQUENCE= zg30
##.SOLVENT NAME= DMSO
##.SHIFT REFERENCE= (INTERNAL, DMSO, 0, 17.5203)
##AUDIT TRAIL= $$ (NUMBER, WHEN, WHO, WHERE, WHAT)
$$ ##TITLE= Audit trail, XWIN-NMR		Version 3.5
$$ ##JCAMPDX= 5.01
$$ ##ORIGIN= Bruker BioSpin GmbH
$$ ##OWNER= she
$$ F:/spectra/data/she/nmr/H-F/1/pdata/1/auditp.txt
$$ ##AUDIT TRAIL=  $$ (NUMBER, WHEN, WHO, WHERE, WHAT)
(   1,<2021-07-08 08:45:46.56 +0400>,<she>,<DPX200>,
      <created by zg, POWCHK disabled, PULCHK disabled
       configuration hash MD5:
       00 E9 B6 7A A2 85 ED C7 34 08 36 98 17 FE 4E 26
       data hash MD5: 16K
       BF E6 70 44 FE A2 FE E8 1B E0 67 AF 8D 8E 6D F4>)
(   2,<2021-07-08 08:45:57.35 +0400>,<she>,<DPX200>,
      <Start of raw data processing
       efp BC_mod = 2 LB = 0.24 FT_mod = 6 PKNL = 1 PHC0 = -12427.15 PHC1 = 5.201011 SI = 16K 
       data hash MD5: 16K
       33 6D 58 E7 3A DB 68 F7 2A FA CF 0C 2B 87 BE 0C>)
(   3,<2021-07-08 08:46:22.78 +0400>,<she>,<DPX200>,
      <pk PHC0 = -12.28188 PHC1 = 14.8 
       data hash MD5: 16K
       72 26 97 5D D4 BB 8E D3 16 09 20 DC E7 DC 9A A0>)
(   4,<2021-07-08 08:46:26.31 +0400>,<she>,<DPX200>,
      <abs ABSG = 5 
       data hash MD5: 16K
       0B ED FF 7D 54 8B 8C B4 DD 52 08 2D 53 30 7F 3D>)
$$ ##END=
$$ 
$$ hash MD5
$$ 2B EF 7F E8 41 6F 5A EE 2E 25 80 F2 F9 10 C7 21
##$RELAX= 
##$RELAX= 
##$RELAX= 
##$RELAX= 
##$RELAX= 
##$RELAX= 
$$ Bruker specific parameters
$$ --------------------------
##$DU= <F:/spectra>
##$EXPNO= 1
##$NAME= <H-F>
##$PROCNO= 1
##$TYPE= <nmr>
##$USER= <she>
##$AMP= (0..31)
100 100 100 100 100 100 100 100 100 100 100 100 100 100 100 100 100 100 
100 100 100 100 100 100 100 100 100 100 100 100 100 100 
##$AQSEQ= 0
##$AQ_mod= 1
##$AUNM= <au_zg>
##$AUTOPOS= <>
##$BF1= 200.13
##$BF2= 200.13
##$BF3= 200.13
##$BF4= 200.13
##$BF5= 200.13
##$BF6= 200.13
##$BF7= 200.13
##$BF8= 200.13
##$BYTORDA= 1
##$CFDGTYP= 0
##$CFRGTYP= 5
##$CHEMSTR= <none>
##$CNST= (0..31)
1 1 145 1 1 1 1 1 1 1 1 1 1 1 1 1 1 1 1 1 1 1 1 1 1 1 1 1 1 1 1 1 
##$CPDPRG= <>
##$CPDPRG1= <>
##$CPDPRG2= <>
##$CPDPRG3= <>
##$CPDPRG4= <mlev>
##$CPDPRG5= <mlev>
##$CPDPRG6= <mlev>
##$CPDPRG7= <mlev>
##$CPDPRG8= <mlev>
##$CPDPRGB= <>
##$CPDPRGT= <>
##$D= (0..31)
0 1.2 0 0 0 0 0 0 0 0.06 0 0.03 0 0 0 0 0.0002 0 0 0 0 0 0 0 0 0 0 0 0 
0 0 0 
##$DATE= 1625719546
##$DBL= (0..7)
120 120 120 120 120 120 120 120 
##$DBP= (0..7)
150 150 150 150 150 150 150 150 
##$DBP07= 0
##$DBPNAM0= <>
##$DBPNAM1= <>
##$DBPNAM2= <>
##$DBPNAM3= <>
##$DBPNAM4= <>
$$ [...]
##$SUBNAM3= <"">
##$SUBNAM4= <"">
##$SUBNAM5= <"">
##$SUBNAM6= <"">
##$SUBNAM7= <"">
##$SUBNAM8= <"">
##$SUBNAM9= <"">
##$SW= 20.0188882624521
##$SWIBOX= (0..15)
0 0 2 0 0 0 0 0 0 0 0 0 0 0 0 0 
##$SW_h= 4006.41025641026
##$TD= 16384
##$TD0= 1
##$TE= 0
##$TE2= 300
##$TE3= 300
##$TEG= 300
##$TL= (0..7)
0 120 120 120 120 120 120 120 
##$TP= (0..7)
150 150 150 150 150 150 150 150 
##$TP07= 0
##$TPNAME0= <>
##$TPNAME1= <>
##$TPNAME2= <>
##$TPNAME3= <>
##$TPNAME4= <>
##$TPNAME5= <>
##$TPNAME6= <>
##$TPNAME7= <>
##$TPOAL= (0..7)
0.5 0.5 0.5 0.5 0.5 0.5 0.5 0.5 
##$TPOFFS= (0..7)
0 0 0 0 0 0 0 0 
##$TUNHIN= 0
##$TUNHOUT= 0
##$TUNXOUT= 0
##$USERA1= <user>
##$USERA2= <user>
##$USERA3= <user>
##$USERA4= <user>
##$USERA5= <user>
##$V9= 5
##$VALIST= <valist>
##$VCLIST= <CCCCCCCCCCCCCCC>
##$VD= 0
##$VDLIST= <DDDDDDDDDDDDDDD>
##$VPLIST= <PPPPPPPPPPPPPPP>
##$VTLIST= <TTTTTTTTTTTTTTT>
##$WBST= 1024
##$WBSW= 4
##$XGAIN= (0..3)
0 0 0 0 
##$XL= 0
##$YL= 0
##$YMAX_a= 102701
##$YMIN_a= -67018
##$ZGOPTNS= <>
##$ZL1= 120
##$ZL2= 120
##$ZL3= 120
##$ZL4= 120
##$ABSF1= 17.48245
##$ABSF2= -2.536587
##$ABSG= 5
##$ABSL= 3
##$ALPHA= 0
##$AQORDER= 0
##$ASSFAC= 0
##$ASSFACI= 0
##$ASSFACX= 0
##$ASSWID= 0
##$AUNMP= <proc_1d>
##$AZFE= 0.1
##$AZFW= 0.1
##$BCFW= 0
##$BC_mod= 2
##$BYTORDP= 0
##$COROFFS= 0
##$CY= -3
##$DATMOD= 1
##$DC= 0
##$DFILT= <>
##$DTYPP= 0
##$F1P= 0
##$F2P= 0
##$FCOR= 1
##$FTSIZE= 16384
##$FT_mod= 6
##$GAMMA= 0
##$GB= 0
##$INTBC= 1
##$INTSCL= 1.334414e-10
##$ISEN= 128
##$LB= 0.24
##$LEV0= 0
##$LPBIN= 0
##$MAXI= 10000
##$MC2= 0
##$MEAN= 0
##$ME_mod= 0
##$MI= 1.114404
##$NCOEF= 0
##$NC_proc= -10
##$NLEV= 6
##$NOISF1= 3.799351
##$NOISF2= 2.8
##$NSP= 0
##$NTH_PI= 0
##$NZP= 0
##$OFFSET= 17.52032
##$PC= 1
##$PHC0= -12439.43
##$PHC1= 20.00101
##$PH_mod= 1
##$PKNL= yes
##$PPARMOD= 0
##$PSCAL= 0
##$PSIGN= 0
##$REVERSE= no
##$SF= 200.130002863021
##$SI= 16384
##$SIGF1= 3
##$SIGF2= 2
##$SINO= 5.538805
##$SIOLD= 16384
##$SREGLST= <1H.CDCl3>
##$SSB= 0
##$STSI= 16384
##$STSR= 0
##$SW_p= 4006.41025641026
##$SYMM= 0
##$S_DEV= 0
##$TDeff= 16384
##$TDoff= 0
##$TI= <>
##$TILT= no
##$TM1= 0
##$TM2= 0
##$TOPLEV= 0
##$USERP1= <user>
##$USERP2= <user>
##$USERP3= <user>
##$USERP4= <user>
##$USERP5= <user>
##$WDW= 1
##$XDIM= 16384
##$YMAX_p= 372058773
##$YMIN_p= -1879847
$$ End of Bruker specific parameters
$$ ---------------------------------
##NTUPLES= NMR SPECTRUM
##VAR_NAME=  FREQUENCY,     SPECTRUM/REAL,   SPECTRUM/IMAG
##SYMBOL=    X,             R,               I
##VAR_TYPE=  INDEPENDENT,   DEPENDENT,       DEPENDENT
##VAR_FORM=  AFFN,          ASDF,            ASDF
##VAR_DIM=   16384,         16384,           16384
##UNITS=     HZ,            ARBITRARY UNITS, ARBITRARY UNITS
##FACTOR=    0.24454680195387, 1,            1
##FIRST=     3506.34187034385, 0,            0
##LAST=      -500.068386066413, 0,           0
##MIN=       -500.068386066413, -1879847,    0
##MAX=       3506.34187034385, 372058773,    0
$$ Real data points
##PAGE= N=1
##DATA TABLE= (X++(R..R)), XYDATA
$$ [...]
6259H2122K56598J03084k06258L79981j43555k65868j91761M53880J93622k16597
6249D45248m28992M66214O6544N1591M39504L4730n48777n25633J72923L16651
6239D90003q8926l08432M10415l8656n1372O48901M20280l55387p02146q68853
6229d44173M40514N88309l23126J51923K55997M69403K14807m64186m48862P76636
6219A217242l77998o08179k82375J10353L05321J49604J146206j84252m99662
6210I76260k41428r7791K95771m31750p53550R91783K99409j5305J82328m11440
6200G94287m6399K21925J178k89808N07177K91679k49661L04600j29142j65465
6190A240371J66084K31362m6703j20345k77440K13297J23583M89404R8218P93
$$ y = [82122, 338720, 441804, 235546, 615527, 471972, 206104, 14343, 468223, 661845, 445248, 16256, 482470, 549014, 600605, 1040109, 1074839, 526062, 429, 173352, 490003, 401077, 92645, 503060, 464404, 413032, 1061933, 1482213, 1126826, 424680, -444173, -3659, 584650, 261524, 413447, 669444, 1138847, 1353654, 889468, 440606, 1217242, 839244, 231065, -51310, 59043, 364364, 513968, 1660174, 1475922, 976260, 734832, 637041, 932812, 501062, -252488, 739295, 1038704, 1023399, 1205727, 794287, 747888, 969813, 970991, 681183, 1188360, 1480039, 1230378, 1534978, 1405836, 1240371, 1406455, 1637817, 1591114, 1470769, 1193329, 1406626, 1530209, 2019613, 2117831, 2118624]
6180B118624j23132k44688l00q37097P3028R19792M5365L32482j14673L45100
6170B514501m0036q14527j87787K42497M68097j022164M30231K60312j28290K67798
6160A990632J94160K05208n8295P210q51512O30993M34936n95555l92483k29091
6150A336203J9166J028882o96545n03166J96872l91182K02773M70887J07645j19843
6140A651692m98318N72385J21404m73132L40081L65674k38543M8649l86764j69085
6130A334043k16318J7841P76696P8016j75689k72726r27320L97407O63614O20962
6120B296526J8937m80919R5036K07792l96839n30447k53601k3865m7935k33229
6110F51456Q43766j70716r1839M05663L8050m05443M45435J10925m53392m04666
$$ y = [2118624, 1995492, 1750804, 1750504, 913407, 986435, 1906227, 1951592, 2284074, 2169401, 2514501, 2474465, 1659938, 1472151, 1714648, 2182745, 1160581, 1590812, 1851124, 1722834, 1990632, 2184792, 2390000, 2331705, 2338915, 1487403, 2118396, 2553332, 1957777, 1565294, 1336203, 1355369, 2384251, 1687706, 1184540, 1381412, 990230, 1193003, 1663890, 1771535, 1651692, 1153374, 1725759, 1847163, 1374031, 1714112, 2079786, 1841243, 1889892, 1503128, 1334043, 1117725, 1135566, 1912262, 1990278, 1814589, 1541863, 614543, 1011950, 1675564, 2296526, 2315463, 1834544, 1929580, 2137372, 1740533, 1210086, 956485, 932620, 884685, 651456, 1495222, 1324506, 1232667, 1638330, 1676380, 1270937, 1716372, 1827297, 1373905, 969239]
6100I69239K19358K86498Q7768l35375m7211K43755p7694L18406j5577n88380
6090A060787k73367K49488N30981j3021k10972p18926O40003o3283l18173O13653
6080A497170K73868J04854j04100l65207O21890m28132K23338m96659L06754j8619
6070A615157l98656k23743M85005l39811j71295j6744J94060L86925P07228n6802
6060B181324k92082L8164k60206J27381K05192P1775n94526j10687k100k97611
6050A066624P083N64175J78037k62681K61301O55961j20643m8759O8263J47645
6040B517006J27363r2414j224772Q63533M11957K1739m53058l93370l15803O96
6030A462877J3838Q5860L9868r8520N58442J47215m68701K72162k40437J66171
$$ y = [969239, 1188597, 1475095, 1562863, 1227488, 1180277, 1424032, 1346338, 1664744, 1649167, 1060787, 787420, 1036908, 1567889, 1554868, 1343896, 624970, 1264973, 1201690, 883517, 1497170, 1771038, 1875892, 1771792, 1406585, 2028475, 1600343, 1823681, 1327022, 1633776, 1615157, 1216501, 992758, 1477763, 1137952, 966657, 949913, 1143973, 1530898, 2238126, 2181324, 1889242, 1927406, 1667200, 1794581, 1999773, 2071548, 1477022, 1366335, 1364235, 1066624, 1073707, 1637882, 1815919, 1553238, 1814539, 2470500, 2349857, 2301098, 2369361, 2517006, 2644369, 2551955, 1327183, 2190716, 2602673, 2624412, 2171354, 1777984, 1462181, 1462877, 1476715, 1562575, 1602443, 1503923, 2062365, 2209580, 1740879, 2013041, 1772604, 1938775]
6020A938775J35104O7117j3512l66598M88644L85294m73050N00670k56883O9753
6010B475314N6317q32002o0182l2048J58124J34532k22960M92358k64007J19166
6000B024612K81741j24121K62078k60981k02269R79203J06236j90045p12282K00796
5990B364968K12385j96385K95418N7034L4683k83728K81809O7938M98670J71947
5980C504739l80508j11991o91492j13028J60990j29297L05775J16908K99368K88798
5970C250262J9455k27284K2639l51909K51520P69794k8008o56832L99831n28945
5960B920523L40994L50357n01563m44709R88609m45602m33153k23230l0764N99178
5950C120640k48358K2779M19379M64815l26125k04399k11356N91414J41155m35907
$$ y = [1938775, 2073879, 2140996, 2127484, 1760886, 2249530, 2634824, 2161774, 2662444, 2405561, 2475314, 2531631, 1699629, 1639447, 1607399, 1765523, 1900055, 1677095, 2169453, 1905446, 2024612, 2306353, 2182232, 2444310, 2183329, 1981060, 2960263, 3066499, 2876454, 2164172, 2364968, 2577353, 2380968, 2676386, 2733420, 2768103, 2484375, 2766184, 2834122, 3332792, 3504739, 3124231, 3012240, 2320748, 2207720, 2368710, 2239413, 2545188, 2662096, 2961464, 3250262, 3269717, 3042433, 3065072, 2713163, 2964683, 3734477, 3706469, 3049637, 3449468, 2920523, 3261517, 3611874, 3110311, 2665602, 3654211, 3208609, 2775456, 2552226, 2521462, 3120640, 2872282, 2895061, 3314440, 3779255, 3453130, 3248731, 3037375, 3628789, 3769944, 3334037]
5940C334037m67483N5462K65935j5631j84602l44367k86597M98160L59070M58760
5930C672744k79177N3112L04777l14888L25425n23508K29938l38381J60916n899
5920C285059J96571O29883k32377J13900j38549J93056m14166J29954K32386q56539
5910C139178Q6785N61015J96338m07399L44825J28993q31085L60379J90262L28210
5900D097501m12909l61504N25867L72718O1936N1176L22547r6167o63045l33664
5890C564456L01646n20557K39226J40754j43218J74354O38043N00743j19812J0575
5880D786210l70666P304j28898J1824p3056l50525K79842k39997J14118L11145
5870D347301L41417M9464n36423Q859L94012j94664j05455L8827K88335j85242
$$ y = [3334037, 2866554, 2922016, 3187951, 3172320, 2987718, 2643351, 2356754, 2854914, 3213984, 3672744, 3393567, 3446679, 3751456, 3436568, 3761993, 3238485, 3468423, 3130042, 3290958, 3285059, 3481630, 4111513, 3879136, 3993036, 3854487, 4047543, 3633377, 3763331, 3995717, 3139178, 3225963, 3786978, 3983316, 3575917, 3920742, 4049735, 3218650, 3579029, 3769291, 4097501, 3684592, 3323088, 3848955, 4221673, 4283609, 4334785, 4657332, 4561165, 3898120, 3564456, 3866102, 3345545, 3584771, 3725525, 3582307, 3756661, 4394704, 4895447, 4775635, 4786210, 4415544, 4422848, 4293950, 4305774, 4232718, 3882193, 4162035, 3922038, 4036156, 4347301, 4688718, 4738182, 4201759, 4210618, 4604630, 4409966, 4304511, 4343338, 4631673, 4446431]
5860D446431j76406J05824K34964K72618J74609j26671L52918J04925k74941k51345
5850D862926j117837N76863J56997K65362J29801J40412K12723K33238j37331
5841E323154K27274k22726m94286O20673K71815l31537J54941p768l06024K97487
5831E533003L3458K2658K79813K04916o020k94675j43131q1169K48189K89686
5821F086728j33273J39948P65557p34709K0446J01746p9088r20489l15448P87407
5811E718825J45069K34045k37350L88581J01361j83314k34467L93411k41940o04013
5801E480208l12645N78952j57777j46884J1600k551N96840q0494p00193Q28170
5791F095226K97564r6746l65893m37294M88456L07042j72558k28000J87930j62618
$$ y = [4446431, 4270025, 4375849, 4610813, 4883431, 5058040, 4931369, 5284287, 5389212, 5114271, 4862926, 3745089, 4321952, 4478949, 4744311, 4874112, 5014524, 5227247, 5460485, 5323154, 5550428, 5327702, 4833416, 5454089, 5725904, 5394367, 5549308, 5541540, 5235516, 5533003, 5566461, 5589119, 5868932, 6073848, 6067828, 5773153, 5630022, 5548853, 5797042, 6086728, 5953455, 6093403, 6858960, 6124251, 6144697, 6246443, 6167355, 5246866, 4931418, 5718825, 5863894, 6097939, 5860589, 6249170, 6350531, 6167217, 5932750, 6326161, 6084221, 5480208, 5167563, 5746515, 5588738, 5441854, 5453454, 5450903, 6047743, 5967249, 5267056, 6095226, 6392790, 6296044, 5930151, 5492857, 5981313, 6288355, 6115797, 5887797, 6075727, 5913109]
5781E913109Q31584J08437k94809k24906l23158O0961n44943M56205N26041J16324
5771F624845L82386m90989j60480P5336N68032M96354p93555j21561r8750L14515
5761F796133Q02721k47830J055091r2197n41616j58427j9046M22387j48121K99020
5751H168115j30084j27302j20289r0921m80500K41721K19943N34559P8904Q6990
5741H381136m1817K34736m9021Q0214J64841k0401j91103K07492J31053M68223
5731I365353L775r12553N05517K41874J71899k78631J6430L53524O26959K42708
5721A0336855J1488l76918n8530J81736j2600L51797k11420q9005m0105N52760
5711A0646058L05133J0097R7591k44509K73014O2215L61956K60934J09728L39308
$$ y = [5913109, 6744693, 6853130, 6558321, 6333415, 6010257, 6071218, 5526275, 5982480, 6508521, 6624845, 7007231, 6516242, 6355762, 6431098, 6999130, 7495484, 6701929, 6580368, 6481618, 6796133, 7598854, 7351024, 8406115, 8313918, 7772302, 7613875, 7594829, 8017216, 7869095, 8168115, 8038031, 7910729, 7790440, 7699519, 7219019, 7460740, 7680683, 8215242, 8294146, 8381136, 8339319, 8574055, 8525034, 8605248, 8770089, 8749688, 8558585, 8766077, 8897130, 9365353, 9369128, 8456575, 8962092, 9203966, 9375865, 9097234, 9113664, 9467188, 10094147, 10336855, 10348343, 9971425, 9912895, 10094631, 10082031, 10433828, 10222408, 10133403, 10093298, 10646058, 10951191, 10961288, 11058879, 10814370, 11087384, 11149599, 11511555, 11772489, 11882217, 12221525]
5701A2221525O5134j71706L04793k38639O34287J09437j35142j26734L44449J32781
5691A3140185M72906l9567l79521N84212Q02052p53446J36664P05238k28301J068816
5681A5509238P15768j5469k42789j08911M95562M36429L3847O48660K31678L00035
5671A8004048L39908O76543K39009k24918j78457K38811J046052K91818L71727
5662B0804541Q20920J25917L49048L79063k16344P54413K78038O13233P36116
5653B4644945M32382L70161N44565P25917J25011M33773J031375Q21071K34630
5644B9363830J713776R55522Q31090J007046M53906K52698J282323J031818J820722
5635C8712731J514354J174398J813901R01391J367283J583521Q35419R80664O98916
$$ y = [12221525, 12286659, 12114953, 12419746, 12181107, 12815394, 12924831, 12789689, 12662955, 13007404, 13140185, 13613091, 13573524, 13194003, 13778215, 14580267, 13826821, 13963485, 14668723, 14440422, 15509238, 16225006, 16209537, 15966748, 15857837, 16353399, 16789828, 16823675, 17472335, 17704013, 18004048, 18343956, 19020499, 19259508, 19034590, 18856133, 19094944, 20140996, 20432814, 20804541, 21625461, 21751378, 22100426, 22479489, 22263145, 23017558, 23295596, 23908829, 24644945, 25077327, 25447488, 25992053, 26717970, 26842981, 27276754, 28308129, 29129200, 29363830, 31077606, 32033128, 32864218, 33871264, 34325170, 34577868, 35860191, 36892009, 38712731, 40227085, 41401483, 43215384, 44116775, 45484058, 47067579, 47902998, 48883662, 49582578]
5626D9582578J101771J115804J232520J88086J015819K53003p3931j71152J24585
5617E4369083j30715r61933m85411m77901l31628j329621l51934J49962m52658
5608D9997244J26758j5997L16764J40600p22630L59746K38362L03101N58500K33058
5598E1535506K46480J194549O27149R85066O45211J136204J455852R53366J433372
5589F0212755J735754Q76915J854558J788382K098721K165446J271809J391498
5581G3395838J594669J361868K080423J820595J577553J423362P67678J275896
5573H5297882J207352P85886O72378M4826Q36117M45662K09471k14664n81607
5564H8703303Q09502M62427o26576L60119J165490J067531N90597P1341J232079
$$ y = [49582578, 50684349, 51800153, 53032673, 53220759, 54236578, 54489581, 54415650, 54244498, 54369083, 54238368, 53276435, 52791024, 52313123, 51981495, 50651874, 50299940, 50449902, 49997244, 50124002, 50108005, 50424769, 50565369, 49842739, 50202485, 50440847, 50743948, 51302448, 51535506, 51781986, 52976535, 53603684, 54588750, 55233961, 56370165, 57826017, 58779383, 60212755, 61948509, 62825424, 64679982, 66468364, 68567085, 70732531, 72004340, 73395838, 74990507, 76352375, 78432798, 80253393, 81830946, 83254308, 84021986, 85297882, 86505234, 87291120, 87963498, 88008324, 88844441, 89290103, 89499574, 89284910, 88703303, 89512805, 89975232, 89348656, 89708775, 90874265, 91941796, 92532393, 92603734, 93835813]
5555I3835813J016503J300125L03069K082869K114334K122879J801799K259001
5547A06836392L845105J907878L137975K651358L247310L697287K882920M184555
5539A32390780L492610L625148L822927M511946N023329L319804L397701L842801
5531A63427046L294114L204377K933635J535277J376716J900818Q34932J29667
5523A78636582n39671J75739j053563j632479k699353k874880l263761l314012
5515A63434602l138663l918655l400932l408984l284071l237331m128175l356546
5507A35561245k170305l231614l040866k872106k701418j891624k577611k306307
5499A14769394k009651k124236j829109p58996j262604p83474r75397j524072
$$ y = [93835813, 94852316, 96152441, 96455510, 98538379, 100652713, 102775592, 104577391, 106836392, 110681497, 112589375, 115727350, 118378708, 121626018, 125323305, 128206225, 132390780, 135883390, 139508538, 143331465, 147843411, 152866740, 156186544, 159584245, 163427046, 166721160, 169925537, 172859172, 174394449, 175771165, 177671983, 178506915, 178636582, 178096911, 178272650, 177219087, 175586608, 172887255, 170012375, 166748614, 163434602, 160295939, 156377284, 152976352, 149567368, 146283297, 143045966, 138917791, 135561245, 133390940, 130159326, 127118460, 124246354, 121544936, 119653312, 117075701, 114769394, 112759743, 110635507, 108806398, 108047402, 106784798, 106001324, 105025927, 103501855]
5491A03501855n98126q29576l00596o38731n83047o57656M25649O13066l28653
5482A00604185m52461O44198n63183J73411M81233L5129J35798L20528n5279K25026
5472A01548585M41736Q80994Q9459q3522O05244l07818R78489J041211O12133
5463A05806511j60932k21288J228601R83271M89215J186877J036735R90713J038050
5454A12377753K76493J157405J890141M87769P25960J228409k6819J69666K12025
5445A18498802K87654q11631j203742r47485j305253j689946k236991j316662
5437A09274746j326668k703394k055735k432617k752010k713822k598601k093043
5429I0598856k551215k436552j967348j585077k037429j815798j775398j022262
$$ y = [103501855, 102903729, 102074153, 101773557, 101134826, 100551779, 99894123, 100319772, 100932838, 100604185, 100151724, 100795922, 100232739, 100406150, 100887383, 100922512, 101058310, 101378838, 101323559, 101548585, 101990321, 102871315, 102960774, 102877252, 103482496, 103174678, 104153167, 105194378, 105806511, 105645579, 105424291, 106652892, 107636163, 108125378, 109312255, 110348990, 111339703, 112377753, 112654246, 113811651, 115701792, 116189561, 116915521, 118143930, 118117111, 118286777, 118498802, 118786456, 117974825, 116771083, 115823598, 114518345, 112828399, 110591408, 109274746, 107948078, 105244684, 103188949, 100756332, 98004322, 95290500, 92691899, 90598856, 88047641, 85611089, 83643741, 82058664, 80021235, 78205437, 76430039, 75407777]
5421G5407777j188134j612635j663676j308757j245889j196965o16132r66623
5413F5608966r03087j049899l12530j04814o07910r29257n07609R3985k96150
5404F0991695p75660K81324O4923k96615o8224P2067M95061m57030l01624O83229
5394F0689146J29019p77032r59938p13049l25972j615988k26995j366025q60554
5385E3972612p41427p24227j195287j208132j99684j193667l53104m99853j325859
5376D6531372l76354k08269l88013o76098k05345k12561L7287r74622j70997J51493
5366D3507893j60999K40638k54737m00565j0981p45189l47077m67848p63517J38221
5356D0735839k02374m28329p36305j273790m63175p2736n31118l98783j313863
$$ y = [75407777, 74219643, 72607008, 70943332, 69634575, 68388686, 67191721, 66575589, 65608966, 64705879, 63655980, 63343450, 63238636, 62630726, 61701469, 61193860, 61287845, 60991695, 60216035, 60497359, 60562282, 60265667, 60197443, 60269510, 60764571, 60307541, 60005917, 60689146, 60818165, 60041133, 59081195, 58368146, 58042174, 56426186, 56199191, 54833166, 53972612, 53231185, 52506958, 51311671, 50103539, 49903855, 48710188, 48357084, 47857231, 46531372, 46155018, 45946749, 45558736, 44882638, 44677293, 44464732, 44502019, 43527397, 43356400, 43507893, 43346894, 43587532, 43332795, 42932230, 42921249, 42176060, 41828983, 41361135, 40597618, 40735839, 40533465, 40105136, 39368831, 38095041, 37631866, 37559130, 37028012, 36629229, 35315366]
5347C5315366k95786K14910n68429j384835m3140k04753l39818o596o8503j43042
5337C2475374p41171o96072O2910k81649L4953j38450m48277m86050j62491j70769
5327B9448308L27444J00839m49348m7674k72849M0949M9730q78334p02853M64931
5317B8081143q5887j25814l00528L67859P30087m25091j99880L77021M28410l71611
5307B8475709n04198l56331j01686Q401m1606j14219M88133k68133L57240l29598
5297B7613712m98041L99667M43319p3594L90803k25799L01447q2190n40034k00972
5287B7528318J79511j33201N86896k38462J61624M43486n64563j11932J08810
5278B7960487L09754n55501O95349J18875Q652J27826q21552K83965M22751m64210
$$ y = [35315366, 35019580, 35234490, 34666061, 33281226, 33238086, 33033333, 32693515, 32686919, 32618416, 32475374, 31734203, 31038131, 31101041, 30819392, 30854345, 30715895, 30267618, 29781568, 29619077, 29448308, 29775752, 29876591, 29427243, 29379569, 29106720, 29147669, 29197399, 28319065, 27616212, 28081143, 27995256, 27869442, 27568914, 27936773, 28666860, 28241769, 28041889, 28418910, 28847320, 28475709, 27971511, 27615180, 27513494, 27521895, 27480289, 27366070, 27854203, 27586070, 27943310, 27613712, 27115671, 27515338, 27958657, 27885063, 28275866, 28050067, 28351514, 28269324, 27729290, 27528318, 27707829, 27574628, 28161524, 27923062, 28084686, 28528172, 27963609, 27851677, 27960487, 28270241, 27714740, 28410089, 28528964, 28537616, 28665442, 27843890, 28127855, 28550606, 28086396]
5268B8086396K05143P69360j31344n03298L84561L27258J24407M45554m55280
5259B9252757M2424M2429k54365l87908M05160Q40339o22290L73551K10256K97851
5249C0200204l83684J37890l5900Q4904J66887N12202k359J45761J80572m43203
5239C0563274o5981m2057M41813Q17118q69036o1630N07206Q923J50662M19482
5229C1869774j48508N76177K9439j93825M76088M01277j44725J05596O2157L71653
5219C3405103l50811j68605M43405j5085K78184N5453K19089j2872K54394M06685
5209C4514940R8108o478l16711M93614J49883j57216q0136O60291R57830n07087
5199C5807038j17832J13898O60766Q8632L97779L7568J19362L61032M7767l5104
$$ y = [28086396, 28291539, 29060899, 28929555, 28426257, 28810818, 29138076, 29262483, 29708037, 29252757, 29295181, 29337610, 29083245, 28695337, 29100497, 29940836, 29318546, 29692097, 29902353, 30200204, 29816520, 29954410, 29918510, 30003414, 30170301, 30682503, 30680144, 30825905, 31006477, 30563274, 30497293, 30455236, 30897049, 31714167, 30845131, 30783501, 31290707, 31299630, 31450292, 31869774, 31721266, 32297443, 32326882, 32133057, 32609145, 33010422, 32865697, 32971293, 33033450, 33405103, 33054292, 32885687, 33329092, 33314007, 33592191, 33647644, 33866733, 33853861, 34108255, 34514940, 34613048, 34606570, 34289859, 34783473, 34933356, 34776140, 34696004, 35356295, 36314125, 35807038, 35689206, 35803104, 36463870, 36552502, 36950281, 36987849, 37107211, 37468243, 37516010, 37480906]
5189C7480906m10108O91577O86308l77424O75823P5869j93682l9626J47339M68566
5179C9205548N71191o15779J118161L86930o14402P22369N6231K74436J15706
5170D1220391n08193L77824O12896j30457K34566l29858K05151J081972P1436
5161D2835728K01634M7183J95086P62857K34562m82799O79055K74267N93679l09614
5151D5031638l26255R49486K93594P82628l51499l18367O70558N14168K60606
5142D7506557J58124j67806J40744k8934N3660N24068M84625J32335L25918N21518
5132D9650809P23085k03950k09336J8311R9825K64143M04448J65282Q51737K6309
5122E1790663J60822N19432P6486k41505L48562j03403J80590J035640L12336
$$ y = [37480906, 37070798, 37762375, 38448683, 38071259, 38747082, 38822951, 38629269, 38589643, 38736982, 39205548, 39776739, 39160960, 40279121, 40666051, 40051649, 40774018, 40830249, 41104685, 41220391, 40712198, 41090022, 41702918, 41572461, 41807027, 41477169, 41682320, 42764292, 42835728, 43037362, 43084545, 43279631, 44042488, 44277050, 43794251, 44473306, 44747573, 45341252, 45031638, 44705383, 45654869, 45948463, 46731091, 46379592, 46061225, 46731783, 47245951, 47506557, 47664681, 47496875, 47637619, 47608685, 47662345, 48186413, 48671038, 48803373, 49129291, 49650809, 50373894, 50169944, 49960608, 49978919, 50078744, 50342887, 50747335, 50912617, 51764354, 51790663, 51951485, 52470917, 52547403, 52305898, 52654460, 52551057, 52731647, 53767287, 54079623]
5113E4079623P09307M02159K15200k3329M1502M59044N23780J08354P73586o3103
5103E7226123n16175J083014Q16741q8793N29350N38836J98649M78195K29625
5094F0495565K82373N48052Q71761M30190L85157L07851N43708R5695O3236K31462
5084F4255050K01295N49808O18008P81026J25361J06836M95907l0651L97430Q85225
5074F8385295O05787K57816j7641M21377R3966N34081M71402K62813l26933L90381
5064G1078344P48555J48510K71349j34336J139P35717R45109L21215l50354N41411
5054G4306659K75170N56139K43305L94515P31303K26486L34602M10384M49914
5045G7928477Q33883p2233Q20012J59339p50540K44246P41137O33885K94558Q49373
$$ y = [54079623, 54788930, 55191089, 55406289, 55382960, 55424462, 55883506, 56407286, 56515640, 57289226, 57226123, 56709948, 57792962, 58609703, 58520910, 59050260, 59589096, 59787745, 60265940, 60495565, 60777938, 61325990, 62197751, 62627941, 63013098, 63320949, 63864657, 63960352, 64023588, 64255050, 64456345, 65006153, 65624161, 66405187, 66530548, 66637384, 67133291, 67102640, 67500070, 68385295, 68991082, 69248898, 69231257, 69652634, 69746600, 70280681, 70752083, 71014896, 70687963, 71078344, 71826899, 71975409, 72246758, 72112422, 72113561, 72849278, 73794387, 74115602, 73765248, 74306659, 74581829, 75137968, 75381273, 75775788, 76507091, 76733577, 77068179, 77478563, 77928477, 78762360, 78690127, 79510139, 79669478, 78918938, 79163184, 79904321, 80538206, 80832764, 81682137]
5035H1682137P80298k6769L73165M16919Q52026M53997L7213Q79076O29793K42833
5025H6320688N47754M17616O26824O38468M82318L29731O48333L11418M76086
5016I0799236J46827K14938r0953K33583J025570M29085J597814K99123K47132
5007I4902355M62286N73533J33923M83350J093822Q64499K90498j13890M35846
4998I9126222R72181L49071J111548Q72642L32360K14006Q63911M82547M03981
4989A04728469n24013J164198J193881L99232N62397Q94530P89477O90530L21905
4980A10220606L56921R26733J4006N77367Q78084Q09571Q36419O28945M59726
4971A15708378L41394M67443N47936K84550N37195P69890O50044K05861J30221
$$ y = [81682137, 82462435, 82435666, 82808831, 83225750, 84077776, 84531773, 84568986, 85448062, 86077855, 86320688, 86868442, 87286058, 87912882, 88551350, 89033668, 89363399, 90011732, 90323150, 90799236, 90946063, 91161001, 91070048, 91303631, 92329201, 92758286, 94356100, 94655223, 94902355, 95364641, 95938174, 96072097, 96555447, 97649269, 98513768, 98804266, 98690376, 99126222, 100098403, 100447474, 101559022, 102431664, 102764024, 102978030, 103841941, 104324488, 104728469, 104204456, 105368654, 106562535, 106961767, 107524164, 108418694, 109208171, 109898701, 110220606, 110577527, 111504260, 111518266, 112095633, 112973717, 113783288, 114619707, 115248652, 115708378, 116049772, 116517215, 117065151, 117349701, 117886896, 118656786, 119306830, 119512691, 119642912]
4962A19642912N72555R98963N13267N14341J110165M06899j57925M27226Q22674
4953A24851077R97723M29962J058163R16255J005074M88300N61283J710483Q67918
4944A32886238J118518J77046N81524J066811P52286J282104M74862Q31791J143437
4935A40314617R15728J589572R86711J209301J333333J559994J489838N37516
4927A49936610J557146J986303J443786J330275J393718J347454K198873J738044
4919A62932209J350297J701931J766057J813664J944464K041432J763373J422082
4911A76735509J948654J772720J689329J497426J992376R56110J647446J944815
4903A90184385J648471K101956J405503J641543J510188J343446J457928J601921
$$ y = [119642912, 120215467, 121214430, 121727697, 122242038, 123352203, 123759102, 123601177, 124028403, 124851077, 125848800, 126278762, 127336925, 128253180, 129258254, 129746554, 130307837, 132018320, 132886238, 134004756, 134181802, 134763326, 135830137, 136582423, 137864527, 138339389, 139171180, 140314617, 141230345, 142819917, 143806628, 145015929, 146349262, 147909256, 149399094, 149936610, 151493756, 153480059, 154923845, 156254120, 157647838, 158995292, 161194165, 162932209, 164282506, 165984437, 167750494, 169564158, 171508622, 173550054, 175313427, 176735509, 178684163, 180456883, 182146212, 183643638, 185636014, 186592124, 188239570, 190184385, 191832856, 193934812, 195340315, 196981858, 198492046, 199835492, 201293420, 202895341]
4895B02895341J634412J997201J284425J299873J332230J285706J393562Q30028
4887B13952778N47914P51162P53161k70580k37958n94901q57564l86208p46521
4878B12911283r36523j421279j524849j307033j509125j558512j008602j262130
4870B02383230j774224j612390j201939j194463j522471j487461j570838j319585
4862A90699859j948990j777688j936101j760387k182678k232261j805101k096812
4854A74959841j968371j743189k364991k419551k963877j758319k213746k800106
4846A56727691j641505j851056k218813j774436k035758j866762j574956k421032
4838A41343373j198479j788735j424082j084982j698568j092630j608331j472095
$$ y = [202895341, 204529753, 206526954, 207811379, 209111252, 210443482, 211729188, 213122750, 213952778, 214500692, 215251854, 216005015, 215734435, 215496477, 214901576, 214044012, 213657804, 212911283, 211974760, 210553481, 209028632, 207721599, 206212474, 204653962, 203645360, 202383230, 200609006, 198996616, 197794677, 196600214, 195077743, 193590282, 192019444, 190699859, 188750869, 186973181, 185037080, 183276693, 181094015, 178861754, 177056653, 174959841, 172991470, 171248281, 168883290, 166463739, 163499862, 161741543, 159527797, 156727691, 155086186, 153235130, 151016317, 149241881, 147206123, 145339361, 143764405, 141343373, 140144894, 138356159, 136932077, 135847095, 134148527, 133055897, 131447566, 129975471]
4830A29975471j226008j696575q53018r38208j358605r89764j284768q11844o58877
4821A20157804j025469j037732j073596o69519j268790j200299m20459m71172
4813A12990768j183637j135168j013103r36014l61466q17253j44231r85139n21608
4804A05893149o98992j114789j87167j29396j020296j026860o77799r17928o72427
4795I9447495m87846k34231o54323l87950q34934j12303j002986l53873o007r07639
4785I4465403j20403n03747m64077l1282p72954l34607p1712n38644o67184j16931
4775I0843862m75351l64374r71115k69320R7041j97873p54479k56811J3391L05007
4765H7969978q36399o05656j36336k76893o01906K55998p5977n88638L96882j04785
$$ y = [129975471, 128749463, 127052888, 126199870, 125261662, 123903057, 122913293, 121628525, 120816681, 120157804, 119132335, 118094603, 117021007, 116351488, 115082698, 113882399, 113461940, 112990768, 111807131, 110671963, 109658860, 108722846, 108361380, 107544127, 107399896, 106414757, 105893149, 105194157, 104079368, 103892201, 103762805, 102742509, 101715649, 101037850, 100119922, 99447495, 98959649, 98725418, 98071095, 97683145, 96848211, 96735908, 95732922, 95379049, 95373042, 94465403, 94345000, 93841253, 93377176, 93345894, 92572940, 92238333, 92166621, 91627977, 90960793, 90843862, 90368511, 90004137, 89033022, 88763702, 88860743, 88662870, 87908391, 87651580, 87664971, 87969978, 87133579, 86527923, 86391587, 86114694, 85512788, 85768786, 85692809, 85104171, 85501053, 85396268]
4755H5396268P7188p2701k33378j92692m14690N670n4106j68070O0818m40585
4745H3963722k84864p81558k8303K37194l09744J4270O53268k32471l41097K5346
4735H2915763J86118j51688N36420O3712l59121L32064p79964P03002j97811k19237
4725H3029258n7918j67390k47491j48195k74789k10136Q09928K38944p4104m04684
4715H2493423k47406l19030j56795P25633N53769M54086k4381l51298R01231K48736
4705H4277968J095011J21274M35186O26295M63284O18065M82937P26562J269089
4696I0115671R70670J081025L70421J165505J243776J128557J670658J080637
4688I8826920J185144O01616K094269J701125J258569K093952J426548J660243
$$ y = [85396268, 85473456, 85400755, 85167377, 84974685, 84559995, 84565665, 84511559, 84343489, 84404307, 83963722, 83678858, 82897300, 82868997, 83106191, 82796447, 82810717, 83463985, 83231514, 82890417, 82915763, 83101881, 82950193, 83486613, 83550325, 83191204, 83523268, 82743304, 83446306, 83248495, 83029258, 82971340, 82803950, 82556459, 82408264, 82133475, 81923339, 82733267, 82972211, 82898107, 82493423, 82246017, 81926987, 81770192, 82495825, 83049594, 83503680, 83479299, 83128001, 84029232, 84277968, 85372979, 85494253, 85929439, 86555734, 87019018, 87637083, 88120020, 88846582, 90115671, 91086341, 92167366, 92537787, 93703292, 94947068, 96075625, 97746283, 98826920, 100012064, 100613680, 102707949, 104409074, 105667643, 107761595, 109188143, 110848386]
4680A10848386J885368J839648J561322J712288J200585K193089J566436J750022
4672A24557144J747777L007302J650000J524619K468301J553249J261745J753134
4664A39523271K386392J862958J781283J285057J935560J513024O24211J266921
4656A52178677J502325P30792J178470L67565M77017Q39636K16876Q34867q7140
4647A58239085l64719j022423p21623O02821n54634l94088o75737q30091r20694
4638A53357897j167155j639629n11310j566615j476321j540834j341681j507474
4630A42606878j556820j583500k154676j308037j047196k099344k079266q07821
4622A29970218o96414j217645j266442q60623r29390j220281l18499L5825k81706
$$ y = [110848386, 112733754, 114573402, 116134724, 117847012, 119047597, 121240686, 122807122, 124557144, 126304921, 129312223, 130962223, 132486842, 134955143, 136508392, 137770137, 139523271, 141909663, 143772621, 145553904, 146838961, 148774521, 150287545, 150911756, 152178677, 153681002, 154411794, 155590264, 155957829, 156434846, 157274482, 157491358, 158326225, 158239085, 157874366, 156851943, 156130320, 156733141, 156178507, 155784419, 155108682, 154278591, 153357897, 152190742, 150551113, 150039803, 148473188, 146996867, 145456033, 144114352, 142606878, 141050058, 139466558, 137311882, 136003845, 134956649, 132857305, 130778039, 129970218, 129273804, 128056159, 126789717, 125929094, 124999704, 123779423, 123460924, 123496749, 123215043]
4613A23215043j133885r07144k30337j65644K58882q33158j70138J62618k97320
4604A19898917k99683q09374q78646r75612p40208j165837n83701j018038j837621
4595A11590197q58333j878683n23282j991045j938768j560811k191214j896836
4587I8751225j846374q39285k245781j760485j538702k127124j698412j416084
4579H5278978j497871j769959j485723q08109j871481j915881r69433j280366
4571G3680155q34378q14435j174189j589240j236010r71305j117192n18222j214856
4562F4210328j113113m96324o06255q57453r74308p04083p19935j278791l16122
4553E7143944q10998j322237q05817K20872o77442n51221k88883o11995m02624
$$ y = [123215043, 122081158, 121174014, 120943677, 120778033, 121036915, 120203757, 120033619, 120196237, 119898917, 119599234, 118789860, 117911214, 116935602, 116195394, 115029557, 114445856, 113427818, 111590197, 110731864, 108853181, 108329899, 106338854, 104400086, 102839275, 100648061, 98751225, 96904851, 96065566, 93819785, 92059300, 90520598, 88393474, 86695062, 85278978, 83781107, 82011148, 80525425, 79717316, 77845835, 75929954, 74960521, 73680155, 72845777, 72031342, 70857153, 69267913, 68031903, 67060598, 65943406, 65425184, 64210328, 63097215, 62600891, 61994636, 61137183, 60162875, 59458792, 58738857, 57460066, 57143944, 56332946, 55010709, 54204892, 54425764, 53748322, 53197101, 52908218, 52296223, 51893599]
4544E1893599j261309r97241J45983j123473l34481j63957m4954k26510q76673
4535D7010984R8460r34738m97877K1346r82003l21683J45914M1247L44352l37959
4525D4588043r34411l72205l64449n27018J84244n01103K12229k8145k95104J94259
4515D2156340O37072o65450o03849Q59793k58476L75709O039k12762K63326n44029
4505D2013713J104622M89965k5606k05765Q3077m84997O83365N90518n28386N5254
4495D3775760R36480J50897K70440L92891L24145O71320K2005J584274M89001
4486D8617213O25682L69435O80709Q55280J195907K95352O49502J169235J312556
4477E5770871P13236O19670R97725M73958R27500R23701O77777P37963J518345
$$ y = [51893599, 50632290, 49635049, 49781032, 48657559, 48323078, 48159121, 48114167, 47887657, 47010984, 47109444, 46174706, 45676829, 45698175, 44716172, 44394489, 44540403, 44581650, 44926002, 44588043, 43653632, 43281427, 42916978, 42389960, 42574204, 42073101, 42285330, 42257185, 41962081, 42156340, 42793412, 42127962, 41524113, 42383906, 42125430, 42501139, 42507178, 42294416, 42557742, 42013713, 43118335, 43608300, 43582694, 43376929, 43460006, 42975009, 43658374, 44248892, 43720506, 43775760, 44712240, 44863137, 45133577, 45526468, 45850613, 46521933, 46543938, 48128212, 48617213, 49242895, 49612330, 50293039, 51148319, 52344226, 52639578, 53289080, 54458315, 55770871, 56484107, 57103777, 58101502, 58575460, 59502960, 60426661, 61104438, 61842401, 63360746]
4468F3360746L33722J201822J119521O59732O11747M34749J047460P91752M73313
4459G0034564O22369L32804N73802L96839Q73346j86673O83398Q38666Q04130
4450G4973245J108538L85913J148666M25250O54364Q40085Q13955R98146L68158
4441H1716320J436175J016313Q59988O30163J032762J330991O47431J238245J545706
4432I1454094P25192R14036J104767J509641J928623J017574K269665J611864
4424A02535456J230685J645881J341707K035609K127583K584874K438456K475583
4416A18415834K420280L196641L178807K680890L262005L775543L705547L914718
4408A44550265L966412M539032N118171N488901O849537O549930O859725P766420
$$ y = [63360746, 63694468, 64896290, 66015811, 66675543, 67287290, 67722039, 68769499, 69561251, 70034564, 70656933, 70989737, 71563539, 71960378, 72833724, 72647051, 73330449, 74169115, 74973245, 76081783, 76467696, 77616362, 78041612, 78695976, 79536061, 80350016, 81348162, 81716320, 83152495, 84168808, 85028796, 85658959, 86691721, 88022712, 88670143, 89908388, 91454094, 92179286, 93093322, 94198089, 95707730, 97636353, 98653927, 100923592, 102535456, 103766141, 105412022, 106753729, 108789338, 110916921, 113501795, 115940251, 118415834, 120836114, 124032755, 127211562, 129892452, 133154457, 136930000, 140635547, 144550265, 148516677, 153055709, 158173880, 163662781, 170512318, 177062248, 183921973, 191688393]
4400A91688393Q447720R278811R832928J0258652J0548701J0352488J1192768
4393B61600461J0826973J0324741R831618R080430P906070O256544L883162P42198
4385C20452197k289586m547687o299143r276785j0290575j1197850j1882844j2323900
4377B52343827j1679952j1938987j2030902j0335657j0265263j0083918r306287
4370A76702861p846127q331243p119297o471347o539884o372231o068025n342212
4362A22612495m667968m343993m126735m366808l983380l852809l042001l433090
4354I0795711k735046k990110k762180k744115k487450k364066k801381j668631
4346G0242732j577502k282183q71057k260269k509749j289150j332809q25248
$$ y = [191688393, 200136113, 209414924, 219247852, 229506504, 240055205, 250407693, 261600461, 272427434, 282752175, 292583793, 301664223, 309570293, 315826837, 319709999, 320452197, 318162611, 313614924, 307315781, 298038996, 287748421, 276550571, 264667727, 252343827, 240663875, 228724888, 216693986, 206358329, 196093066, 186009148, 176702861, 168856734, 160525491, 153406194, 146934847, 140394963, 134022732, 127954707, 122612495, 117944527, 113600534, 109473799, 105106991, 101123611, 97270802, 94228801, 90795711, 88060665, 85070555, 82308375, 79564260, 77076810, 74712744, 71911363, 70242732, 68665230, 66383047, 65511990, 63251721, 60741972, 59452822, 58120013, 57294765]
4338E7294765q66819j691726j560972j429043j664244j558211k87785p86810j402500
4329D6046655n49035j237688q14440j331567m43809j048307n11194q99759q07516
4320C8403340m1340n10738o49930m59955j103155k47669k4004q37438m45252m20846
4310C3663013l29762j65347j084391r53390p00052n00986R3340p82782m06054
4301B8833589m109j44309O6901q47787o06418J66886J53277L0662k67635l26748
4291B7054309k12010n60494J59875L40131k93620L449n26412K70896j45072q61503
4281B5229549J06703K50656m32162o81955j12713j292424M87840l86937j132042
4272B2036515k96236m13298j56985m10165k5974K92730r09311n46280q54230K7763
$$ y = [57294765, 56427946, 54736220, 53175248, 51746205, 50081961, 48523750, 48235965, 47449155, 46046655, 45497620, 44259932, 43445492, 42113925, 41670116, 40621809, 40110615, 39210856, 38403340, 38362000, 37851262, 37201332, 36741377, 35638222, 35390553, 35366549, 34529111, 34083859, 33663013, 33333251, 33167904, 32083513, 31130123, 30430071, 29929085, 30022425, 29239643, 28833589, 28829480, 28685171, 28752072, 27904285, 27297867, 27464753, 27618030, 27648692, 27381057, 27054309, 26842299, 26281805, 26441680, 26781811, 26488191, 26491640, 25965228, 26236124, 26091052, 25229549, 25336252, 25586908, 25154746, 24472791, 24360078, 23067654, 23555494, 23168557, 22036515, 21740279, 21326981, 21169996, 20759831, 20733857, 21026587, 20117276, 19570996, 18716766, 18744529]
4262A8744529P72432r66877m02256r599l84041J56489k6727J6609p62192J17940
4252A7256307J72702n45528J98818o22769M64532Q1540l57123r97817q4260J45374
4242A5711776K67344M17346r7260n61773m61126J03033n01891n6918k38823N90525
4232A5172233l5461L00622j65388n26132K55870j69379k50937m35379J61678l73217
4222A3934510j57822K85002K88425J56577k92162k95831J56631K18888q77274
4213A3416944J1615j6298M16444j231l26154j74374J7996K92432m09443O48531
4203A3876462L15523q0352n93643m76742R0010N70525m76358j09886L35227o21970
4193A2828796L68448Q15846J22918k86184J07935J75678o45305M9598J20497J67140
$$ y = [18744529, 19516961, 18550084, 18147828, 18138229, 17754188, 17910677, 17883950, 17900559, 17138367, 17256307, 17429009, 16883481, 17082299, 16459530, 16924062, 17005602, 16648479, 15650662, 15566402, 15711776, 15979120, 16396466, 16299206, 15737433, 15276307, 15379340, 14877449, 14820531, 14581708, 15172233, 15136772, 15437394, 15272006, 14745874, 15001744, 14832365, 14581428, 14146049, 14307727, 13934510, 13776688, 14061690, 14350115, 14506692, 14214530, 13918699, 14075330, 14294218, 13416944, 13428559, 13412261, 13828705, 13827474, 13501320, 13326946, 13344942, 13637374, 13227931, 13876462, 14191985, 14111633, 13517990, 13041248, 13131258, 13701783, 13225425, 13115539, 13450766, 12828796, 13197244, 14013090, 14136008, 13849824, 13957759, 14133437, 13488132, 13537730, 13658227, 13825367]
4183A3825367K02255j05154K48577M24056k55595N44689l58659k89300K44413
4174A4480649O80377m05401l66353R94785n5908L2870L06699m40104N47028r6420
4164A5678222j80476j78610K99551J170410R7578m21993r0629J035990K66947
4155A7676990k77584M35207N90865j7818o9645M6071O74202R25870K75540M3906
4145B0303604M83894L85180R6748k22814Q97035J69884K19271J233888Q47503
4136B4414193N52552P81275J343872Q91380M17835J721295M13884J479214J806204
4127C3821704J572279J606648J600670K027147J938535K413472K516146L217538
4119E0714139K929292L376283L616811M318109L902262M003182M353730M501704
$$ y = [13825367, 14027622, 13922468, 14171045, 14595101, 14339506, 14884195, 14525536, 14236236, 14480649, 15161026, 14755625, 14389272, 15384057, 15328149, 15361019, 15667718, 15227614, 15774642, 15678222, 15497746, 15319136, 15618687, 16789097, 16886675, 16464682, 16374053, 17410043, 17676990, 17399406, 17834613, 18425478, 18407660, 18338015, 18384086, 19058288, 19984158, 20259698, 20303604, 20787498, 21172678, 21269426, 21046612, 21943647, 22113531, 22332802, 23566690, 24414193, 24966745, 25748020, 27091892, 27983272, 28401107, 30122402, 30536286, 32015500, 33821704, 35393983, 37000631, 38601301, 40628448, 42566983, 44980455, 47496601, 50714139, 53643431, 57019714, 60636525, 64954634, 68856896, 72860078, 77213808, 81715512]
4111H1715512M477642M788493M487880M375049M962380M020131L697364L566300
4103A16090751L131619L291940J456071K054191K206476O29269K17950p14997
4095A28363270r95368k202424k547671k487888k677242l440638m653958l761824
4087A05596257m426197m161470n016356m524546m391961m467652m194114l589622
4079G0824339l983273m423393l194904l296870k832877k531815k950053k905414
4071D4705740k520591j833097j244872k175880q29045j598008j799284j060520
4063C1644443j239602j086776q67090p26587m93158j271522r10818k30442q0989
4054B4737459o07390p16289j250070n46012o83653k74256o07155n79306l64202
$$ y = [81715512, 86193154, 90981647, 95469527, 99844576, 104806956, 108827087, 112524451, 116090751, 119222370, 122514310, 123970381, 126024572, 128231048, 128860317, 129078267, 128363270, 127367902, 125165478, 122617807, 120129919, 117452677, 114012039, 109358081, 105596257, 101170060, 97008590, 91992234, 87467688, 83075727, 78608075, 74413961, 70824339, 66841066, 62417673, 59222769, 55925899, 53093022, 50561207, 47611154, 44705740, 42185149, 40352052, 39107180, 36931300, 36102255, 34504247, 32704963, 31644443, 30404841, 29318065, 28450975, 27724388, 27231230, 25959708, 25048890, 24818448, 24737459, 24130069, 23413780, 22163710, 21617698, 20934045, 20659789, 20052634, 19473328, 19109126]
4045A9109126p1916r1476k92615k57461j73018k48481q58696m74375L45612j42469
4035A6844231j35213p14405k30959p22961j53288j01203j44283j15518o98331
4026A3828070L05333p20648k87280M601o2066L00831k72987l19850k18869j43944
4016A2413191j88037q10135L81693l69588j91603J78276J16465p47733q55945
4007I926584p2840Q58012n04040j55636N10052N95814q09179M87528M4143p44888
3997A0135550m7612l24209o40454J9788K8189j69804L47895l38947k8092m93826
3987H488478j47565O65808o732o59004M49639k01179l12232N05684k43698J07790
3977H646989P9975k33760l6318J15852L99417K36750L1724l17736m96400K56093
$$ y = [19109126, 19037210, 18945734, 18653119, 18395658, 18222640, 17974159, 17115463, 16641088, 16986700, 16844231, 16709018, 15994613, 15763654, 15040693, 14887405, 14786202, 14641919, 14526401, 13828070, 14133403, 13412755, 13125475, 13130076, 13068010, 13368841, 13095854, 12776004, 12557135, 12413191, 12225154, 11415019, 11796712, 11427124, 11235521, 11413797, 11530262, 10782529, 9926584, 9853744, 10711756, 10207716, 10052080, 10562132, 11157946, 10348767, 10836295, 10880438, 10135550, 10087938, 9763729, 9123275, 9143063, 9171252, 9001448, 9349343, 9010396, 8982304, 8488478, 8340913, 9006721, 8999989, 8340985, 8790624, 8589445, 8277213, 8782897, 8539199, 8646989, 8726964, 8493204, 8456886, 8572738, 8972155, 9208905, 9240629, 8922893, 8426493, 8682586]
3967H682586K04818k11039L97162j16667k76635l8549L7060l7505n74672j77599
3957G888960O19431O2713M26675n15823K0926k12154M40139k06181l43542k72164
3947G908980O2440r3654J92110n8987R97402P96529q38159Q9837m58087J59859
3937H758270j75766M97680Q2011P2548k92036l41249P5855J69122Q33724k77925
3927I402234L11794m75089r61298O56336L29327L50381j45533P5328O0042L06128
3917I909650L07452J83380m80404K84756N29901k65023n21135J41242L53378M19661
3907A0862858k37725o58307J0759Q20186M73866p36736m31959P24908l92822K02202
3897A0637230j51171J57177J306802N52021j61361k08174j0786r0889L62769q3447
$$ y = [8682586, 8887404, 8676365, 9073527, 8956860, 8680225, 8641676, 8678736, 8641231, 8066559, 7888960, 8508391, 8571104, 8997779, 8481956, 8502882, 8290728, 8730867, 8524686, 8181144, 7908980, 7971420, 7877766, 8069876, 8010889, 9008291, 9804820, 8966661, 9056498, 8598411, 8758270, 8582504, 9080184, 9162195, 9234743, 8942707, 8601458, 8677313, 8846435, 9680159, 9402234, 9714028, 9238939, 8277641, 8933977, 9263304, 9613685, 9468152, 9543480, 9603522, 9909650, 10217102, 10400482, 9920078, 10204834, 10734735, 10469712, 9948577, 10089819, 10443197, 10862858, 10625133, 9966826, 9977585, 10797771, 11271637, 10534901, 10102942, 10827850, 10435028, 10637230, 10486059, 10643236, 11950038, 12502059, 12340698, 12132524, 12121738, 12030849, 12393618, 12310171]
3887A2310171j14852K77360M66207k9685l95120O08825L40802k74942K77687k5212
3877A3441241M99137P44516o69413Q48992K03946K21376q0216o63425O74761O01395
3867A5822310L95555L8723O83163r9132O56059r7368M77783K27415K48300R3208
3857A8446016P53583O80591K96501J49106K58179K06981N37742L55244Q99234
3848B2583177Q23007K44062M20900P60690R29947J56819J2309N88877O64387P90821
3838B7974996J373390K56330M67235N26449M93765J707302J209400Q62049O63256
3829C5534172J083172O88186J231385J504857J192502J132875J097129J356457
3821D4820735K230887J594919J143822J749795J752188K686187J893270J715465
$$ y = [12310171, 12195319, 12472679, 12938886, 12909201, 12514081, 13122906, 13463708, 13188766, 13466453, 13441241, 13940378, 14684894, 14015481, 14864473, 15068419, 15289795, 15209579, 14546154, 15220915, 15822310, 16217865, 16256588, 16939751, 16840619, 17496678, 17399310, 17877093, 18104508, 18352808, 18446016, 19199599, 19880190, 20176691, 20325797, 20583976, 20790957, 21328699, 21683943, 22583177, 23406184, 23650246, 24071146, 24831836, 25761783, 25918602, 25930911, 26519788, 27184175, 27974996, 29348386, 29604716, 30071951, 30598400, 31092165, 32799467, 34008867, 34870916, 35534172, 36617344, 37305530, 38536915, 40041772, 41234274, 42367149, 43464278, 44820735, 47051622, 48646541, 49790363, 51540158, 53292346, 55978533, 57871803, 59587268]
3813E9587268K442424K600444K720727K494632L207962L756535L075953L988199
3805H3874144L487432L530961M326581L769446L638795L868411M639380M568545
3797A15703695N263588M829571N076541M743143N140052N192513M488998N740532
3789A56178633M120711M896958M952084M857599N020230L912815L309005L891335
3781A91139370L913260L604406K791566L064994K241509K119111J790958J185244
3773B11850418R54906P61237k5949j131942n30872j316850j823015j427076j990894
3764B05319963k179817l156757k907318l389450l350238l491086l961696l528883
3756A79354718l881623n049507m792069m180208m546492m149640m064102m098933
$$ y = [59587268, 62029692, 64630136, 67350863, 69845495, 73053457, 76809992, 79885945, 83874144, 87361576, 90892537, 95219118, 98988564, 102627359, 106495770, 111135150, 115703695, 120967283, 125796854, 130873395, 135616538, 140756590, 145949103, 150438101, 156178633, 160299344, 165196302, 170148386, 175005985, 180026215, 183939030, 187248035, 191139370, 195052630, 198657036, 201448602, 204513596, 206755105, 208874216, 210665174, 211850418, 212805324, 213566561, 213540612, 212408670, 211877798, 210560948, 208737933, 207310857, 205319963, 203140146, 199983389, 197076071, 193686621, 190336383, 186845297, 182883601, 179354718, 175473095, 170423588, 165631519, 161451311, 156904819, 152755179, 148691077, 144592144]
3748A44592144m164544m646981m550763m198863l693781m303693l472614l658055
3740A11902850k995313l220362l795395l432913k890027k597266k510966k590294
3732H7870314k684288k618471k280011j961061k265467k129448j732115j518887
3724G0680566j946121m49244j754142j897998r92153j631264j112131l06711j088330
3715E9502472m88811j114167m22108k74433j122256j040651m43887o56997l06033
3706E3633129n57184K7506k52737j50728l48147j57593M05539J75569j59325N19896
3696E3135925K79550J90870K15854K8224N20312Q38972O17256R03276L46547J169818
3686E8246604N99307P90310J686428Q86467Q67428N40977J441530J805535R77901
$$ y = [144592144, 140427600, 135780619, 131229856, 127030993, 123337212, 119033519, 115560905, 111902850, 108907537, 105687175, 101891780, 98458867, 95568840, 92971574, 90460608, 87870314, 85186026, 82567555, 80287544, 78326483, 76061016, 73931568, 72199453, 70680566, 68734445, 68285201, 66531059, 64633061, 63640908, 62009644, 60897513, 60590802, 59502472, 59013661, 57899494, 57477386, 57202953, 56080697, 55040046, 54596159, 53939162, 53633129, 53075945, 53103451, 52850714, 52699986, 52351839, 52194246, 52599785, 52775354, 52616029, 53135925, 53415475, 53606345, 53822199, 53850423, 54370735, 55209707, 55826963, 56730239, 57076786, 58246604, 58845911, 59636221, 61322649, 62209116, 63076544, 63617521, 65059051, 66864586, 67842487]
3677F7842487J227465K040608J388545J655308K512249J908003J094649J545989
3669H1215303J639854J521687J717040J882579J566013J389605K101931J902470
3661I4936482J415077J491077J298893K644553J339548J432516J841511K405764
3653A08805421J008739J650168K228236K296479K586823K302465K080398K431314
3645A25390043L018445L227968L268025L589554L731768L853157M126223M940133
3637A55145316M619501N339173N877201N916878P053859O641318O518586P052658
3629B04164490Q032009Q302479Q103607Q973255R618149Q939124R090840R386785
3621B74610738R351074Q719129R184250Q403390Q974306P888294P354095P059567
$$ y = [67842487, 69069952, 71110560, 72499105, 74154413, 76666662, 78574665, 79669314, 81215303, 82855157, 84376844, 86093884, 87976463, 89542476, 90932081, 93034012, 94936482, 96351559, 97842636, 99141529, 101786082, 103125630, 104558146, 106399657, 108805421, 109814160, 111464328, 113692564, 115989043, 118575866, 120878331, 122958729, 125390043, 128408488, 131636456, 134904481, 138494035, 142225803, 146078960, 150205183, 155145316, 159764817, 165103990, 170981191, 176898069, 183951928, 190593246, 197111832, 204164490, 212196499, 220498978, 228602585, 237575840, 247193989, 256133113, 265223953, 274610738, 283961812, 292680941, 301865191, 310268581, 319242887, 327131181, 334485276, 341544843]
3613C41544843O924469N986911N088686M072474K927053K851029J926204P37104
3605C72058773o90378p45222k688584k802042l805355m726892m794840o271627
3597C45533833o080841o704555o945466p311442q297616q187625q332249q183833
3589B85490206q628135q315019q279912q547584q540718q184954p909158p999677
3581B19085049p277542p328381o698836o422984o021643o850611n939203n286157
3573A67259692m774568m704016m206696m100087m518468l052018l159661k674029
3565A36070149k898722k608756k699804k002421k851392k368570k214715k470327
3557A15955442j792705j451588k170358k503609j309698j331381j361541j188218
$$ y = [341544843, 348469312, 354456223, 359544909, 363617383, 366544436, 369395465, 371321669, 372058773, 371368395, 370623173, 367934589, 365132547, 361327192, 356600300, 351805460, 345533833, 339452992, 332748437, 325802971, 318491529, 310193913, 302006288, 293674039, 285490206, 276862071, 268547052, 260267140, 251719556, 243178838, 234993884, 227084726, 219085049, 211807507, 204479126, 197780290, 191357306, 185335663, 178485052, 172545849, 167259692, 162485124, 157781108, 153574412, 149474325, 144955857, 141903839, 138744178, 136070149, 133171427, 130562671, 127862867, 125860446, 123009054, 120640484, 118425769, 115955442, 114162737, 112711149, 110540791, 108037182, 106727484, 105396103, 104034562, 102846344]
3549A02846344k137456j735948r39894j603515k098295j333362j772912j103197
3541I0121765j131167j592182j498443j065394o31216j192594p05202j182931
3533H1122636r62874m31080p48474j121689n92952r29068l62173q66817n99371
3524G4508138j132029r95243q76157j055505j030319o51647r48150j037112p39274
3515F6042702q03841j353437o47571j96694j767199j387087r14201p23234j07336
3506E8142102r66829j513447n82964m69848p98153n28971j183351o85671m6987
3497E1365881m17099q21380K66995m4715j018903r72230L11761Q8307m35806Q6278
3487D8409089q27965l46375j08880N34026k98856l95250P68589j02933L02268
$$ y = [102846344, 100708888, 98972940, 98033046, 96429531, 94331236, 92997874, 91224962, 90121765, 88990598, 87398416, 85899973, 84834579, 84203363, 83010769, 82305567, 81122636, 80159762, 79728682, 78980208, 77858519, 77265567, 76336499, 75974326, 75107509, 74508138, 73376109, 72380866, 71504709, 70449204, 69418885, 68767238, 67819088, 66781976, 66042702, 65238861, 63885424, 63237853, 63041159, 61273960, 59886873, 58972672, 58249438, 58142102, 57175273, 55661826, 55078862, 54609014, 53810861, 53281890, 52098539, 51412868, 51365881, 50948782, 50127402, 50394397, 50349682, 49330779, 48358549, 48670310, 48758617, 48322811, 48409089, 47581124, 47234749, 47125869, 47659895, 47361039, 46965789, 47734378, 47631445, 47933713]
3478D7933713j04253K2000J35253O74505L76798K59236M02699p0961N01895O10317
3468E0741202O91229K26031R71514P74289Q08299O20492M81303J068452J357746
3459E7740557J187145J132648Q90260K106242J045662J395729J417486J109428
3451F8025157J454929J440372J201863K257286J968015J596607J287876J236206
3443H0468311J899201J980339J074662J464568J239456K157062J502255J277282
3435I3063136J494292N51028J787541O89053J173665J374200J223744J127921
3427A02484580J247153J001141J452934J774341R60869P63305K179650J747516
3419A13611489J813678K910643J444484K144864L072384L601651L474601K953834
$$ y = [47933713, 47829460, 47851460, 47986713, 48661218, 49038016, 49297252, 49699951, 49628990, 50130885, 50741202, 51432431, 51658462, 52629976, 53404265, 54212564, 54833056, 55314359, 56382811, 57740557, 58927702, 60060350, 60950610, 63056852, 64102514, 65498243, 66915729, 68025157, 69480086, 70920458, 72122321, 74379607, 76347622, 77944229, 79232105, 80468311, 82367512, 84347851, 85422513, 86887081, 88126537, 90283599, 91785854, 93063136, 94557428, 95108456, 96895997, 97585050, 98758715, 100132915, 101356659, 102484580, 103731733, 104732874, 106185808, 107960149, 108921018, 109684323, 111863973, 113611489, 115425167, 118335810, 119780294, 121925158, 124997542, 128599193, 132073794, 135027628]
3411A35027628L312229M111359M675133M885770M961008N244654M907457O154362
3403A73279600O373011N893774O742048O543773P127860P182300P151577O743923
3395B27037866P237232P400818P874961P975078O939646N827267O417474O748496
3387B83458838O280900N365711N564959N705680M298554M348889M182151L017812
3379C22223494K568393K321840K509951J782842J557932O75125o09131j566346
3371C31464100n02512l80988j324954k136635k170941l034922l248177k679311
3363C15985660l516130n162636m893552n265522m697211n415654o182473o012178
3355B74840304o301194n474777o423071o719685o299429o623223p035008o034526
$$ y = [135027628, 138339857, 142451216, 147126349, 152012119, 156973127, 162217781, 167125238, 173279600, 179652611, 185546385, 192288433, 198832206, 205960066, 213142366, 220293943, 227037866, 234275098, 241675916, 249550877, 257525955, 264465601, 270292868, 276710342, 283458838, 289739738, 295105449, 300670408, 306376088, 310674642, 315023531, 319205682, 322223494, 324791887, 327113727, 329623678, 331406520, 332964452, 333639577, 333030446, 331464100, 330961588, 330580600, 329255646, 327119011, 324948070, 321913148, 318664971, 315985660, 312469530, 307306894, 302413342, 297147820, 292450609, 287034955, 280852482, 274840304, 268539110, 263064333, 256641262, 249921577, 243622148, 236998925, 229963917, 223929391]
3347B23929391o576024o499007o231563o714819o534278n766720n392707n259879
3339A74954394n092208m743034m696982m104741m914039m470851l612736l412750
3331A39907053k653771l400686k073670k834628l457317j861942k224251j682676
3323A19718112k278406k211524j673068j754488j720864j826273k284359j129806
3315A04839324j119713j876007j551871j975353j607268j859162j376482j917365
3307I1556103j981324k265872j409783j283864j749526j711342k025049j522661
3299G7606682j801085j950822j829229j528532k625417j868348j755216j438334
3291F2809699j770611j481714j706590j217665j550998j556251j525387j669956
$$ y = [223929391, 217353367, 210854360, 204622797, 197907978, 191373700, 185606980, 180214273, 174954394, 169862186, 165119152, 160422170, 156317429, 151403390, 146932539, 143319803, 139907053, 137253282, 133852596, 131778926, 128944298, 125486981, 123625039, 121400788, 119718112, 117439706, 115228182, 113555114, 111800626, 110079762, 108253489, 105969130, 104839324, 103719611, 101843604, 100291733, 98316380, 96709112, 94849950, 93473468, 91556103, 89574779, 87308907, 85899124, 84615260, 82865734, 81154392, 79129343, 77606682, 75805597, 73854775, 72025546, 70497014, 67871597, 66003249, 64248033, 62809699, 61039088, 59557374, 57850784, 56633119, 55082121, 53525870, 52000483, 50330527]
3283E0330527j419053j322122r25089j197557j332587j006757j092445m12154
3275D1622763p36268j000007j024265j045074p68228j267243q64320m00348j78601
3266C4338409r57777k64778r64652j165643p65784K46990k55278j170696n82827
3257B8457964j107329n9585k33675m84655o38240l81722k50195p42654K0610k96124
3247B4284395k71213m99362n35200k68101n76615r18404k91130m01531K32945
3238B0755784N08131r04261p85166k07201r2218k48885k72405N9727N10688j63591
3228A9160603n79078m58108m86008k29317l7345k22063n88353k82731k02466M5232
3218A6120366j45847P4206m26126n5106j28994m53508J79348o78353m95817r4532
$$ y = [50330527, 48911474, 47589352, 46664263, 45466706, 44134119, 43127362, 42034917, 41622763, 40886495, 39886488, 38862223, 37817149, 37048921, 35781678, 34917358, 34517010, 34338409, 33380632, 33115854, 32151202, 30985559, 30219775, 30466765, 30211487, 29040791, 28457964, 27350635, 27291050, 27057375, 26572720, 25934480, 25552758, 25302563, 24559909, 24580519, 24284395, 24013182, 23513820, 22978620, 22710519, 22133904, 21215500, 20924370, 20522839, 20755784, 21263915, 20359654, 19574488, 19367287, 19275069, 19026184, 18753779, 18813506, 19324194, 19160603, 18581525, 18123417, 17637409, 17408092, 17370747, 17148684, 16560331, 16277600, 16075134, 16120366, 15974519, 16048725, 15622599, 15567493, 15438499, 14984991, 15164339, 14485986, 13990169, 13895637]
3208A3895637O47203j01119q73968K96968l42422m24999l21362J50985K28413
3199A3155336l50944n13706M81200l17981n61048M81694p7435k19827J5593J99421
3189A2292303l93756j01077J21064k02964k32723j55158j4819o96111L18558L20842
3179A1256159J99493L2778j026255j84642K81103j12457L27518M2690o14386N4559
3169A0256560l1170N1717m89517j78104j50114n97240M20261L39190m13804j58364
3159I049415L98943J19855j30783j39476K5573m90606j44975L23513P19042J04945
3149I835446l68481Q8159m35566Q8704l19494j95614J3218n4643M29189q0426
3139I000492n03379K4685N86542L8353n50430n32221L05807N54163Q6730J9562
$$ y = [13895637, 14542840, 14441721, 13567753, 13864721, 13522299, 13097300, 12775938, 12926923, 13155336, 12804392, 12290686, 12771886, 12453905, 11892857, 12374551, 12297116, 12077289, 12092882, 12292303, 11898547, 11797470, 11918534, 11715570, 11482847, 11327689, 11312870, 10616759, 10935317, 11256159, 11455652, 11488430, 10462175, 10277533, 10558636, 10446179, 10773697, 10816387, 10202001, 10256560, 10225390, 10277107, 9787590, 9609486, 9459372, 8862132, 9282393, 9621583, 9207779, 9049415, 9448358, 9568213, 9437430, 9297954, 9323527, 8832921, 8687946, 9011459, 9730501, 9835446, 9466965, 9555124, 9119558, 9208262, 8888768, 8693154, 8706372, 8651729, 9080918, 9000492, 8497113, 8521798, 9108340, 9146693, 8596263, 8064042, 8369849, 8924012, 9010742, 9030304]
3129I030304N41935m70352j94207N2565l32162O89114j178M49822j08861K82942
3119I939922k30934m75850n51408p33O97673K29239j018144l60313K14644j0423
3109H433673o862N13510m44336m40113L73211j72978L67794k04758J00480M2147
3099H561768K0603P5565N5340O73629j29041q08253K98748M5684N1427l13067
3089H532403Q7563K52356K53725n68881j02545J36283l5325Q4621J86122J83260
3079I009582K27592J22420L58103r33694L6834R88586l63430l01970k43172P52078
3069I652929L26462K2131K95159j87926j26685j20922P84901j78771m26902N10754
3059A0551130r12816n49042L83762o1860o99598k8512K12317K8105j200021q15357
$$ y = [9030304, 9572239, 9101887, 8907680, 8960245, 8628083, 9317197, 9316019, 9765841, 9656980, 9939922, 9708988, 9233138, 8681730, 8680997, 9378670, 9607909, 8589765, 8229452, 8444096, 8433673, 8426811, 8940321, 8495985, 8055872, 8429083, 8256105, 8623899, 8419141, 8519621, 8561768, 8582371, 8657936, 8713276, 9386905, 9257864, 8449611, 8748359, 8794043, 8845470, 8532403, 8619966, 8872322, 9126047, 8557166, 8454621, 8590904, 8555579, 8640200, 8826322, 9009582, 9237174, 9359594, 9717697, 8784003, 8820837, 9809423, 9445993, 9144023, 8900851, 9652929, 9979391, 10001522, 10296681, 10108755, 9982070, 9861148, 10646049, 10467278, 10040376, 10551130, 9638314, 9089272, 9473034, 9411174, 8711576, 8683064, 8895381, 8923486, 7723465, 6908108]
3049F908108M33275N48932n92841N0080l56653j93470J36336J77349J21495j53354
3039G079257l97793l52561O37221J79828j304514m73231K34978J42053j67315
3030E577923J18066n79763J29658K58540r86185J62873L52045k6292m45991L91453
3020D952327P60135M84254p79889n04873k80257m3417n10188j14153N27885k1800
3010D470024l4156k05064N2801q0735m8102k53446M233J062324r6906p36094M7192
2999D182071j1885L52376k31336k09201J55908k76859O00615j94691J5899o4520
2989D318377j47560L60858J5910J171m50854k46025M50240O2378K34632J98320
2979D797447m99517J43054l57447p8060L18333j98307r1155l6993k60639n91647
$$ y = [6908108, 7341383, 7890315, 7297474, 7347554, 6990901, 6797431, 6933767, 7111116, 7232611, 7079257, 6681464, 6328903, 6966124, 7145952, 5841438, 5368207, 5603185, 5745238, 5577923, 5695989, 5116226, 5245884, 5504424, 4518239, 4681112, 5033157, 5006865, 4560874, 4952327, 5712462, 6196716, 5416827, 4911954, 4631697, 4588280, 4078092, 3963939, 4491824, 4470024, 4435868, 4230804, 4283605, 4202870, 4154768, 3901322, 3905555, 4967879, 4870973, 4134879, 4182071, 4170186, 4522562, 4291226, 4082025, 4237933, 3961074, 4561689, 4366998, 4382897, 4318377, 4170817, 4531675, 4547585, 4548756, 4097902, 3851877, 4302117, 4364495, 4599127, 4797447, 4297930, 4440984, 4083537, 4005477, 4323810, 4125503, 4034348, 3997355, 3736716, 3145069]
2969C145069M66121j59085o43143j06740K0876J02259K92366l16292M38877m42829
2959B797479n01818J90448M58377R0233K31351r9922l60992k40448P077N45004
2949C116789o8929n36843j70975m3921j05943J43831K86392N89214p13152K13
2939B496676l8307J87532P9671L54676L66206k53663m41685j87085J37084J32783
2929B833888M40374j85098n04282p8955m40753j03555M48568J88520J51013m1585
2919B708135J9067K49450L9675K15024o19795m2201m68796j67380K48089K16742
2909B398010K76420k3137q27829j3581O00896l23750j24507q8687k20679j9368
2899A633788o5097K52915J71491J25924k29136L04281n00198K63079N57151k71263
$$ y = [3145069, 3611190, 3452105, 2808962, 2702222, 2723098, 2825357, 3117723, 2801431, 3240308, 2797479, 2295661, 2486109, 2944486, 3034719, 3266070, 3166148, 2805156, 2564708, 2571785, 3116789, 3047860, 2511017, 2340042, 2296121, 2190178, 2334009, 2620401, 3209615, 2496463, 2496676, 2458369, 2645901, 2725572, 3080248, 3446454, 3192791, 2751106, 2564021, 2701105, 2833888, 3274262, 3089164, 2584882, 2505927, 2065174, 1961619, 2410187, 2598707, 2749720, 2708135, 2727202, 2976652, 3016327, 3231351, 2611556, 2569355, 2100559, 1933179, 2181268, 2398010, 2674430, 2651293, 1823464, 1809883, 2410779, 2087029, 1962522, 1873835, 1653156, 1633788, 1568691, 1821606, 1993097, 2119021, 1889885, 2194166, 1693968, 1957047, 2514198, 2242935]
2889B242935r8885l55123M03242N297m87593J33012N2932m96802P97316o3857
2879B132474l97910l0650n5736J12553L60780j72319J92075k35493m06210k48052
2869A251512Q02181j21573m8978j9452j70655J58140j01079J78677k73168l02900
2859A352705P31246J83256J47660K14241l14536m06530m38101N45583j49273j644
2849A864607L84476j42753q6912J66707j30862K23695m4096m04093m01253j7483
2839A412033M92489K04752O0123L86420n30587l0094k09788k48760n04059q2934
2829I49595J003913N6640n48111R8518O04431k03490k37520l85650L02644J9358
2819A660328r3080k81609N25636K41125L51510L3994Q5060n91276n01435O53796
$$ y = [2242935, 2144050, 1788927, 2192169, 2197466, 1709873, 1842885, 1895817, 1399015, 2196331, 2132474, 1734564, 1703914, 1648178, 1760731, 2121511, 1949192, 2141267, 1905774, 1499564, 1251512, 2053693, 1932120, 1883142, 1863690, 1693035, 1851175, 1750096, 1928773, 1655605, 1352705, 2083951, 2267207, 2414867, 2629108, 2314572, 1908042, 1469941, 2015524, 1866251, 1864607, 2249083, 2106330, 2019418, 2186125, 2055263, 2278958, 2234862, 1830769, 1429516, 1412033, 1904522, 2109274, 2169397, 2555817, 2025230, 1995136, 1785348, 1536588, 1032529, 949595, 1953508, 2010148, 1462037, 1560555, 2164986, 1961496, 1723976, 1338326, 1640970, 1660328, 1567248, 1285639, 1811275, 2052400, 2403910, 2437904, 2522964, 1931688, 1430253, 2084049]
2809B084049K12543p45927k40080Q63167K4412l58407l4033M68641q52704L451
2799A425112M75129K08942J48431L70498l9808j92576p11176M63120m83500L8242
2789A702414J073112K8114m17126L2097R223j39294J76811M76369L45937n53310
2779B734347J59861m2420L31170m8682j10501L77876j12736P8045Q405L60860
2769C736225K24024J89406l39948m76122L4846l4435M194L64432P79121l77645
2759D104098l37773J60629K13667K7406Q9486J87796J65832q45148k0023L46608
2749D092578K03142L01261l3465l52143l37994K1374k62349m05323L08754k15817
2739C320018K13402j12056k47624N45614q08463K60333L64668J49388n24790m7157
$$ y = [2084049, 2296592, 1550665, 1310585, 2173752, 2198164, 1839757, 1805724, 2274365, 1421661, 1425112, 1900241, 2109183, 2257614, 2628112, 2588304, 2395728, 1684552, 2147672, 1664172, 1702414, 2775526, 2803640, 2386514, 2418611, 2427834, 2288540, 2465351, 2941720, 3287657, 2734347, 2894208, 2851788, 3182958, 3134276, 3023775, 3401651, 3288915, 3366960, 3375365, 3736225, 3960249, 4149655, 3809707, 3333585, 3368431, 3333996, 3338190, 3702622, 4481743, 4104098, 3766325, 3926954, 4140621, 4168027, 4257513, 4445309, 4611141, 3765993, 3745970, 4092578, 4295720, 4596981, 4563516, 4211373, 3873379, 3894753, 3632404, 3227081, 3535835, 3320018, 3533420, 3421364, 3173740, 3719354, 2910891, 3171224, 3535892, 3685280, 3160490, 3113333]
2729C113333k31829J97320o31566n98587N66557J90896k3950Q8630J40045l98781
2719B412068J48175P6151j93021l90453J35669J50639P15021j45785j7692l00524
2709B590248k62607k60165k22438L5511O20990k93398j010631R4316M76570J10622
2699A879018O20256n85052o48091K29836L35919m33881l45419O72334k06390j33473
2689A385057j18531n22805L2808N37882k187M1726j29329N81226K93470n03372
2679A595945n15144l38311l35417M81609P7770k27303m40474K15697L37601l64
2669H51609P93956M820l87130p04266j52427K41420k42134l10091M39776Q35819
2659A371352n19224L68035M8836o04619k28747K17222l43562J3827L99303L14601
$$ y = [3113333, 2881504, 3078824, 2447258, 1848671, 2415228, 2606124, 2582174, 2670804, 2810849, 2412068, 2560243, 2636394, 2443373, 2052920, 2188589, 2339228, 3054249, 2908464, 2890772, 2590248, 2327641, 2067476, 1845038, 1880549, 2501539, 2208141, 1197510, 1291826, 1768396, 1879018, 2499274, 1914222, 1266131, 1495967, 1831886, 1398005, 1052586, 1724920, 1518530, 1385057, 1266526, 743721, 776529, 1314411, 1312224, 1353950, 1224621, 1805847, 2099317, 1595945, 1080801, 742490, 407073, 888682, 966452, 739149, 298675, 514372, 851973, 851609, 1645565, 1650385, 1263255, 558989, 406562, 647982, 405848, 95757, 535533, 1371352, 852128, 1220163, 1268999, 664380, 435633, 652855, 309293, 323120, 722423, 1037024]
2649A037024K03372n8424l05225K4576n6134m63028M96087K8988q6217k79215
2639E41804J68400L13009Q6272j10605j13905j43212m45284O63768P36035J5716
2629A711998o60576m69537K0372k30804k55601L4748J78620J26101m52911L15986
2619C18396K05045J26007j42645J85035O22942n31706m14303O21158O8107r62138
2609I5898J46853L66779K96293J33716J62231l34647K39853j76818k8388N3799
2599I55569l14534M162k00521k97966l94352O71714P53443m20807j81531K34427
2589H09604K06549K83873k40274n67721O51575o31927n22534J59710J70464k34947
2579H4372m89556M86750N595K0353O96642J45296j82265l4201l75860l41203p16664
$$ y = [1037024, 1240396, 1181972, 876747, 901323, 845189, 382161, 878248, 907236, 821019, 541804, 710204, 1023213, 1109485, 998880, 884975, 741763, 296479, 960247, 1696282, 1711998, 1051422, 581885, 602257, 371453, 115852, 150600, 329220, 455321, 2410, 318396, 523441, 649448, 506803, 691838, 1314780, 783074, 368771, 989929, 1058036, 95898, 242751, 609530, 905823, 1039539, 1201770, 867123, 1106976, 930158, 901770, 955569, 641035, 645197, 444676, 146710, -247642, 424072, 1177515, 756708, 575177, 809604, 1016153, 1300026, 1059752, 492031, 1143606, 511679, -10855, 148855, 319319, 84372, -405184, 81566, 87161, 107514, 804156, 949452, 767187, 732986, 357126, 15923, -700741]
2568g00741l918J050733M47215j0541l99160l15957R53212k14432j17352l25276
2558C63783l78005P61656J96861p27409q43311L11403K14687L36991N49640O7180
2548H53476J6047l84339l87504K58499j4350k37662n388m28948J38639N79023
2538C87493J14909J05870j65922j52611L9072o1940M98896m48967j76623L4566
2528A74743L0588j36279r9392O65884L84959j139061L1585n8406o90509L66949
2518d68939O07056L83665m6792l35825j23843r0640K82347N83011j37184k32280
2508D20576N16034l27032r89732J22953N06139J17193n11981K38814K27697m17287
2498i6626m03764L9862L31928j70383J18780j25636q670O36230k18308m74074
$$ y = [-700741, -704659, 346074, 793289, 782748, 383588, 67631, 1020843, 806411, 689059, 363783, -14222, 747434, 944295, 216886, -626425, -315022, -100335, 236656, 786296, 853476, 869523, 485184, 97680, 356179, 341829, 104167, 98779, -330169, -191530, 387493, 502402, 608272, 442350, 289739, 328811, 266871, 765767, 316800, 140177, 174743, 205331, 69052, -30340, 635544, 1020503, -118558, -86973, -145379, -835888, -468939, 138117, 521782, 474990, 139165, 15322, -75318, 207029, 790040, 652856, 420576, 936610, 609578, -380154, -257201, 248938, 366131, -145850, 92964, 320661, -96626, -500390, -460528, -128600, -298983, -180203, -305839, -314509, 321721, 103413, -370661]
2488c70661N59916P4011R5746n2159p5962O50696j70779k37030J0250l78992m88328
2477c83292K80720l88321J650247m93082o78816J56946j1797L6466R1266n858
2467B54479N5725m26149j78707M26197k07107o1763o3560L02541k79963L51112
2457A72805K39548j5297o63223j28372K81265n8467N45378J74678p125o88198
2447a47008o23128l30744K91602R15493k14886K27836L06989n68294K89998L0866
2437A78724J00442O763p96754M76975L44737Q9575J4396n73212M2525L53546M27916
2426F65633J47444N1383l80837o9415o36728k87161M16362P27332q721j38861
2416D86431m0465n8371O949m31995m41691l57742O74503N83277q4616j79527k581
$$ y = [-370661, 189255, 263266, 359012, 306853, 230891, 881587, 710808, 473778, 484028, 105036, -383292, -102572, -490893, 1159354, 666272, -12544, 144402, 132605, 169071, 260337, 254479, 310204, -115945, -294652, 131545, -75562, -137325, -200885, 101656, -178307, 172805, 412353, 397056, -266167, -394539, -113274, -171741, 373637, 548315, 541190, -147008, -770136, -1100880, -809278, 106215, -108671, 119165, 426154, -142140, 147858, 178724, 279166, 285929, -510825, -33850, 310887, 400462, 414858, -158354, -115829, 237717, 665633, 813077, 864460, 483623, 414208, -222520, -509681, -93319, 634013, 625292, 486431, 445966, 387595, 394544, -37451, -479142, -836884, -162381, 420896, 336280, 156753, 154172]
2405A54172o11377m95584J59745J50010L50615K97304l74587M43074j41897K64066
2395A95541l67898J60482J63038K80581m08495k36757j80451q2224P9917O27981
2385B31715o355N04218j02973o27436J91926j17402l37087K07750N93855K01081
2375G39292k8278m93986o37153j77947M33756J54308k81539K02913k18923J15909
2365a91648M75449m2848l50224J20656M52069O3382q6590j108128j17800R80854
2355A95172K35027n9519J27778m50542m4195l89801K60762J04652j69639L61663
2345A71358o3241m62930L17516N98056q0975m67426j18655L36169L87986o19711
2335a853l94505L96999l53274l09552J131682K5327k65516M2085l03680l47628
$$ y = [154172, -457205, -952789, -793044, -643034, -292419, 4885, -369702, 73372, -68525, 195541, -172357, -11875, 151163, 431744, 23249, -213508, -393959, -476183, -396266, 231715, 225360, 729578, 626605, -831, 191095, 73693, -263394, -55644, 538211, 739292, 711014, 217028, -420125, -598072, -164316, -10008, -291547, -88634, -307557, -191648, 283801, 240953, -109271, 11385, 463454, 526836, 440246, -667882, -785682, 195172, 430199, 370680, 498458, 47916, 3721, -386080, -125318, -20666, -190305, 171358, 108117, -354813, -37297, 560759, 479784, 12358, -106297, 229872, 617858, -1853, -396358, 641, -352633, -662185, 469497, 494824, 229308, 271393, -32287, -379915]
2325c79915P9582j05999J3648l16840l36004N86941Q40445m17938J30737L10532
2315D05189R031l08927K7889K43310j057524J21599O31700k18003M87732p32768
2305c90772j38573O92230K57783j60067J05367L95333l84521l18247n4608r6361
2295i2436l18886L39084L10032K21643o73917O72889J79587k17870k7462N57593
2285I50257M6117k99360q56192M3233N51867J5218l1836J19175n5367l65533m22075
2274c04496M02601L42743m13320M3941m97729M21008K93275j8302l8738M00489
2264F31472p98856k14862M43965N85790j45000l37071l23261N46192l46732j3758
2254B7879m9620O02732M47069o02225o23912L33314L29243J32255l20255p18333
$$ y = [-379915, -300333, -406332, -392684, -709524, -1045528, -458587, 381858, -36080, 94657, 405189, 414220, 105293, 133182, 376492, -681032, -559433, 72267, -145736, 341996, -390772, -529345, 162885, 420668, 260601, 365968, 761301, 376780, 58533, 3925, -92436, -411322, -72238, 237794, 459437, -214480, 458409, 637996, 420126, 392664, 950257, 996374, 697014, -159178, -115945, 435922, 451140, 419304, 538479, 483112, 117579, -304496, 98105, 440848, 27528, 71469, -426260, -5252, 288023, 269721, 230983, 631472, -167384, -382246, 61719, 647509, 502509, 165438, -157823, 388369, 41637, 27879, -21741, 580991, 1028060, 425835, -198077, 135237, 464480, 596735, 276480, -441853]
2244d41853Q76079m3945j71664n5065m2480J10075k76977j34366L2467O12528
2234D64799K20165o32757L23323m8298n88933O7399N17516r3121J44281j02890
2224B71484K55856J4918j9255j03945K35422o45816K48282K7837j94610k89997
2214a99824L08482K85975m07762j51279Q41447k34924m77249M13530M1746m03168
2204A6974l67344N07849M11759Q3515j03191j70758m39911j64328K69409O00765
2194F44739M96941k00961n54835r6179o44136J15904L50476K88263q0515l02275
2184A7422l13426K61449L91675M7007L50977k89227m39546q220k03879J31797
2174e3971l94445N31030L69680n0940P57156n44298m86987L55150K00900J9705
$$ y = [-441853, 434226, 390281, 218617, 163552, 121072, 231147, -45830, -180196, -147729, 464799, 684964, 52207, 375530, 327232, -261701, -194302, 323214, 230093, 374374, 271484, 527340, 542258, 523003, 419058, 654480, 8664, 256946, 284783, 90173, -199824, 108658, 394633, -13129, -164408, 677039, 442115, -35134, 378396, 420142, 16974, -350370, 157479, 569238, 652753, 549562, 378804, -61107, -225435, 43974, 644739, 1141680, 940719, 385884, 289705, -354431, -238527, 111949, 400212, 319697, 17422, -296004, -34555, 357120, 404127, 755104, 465877, 26331, 18111, -185768, -53971, -448416, 82614, 452294, 401354, 1158510, 614212, 127225, 482375, 683275, 702980]
2164G02980J20616o63414K23147l33952M95609j77085P05848J04111l78136M91264
2154A290988P5648n75781j36739L08446j71369m42180L59456q3580J20769o5452
2144F80206o78959O90732j87234o50944M65542N98677l56882O3349J75369L39168
2134A139024r7255M1737P73160k74685n08615P30550m49554l8402j02885L65066
2124A578141L44895n99684M5118p42767K40685R68049J90494k59033l61896P89633
2114B193635k72720P57005p81275j89019O52456k9442k55140K74521K29027L30208
2104B909256K60874j30220k87330N31678M13697p9061m99669J31193R6069K75166
2094C621653J49891R6440M87414M91467l99284K25709O7059K27340L59934M09279
$$ y = [702980, 823596, 160182, 383329, 49377, 544986, 367901, 1073749, 1177860, 799724, 1290988, 1366636, 790855, 654116, 962562, 791193, 349013, 708469, 624889, 745658, 680206, 1247, 691979, 504745, -146199, 319343, 918020, 561138, 624487, 799856, 1139024, 1041769, 1083506, 1856666, 1581981, 1073366, 1803916, 1354362, 1315960, 1213075, 1578141, 1923036, 1323352, 1368470, 625703, 866388, 1834437, 2024931, 1765898, 1404002, 2193635, 1920915, 2677920, 1896645, 1707626, 2360082, 2330640, 2075500, 2350021, 2579048, 2909256, 3170130, 3039910, 2752580, 3284258, 3697955, 3618894, 3119225, 3250418, 3346487, 3621653, 3771544, 3867984, 4355398, 4846865, 4447581, 4673290, 4740349, 4967689, 5327623, 5736902]
2084E736902K74593R9186K17077J22161P56020j41814N69987J83069R22458j63074
2074H576565J6791P23634O42624N83149L76615M96855N98876Q45426J404404J153066
2064A5418005J409871J589086J192035J340035K062009J558508K498087K173644
2056B9241280K109790K952301L300147L957637L511235L616651M879300M669594
2048E8237935M631820L425057J739157K43860j108027k296672l955757m724545
2040E6192828n077796m114910l734505l294178l117775l010936k798575k294184
2032B8749969j695054k328955j451854j095191j808161j258010o27678j324208
2024A7160858j639092o91536m46271j609523l31119j29403l75804l93654k46837
$$ y = [5736902, 6011495, 6110681, 6327758, 6449919, 7205939, 7064125, 7634112, 7817181, 8739639, 8576565, 8593356, 9316990, 9959614, 10542763, 10919378, 11416233, 12015109, 12860535, 14264939, 15418005, 16827876, 18416962, 19608997, 20949032, 23011041, 24569549, 27067636, 29241280, 31351070, 34303371, 37603518, 41561155, 45072390, 48689041, 53568341, 58237935, 62869755, 66294812, 68033969, 68277829, 67169802, 64873130, 60917373, 56192828, 51115032, 47000122, 43265617, 39971439, 36853664, 33842728, 31044153, 28749969, 27054915, 24725960, 23274106, 22178915, 20370754, 19112744, 18485066, 17160858, 15521766, 14830230, 14383959, 12774436, 12443317, 12313914, 11938110, 11544456, 11297619]
2015A1297619n20059n86571j071313r60453K54978M0092l72834m35122o2560l63774
2005G220003k48503Q14232p00049o53622J23676n91170l99072o4000M1776K32221
1995E775492m72356n59731N14382q26904k36612J22719M70326P0712o35291k79301
1985C943436l49350K97509l76177Q6577n13687o71549J418870m67066m44091K53874
1975C178346l01625j29949l6623J72687j39706o29531k80798J15910L40398j74410
1965B114699k50603N66654j38432o96726R3846L7734l94290n1886L40559j98229
1955A423326K33642l71463K24321L81220k26624k11600o16152K05677r709K79147
1945A311785Q10654l66019j10778j9366M1419l24464J55521M78251n13039n53135
$$ y = [11297619, 10777560, 10190989, 9119676, 8159223, 8414201, 8454293, 8081459, 7646337, 7583777, 7220003, 6971500, 7785732, 7085683, 6432061, 6555737, 5964567, 5565495, 5501495, 5543271, 5775492, 5303136, 4743405, 5257787, 4430883, 4194271, 4316990, 4787316, 4858028, 4222737, 3943436, 3594086, 3891595, 3515418, 3601995, 3088308, 2416759, 3835629, 3368563, 2924472, 3178346, 2876721, 2746772, 2710149, 2882836, 2743130, 2113599, 1832801, 1948711, 2289109, 2114699, 1864096, 2430750, 2292318, 1595592, 1689438, 1727172, 1332882, 1280996, 1621555, 1423326, 1656968, 1285505, 1509826, 1891046, 1664422, 1452822, 836670, 1042347, 1032638, 1311785, 2122439, 1756420, 1645642, 1626276, 1667695, 1343231, 1498752, 1977003, 1463964, 910829]
1935I10829q3140j7192N26670m6211k01133r26801L8591M80583k23782L60000
1925H18414J13987J20285o96726L31574l1544l58881k2411K98346m26014L99151
1915E46181j22995K49728l35635m64769N76284M88197L06868L84439l46851j155416
1905A26031N74007J44955M1588J59488j243431M55755r5529J01998M06696m24166
1895B47392J2545N2559N64568k13738j09752l74987j6347M79503j25178o0551
1885D56014M95199k18947l67226K40567M48458o30658l22398J93833J8838M45165
1875G58845j22658k60054m17542l25522O68066l10264l52774k07946N15077N3986
1865g86l12769Q42780R1572k59647j02599Q8238O1853j73982p64900j70723O53317
$$ y = [910829, 827689, 810497, 1337167, 1290956, 1089823, 163022, 201613, 682196, 458414, 818414, 932401, 1052686, 355960, 687534, 655990, 297109, 274698, 573044, 147030, 546181, 423186, 672914, 337279, -127490, 448794, 936991, 1243859, 1628298, 1281447, 126031, 700038, 844993, 886581, 1046069, -197362, 258393, 162864, 264862, 671558, 247392, 259937, 312496, 877064, 663326, 553574, 178587, 162240, 641743, 516565, 456014, 951213, 732266, 365040, 605607, 1054065, 423407, 101009, 294842, 313680, 758845, 636187, 376133, -41409, -366931, 301135, -9129, -361903, -569849, -54772, -786, -313555, 529225, 620797, 361150, 258551, 346789, 408642, 234660, -530240, -700963, -47646]
1854d7646n79032J69180J73265N8460M2544O64520j89938l82017N22908J63730
1844E95974l60279J67523J87412l49852J84050O8144l11208N6809L62827m3949
1834E57451K97662n62014k26838k29499l28445O21170P76645o3414o93596j35014
1824A4108M94083L5106j92857O6276L74500j62083L50287K2091k0109m49046k60947
1813B71409p65470M74573L42658J27701M29130n64786L17205m7777k07163P04480
1803A081960k55142K3197o04790j69851L73256K6678L49568K88693P1986p13389
1793D72166N3493l8825M2297l07437n55455K0061l5321p490R043j96352K98415
1782b45405j62327O50404J40674j28830j55131K46491J57046p01429j44575J0563
$$ y = [-47646, -626678, -457498, -284233, -225773, -183229, 481291, 291353, -90664, 432244, 595974, 235695, 403218, 590630, 240778, 424828, 492972, 181764, 238573, 601400, 557451, 855113, 293099, 66261, -163238, -491683, 129487, 906132, 842718, 149122, 14108, 508191, 543297, 350440, 416716, 791216, 629133, 979420, 1001511, 981402, 532356, 271409, -494061, -19488, 323170, 450871, 880001, 315215, 632420, 584643, 377480, 1081960, 826818, 850015, 245225, 75374, 448630, 475308, 824876, 1113569, 1185555, 472166, 525659, 486834, 529131, 221694, -333761, -313700, -349021, -356511, -347468, -543820, -245405, -407732, 242672, 383346, 254516, 99385, 345876, 502922, -198507, -343082, -332519]
1772c32519k40742K65938j51779p8996j92462M12963N8094M00638l34414o6014
1762b59293Q07057j31288n06123q62886M39981j4354K19304J85197r72962l1349
1752a126716M18711J012984j41389r98873L75607M50426r1014K73243l53892l44603
1742e25516K56954k69224M90800M13089l85466j80076L3144j25769J83246O00860
1732D92042K63744J83280n67604m27876l83431J29918K11114l7035K86216p61645
1722f11277K93465J69839K03077J50104N21945q63537m27549K26836Q8102m4814
1712b93809k91648Q6861P86685j80353l24730K26991K96433k20919L54255n5309
1702C84457p33787J04073M05312R0694P4525K74884p37719M59440j55865p42488
$$ y = [-332519, -573261, -307323, -459102, -538098, -730560, -317597, -259503, 141135, -193279, -259293, 547764, 416476, -89647, -952533, -512552, -526906, -307602, -122405, -1095367, -1126716, -708005, 304979, 163590, -835283, -459676, -9250, -100264, 172979, -180913, -525516, -268562, -537786, -46986, 366103, -19363, -199439, -166295, -292064, -108818, 492042, 755786, 939066, 371462, -56414, -439845, -309927, -98813, -135848, 150368, -611277, -317812, -147973, 55104, 205208, 727153, -136384, -563933, -337097, -248995, -293809, -585457, -498596, 288089, 107736, -216994, 9997, 306430, 85511, 439766, 384457, -349330, -245257, 160055, 250749, 325274, 600158, -137561, 321879, 166014, -576474]
1692e76474j63952O38431m90732k326J53344k69557L69146K26974p00J69729K58319
1681C12202k41186K96926n66202L20328l04753m73557J21828L63687L87159k45910
1671b9478L22871l02122n44816K24375K75070m17539L99302m2461k38626K56708
1661i6716l44758L78534O11093L03605n12182o75020R3313o9887N94154j3989
1651B68147L6769k3955k76199M9263K28304M0445O2646m1111p6044M29759k66733
1640D31291p77407k13247J54831N84348n74851k9453p8100l99063M84456L39375
1630g7820Q37471l50447k12625P4502k02369l04907n50209K66346M35759j012059
1620a096358Q71891J62557j27432J23298o714m64415K03903P66383o66429L98457
$$ y = [-576474, -740426, -101995, -592727, -595053, -441709, -711266, -342120, -115146, -115846, 53883, 312202, 71016, 367942, -198260, 122068, -182685, -656242, -534414, -170727, 216432, -29478, 293393, -8729, -553545, -329170, -54100, -471639, -72337, -114798, -353424, -96716, -441474, -62940, 548153, 851758, 339576, -335444, -242131, -312018, 282136, 268147, 304916, 280961, 4762, 54025, 282329, 322774, 385420, 344309, 268265, 698024, 431291, -346116, -559363, -404532, 179816, -395035, -424488, -502588, -901651, -417195, -77820, 759651, 409204, 196579, 271081, 68712, -236195, -786404, -520058, -84299, -1096358, -224467, -61910, -189342, -66044, -72758, -537173, -333270, 433113, -233316, 165141]
1610A65141j93198l77512J67101L07530j30991M17248l76777k05815L80717n67345
1600d13901q5865M91540j38223K22471n42012L02179M093N37646L13587n05064
1590A86451m04466K48900m14007M32864K44778o19J0255j003083N83308J01251
1580a4368l03482M28875j94021J184993o28565m2213J759r84667J30242j06913
1570e28360J18690L22531P71936p92140n41118K22672J063609p30221o84229J73948
1560f02682P84967l50609N13722N1512o11623l3038J87813R7941j03847J16175
1550E0331j79330l36582l55703K56436L39358n00278L37246P6525j44175J63290
1540b92882l18163J52585o1888k74326L85295j44039J92339J53922P5841j02814
$$ y = [165141, -28057, -405569, -238468, 69062, -61929, 355319, -21458, -227273, 153444, -413901, -499766, -8226, -146449, 76022, -465990, -163811, -159718, 377928, 691515, 186451, -218015, 30885, -383122, 49742, 294520, 293901, 304156, -698927, -115619, -14368, -317850, 111025, -82996, 1101997, 473432, 431219, 432978, -551689, -421447, -528360, -409670, -87139, 684797, -107343, -648461, -425789, 637820, -92401, -776630, -602682, 182285, -168324, 345398, 396910, -214713, -247751, -59938, 38003, -65844, 50331, -128999, -465581, -821284, -564848, -225490, -725768, -388522, -311997, -456172, -292882, -611045, -458460, -520348, -794674, -409379, -553418, -361079, -207157, -131316, -234130]
1530b34130M89852J84918m20865L53412o30521l4148r8358r096J66212j70459
1520d03183l94290r0515J24423Q8533J91429K72275J45298M3647k83569l6771
1510c42723J701P2481k05334j55479L86647K21783j11571r32426k00656J89058
1500a076519L2901J39360M56010M01977L78578k38496L11709k99772n21626L98829
1490a7049q5705J75359L47533q6359m81064M5812K15935j70600M59257R5445r08949
1479d10385K27998L27337l62131P7108j3011K81373j01827j32660k65944k87940
1469f60082N45590L4334n6252L50039L4255L79207n01130J08144k55510k2026
1459d3431J40606J96546J4072j03334n08842j00002J74258l12781M00749o6768
$$ y = [-234130, 255722, 440640, 19775, 373187, -257334, -291482, -389840, -398936, -232724, -403183, -797473, -887988, -763565, -675032, -483603, -211328, -66030, -22383, -305952, -342723, -341022, -268541, -473875, -629354, -242707, -20924, -132495, -1064921, -1265577, -1076519, -1043618, -904258, -448248, -46271, 332307, 93811, 405520, 105748, -415878, -17049, -102754, 72605, 420138, 333779, -147285, -101473, 114462, -56138, 403119, 498564, -410385, -182387, 144950, -217181, -140073, -153084, 128289, 26462, -106198, -372142, -660082, -114492, -80158, -136410, 213629, 247884, 627091, 125961, 234105, -21405, -43431, 97175, 293721, 307793, 204459, -304383, -404385, -230127, -542908, -142159, -208927]
1449b08927j5540l31227M32317J82018K7942O7411n40436J83084L56497l34231
1439a81092M70728m44885K12240k17803j17009J09160N05238j09350J32118j30351
1429B28994K76903k56331l41730L31402m60637j68521J99262O86293q99957j27006
1419e31328M22731j04053K37578j3268r9689k57506L95095j13389M92060O5869
1409D94100p74067J6424J02864L07787K02439m09797j52929O4017M89924j26264
1399B14498k14277j50995O1250J14943M18107n48741m31117J70306M06421n47257
1389e06862q13412P72733j05651L44576j67786J4482M30300k62370n961L09078
1379I127K18542j42397r6493j10581l18689M02716N36302m28372k19016N8388
$$ y = [-208927, -224467, -555694, -123377, 58641, 86583, 153994, -386442, -203358, 153139, -181092, 289636, -155249, 56991, -160812, -277821, -168661, 336577, 227227, 359345, 228994, 505897, 249566, -92164, 239238, -221399, -389920, -190658, 495635, -404322, -531328, -108597, -212650, 24928, 11660, -88029, -345535, 49560, -63829, 428231, 494100, -279967, -263543, -160679, 147108, 349547, -60250, -213179, -149162, 340762, 214498, 221, -150774, -89524, 25419, 443526, -105215, -536332, -366026, 40395, -506862, -1320274, -547541, -653192, -308616, -476402, -461920, -31620, -293990, -299951, 9127, 227669, 85272, -11221, -121802, -440491, -37775, 498527, 70155, -148861, -90473]
1369i0473K30634M12431p06156k97372k0045P9708M83335k64806M26242n04500
1359b51002m15864J33346O55720M64192o84337m40896k02692O35698K79516q14250
1349f40569J10422O73619l27704J34215J28555J31868n99633N2038L52922L15538
1339C31271m96277K3185j00436L96070m2599r99303r256Q92505l10151M48040
1329A33049q9363m09899J50644L03802m22602j78533J75124j87239o6835L18253
1319b73599L67236k17981q4903M80710K42143r8647m55067K54965j05982j19817
1309a0942j39097r20998k8858R11177N51837N3468m52530J98785o57580P34178
1299B39440O4587o82282J44302k32186K62404l43629M74900K30725n28502r2244
$$ y = [-90473, 140161, 552592, -153564, -450936, -470981, -391273, 92062, -172744, 253498, -251002, -666866, -533520, 122200, 586392, -97945, -538841, -741533, -105835, 173681, -640569, -530147, 143472, -184232, -50017, 78538, 210406, -389227, -337189, 15733, 331271, -165006, -141821, -242257, 153813, 111214, -888089, -897345, -4840, -314991, 133049, 43686, -366213, -215569, 88233, -334369, -512902, -337778, -525017, -591852, -273599, 93637, -124344, -209247, 271463, 513606, 414959, -40108, 214857, 108875, -10942, -150039, -1071037, -1099895, -188718, 363119, 416587, -35943, 162842, -494738, 239440, 304027, -378255, -233953, -466139, -203735, -547364, -72464, 158261, -370241, -462485]
1289d62485R01345o53643L1279m3869J96924k74609k67212Q93711q9367o81492
1279d49418j98146J53623n5405N0674K56708N59557K83912o44960j76044L14924
1269I5425J73700l39813L55073n0736k05959m49046L23865k84134K19403Q1229
1259h0993j87858J38586l87253j75333L65823O00219m81909k48499M71276k87734
1249b73675P4523n0950p9244J37777N42442l90472N8179N37057n29380m85775
1239d59518Q5753m88706K29968O71005m85609K30811J2379o50554Q2634j35211
1229i07048M1504K22578P4116M46645n55244M5006M49239k56194L91591m40574
1219d88381o22281L48082Q26809K7655J10761J2740Q1162r2485m47774M44040
$$ y = [-462485, 438860, -214783, -183504, -227373, -30449, -305058, -572270, 321441, 232074, -449418, -647564, -493941, -549346, -498672, -241964, 317593, 601505, -43455, -219499, 95425, 269125, -70688, 284385, 233649, 27690, -421356, -97491, -381625, -162222, -80993, -268851, -130265, -517518, -692851, -327028, 273191, -208718, -457217, 14059, -273675, -199152, -250102, -329346, -191569, 350873, -39599, 18580, 555637, 26257, -459518, -373765, -862471, -632503, 38502, -447107, -216296, -203917, -854471, -771837, -907048, -865544, -642966, -568850, -122205, -677449, -632443, -183204, -439398, -47807, -488381, -1110662, -762580, 64229, 91884, 202645, 215385, 296547, 204062, -243712, 200328]
1209B00328J40983j020688j92911O11218L30662k82025l4756k58894P60753k05040
1199D9630j76248J05201K02276L51844o99050q61536R3475R08910m39622q0788
1189e45908k37154Q8271p56483Q41091J03292L31654L97371k34310M8336N43358
1179E79518L0162m78802j82764l3586L10725J4024q63491K91367r4594j69843
1169e97284K61855J7371O67059Q23390o17267o79287k96757L32540J31521j37607
1159i4466J34862L65604k63150J96933m22069l80757p5606J74107k79826L55187
1149b89181N04128j39062n14009J30543l9668k33278q2842N4450L04620k10913
1139e15212M98505K68879k60337P4338l1726k19080j38777j13606L20266k44319
$$ y = [200328, 341311, -679377, -872288, -261070, 69592, -212433, -247189, -506083, 254670, 49630, -126618, -21417, 180859, 532703, -166347, -1027883, -934408, -25498, -465120, -545908, -783062, -694791, -1451274, -610183, -506891, -175237, 222134, -12176, 36160, 579518, 609680, 130878, -51886, -85472, 225253, 239277, -624214, -332847, -427441, -597284, -335429, -318058, 349001, 1172391, 555124, -124163, -420920, -88380, 43141, -94466, 40396, 406000, 142850, 339783, -82286, -463043, -538649, -364542, -644368, -289181, 214947, 75885, -438124, -307581, -347249, -580527, -663369, -608919, -304299, -515212, -16707, 252172, -8165, 66173, 34447, -184633, -323410, -437016, -116750, -361069]
1129c61069P32357l59749j37975j66056K6617j29994O02621j99314l64217J75187
1119a81592J43616m10080M08455N45825M7261n28223K8718o0618J62557k62031
1109a06112K18936K10628o24767q8959L47802K73019o64478l10222O99913j77517
1099b21757l03160O64036J25279P5687j68617q0241M11546K16026p19243m56229
1089d56673K56350L08044j70892J5313q4170M46801l36152J46925M00485j37216
1079C88815q73565J24972K03306P07853M93904j011253n24408L8075M75291M97588
1069E20578o7180j53914M08497j50414k03677m74643k62203K22349J22753L91349
1059C53495L23876m71353j94021J55771j48179l52274K66676M04909j65149l2738
$$ y = [-361069, 371288, 11539, -126436, -292492, -265875, -395869, 206752, 7438, -356779, -181592, -37976, -448056, -39601, 506224, 553485, 25262, 53980, -6638, 155919, -106112, 112824, 323452, -301315, -390274, -42472, 230547, -433931, -744153, -44240, -221757, -524917, 139119, 264398, 340085, 171468, 91227, 502773, 718799, -444, -456673, -200323, 107721, -63171, -47858, -132028, 314773, -21379, 125546, 526031, 388815, -484750, -359778, -156472, 551381, 1045285, 34032, -490376, -452301, 22990, 520578, 453398, 299484, 707981, 557567, 353890, -120753, -382956, -160607, -37854, 353495, 677371, 206018, 11997, 167768, 19589, -332685, -66009, 338900, 173751, 141013]
1049A41013K81094j69546m66128k67587J01565j52795L79626R9817q28817P4621
1039h07137q9477L6410O10402m4157p4247M10164L34745n73550K45081N0485L8099
1028A36818K52673n19716l33487j21925J67933n91780p1930L84422K39910j24238
1018e81320j98425J116641k20231Q5050O82947o75449o22130k80130m9270N41713
1008b00604J65980j01756P45970m63821K71599j86293n70814J31550k82987N03194
998A2018k75422p8584N38608K311J25277k14292o5597l37523j02945L6199k09285
987e69235P78020j15908k46425l84446N01207j20333n14306J55693K67508K8748
977b19477q8616K79145L07982K17178n68878R190L94975L87176m92410r53358
$$ y = [141013, 422107, 252561, -213567, -481154, -379589, -532384, -152758, -52941, -881758, -807137, -896614, -860204, -249802, -293959, -368206, 41958, 376703, -196847, 48234, 98719, 136818, 389491, -130225, -463712, -585637, -417704, -1009484, -1081414, -696992, -457082, -581320, -779745, 336896, 116665, 201715, 884662, 209213, -412917, -693047, -742317, -200604, -34624, -136380, 609590, 145769, 417368, 231075, -339739, -208189, -491176, 12018, -263404, -341988, 196620, 198931, 324208, 109916, 44319, -293204, -396149, -359950, -569235, 208785, 92877, -153548, -537994, -36787, -157120, -671426, -515733, -248225, -219477, -308093, -28948, 279034, 496212, -72666, -63476, 331499, 718675, 226265, -727093]
967g27093P52302J57383j26660L91649j49463l24946J23632l6435J19813M38841
957F19023J18771o13271q89183L76019j47495K56003j85059O98739k87390R19319
947H65476k78233n23646J07757m38364N47550j35136j1898M76065J4312o20750
937C133O8983m16469N56206k56847j108678J003526K79726r8968J60905k24661
927c3144M55558J45230K06321l83071m08554k03390J88570n2526L82084l84562
917h7484j26354L37810m54559o4144K3846K55568k61963J00216K1822L16686k030
906E9414k95478l50185J70749K52503J51849m49900o38655J70397O00039K72866
896e6401j67443m08142k77845N07388k4108M6326O65294K29978j272920P04073
$$ y = [-727093, 25209, 182592, 55932, 447581, 298118, -26828, 96804, 60369, 180182, 619023, 737794, 124523, -764660, -388641, -536136, -280133, -465192, 233547, -53843, 865476, 587243, 63597, 171354, -267010, 280540, 145404, 133506, 609571, 623883, 3133, 72116, -344353, 211853, -44994, -1153672, -150146, 129580, 30612, 191517, -33144, 422414, 567644, 773965, 390894, -17660, -221050, -32480, -85006, 297078, -87484, -213838, 123972, -330587, -394731, -370885, -115317, -377280, -277064, -255242, 61444, 59414, -236064, -586249, -415500, -162997, -11148, -461048, -1099703, -929306, -329267, -56401, -223844, -631986, -909831, -402443, -426551, -380225, 285069, 515047, -757873, -53800]
886e3800m6277m72722P31452r372J64864j14032q1897L24778j80580j40104P98517
875I20827k95162m11750j17252k0359j6423n95605L72613l60467p7551M05918
865a95211l56201J8820p28052Q32820M14461L8510K67554j15773L12486q19687
855c30273k8542o7192M39708M4821L00433k1565o1463o05782K10773P69455N12753
844A163126J88791j106658j93897m92306l16607L00423N48359J16865j3640J25181
834C19637l58440n96416M61867k79339J32773j74408k7042K08899n02077O40435
824a74111K66258J35281o552o91015K97109K25898j4224l19458m71776N82322
814a70268j76919L97989l12588Q417K59402n40820m4639L22926K38835J6517j9645
$$ y = [-53800, -100077, -572799, 158653, 149281, 314145, 200113, 118216, 442994, 262414, 122310, 920827, 625665, 213915, 96663, 76304, 59881, -535724, -163111, -523578, -601129, -195211, -551412, -532592, -1260644, -427824, -13363, 25147, 292701, 176928, 489414, -330273, -358815, -426007, 13701, 58522, 358955, 337390, 275927, -329855, -119082, 650373, 1163126, 1351917, 245259, 51362, -440944, -757551, -457128, 91231, 208096, 194456, 319637, -38803, -635219, -173352, -452691, -319918, -494326, -521368, -312469, -814546, -174111, 92147, 227428, 220876, -470139, -173030, 52868, 38644, -280814, -752590, -170268, -347187, 50802, -261786, -253369, 6033, -534787, -579426, -256500, -17665, -1148, -20793]
803b0793Q4514k19668K24034j548P0998O27737l11119k21588j11261m23995l76470
792f79159l9142j6934J81083M87098K30870K13204l38584m43130O49185j42625
782A01866J20195j35777J01234M19140L08631m17456N03013J20389o87224n6654
772C77357m19596n8499K61375J59355l50237K29045j7678O05679o68729j93998
$$ y = [-20793, 63721, -155947, 68087, 66539, 137537, 765274, 454155, 232567, 121306, -302689, -679159, -718301, -735235, -554152, -67054, 163816, 377020, 38436, -404694, 244491, 101866, 222061, 86284, 187518, 606658, 915289, 497833, 1000846, 1121235, 434011, 377357, -42239, -100738, 160637, 319992, -30245, 198800, 181122, 786801, 118072, -75926]
$$ [...]
##END NTUPLES=NMR SPECTRUM
##END=
