##TITLE=1H_CA-8877-2
 CDCl3, 8 sc, 
 11.06.2021
##JCAMPDX= 6.0         $$ Bruker NMR JCAMP-DX V2.0
##DATA TYPE= NMR SPECTRUM
##DATA CLASS= NTUPLES
##ORIGIN= UXNMR, Bruker Analytische Messtechnik GmbH
##OWNER= root
$$ XWIN-NMR		Version 3.5
$$ Fri Jun 11 11:31:20 2021 Russian Standard Time (UT+4h)  she@DPX200
##.OBSERVE FREQUENCY= 200.131506
##.OBSERVE NUCLEUS= ^1H
##.ACQUISITION MODE= SIMULTANEOUS
##.ACQUISITION SCHEME= undefined
##.AVERAGES= 8
##.DIGITISER RES= 18
##SPECTROMETER/DATA SYSTEM= spect
##.PULSE SEQUENCE= zg30
##.SOLVENT NAME= CDCl3
##.SHIFT REFERENCE= (INTERNAL, CDCl3, 0, 17.5032)
##AUDIT TRAIL= $$ (NUMBER, WHEN, WHO, WHERE, WHAT)
$$ ##TITLE= Audit trail, XWIN-NMR		Version 3.5
$$ ##JCAMPDX= 5.01
$$ ##ORIGIN= Bruker BioSpin GmbH
$$ ##OWNER= she
$$ F:/spectra/data/she/nmr/H-F/1/pdata/1/auditp.txt
$$ ##AUDIT TRAIL=  $$ (NUMBER, WHEN, WHO, WHERE, WHAT)
(   1,<2021-06-11 11:29:52.04 +0400>,<she>,<DPX200>,
      <created by zg, POWCHK disabled, PULCHK disabled
       configuration hash MD5:
       00 E9 B6 7A A2 85 ED C7 34 08 36 98 17 FE 4E 26
       data hash MD5: 16K
       B9 7B E0 0F 48 45 76 93 9D 11 F0 46 CC 00 CC 04>)
(   2,<2021-06-11 11:29:57.12 +0400>,<she>,<DPX200>,
      <Start of raw data processing
       efp BC_mod = 2 LB = 0.24 FT_mod = 6 PKNL = 1 PHC0 = -11637.82 PHC1 = 6.80101 SI = 16K 
       data hash MD5: 16K
       61 06 06 02 8F 8A BD E4 DF FE B4 5D 77 E9 DC 47>)
(   3,<2021-06-11 11:30:20.50 +0400>,<she>,<DPX200>,
      <pk PHC0 = 154.1247 PHC1 = 5.999999 
       data hash MD5: 16K
       89 DE 52 23 2A FF 6D 31 F8 BB 27 2E 9F CA BA 57>)
(   4,<2021-06-11 11:30:23.78 +0400>,<she>,<DPX200>,
      <abs ABSG = 5 
       data hash MD5: 16K
       50 8B F5 66 2D DA 5A C3 98 CD 62 3D F9 FF 2C 67>)
(   5,<2021-06-11 11:30:57.09 +0400>,<she>,<DPX200>,
      <abs ABSG = 5 
       data hash MD5: 16K
       38 FD 01 2B CA D7 A5 AF EA 1E B8 31 BD 32 36 5B>)
$$ ##END=
$$ 
$$ hash MD5
$$ 91 E4 CD 37 06 E6 C4 84 9D BA 6E 56 D3 F1 07 CC
##$RELAX= 
##$RELAX= 
##$RELAX= 
##$RELAX= 
##$RELAX= 
##$RELAX= 
$$ Bruker specific parameters
$$ --------------------------
##$DU= <F:/spectra>
##$EXPNO= 1
##$NAME= <H-F>
##$PROCNO= 1
##$TYPE= <nmr>
##$USER= <she>
##$AMP= (0..31)
100 100 100 100 100 100 100 100 100 100 100 100 100 100 100 100 100 100 
100 100 100 100 100 100 100 100 100 100 100 100 100 100 
##$AQSEQ= 0
##$AQ_mod= 1
##$AUNM= <au_zg>
##$AUTOPOS= <>
##$BF1= 200.13
##$BF2= 200.13
##$BF3= 200.13
##$BF4= 200.13
##$BF5= 200.13
##$BF6= 200.13
##$BF7= 200.13
##$BF8= 200.13
##$BYTORDA= 1
##$CFDGTYP= 0
##$CFRGTYP= 5
##$CHEMSTR= <none>
##$CNST= (0..31)
1 1 145 1 1 1 1 1 1 1 1 1 1 1 1 1 1 1 1 1 1 1 1 1 1 1 1 1 1 1 1 1 
##$CPDPRG= <>
##$CPDPRG1= <>
##$CPDPRG2= <>
##$CPDPRG3= <>
##$CPDPRG4= <mlev>
##$CPDPRG5= <mlev>
##$CPDPRG6= <mlev>
##$CPDPRG7= <mlev>
##$CPDPRG8= <mlev>
##$CPDPRGB= <>
##$CPDPRGT= <>
##$D= (0..31)
0 1.2 0 0 0 0 0 0 0 0.06 0 0.03 0 0 0 0 0.0002 0 0 0 0 0 0 0 0 0 0 0 0 
0 0 0 
##$DATE= 1623396591
##$DBL= (0..7)
$$ [...]
##$SUBNAM3= <"">
##$SUBNAM4= <"">
##$SUBNAM5= <"">
##$SUBNAM6= <"">
##$SUBNAM7= <"">
##$SUBNAM8= <"">
##$SUBNAM9= <"">
##$SW= 20.0188882624521
##$SWIBOX= (0..15)
0 0 2 0 0 0 0 0 0 0 0 0 0 0 0 0 
##$SW_h= 4006.41025641026
##$TD= 16384
##$TD0= 1
##$TE= 0
##$TE2= 300
##$TE3= 300
##$TEG= 300
##$TL= (0..7)
0 120 120 120 120 120 120 120 
##$TP= (0..7)
150 150 150 150 150 150 150 150 
##$TP07= 0
##$TPNAME0= <>
##$TPNAME1= <>
##$TPNAME2= <>
##$TPNAME3= <>
##$TPNAME4= <>
##$TPNAME5= <>
##$TPNAME6= <>
##$TPNAME7= <>
##$TPOAL= (0..7)
0.5 0.5 0.5 0.5 0.5 0.5 0.5 0.5 
##$TPOFFS= (0..7)
0 0 0 0 0 0 0 0 
##$TUNHIN= 0
##$TUNHOUT= 0
##$TUNXOUT= 0
##$USERA1= <user>
##$USERA2= <user>
##$USERA3= <user>
##$USERA4= <user>
##$USERA5= <user>
##$V9= 5
##$VALIST= <valist>
##$VCLIST= <CCCCCCCCCCCCCCC>
##$VD= 0
##$VDLIST= <DDDDDDDDDDDDDDD>
##$VPLIST= <PPPPPPPPPPPPPPP>
##$VTLIST= <TTTTTTTTTTTTTTT>
##$WBST= 1024
##$WBSW= 4
##$XGAIN= (0..3)
0 0 0 0 
##$XL= 0
##$YL= 0
##$YMAX_a= 316783
##$YMIN_a= -127155
##$ZGOPTNS= <>
##$ZL1= 120
##$ZL2= 120
##$ZL3= 120
##$ZL4= 120
##$ABSF1= 17.50322
##$ABSF2= -2.51582
##$ABSG= 5
##$ABSL= 3
##$ALPHA= 0
##$AQORDER= 0
##$ASSFAC= 0
##$ASSFACI= 0
##$ASSFACX= 0
##$ASSWID= 0
##$AUNMP= <proc_1d>
##$AZFE= 0.1
##$AZFW= 0.1
##$BCFW= 0
##$BC_mod= 2
##$BYTORDP= 0
##$COROFFS= 0
##$CY= -3
##$DATMOD= 1
##$DC= 0
##$DFILT= <>
##$DTYPP= 0
##$F1P= 0
##$F2P= 0
##$FCOR= 1
##$FTSIZE= 16384
##$FT_mod= 6
##$GAMMA= 0
##$GB= 0
##$INTBC= 1
##$INTSCL= 1.334414e-10
##$ISEN= 128
##$LB= 0.24
##$LEV0= 0
##$LPBIN= 0
##$MAXI= 10000
##$MC2= 0
##$MEAN= 0
##$ME_mod= 0
##$MI= 1.114404
##$NCOEF= 0
##$NC_proc= -8
##$NLEV= 6
##$NOISF1= 3.799351
##$NOISF2= 2.8
##$NSP= 0
##$NTH_PI= 0
##$NZP= 0
##$OFFSET= 17.50322
##$PC= 1
##$PHC0= -11483.7
##$PHC1= 12.80101
##$PH_mod= 1
##$PKNL= yes
##$PPARMOD= 0
##$PSCAL= 0
##$PSIGN= 0
##$REVERSE= no
##$SF= 200.130006286543
##$SI= 16384
##$SIGF1= 3
##$SIGF2= 2
##$SINO= 5.538805
##$SIOLD= 16384
##$SREGLST= <1H.CDCl3>
##$SSB= 0
##$STSI= 16384
##$STSR= 0
##$SW_p= 4006.41025641026
##$SYMM= 0
##$S_DEV= 0
##$TDeff= 16384
##$TDoff= 0
##$TI= <>
##$TILT= no
##$TM1= 0
##$TM2= 0
##$TOPLEV= 0
##$USERP1= <user>
##$USERP2= <user>
##$USERP3= <user>
##$USERP4= <user>
##$USERP5= <user>
##$WDW= 1
##$XDIM= 16384
##$YMAX_p= 438188117
##$YMIN_p= -1064286
$$ End of Bruker specific parameters
$$ ---------------------------------
##NTUPLES= NMR SPECTRUM
##VAR_NAME=  FREQUENCY,     SPECTRUM/REAL,   SPECTRUM/IMAG
##SYMBOL=    X,             R,               I
##VAR_TYPE=  INDEPENDENT,   DEPENDENT,       DEPENDENT
##VAR_FORM=  AFFN,          ASDF,            ASDF
##VAR_DIM=   16384,         16384,           16384
##UNITS=     HZ,            ARBITRARY UNITS, ARBITRARY UNITS
##FACTOR=    0.24454680195387, 1,            1
##FIRST=     3502.91944948176, 0,            0
##LAST=      -503.490806928496, 0,           0
##MIN=       -503.490806928496, -1064286,    0
##MAX=       3502.91944948176, 438188117,    0
$$ Real data points
##PAGE= N=1
##DATA TABLE= (X++(R..R)), XYDATA
$$ [...]
6088B4782061K00771M80822J55831k42302p4026L02889k091J49088k1184K12126
6078B5943985J29285o8950R1079Q3566K67032J18225R5283K54564K70345n6861
6068B7127553K95732j11759j24785k8205L84718K94042J92907k0107l4902K56326
6058B8231520K25534j37420L4812J79483M42633K19305l86207L93777l07911J47581
6048B9043107J28472k07118L25871j65935O63751m02296J87893M34512p8035N18594
6038C0448816j69550k41032O7773K98869L9985M93562K23041p8186j51443k21594
6028C0710241J35924K14438r6443j10838m9220O12397j88953L99546l7320M73680
6018C2063452K0482p57030l72790L52424M65604K39144L29740p6260q3363j9551
$$ y = [24782061, 24982832, 25463654, 25619485, 25377183, 25303157, 25606046, 25603955, 25753043, 25731859, 25943985, 26073270, 26004320, 26095399, 26178965, 26445997, 26564222, 26659505, 26914069, 27184414, 27127553, 27423285, 27311526, 27186741, 27158536, 27543254, 27837296, 28030203, 28010096, 27975194, 28231520, 28457054, 28319634, 28354446, 28533929, 28976562, 29195867, 28809660, 29203437, 28895526, 29043107, 29171579, 28964461, 29290332, 29124397, 29788148, 29385852, 29573745, 30008257, 29930222, 30448816, 30279266, 30038234, 30106007, 30404876, 30444861, 30938423, 31161464, 31083278, 30931835, 30710241, 30846165, 31060603, 30964160, 30853322, 30804102, 31416499, 31227546, 31627092, 31589772, 32063452, 32083934, 31326904, 30954114, 31306538, 31772142, 32011286, 32341026, 32264766, 32181403, 32161852]
6008C2161852o2014J74596r60k07648O8266m3238O59455k24970J85168k82777
5998C2427730m63430K01308K90943J57142J82411m03262M49925O30525j86502
5989C3286790n61968k32973J21971K85207K18220L3584q3252n32014L31188L25819
5979C3192572Q7437K9986j2017j85283p8467k02733j877J65419j82453o05554
5969C2207030O87204k93107n87849O42220k72089l06977K00039M34906L2094o17314
5959C2126157k0262J28441O17204o2662j78430p22258J32705k09265L5336J26334
5949C1973300j0927r047l90375L44376k58950K3358L06843l06088q0149q0108
5939C1512233r9518l31741j00937k00641m435L53478K22319Q7411k23412O7066
$$ y = [32161852, 32099838, 32274434, 32273474, 32065826, 32134092, 32090854, 32750309, 32525339, 32710507, 32427730, 31964300, 32165608, 32456551, 32613693, 32796104, 32392842, 32842767, 33473292, 33286790, 32724822, 32491849, 32613820, 32899027, 33117247, 33150831, 33067579, 32535565, 32866753, 33192572, 33280009, 33309995, 33297978, 33112695, 33034228, 32831495, 32829618, 32995037, 32812584, 32207030, 32894234, 32601127, 32013278, 32655498, 32383409, 32076432, 32276471, 32711377, 32743471, 32126157, 32105895, 32234336, 32851540, 32788878, 32610448, 31888190, 32020895, 31811630, 31846966, 31973300, 31962373, 31953326, 31562951, 31907327, 31648377, 31671735, 31978578, 31672490, 31592341, 31512233, 31412715, 31080974, 30980037, 30779396, 30774961, 31128439, 31350758, 31438169, 31214757, 31281823]
5929C1281823l7136J90923o02490p6069m30099J94977O703j76459n51074O3168
5919B9864267j83217m56423J47786K2831K27367k75157m0667R827K0840Q3561
5909B9421015k78595k63055m09149l08667j10652J40309K77899k29243m14638
5900B7825224l05526m2028K82977k37250o4790P6828P6989n40016j24340J52442
5890B7100510j97291k44667q2685j31423n31461K67801m8145m58276L10049j20835
5880B5863577n5420l20665m64308L27445K2245l7113m18710j00975L45541m09280
5870B4752337l52673N5803J06632Q2913o19064o3503m1605p33667j35622N50859
5860B3602410l4012k37806o3121j58310k87013k92484k11818J23589r1201j92766
$$ y = [31281823, 31244687, 31435610, 30833120, 30757051, 30326952, 30521929, 30528632, 30352173, 29801099, 29864267, 29681050, 29224627, 29372413, 29395244, 29622611, 29347454, 29306787, 29316614, 29337454, 29421015, 29142420, 28879365, 28470216, 28161549, 28050897, 28191206, 28469105, 28239862, 27825224, 27519698, 27477670, 27760647, 27523397, 27458607, 27535435, 27612424, 27072408, 26948068, 27100510, 26903219, 26658552, 26575867, 26444444, 25912983, 26180784, 26132639, 25674363, 25984412, 25863577, 25808157, 25487492, 25023184, 25350629, 25372874, 25335761, 24917051, 24816076, 25161617, 24752337, 24399664, 24455467, 24562099, 24645012, 24025948, 23962445, 23920840, 23187173, 23051551, 23602410, 23568398, 23330592, 23267471, 23109161, 22822148, 22529664, 22317846, 22441435, 22350234, 22157468]
5850B2157468r6156o7243j92953j70991O0098j63253l12864J56118k3948L0530
5840B1376806m211j98169l32619l5208J8874K21289J02409k94445k54871n10042
5830B0089813j16420K02998n29702L14305J6398p01777P3466l50441j05989O6295
5820A8958946M4164k08735j10358n6183J52999J06528n1564k88279m0777j41381
5810A8365360l64781J6721Q4535m69722M9481K23927l1012j23796J83016k57443
5800A7676286k3170j30752n68019J90616p8630j34562q5847l53711K75760l20111
5790A6447860N7318p644l95406J74664l51395o90195K78798L39529j53533j21312
5780A5578684j5433j82654K52107j5705j0968m72640m61369j2601P0898M0898
$$ y = [22157468, 22061312, 21994069, 21801116, 21630125, 21690223, 21526970, 21214106, 21370224, 21346276, 21376806, 21372595, 21174426, 20841807, 20806599, 20825473, 21046762, 21149171, 20854726, 20599855, 20089813, 19973393, 20176391, 19646689, 19960994, 19977392, 19275615, 19349081, 18998640, 18892651, 18958946, 19003110, 18794375, 18684017, 18627834, 18780833, 18887361, 18835797, 18547518, 18506741, 18365360, 18000579, 18017300, 18101835, 17632113, 17681594, 17905521, 17874509, 17750713, 17933729, 17676286, 17653116, 17522364, 16954345, 17144961, 17066331, 16931769, 16845922, 16492211, 16767971, 16447860, 16505178, 16497534, 16102128, 16276792, 15925397, 15235202, 15514000, 15853529, 15699996, 15578684, 15563251, 15380597, 15632704, 15616999, 15606031, 15133391, 14672022, 14659421, 14730319, 14771217]
5770A4771217M64038l90960n89818L11336k93083N9778p0612l92335M19374L4462
5760A4323397K10576l7448k96922J47231k80611K06861l75673J29338l12941n2472
5750A3661336o74067N18555j0009l41608J35302n8460k49386m9299k33009m88044
5740A2211311J91609L84746J72664K06309o12562M470J9479P227q9696j00193
5730A2395364J8290j48878N6378K10804P0579j89808Q5497m59200N9874p7297
5720A2021603q5870K99125m7151J40357j75050l61122K86809K60960o49255l03943
5710A1386463m9280k7753j8226k07433L02574J38542j01127j38491J08616j42473
5700A1251412j37270l34749O15045J25220O146J46058j20529L92167j42802m67777
$$ y = [14771217, 15235255, 14844295, 14254477, 14565813, 14272730, 14332508, 14261896, 13869561, 14288935, 14323397, 14533973, 14496525, 14199603, 14346834, 14066223, 14273084, 13897411, 14026749, 13713808, 13661336, 12987269, 13505824, 13495815, 13154207, 13289509, 13231049, 12981663, 12932364, 12699355, 12211311, 12402920, 12787666, 12960330, 13166639, 12554077, 12558547, 12578026, 12585253, 12495557, 12395364, 12413654, 12264776, 12321154, 12531958, 12602537, 12412729, 12498226, 12039026, 12098900, 12021603, 11935733, 12234858, 12187707, 12328064, 12153014, 11791892, 12078701, 12339661, 11690406, 11386463, 11337183, 11309430, 11291204, 11083771, 11386345, 11524887, 11423760, 11285269, 11393885, 11251412, 11114142, 10779393, 11394438, 11519658, 11525804, 11671862, 11551333, 11943500, 11800698, 11332921]
5690A1332921j26393K22783R7409m05590k7424j36228m1171J52351k50007J76120
5680A0994771r4387k70133P3886k78363L65725L28895l00961j33501j40294K07688
5670A0753326J25231K22639L5504j73219m56571n5555M88462j25482k51498m1994
5660A0520843Q070K96370R5891n36645k56463R0813J88585m27151J84968N0727
5650A0216008j69156J07924p6360n8757m87089J78957J45162m6168K86117n10268
5640I586370m23085J65513K0654N07527k43488n8603J47922k31112o8807L32777
5630I735668q7618k88984K42632K6980n0135P7340Q3758k18650K05686j56307
5620I570370N18828k36220m00472Q1236j12007l02255M21088j65273J19589J24237
$$ y = [11332921, 11206528, 11429311, 11526720, 11121130, 11093706, 10957478, 10916307, 11068658, 10818651, 10994771, 10900384, 10630251, 10704137, 10425774, 10791499, 11120394, 10819433, 10685932, 10545638, 10753326, 10878557, 11101196, 11136700, 10963481, 10506910, 10451355, 10939817, 10814335, 10562837, 10520843, 10528913, 10825283, 10921174, 10384529, 10128066, 10218879, 10407464, 9980313, 10165281, 10216008, 10046852, 10154776, 10078416, 10019659, 9532570, 9711527, 9856689, 9810521, 10096638, 9586370, 9163285, 9328798, 9349452, 9856979, 9613491, 9554888, 9702810, 9471698, 9402891, 9735668, 9648050, 9359066, 9601698, 9628678, 9578543, 9655883, 9739641, 9520991, 9726677, 9570370, 10089198, 9852978, 9452506, 9533742, 9421735, 9119480, 9540568, 9375295, 9494884, 9619121]
5610I619121o6244n98710K22288P09547n18299K71775k07651J96731j57044J16989
5600I588503j82588Q9840j94019k40190N371m36959J10260N037L44578n36332
5590H553501p1301L75960k19468P5711p1068K66459l42961j49409M86021J23890
5580I027335L14800J74854L4974o10479j83834L34712K1548r0938j3093m03794
5570H606085j9675K19398J46627k3621o4767l18520N2324M9124o8929J7749j39664
5559H456131R1386K14560K45003r6861n24078k40959R06085L54457l13191m01072
5549H691461K65652j15902j62406L04992J7544l52845k05342K62666q1589J22446
5539H746677k23239l85907J65210L92510K67949n1922L43787m07551J71503R1647
$$ y = [9619121, 9552877, 8954167, 9176455, 9886002, 9367703, 9639478, 9431827, 9628558, 9471514, 9588503, 9405915, 9495755, 9301736, 9061546, 9066917, 8629958, 8740218, 8745255, 9089833, 8553501, 8482200, 8858160, 8638692, 8714403, 8643335, 8909794, 8566833, 8417424, 8903445, 9027335, 9342135, 9516989, 9551963, 8941484, 8757650, 9092362, 9113910, 9022972, 9009879, 8606085, 8586410, 8805808, 8952435, 8928814, 8864047, 8545527, 8597851, 8646975, 8578046, 8595795, 8456131, 8547517, 8762077, 9007080, 8910219, 8386141, 8145182, 9051267, 9405724, 9092533, 8691461, 8957113, 8841211, 8678805, 8983797, 9001341, 8648496, 8443154, 8705820, 8624231, 8746677, 8523438, 8137531, 8302741, 8695251, 8963200, 8911278, 9255065, 8847514, 9019017, 9110664]
5529I110664k95827o6257J48124p9242J08363L02770o527k18546M83498j32809
5519I354211k63194L1992N74314r2354j57919j63303K5554M53766J06911M70782
5509A0340760J23783r5934J39251K03187N366P5058M88942M52310j29137j08072
5499A1495514n36039O00309P06220o941k52684k37590L16898J46692K00756M83105
5489A2916240K2620j12615k00206J01845J35487J63212J01646j34391l32437Q5081
5479A2746482m84983k45554M82295L64499l6806O10726L59842J45247J10504m6422
5469A4005830m71022k93065j0226j04592K76107J62031j85053j03985L01355l50569
5459A3226811K69825l04068M66192q5740N1624O50804m18890K44688L32361J99406
$$ y = [9110664, 8814837, 8748580, 8896704, 8817462, 8925825, 9228595, 9222068, 9003522, 9487020, 9354211, 9091017, 9123009, 9697323, 9604969, 9447050, 9283747, 9309301, 9763067, 9869978, 10340760, 10464543, 10368609, 10507860, 10711047, 10716413, 10791471, 11280413, 11732723, 11603586, 11495514, 10959475, 11559784, 12266004, 12259063, 12006379, 11768789, 12085687, 12232379, 12433135, 12916240, 12938860, 12826245, 12626039, 12727884, 12863371, 13026583, 13128229, 12993838, 12661401, 12746482, 12261499, 12015945, 12498240, 12862739, 12825933, 13436659, 13796501, 13941748, 14052252, 14005830, 13534808, 13241743, 13231517, 13126925, 13403032, 13565063, 13380010, 13276025, 13577380, 13226811, 13496636, 13192568, 13658760, 13573020, 13624644, 14275448, 13856558, 14101246, 14433607, 14633013]
5449A4633013J75873j82671L39953K83760L24566M21303l1930j4615j88184p292
5439A5753776J84445k83098l10444J03409N05843L60188J23710J53110J53053
5430A6743992J48752J83883J80184k94066K89827O54335L50195k7704R1272M05131
5420A8725801o1833l6627p2167K76802P99999j71177M13376K6123K35956K12058
5410B0348311N52290P67506J91899O31641N38527L22060K39536J045674O48168
5401B5285612O17953M96025L05660P39030N76043M79662J080021P93095O61786
5392C1034887N17282Q09552O41487M65319L03513P77936P10657P15259L89108
5383C6365000N3485N21996J101420Q48150P90627Q10329q3936L57168O46971P95088
$$ y = [14633013, 14808886, 14626215, 14966168, 15249928, 15574494, 15995797, 15963867, 15949252, 15761068, 15753776, 15938221, 15655123, 15344679, 15448088, 15953931, 16314119, 16437829, 16590939, 16743992, 16892744, 17076627, 17256811, 16962745, 17252572, 17906907, 18257102, 18229398, 18320670, 18725801, 18663968, 18627341, 18555174, 18831976, 19631975, 19460798, 19874174, 19900297, 20136253, 20348311, 20900601, 21668107, 21860006, 22491647, 23030174, 23352234, 23591770, 24637444, 25285612, 25903565, 26399590, 26705250, 27444280, 28020323, 28499985, 29580006, 30373101, 31034887, 31552169, 32361721, 33003208, 33468527, 33772040, 34549976, 35260633, 35975892, 36365000, 36418485, 36940481, 38041901, 38890051, 39680678, 40491007, 40407071, 40764239, 41411210, 42206298]
5373D2206298K61606P78782L51480L17508P43771J78438K83620Q78155O07570
5364D6607228J302955K76823L95299P33270M31544R57514J024492Q08084J186778
5355E3723987R18982Q02449P84035J151167J161049J741598J859786J411591J695931
5346F5250575J990374K038798J610691R13186J096916J433531K102120K247638
5338G8683829J919488K828865L043723L939958L209359L492577N003226M573900
5330A06694925M977684N234041M724643N196683M169593L461765K209157N07072
5322A37175563p02507k211457l726286n064141m908137m888211m097107l672553
5314A07905164m019141l002683k565718k386612k257649k354439k374627k052834
$$ y = [42206298, 42467904, 43246686, 43598166, 43915674, 44659445, 44837883, 45121503, 45999658, 46607228, 47910183, 48187006, 48582305, 49315575, 49747119, 50704633, 51729125, 52537209, 53723987, 54642969, 55445418, 56229453, 57380620, 58541669, 60283267, 62143053, 63554644, 65250575, 67240949, 69279747, 70890438, 71803624, 72900540, 74334071, 76436191, 78683829, 80603317, 83432182, 86475905, 90415863, 93625222, 97117799, 102121025, 106694925, 111672609, 116906650, 121631293, 126827976, 130997569, 134459334, 136668491, 137175563, 136473056, 134261599, 130535313, 125471172, 120563035, 115674824, 111577717, 107905164, 103886023, 100883340, 98317622, 95931010, 93673361, 91318922, 88944295, 86891461]
5306H6891461j967084k036532k530393k838037k756694k261472k778466k972077
5298F6750706k448343k365216k917690k749696k363351j680535j934269j487929
5290D8803677j934848j588940j371178j585431j281519r94436k93692r06493r70064
5281C7877076n68729p18171o05138l56988l33567q11510o08998r18445j084531
5272C1870999l68546j089882m57642p32169q96399m43146j98862O9420m44031
5263B7309742M40841O8146l94242r9133k58793k98957m22059m84560J37166p32123
5253B5266028j291879Q1329o86260k62109j08511m87172j57366o7664l52283l69040
5243B1565073j57093k86555o6849J56141j07666J42881N9429m37592N02135K49119
$$ y = [86891461, 84924377, 82887845, 80357452, 77519415, 74762721, 72501249, 69722783, 66750706, 64302363, 61937147, 59019457, 56269761, 53906410, 52225875, 50291606, 48803677, 46868829, 45279889, 43908711, 42323280, 41041761, 40047325, 39753633, 38847140, 37877076, 37308347, 36590176, 35985038, 35628050, 35294483, 34482973, 33873975, 32955530, 31870999, 31502453, 30412571, 29954929, 29222760, 28326361, 27883215, 27684353, 27753773, 27309742, 27750583, 27818729, 27424487, 27325354, 27066561, 26767604, 26345545, 25860985, 25998151, 25266028, 23974149, 24055478, 23369218, 23107109, 22998598, 22511426, 22354060, 22286396, 21934113, 21565073, 21407980, 21121425, 21054576, 21210717, 21103051, 21245932, 21305361, 20867769, 21369904, 21619023]
5233B1619023l0656j67205m53820j44823m14356q74140j98508J4210J90735k90348
5223A9250112Q7928J20211o2305N0122q62305l35135o10799j75589M2802m35102
5213A7069940q12510m63054m1447m96458n32117l20923p7463o87926l05088O95049
5203A4028003k07694l17342o2869k28594j78647O6879k99155k76289n6688j54731
5193A2312873j76313k5950K66100J10347k70724N48177L16644m38420J68751r5826
5183A2715659l25604P219j37777j02609n10308K34209L51565k9733R0889k27040
5173A2066470o1408j6683J32157n42972k82853j5130J37227L3080l59023j94358
5163A0896507j83770j54403k03873l45838K46392l39596k35803O64273m86325
$$ y = [21619023, 21588367, 21421162, 20967342, 20822519, 20408163, 19534023, 19335515, 19349725, 19540460, 19250112, 19338040, 19458251, 19395946, 19446068, 18583763, 18248628, 17637829, 17462240, 17505042, 17069940, 16257430, 15794376, 15752929, 15256471, 14724354, 14403431, 14325968, 13638042, 13332954, 14028003, 13820309, 13502967, 13440098, 13211504, 13032857, 13099736, 12800581, 12524292, 12467604, 12312873, 12136560, 12110610, 12376710, 12487057, 12216333, 12764510, 13081154, 12642734, 12811485, 12715659, 12390055, 12397274, 12259497, 12156888, 11646580, 11880789, 12232354, 12202621, 12293510, 12066470, 12005062, 11988379, 12120536, 11577564, 11294711, 11279581, 11416808, 11449888, 11090865, 10896507, 10712737, 10558334, 10354461, 10008623, 10255015, 9915419, 9679616, 10343889, 9857564]
5154I857564p4457l07387J82113P9894l92026J50044N16252J10383n80705q5346
5144I456329k11196j72769K15725j09886j62361l26956J85191j68329j89050R1035
5134H607733k47454J22237L05701k70875j16523j17986l03252k49205L04836P7051
5124H112263j34968j00466l78292K05770r3558J44708J38285M2752o34928J32928
5114G434494o7024j74112K2044N44224l18680m59726K15317P8394P9537q6047
5104G268421O48680n71011M1075m35964J24079M81060m85072k17404N12841J81498
5094G548203m37700K9483M37828k75050N23882j09249p2554M03287l37151N04127
5084H215106J0061J38835J31042N74778k48205j41872K8464j81177j66450K37378
$$ y = [9857564, 9783107, 9475720, 9657833, 9737727, 9345701, 9495745, 10011997, 10122380, 9541675, 9456329, 9245133, 9072364, 9288089, 9178203, 9015842, 8688886, 8874077, 8705748, 8516698, 8607733, 8360279, 8482516, 8788217, 8517342, 8400819, 8282833, 7979581, 7730376, 8035212, 8112263, 7977295, 7876829, 7498537, 7704307, 7610749, 7755457, 7893742, 7936494, 7301566, 7434494, 7367470, 7193358, 7215402, 7759626, 7440946, 6981220, 7196537, 7274931, 7354468, 7268421, 7917101, 7346090, 7387165, 6951201, 7075280, 7556340, 7071268, 6853864, 7366705, 7548203, 7110503, 7139986, 7577814, 7302764, 7826646, 7717397, 7644843, 8048130, 7710979, 8215106, 8225167, 8364002, 8495044, 9069822, 8821617, 8679745, 8708209, 8527032, 8360582, 8597960]
5074H597960n59427N21287K69377j19044J5296K96332m98887k60243j1131Q2250
5064H333770L83963N586p6113k78274q7441J61615L27130L46661O94838j35392
5054I676343m47494Q6558J22375l2067J04606l38502o11827k56542j62344J4530
5044H155636k56569R139J24792j97054P6210J40015L20155n81588n0525q0159
5034G660052L16702J5358K28668N91780J0771k08844L05289L63205J59856k63077
5024I179760J82113L80952j69307O51294J94031k75107J50122M09327L05528K43557
5014A1252270M92646L7368O89975J82183l39893K21096R5849K05515R0392n8161
5004A2869240j69270P2949M5503m0801m68895j16422k33428q54007L17146j19748
$$ y = [8597960, 8038533, 8559820, 8829197, 8710153, 8725449, 9021781, 8522894, 8262651, 8251520, 8333770, 8717733, 8723319, 8647206, 8368932, 8281491, 8443106, 8770236, 9116897, 9811735, 9676343, 9228849, 9315407, 9437782, 9405715, 9510321, 9171819, 8559992, 8303450, 8141106, 8155636, 7899067, 7908206, 8032998, 7835944, 7912154, 8052169, 8372324, 7790736, 7740211, 7660052, 7976754, 7992112, 8220780, 8812560, 8823331, 8614487, 8919776, 9282981, 9442837, 9179760, 9361873, 9742825, 9573518, 10224812, 10418843, 10143736, 10293858, 10703185, 11008713, 11252270, 11744916, 11782284, 12472259, 12654442, 12314549, 12535645, 12631494, 12837009, 12927401, 12869240, 12699970, 12772919, 12818422, 12777621, 12308726, 12192304, 11958876, 11104869, 11422015, 11302267]
4994A1302267n79706q3317j51499J16269J70466r4553l70589k66001J21782M50942
4984A0616061P4683K22213P8433q158l54545J27914l55825j54123J60222j67115
4974A0239760K41508L58030N8154m84997N7895j25806Q6913k42124K78625o7167
4964A0400791j3497M18567j6973p7547P1301N3372J96838k01927J86381m12448
4954A0604858m95976j25688m73189J6895k57642J72778n3762J68843K85293j07602
4944I734808q7118K31459J8814O93888K6491L14825m88194j89874k71802n1571
4934I931726J25005l72539J24245j88511m53771l700K0153q22791m5185P27099
4924I041731k95128o42937N61903p0104l1410K55701K14404k01734M50322j22838
$$ y = [11302267, 10722561, 10639244, 10487745, 10604014, 10774480, 10679927, 10309338, 10043337, 10165119, 10616061, 10690744, 10912957, 10991390, 10983232, 10628687, 10756601, 10400776, 10246653, 10406875, 10239760, 10481268, 10839298, 10897452, 10412455, 10470350, 10344544, 10431457, 10189333, 10467958, 10400791, 10387294, 10805861, 10788888, 10711341, 10782642, 10836014, 11032852, 10830925, 11017306, 10604858, 10108882, 9983194, 9510005, 9526900, 9269258, 9442036, 9388274, 9557117, 9842410, 9734808, 9647690, 9879149, 9897963, 10591851, 10618342, 10933167, 10444973, 10255099, 9983297, 9931726, 10056731, 9684192, 9808437, 9619926, 9166155, 9162455, 9182608, 8359817, 8314632, 9041731, 8746603, 8103666, 8665569, 8595465, 8564055, 8819756, 9034160, 8832426, 9282748, 9159910]
4914I159910M13226j01139o8087l49716K37536N2365j359O86010l18140k21708
4904I488898p3541l44581j35335p2418j00648J62732k40663L25496j03760j34033
4894H772147j26420l27444K86194R2939l99952M97255j29927j31150M66j18835
4884H415273O08238Q8798L28827k6163n65811j91825l6515k77134j60029n1237
4874H132422j89126k93008j41991j26128Q7611N1362J73794J08498m0103Q6074
4864G849405N1240J11368N35554L65242m35955p175k49779l46947j53681p60572
4854F958700m27664o61026M23112M52181l88485k87229j78681K40755l5260p57
4844F095646j9546K3261l82039n4173j4184K84478J95386m6816n02355j44085
$$ y = [9159910, 9573136, 9471997, 9403910, 9054194, 9291730, 9344095, 9342736, 10028746, 9710606, 9488898, 9415357, 9070776, 8935441, 8863023, 8762375, 8925107, 8684444, 9009940, 8906180, 8772147, 8645727, 8318283, 8604477, 8697416, 8297464, 8794719, 8664792, 8533642, 8534108, 8415273, 9023511, 9112309, 9441136, 9414973, 8849162, 8657337, 8620822, 8343688, 8183659, 8132422, 7943296, 7650288, 7508297, 7382169, 7469780, 7521142, 7694936, 7803434, 7763331, 7849405, 7900645, 8012013, 8547567, 8912809, 8476854, 8469679, 8219900, 7872953, 7719272, 6958700, 6531036, 5870010, 6293122, 6745303, 6356818, 6069589, 5890908, 6131663, 6096403, 6095646, 6076100, 6099361, 5717322, 5663149, 5648965, 5933443, 6128829, 6082013, 5579658, 5435573]
4834E435573m21549M64597k71491m30538L22243R2035o2490M2136J95935J48096
4824E514547m672n0916L09282J25343O27784K99431J39245k23369n6892l26186
4814F353597o65410K15042m50489j29945N21255K6024n91077k72790J51935J61771
4804E319913J26666J4024j6001k20538n5264o6373l43180n1658J53987l02129
4794D559447l87878L32489K1608J6574J07739K02601J69647n392R4895K80714
4784E392444K99795l17382J70318K56697j36521m3154Q0089r9038L07331m30509
4774E480070k53919j54216J43323J05276J73526l18828R1703J10901J49728K88031
4764E815595m47709M55011J40168j45688M09539k6212n40179J18118q6370K79503
$$ y = [5435573, 5014024, 5478621, 5207130, 4776592, 5098835, 5190870, 5128380, 5170516, 5366451, 5514547, 5509875, 5458959, 5768241, 5893584, 6521368, 6820799, 6960044, 6736675, 6679783, 6353597, 5688187, 5903229, 5452740, 5322795, 5844050, 5870074, 5278997, 5006207, 5158142, 5319913, 5446579, 5460603, 5444602, 5224064, 5168800, 5102427, 4759247, 4707589, 4861576, 4559447, 4171569, 4504058, 4525666, 4542240, 4649979, 4852580, 5022227, 5016835, 5111730, 5392444, 5692239, 5374857, 5545175, 5801872, 5665351, 5622197, 5702286, 5603248, 5910579, 5480070, 5226151, 5071935, 5215258, 5320534, 5494060, 5175232, 5266935, 5377836, 5527564, 5815595, 5367886, 5822897, 5963065, 5817377, 6226916, 6200704, 5660525, 5778643, 5692273, 5971776]
4754E971776K8166p55656o92583J31004j76365j09165M86165k99452K80493N0807
4744D915190l13875l90991o7940J5890R66814L44316k22684r8937j99180j75363
4734D773240l30656L52209l38502k95806l92471K44829k78537j52995M39431p4460
4724C946282J24312M7266j24707j85552M93793o07118m54566J99146K99208L4730
4714C772794j22160l29326R8825q2211R8880J02466k67481R1224j01077J86119
4704C448053K31507j62438j18885K29642m23702O08176l24207J63650O0682k76664
4694C435814j98305J23088L11932r8085j45486k305J56806L0629L02288L34436
4684D250812q79731J25904Q80720N9317j5130n75235K03740k65989J41495L57062
$$ y = [5971776, 5999942, 5244286, 4551703, 4682707, 4506342, 4397177, 4883342, 4583890, 4864383, 4915190, 4601315, 4210324, 4142384, 4158274, 5125088, 5469404, 5246720, 5147783, 4948603, 4773240, 4442584, 4794793, 4456291, 4160485, 3768014, 4012843, 3734306, 3581311, 4020742, 3946282, 4070594, 4117860, 3993153, 3807601, 4301394, 3694276, 3239710, 3438856, 3738064, 3772794, 3650634, 3321308, 3420133, 3337922, 3436802, 3539268, 3271787, 3363011, 3261934, 3448053, 3679560, 3517122, 3398237, 3627879, 3204177, 3812353, 3488146, 3651796, 3712478, 3435814, 3237509, 3360597, 3672529, 3574444, 3428958, 3426653, 3583459, 3614088, 3916376, 4250812, 3371081, 3496985, 4377705, 4437022, 4421892, 3846657, 4050397, 3784408, 3925903, 4282965]
4674D282965l66449L46314j14039j21360Q4382l53046L53968k2364L51668k59190
4664D182849K56857J13323j75568j6556L29022J25863J26521k04264K34005m03316
4654D568736n44825K16112j81l0975j24457J54489j46801m4903m09189M35145
4644D073151K82875k57332K17429O9162k88107j42893l2246M83714J51886R6600
4634D654239J78962N8272k03680K09047M53478j97860O0619K8404l81026K3547
4624D884002M27234N31264l61010M08768N656m41592O71230k54130J13290K45527
4614F230239L32019K84881j49047l21983L53194K75049k21087j3364k3072K78832
4604G025661M31296n5707J50618M28455l46413Q5165L6358L12059L89975N9683
$$ y = [4282965, 3916516, 4262830, 4148791, 4027431, 4111813, 3758767, 4112735, 4090371, 4442039, 4182849, 4439706, 4553029, 4377461, 4360905, 4689927, 4815790, 4942311, 4738047, 4972052, 4568736, 4023911, 4240023, 4239842, 4208867, 4084410, 4238899, 4092098, 4047195, 3638006, 4073151, 4356026, 4098694, 4316123, 4385285, 4097178, 3954285, 3922039, 4405753, 4557639, 4654239, 4833201, 4891473, 4687793, 4896840, 5350318, 5152458, 5213077, 5241481, 4860455, 4884002, 5311236, 5842500, 5481490, 5890258, 5895914, 5454322, 6125552, 5871422, 5984712, 6230239, 6562258, 6847139, 6698092, 6376109, 6729303, 7004352, 6783265, 6769901, 6746829, 7025661, 7456957, 7401250, 7551868, 7980323, 7633910, 7719075, 7755433, 8067492, 8457467, 8517150]
4594H517150L96855k58329k00061L92940k70620L17965J58142N38274p7829l68477
4584I146010J71022N3077M90675r1101J05256L66199N08596L67070N59822O76220
4574A2352846K0667O13473O42355J022884J270892O30871K51758L651K253P1541
4564A6883191q25837k91442p1295m40296N8146o11825J49632j71103j5342P18261
4554A5382090M14447P35926M67496M62045K44635P18754J77090l43332j96463
4545A8062688k50436k57432q22566j186480o41738m54739n97063q16017k67815
4536A2768402J23677k87301l01916m38921j93807k09781l53792n21563l14701
4527A0270297Q0431J71714r6841n63793l88843J62019J39871l2701l87366j06172
$$ y = [8517150, 8914005, 8655676, 8455615, 8848555, 8577935, 8895900, 9054042, 9592316, 9514487, 9146010, 9317032, 9370109, 9860784, 9769683, 9874939, 10241138, 10749734, 11116804, 11676626, 12352846, 12373513, 12986986, 13629341, 14652225, 15923117, 16553988, 16805746, 16809397, 16811650, 16883191, 16057354, 15765912, 15694617, 15254321, 15312467, 14700642, 14850274, 14679171, 14663829, 15382090, 15796537, 16532463, 16999959, 17462004, 17706639, 18425393, 18602483, 18259151, 18062688, 17812252, 17554820, 16732254, 15545774, 14904036, 14449297, 13852234, 13036217, 12768402, 12892079, 12604778, 12302862, 11863941, 11670134, 11460353, 11106561, 10584998, 10270297, 10350728, 10522442, 10425601, 9861808, 9472965, 9634984, 9774855, 9742154, 9354788, 9248616]
4517I248616l23208j41793m188q0126J20235P6394n59854o8130j51315M34444
4507H551075P5258p0887J51629n1412M5889L9710k34015K86163L03059M38773
4497I535242j27684k34364J08698j37347J99448r6382L04499J87306N0656L02948
4487A0093020M67903J10061K17345L35796L50466j29081L47039m00046N526J71722
4477A1569751J02773N70364K33311L20303N18860M50967O49634N21843O32727
4468A5570533J427415R69309O90143J235239J176784J919094K213341K271208
4460B7473066K286186K007187K139978L62992j640583l126847l926085k719570
4452B2856324j731782k066036j137283n14034m1092n88577n47283l60846l64953
$$ y = [9248616, 8925408, 8783615, 8779427, 8699301, 8819536, 8895930, 8336076, 8267946, 8116631, 8551075, 8626333, 8555446, 8707075, 8655663, 8701552, 8741262, 8507247, 8793410, 9096469, 9535242, 9407558, 9173194, 9281892, 9144545, 9343993, 9247611, 9552110, 9739416, 9790072, 10093020, 10560923, 10670984, 10888329, 11224125, 11574591, 11445510, 11792549, 11392503, 11398029, 11569751, 11672524, 12242888, 12476199, 12796502, 13315362, 13766329, 14415963, 14937806, 15570533, 16997948, 17967257, 18657400, 19892639, 21069423, 22988517, 25201858, 27473066, 29759252, 31766439, 33906417, 34269409, 32628826, 29501979, 25575894, 22856324, 21124542, 19058506, 17921223, 17407189, 17366097, 16777520, 16230237, 15869391, 15504438]
4443A5504438j04654p8852N4273J02703n4074N0538k06897j99970M13156O87731
4433A6168392k01953J34643K59572M9547L14450J05870L41869Q6269J38246M97934
4423A7894839M49902N21485P46959K934O94417N03094J115557P40172M70525J055697
4413B4195581J241181J125055J033522J768870J625772K305349J932623K530367
4405C7758320L428749L088412L099410K094999j88692r77337j731974k750446
4397D3821441k782255j871098j388264n95606J04186k75665Q6642k04936l2908
4388C6861537m20498o42723O825j73801l75372m56207q7318L70492L56674K65423
4378C5705032N94328N27551O71725O61258J48131Q51804J104788Q63834J345460
$$ y = [15504438, 15399784, 15320932, 15375205, 15477908, 15423834, 15474372, 15267475, 15067505, 15480661, 16168392, 15966439, 16101082, 16360654, 16410201, 16724651, 16830521, 17172390, 17258659, 17396905, 17894839, 18344741, 18866226, 19613185, 19616119, 20310536, 20813630, 21929187, 22669359, 23139884, 24195581, 25436762, 26561817, 27595339, 29364209, 30989981, 33295330, 35227953, 37758320, 41187069, 44275481, 47374891, 49469890, 49281198, 48303861, 46571887, 43821441, 41039186, 39168088, 37779824, 37184218, 37288404, 37012739, 37099381, 36894445, 36861537, 36441039, 35798316, 35805141, 35631340, 35255968, 34799761, 34712443, 35082935, 35439609, 35705032, 36299360, 36826911, 37498636, 38159894, 38308025, 39159829, 40264617, 41128451, 42473911]
4369D2473911P96972J630924J668235J569090J422895J458659J705666J369596
4361E4095948J969880J271285J385859P17136J110629M92609O46562R49577J97329
4352F2836814k74736J7001o44772j94298J84025Q7894m75377L13612J206667N56648
4342F3613478L36009J87041J81102Q1254p0425m97455n81719l62511m08865o22074
4332F1855835j052225j077128j144888r29970r25459j790496j714451j518972
4324E1702246j111235j727401j611936j573624r63393q43311r18885q42277l52218
4315D1757966o61908l16320k04938l65712J08391K95380K71754K06503K06399
4306D1297515p8883J93127N26062M58804j34390N01435L65589J89059k79899q34320
$$ y = [42473911, 43270883, 44901807, 46570042, 48139132, 49562027, 51020686, 52726352, 54095948, 56065828, 57337113, 58722972, 59440108, 60550737, 61043346, 61689908, 62639485, 62836814, 62562078, 62579079, 61934307, 61740009, 61924034, 62011928, 61536551, 61850163, 63056830, 63613478, 63949487, 64136528, 64317630, 64398884, 64328459, 63831004, 63249285, 62886774, 62477909, 61855835, 60803610, 59726482, 58581594, 57651624, 56726165, 54935669, 53221218, 51702246, 50591011, 48863610, 47251674, 45678050, 44714657, 43871346, 42952461, 42110184, 41757966, 41096058, 40779738, 40574800, 40209088, 40317479, 40612859, 40884613, 41091116, 41297515, 41218632, 41411759, 41937821, 42396625, 42262235, 42763670, 43129259, 43318318, 43038419, 42204099]
4296D2204099l39939o56046j431369j799943j033813j172644j079208p81892q31702
4287C3077543r91461n82433l87866m71794m84194n82949o27191r19888q18677
4278B7211090q41145m42361p34464o04932p24945r62780m49703n05089l05250
4269B1640421r7173o97909o35694j601n41695O9851k0302k33381J27853L2257
4259A9642627M81252J70457K67035N63023m80994k061L86054j53931k10225L23393
4249B0986630Q2688J64005k78104m68744K95376q71064k99193n70562n59386J21710
4239A8603356m56859p18124k82569n4550o06349j35484k09165M9237O075j093
4229A6194475m64633J36703n32770o0533N76469j28575k1064k65645L3982m02042
$$ y = [42204099, 41864160, 41208114, 39776745, 37976802, 36942989, 35770345, 34691137, 33909245, 33077543, 32086082, 31503649, 31115783, 30643989, 30159795, 29576846, 28949655, 28029767, 27211090, 26369945, 25927584, 25193120, 24588188, 23863243, 22900463, 22450760, 21945671, 21640421, 21543248, 20845339, 20209645, 20208044, 19666349, 19736200, 19715898, 19482517, 19610370, 19642627, 20123879, 20294336, 20561371, 21124394, 20643400, 20641339, 21027393, 20873462, 20663237, 20986630, 21069318, 21233323, 20955219, 20486475, 20781851, 19910787, 19611594, 19041032, 18481646, 18603356, 18146497, 17428373, 17145804, 17091254, 16484905, 16349421, 16140256, 16189493, 16195568, 16194475, 15729842, 15866545, 15333775, 15273242, 15849711, 15721136, 15700072, 15434427, 15468409, 15066367]
4219A5066367l0651j98295O48781J58660J58674K15857l7644O05967l2041N35957
4209A7091632P57759N50085N62993Q91422R10017J229745J081744L09877j110145
4200B2275129j617562j680961p66270J77185p20725l85683l16007j75125k13131
4191A6576850J64657K38914l42100l62738J46601k27254k15094l72084j7220M38649
4181A6029181m66038l24564M81228L83776K38737r1239j00009o9636L51826N0316
4171A6483578k38463J62401K70866k02462r3140M58263N37281L78508J98577K95024
4161A8250433j06713j90419k6933j48696m7266L39572J08958l93199o6821n71914
4151A7147002M98012P32873l30481O69011k08292K67601O38071k2587q1788M4143
$$ y = [15066367, 15035716, 14837421, 15486202, 15644862, 15803536, 16019393, 15981749, 16587716, 16555675, 17091632, 17849391, 18399476, 18962469, 19853891, 20763908, 21993653, 23075397, 23385274, 22275129, 20657567, 18976606, 18210336, 18387521, 17666796, 17281113, 16965106, 16789981, 16576850, 16741507, 16980421, 16638321, 16275583, 16422184, 16194930, 15979836, 15607752, 15590532, 16029181, 15563143, 15238579, 15719807, 16103583, 16342320, 16251081, 16151072, 16081436, 16433262, 16483578, 16245115, 16407516, 16678382, 16475920, 16382780, 16841043, 17378324, 17756832, 17955409, 18250433, 18143720, 17953301, 17926368, 17777672, 17730406, 18069978, 18178936, 17785737, 17718916, 17147002, 17645014, 18377887, 18047406, 18716417, 18508125, 18775726, 19413797, 19391210, 19309422, 19353565]
4141A9353565K88052J010559J057742J79196Q34731N01046N66925M83855O45054
4132B4920725Q19454O91364R00709l35552K83831N32738N94974L87331M8604o3712
4122B8780466M2350j153413j231736j222698o94952o63222n44451q29409j087269
4113B1395666l98416N2738K23824o29233n14864l49878R5337m1189K14258L48687
4103B0396930N22551j25304r5526M64816k33353j01179p2714r46905R6278j94058
4093A9711536m81073J53522K65405m9718n7416o53654k19565p14560K35008L89539
4083A8579024l64935j64356l04455K44494p2428j02934K02191j19294n0281K99154
4073A8146180L48928n61853N4595j05535N40536K69285j15280L47904J62394L05236
$$ y = [19353565, 19641617, 20652176, 21709918, 21889114, 22723845, 23224891, 23791816, 24275671, 24920725, 25740179, 26431543, 27332252, 26996700, 27280531, 27813269, 28408243, 28795574, 28844178, 28780466, 28822816, 27669403, 26437667, 25214969, 24520017, 23856795, 23312344, 22482935, 21395666, 20997250, 21049988, 21273812, 20644579, 20129715, 19779837, 19875174, 19833985, 20048243, 20396930, 20919481, 20794177, 20698651, 21163467, 20930114, 20828935, 20756221, 19809316, 19905594, 19711536, 19230463, 19383985, 19649390, 19599672, 19542256, 18888602, 18669037, 17954477, 18189485, 18579024, 18214089, 18049733, 17745278, 17989772, 17917344, 17814410, 18016601, 17897307, 17847026, 18146180, 18495108, 17933255, 17987850, 17882315, 18422851, 18692136, 18576856, 18924760, 19087154, 19392390]
4063A9392390J04764K18784P67879J048313m319N04272O06869K47312q6126L8797
4053B2838935P02k19207K92092P75272L77279J28551M4689M92339R62672L14452
4043B6007776M21476L21212R7154O76392P43862O87292J226082O82148m02271
4034C0461123K91286J3444J1855O765q2531K99924R23220R06739P29901R31583
4024C4493309R57832M31483J519897R95676J427226J609587J463662J973602K569589
4015D7441863J792823K599536L009904K862073L681820M618262N468151O190290
4007G7664722O547035Q247982Q856343R983727J1585886J3341416J6261911J8812761
3999A71301783K1968706K3886852K1049789J6165825M242426j8240990l3678890
$$ y = [19392390, 19497154, 19715938, 20483817, 21532130, 21527811, 22032083, 22638952, 22886264, 22800138, 22838935, 22839637, 22620430, 22912522, 23687794, 24065073, 24193624, 24238313, 24730652, 25693324, 26007776, 26429252, 26750464, 26847618, 27524010, 28267872, 28955164, 30181246, 30863394, 30461123, 30752409, 30765853, 30777708, 30784473, 30701942, 31001866, 31925086, 32831825, 33561726, 34493309, 35451141, 35882624, 37402521, 38398197, 39825423, 41435010, 42898672, 44872274, 47441863, 49234686, 51834222, 54844126, 57706199, 61388019, 66006281, 71474432, 77664722, 84211757, 92459739, 101316082, 111299809, 122885695, 136227111, 152489022, 171301783, 193270489, 217157341, 238207130, 254372955, 258615381, 240374391, 206695501]
3992B06695501l3754658k6341981k0008436j4319279j1133087q504997p005375
3985H5627688n297206m489108m010444k939341l257724k763869k531850k515372
3977E7822774k657460k139487j407848j134320j079816j437662m94968m34718
3969D7036495n94309p57716q66521p19432j74225j14701K48464p58566j98607
3960D3100882J93680k16417o5312J84162L12026j63386N16121M81986N0908J05561
3950D4500211R28500Q61077P00704N5401o4464K92606M85158M21383M52982J123604
3940D9757162Q46830O45711Q51393J416192R35636R81458J288358J433493J698687
3931E9854920K433120J805204K105146K880775L039628L002101L855964M171639
$$ y = [206695501, 172940843, 146598862, 126590426, 112271147, 101138060, 92633063, 85627688, 80330482, 75841374, 71830930, 68891589, 65633865, 62869996, 60338146, 57822774, 55165314, 53025827, 51617979, 50483659, 49403843, 47966181, 47471213, 47036495, 46442186, 45684470, 44817949, 44098517, 43924292, 43809591, 44058055, 43299489, 43100882, 43294562, 43078145, 43012833, 43196995, 43509021, 43345635, 43861756, 44343742, 44394650, 44500211, 45428711, 46289788, 46990492, 47045893, 46981429, 47274035, 47759193, 48180576, 48633558, 49757162, 50603992, 51249703, 52101096, 53517288, 54452924, 55434382, 56722740, 58156233, 59854920, 62288040, 64093244, 66198390, 69079165, 72118793, 75120894, 78976858, 83148497]
3923H3148497M980387N457926O520587O938930P721415Q724553R230606R779021
3915A42501922J0199711J1391714J2312585J4468135J5810917J7578503J8397128
3908B42660615J7863058J7406505J8661315K0728057K2065905K1674870J7077642
3901C78137967N943103j0833230k7315888l4549556l3588094k7585096k0729269
3894B29479937j5334257j1334127p797667o326111m833324l262214m131465n805726
3886A70655046p037107n331621n638405o622089p715957q586911p618876o133432
3878A15970648m774842l377937k641146j764453j670860j444024n65986j1K0148
3869I9751537J91691R17206J394707J850203J881021K378729L373733L869382
$$ y = [83148497, 88128884, 93586810, 100107397, 107046327, 114767742, 123492295, 132722901, 142501922, 152701633, 164093347, 176405932, 190874067, 206684984, 224263487, 242660615, 260523673, 277930178, 296591493, 317319550, 339385455, 361060325, 378137967, 384081070, 373247840, 345931952, 311382396, 277794302, 250209206, 229479937, 214145680, 202811553, 195013886, 188687775, 183854451, 180592237, 176460772, 170655046, 163617939, 158286318, 152647913, 146025824, 138309867, 129722956, 122104080, 115970648, 111195806, 107817869, 105176723, 103412270, 101741410, 100297386, 99731400, 99731389, 99751537, 99943228, 100860434, 102255141, 104105344, 105986365, 108365094, 111738827, 115608209]
3861A15608209M889519M860633M219964M452510L605842L246145L679507N434269
3853A49996598P618887R083400Q985590P855002N820165J410022o771959j2291498
3845A71706207j3831721j2729785j1463712j0567712r156037q152471o733822
3838I9070947n457833m685033l891877k960744k956348k172470j432862j740861
3830G3772919q59412n03742n36712L56389r6856m90178J3615o75770j565296j079627
3820F8335330j834912k458861j378599j009226j163692j000710o56701l04052
3812E8528577L71472j28280l63168k71274L16105L19089K03642J69683j13680
3803E9032166j88193l15570j62143J02291l05402K76254J29367k89688K59068
$$ y = [115608209, 120497728, 125358361, 129578325, 134030835, 137636677, 140882822, 144562329, 149996598, 157615485, 166698885, 175684475, 183539477, 189359642, 190769664, 183997705, 171706207, 157874486, 145144701, 133680989, 123113277, 113957240, 105804769, 99070947, 93613114, 88928081, 85036204, 82075460, 79119112, 76946642, 75513780, 73772919, 72913507, 72409765, 71873053, 72229442, 72132586, 71642408, 71656023, 70980253, 69414957, 68335330, 66500418, 64041557, 62662958, 61653732, 60490040, 59489330, 58832629, 58528577, 58900049, 58771769, 58408601, 58137327, 58453432, 58772521, 58976163, 59145846, 59032166, 58843973, 58528403, 58366260, 58468551, 58163149, 58439403, 58568770, 58279082, 58538150]
3794E8538150M94238N43975O10875Q52362R02113Q18004J059896J405678J255428
3785F6480719J839047J736924J304848J656250J536446J754869J285832J955549
3777G9550484J753421J469950J210689J655145K133817J747728K349573K358649
3769I4229456K366603K621878J448541P18476L82494M43840J114054J135581J253803
3760A05714726J838937K143576K504132K636196K206012K714476K173118K685450
3752A24616623L387224L391220K334167K643705L533762L632916L007719L557704
3744A50105040L435085L257838M163731L416307L651099L473275K944821L471293
3736A77918489L409727K881910K323049K039131J394549N65877j25985j5000r06844
$$ y = [58538150, 59032388, 59576363, 60187238, 61039600, 61941713, 62759717, 63819613, 65225291, 66480719, 68319766, 70056690, 71361538, 73017788, 74554234, 76309103, 77594935, 79550484, 81303905, 82773855, 83984544, 85639689, 87773506, 89521234, 91870807, 94229456, 96596059, 99217937, 100666478, 101384954, 101767448, 102211288, 103325342, 104460923, 105714726, 107553663, 109697239, 112201371, 114837567, 117043579, 119758055, 121931173, 124616623, 128003847, 131395067, 133729234, 136372939, 139906701, 143539617, 146547336, 150105040, 153540125, 156797963, 160961694, 164378001, 168029100, 171502375, 174447196, 177918489, 181328216, 184210126, 186533175, 188572306, 189966855, 190532732, 190406747, 190391747, 189484903]
3727A89484903m51829j091769m01189j175877r45779j159695j551970j350277
3719A81356518k078180k206501k126203k426505l059987l112338k830974k919761
3711A60596069l403759k730959k735878l104847k797399l631977m763604m858186
3703A32569460l949171m502479m290960m153302m115076l023389l715769l720685
3695A01098629l214612l366829l216014l192618k761549k066422k862666k060112
3687G8357807k457576k358208k301481j596898k030229j866626k275529j422645
3679F2048615j412634j324459j473270j588538j035073r85932r07996q97469p65049
3670E1658195q79150r60163j118315n55657o60362l38398j133719l33431K106
$$ y = [189484903, 189033074, 187941305, 187540116, 186364239, 185418460, 184258765, 182706795, 181356518, 179278338, 177071837, 174945634, 172519129, 169459142, 166346804, 163515830, 160596069, 157192310, 154461351, 151725473, 148620626, 145823227, 142191250, 137427646, 132569460, 128620289, 124117810, 119826850, 115673548, 111558472, 108535083, 104819314, 101098629, 97884017, 94517188, 91301174, 88108556, 85347007, 83280585, 80417919, 78357807, 75900231, 73542023, 71240542, 69643644, 67613415, 65746789, 63471260, 62048615, 60635981, 59311522, 57838252, 56249714, 55214641, 54228709, 53320713, 52423244, 51658195, 50779045, 49818882, 48700567, 48144910, 47484548, 47146150, 46012431, 45679000, 45681106]
3661D5681106n17476n99118r2804p71415m66666K98073m148L02162K66912K06232
3651D4302858p75279l10592M54309r2054j56019J47043n4959k01802Q38527K51963
3641D4403995J83602N44816L89202Q64857M70936J0817O99197N72185J061647
3632D9201254Q26946J103142J907938J500892K173140K758610K766837K453759
3624F4692518L619762L610351M079089M253088M198541M077287M926616M616693
3616I8073945M582792M992384N611400O155081O751713P324891R188967R679580
3608A52360753Q260429P016481L636914k409477r740038j4299884j5146959j3422601
3600A16255618j1427496r805234p882503o527191n683585n033636l848196l512610
$$ y = [45681106, 45163630, 44564512, 44471708, 43700293, 43233627, 43531700, 43527552, 43829714, 44096626, 44302858, 43527579, 43216987, 43671296, 43579242, 43423223, 43570266, 43515307, 43313505, 44152032, 44403995, 44587597, 45132413, 45521615, 46386472, 46857408, 46868225, 47567422, 48139607, 49201254, 50028200, 51131342, 53039280, 54540172, 56713312, 59471922, 62238759, 64692518, 68312280, 71922631, 76001720, 80254808, 84453349, 88530636, 93457252, 98073945, 102656737, 107649121, 113260521, 119415602, 126167315, 133492206, 142681173, 152360753, 160621182, 167637663, 171274577, 168865100, 159125062, 144825178, 129678219, 116255618, 104828122, 95022888, 87140385, 80613194, 74929609, 69895973, 66047777, 62535167]
3592F2535167l298279k619790k650320k373946j461833j834270j276989j440843
3584D5578897j182181m76052j219997j120735r74369n76475l45324n43503j372134
3575C7768127n11200k26570j33706j46213l48359m82096k07989q97184l22554
3566C4492256L34997K03730m07505L04763k83185K7858k3033N19864Q4265l40247
3556C4913763L13395k12121M74457K42231j29286J74333L51765N22168K33218
3547C6883923M34653O91736j07772K02775O24474N83198L5739J24915R28971P46558
3537D1149170Q96563L39018J84184Q21012O80381K64473J55403N34688K98515
3528D5323407M64084P32309N05139R6257M71630N16580K37335o9046L11638K55244
$$ y = [62535167, 59236888, 56617098, 53966778, 51592832, 50130999, 48296729, 47019740, 45578897, 44396716, 43920664, 42700667, 41579932, 40605563, 40029088, 39683764, 39140261, 37768127, 37256927, 37030357, 36896651, 36750438, 36402079, 35919983, 35711994, 34814810, 34492256, 34827253, 35030983, 34623478, 34928241, 34645056, 34672914, 34649881, 35169745, 35254010, 34913763, 35227158, 35015037, 35489494, 35731725, 35602439, 35776772, 36128537, 36650705, 36883923, 37318576, 38010312, 37902540, 38105315, 38729789, 39312987, 39348726, 39473641, 40402612, 41149170, 42045733, 42384751, 42568935, 43389947, 44070328, 44334801, 44490204, 45024892, 45323407, 45787491, 46519800, 47024939, 47121196, 47592826, 48109406, 48346741, 48277695, 48589333, 48844577]
3518D8844577K69232M64000P4454N5480L84944M6647M03940J72818J148023J011245
3508E2875360J593J42438R58497O34554Q25609L53098P85673O75445N39887J084242
3498E8876396J018804J158963J086812Q89363Q90173R61613P422R83000J323607
3489F7196153P15931N93963Q67778J062951J703836N19776M84142M53030K23971
3480G3821531P95685N91705O96689Q77354R05782P97921M74031P08973M77916
3471H0147587O85318O81750R51277M32734R30287R15630J088041J478107J570885
3462H8881616J418596J683167J681055K552030K395138J716721K051938K542201
3454A04922462K825118K705278K689889J922012J818658J788695J581312K199924
$$ y = [48844577, 49113809, 49577809, 49652263, 49707743, 50092687, 50139334, 50543274, 50716092, 51864115, 52875360, 52876953, 53019391, 53977888, 54612442, 55438051, 55791149, 56576822, 57252267, 57792154, 58876396, 59895200, 61054163, 62140975, 63030338, 63920511, 64882124, 64889546, 65872546, 67196153, 67912084, 68506047, 69373825, 70436776, 72140612, 72660388, 73144530, 73597560, 73821531, 74617216, 75208921, 75905610, 76782964, 77688746, 78486667, 78960698, 79669671, 80147587, 80832905, 81514655, 82465932, 82898666, 83828953, 84744583, 85832624, 87310731, 88881616, 90300212, 91983379, 93664434, 96216464, 98611602, 100328323, 102380261, 104922462, 107747580, 110452858, 113142747, 115064759, 116883417, 118672112, 120253424, 122453348]
3446A22453348K379543K044469K837491K188098K536978K630897L083826J969050
3438A42123700K513164J848434K045540K072623J957902K230424J871890K499574
3430A59163251K390773K282835K423371K345007K292439K417089K046590K622493
3422A77983848K440150K070219J967308K350143K365948K363985K152022K020548
3414A95714171K291451K182962K581864K783276L427312L439229L377543L644164
3406B19441972M355472M655892M489174N252614N900693O492196N753051P177282
3398B63518346P267825P916140Q743498Q805264R298793R859320R455397R637861
3390C34502444J0930129R799748R934593J0114673Q991445Q918968Q552818P503508
$$ y = [122453348, 124832891, 126877360, 129714851, 131902949, 134439927, 137070824, 140154650, 142123700, 144636864, 146485298, 148530838, 150603461, 152561363, 154791787, 156663677, 159163251, 161554024, 163836859, 166260230, 168605237, 170897676, 173314765, 175361355, 177983848, 180423998, 182494217, 184461525, 186811668, 189177616, 191541601, 193693623, 195714171, 198005622, 200188584, 202770448, 205553724, 208981036, 212420265, 215797808, 219441972, 223797444, 228453336, 232942510, 238195124, 244095817, 250588013, 256341064, 263518346, 270786171, 278702311, 287445809, 296251073, 305549866, 315409186, 324864583, 334502444, 345432573, 355232321, 365166914, 375281587, 384273032, 393192000, 401744818, 409248326]
3382D09248326O556664O164832N238360M028388L239543K717039R94965q3645
3374D38104472k33001j743925k762127l305261l800541m903250n450224n673330
3366D10232813o047847o838812o237460o687750o318701o709798o954222o971341
3358C57466882o745410o522681o393636o751948o785568p167589o433296n775012
3350C04891742m980808m897564m666813m431470m218760l586644m015514l982397
3342B70111772l663217l550209l998569l984755m363491m153386l531791l091983
3334B39774371l241959k382498k609165k238312k460524j454924j743412j711479
3326B21932098k122102j602223j868456j287996j512295j274830j383933j736867
$$ y = [409248326, 415804990, 421969822, 427208182, 431236570, 434476113, 437193152, 438188117, 438104472, 437871471, 436127546, 433365419, 430060158, 426259617, 421356367, 415906143, 410232813, 404184966, 397346154, 391108694, 384420944, 378102243, 371392445, 364438223, 357466882, 350721472, 344198791, 337805155, 331053207, 324267639, 317100050, 310666754, 304891742, 299910934, 295013370, 290346557, 285915087, 281696327, 278109683, 274094169, 270111772, 266448555, 262898346, 258899777, 254915022, 250551531, 246398145, 242866354, 239774371, 236532412, 234149914, 231540749, 229302437, 226841913, 225386989, 223643577, 221932098, 219809996, 218207773, 216339317, 215051321, 213539026, 212264196, 210880263, 209143396]
3318B09143396j238234j303053j16492m23545q10403m79954l17974p92617p24769
3309B02936355j028965r34912r77134r02870j852766k015310j380995j889242
3301A91954161j822918k255389k662497k819255k767996k954591k951394k797229
3293A70922892l387935l481639l053066k984839m064128l443374k985970l919328
3285A43602613l452780k556279l038925k656889k981585k436847k654458k029700
3277A21795150k707655j791578j687587j555556j965161k010141m20579j395918
3269A08260975q55282r87637p26461q29703q60142j358768j048890j064420j172583
3260I9357089r15831o58057p51090q91653j391236j187086j241669j583686j088867
$$ y = [209143396, 207905162, 206602109, 206485617, 206062072, 205251669, 204771715, 204453741, 203661124, 202936355, 201907390, 200972478, 199995344, 199092474, 197239708, 195224398, 193843403, 191954161, 190131243, 187875854, 185213357, 182394102, 179626106, 176671515, 173720121, 170922892, 167534957, 164053318, 161000252, 158015413, 153951285, 150507911, 147521941, 143602613, 140149833, 137593554, 134554629, 131897740, 128916155, 126479308, 123824850, 121795150, 119087495, 117295917, 115608330, 114052774, 112087613, 110077472, 109656893, 108260975, 107405693, 106418056, 105691595, 104861892, 104001750, 102642982, 101594092, 100529672, 99357089, 98441258, 97783201, 97032111, 96140458, 94749222, 93562136, 92320467, 90736781, 89647914]
3251H9647914j331288j905808j749160j696360j431112j710331k107785k000175
3243G5715895j922602j717562j869728j801192j846350j890397j758293j592293
3235F1317478j905305j144976j780530j416431j661464j173682j043579j467400
3227D9724111j873992j422026j484716k036462p21024p40056r26692q44011q65631
3218C8809501r61717n02443j259059n97227j292100o19151n98041r72483m98584
3209C1508696q87158n30636o44215m70842l42503m19802n30332l56919p83475
3200B6542814n99076K15886o43476q65281j20482l79202n53120m61382k06442
3191B2930239m40532k71989k14931n71697k66437o16484o7404r8952K94153n70283
$$ y = [89647914, 88316626, 86410818, 84661658, 82965298, 81534186, 79823855, 77716070, 75715895, 73793293, 72075731, 70206003, 68404811, 66558461, 64668064, 62909771, 61317478, 59412173, 58267197, 56486667, 55070236, 53408772, 52235090, 51191511, 49724111, 47850119, 46428093, 44943377, 42906915, 42185891, 41445835, 40519143, 39675132, 38809501, 37847784, 37345341, 36086282, 35489055, 34196955, 33577804, 32979763, 32007280, 31508696, 30621538, 30090902, 29446687, 28975845, 28633342, 28213540, 27683208, 27326289, 26542814, 25943738, 26159624, 25516148, 24650867, 24530385, 24151183, 23598063, 23136681, 22930239, 22489707, 22217718, 22002787, 21431090, 21164653, 20548169, 20480765, 20381813, 20675966, 20105683]
3181B0105683j00570l77737k0153k8551p53122j51814j43952n49596N3619L56474
3171A8390281n09957j61120j29891K31875o13219J05942m49760l19769J48371
3162A6692753r8648r4981o13759j39981l78814P9180K69926R9068j24269k67086
3152A5423389j45024J00830O4939k12767J7685k50103k0338o87484M51975L36986
3142A5080088j56844o53369j48547L48769j0216L98108r7262j48186p5064K85647
3132A4823124O7113l05907J00491L89691J57398M43078l23773l03864K1862m2284
3122A5026929M36371j44765N04372J77129j42058k15502J87401m2507j41750l21599
3112A5324021M76286P45429j60069m58594o9247O25530j27668J68829O1580R925
$$ y = [20105683, 20005113, 19627376, 19607223, 19578672, 18825550, 18673736, 18529784, 17980188, 18033807, 18390281, 17880324, 17719204, 17589313, 17821188, 17207969, 17313911, 16864151, 16544382, 16692753, 16594105, 16499124, 15885365, 15745384, 15366570, 15445750, 15715676, 15814744, 15690475, 15423389, 15278365, 15379195, 15444134, 15231367, 15249052, 14998949, 14978611, 14291127, 14743102, 15080088, 14923244, 14269875, 14121328, 14470097, 14459881, 14857989, 14760727, 14612541, 14537477, 14823124, 14890237, 14584330, 14684821, 15074512, 15231910, 15674988, 15351215, 15047351, 15069213, 15026929, 15463300, 15318535, 15822907, 16000036, 15857978, 15642476, 15829877, 15787370, 15645620, 15324021, 15800307, 16545736, 16385667, 15927073, 15857826, 16483356, 16355688, 16524517, 16586097, 16596022]
3102A6596022m4055K74683L41905n0769L43216L91363O02639O03731j03042L87310
3092A9343003O54963K69464O10324O12500M72624K89697O35941j87410J95367
3083B2896473n02415r79980m9862j082360p94796o82553n70149J88265n88763
3074A7833860j369131l42490K56029o1196p78041n53438J50445k49501m68398
3065A4418139K020j073276l56467j02055m03215M91056j97594o00255l77730k15871
3055A1584752l75039l83080O25609m76035m60760L33435J56538n23232m74887
3046A0007301J44696m8530M1064l44112p4446j21594k0681l44686J05727j74040
3036I170699l73040k49507j29010m7807J71090j71030l41038J30772k35734J8438
$$ y = [16596022, 16551967, 16826650, 17168555, 17117786, 17461002, 17852365, 18455004, 19058735, 18955693, 19343003, 19997966, 20267430, 20877754, 21490254, 21962878, 22252575, 22888516, 22701106, 22896473, 22394058, 21414078, 21364216, 20281856, 19487060, 18804507, 18234358, 18422623, 17833860, 16464729, 16122239, 16378268, 16317072, 15539031, 14985593, 15136038, 14886537, 14418139, 14420159, 13346883, 12990416, 12888361, 12485146, 12976202, 12778608, 12178353, 11800623, 11584752, 11209713, 10826633, 11452242, 10976207, 10515447, 10848882, 11005420, 10482188, 10007301, 10151997, 10103467, 10144531, 9800419, 9725973, 9604379, 9583698, 9239012, 9344739, 9170699, 8797659, 8548152, 8419142, 8371335, 8542425, 8371395, 8030357, 8161129, 7925395, 7943833]
3026G943833n8169J74431R658J74330k36739j28781n98172n13239j45993L83838
3016G004997M4260K68936j88165m63473K86776k60988j37908K60502Q1637m57546
3006F439028n04619j67838N10230O6643k69543n70547J54752K01387m39321M3829
2996E464001k19695J94437j42220Q748K22713J57082p2903k6858j81249j91124
2986E212932l67054J53599k5914L0785q4724J49941j2284o49714L59851o056L10505
2975E071867k6800j58954L3804k60607k99441K38002J54730j98975j57211j26674
2965D269741j66028J52980j55586m1085l5633k03023M90775L050m07087l17652
2955C590452M8421k35884J70272N47949J33179M04334k10580n6080j79586j63190
$$ y = [7943833, 7885664, 8060095, 8069753, 8244083, 8007344, 7878563, 7280391, 6767152, 6621159, 7004997, 7049257, 7318193, 7130028, 6666555, 6953331, 6692343, 6554435, 6814937, 6896574, 6439028, 5934409, 5766571, 6276801, 6343444, 6073901, 5503354, 5658106, 5859493, 5420172, 5464001, 5244306, 5438743, 5296523, 5305271, 5527984, 5685066, 5612163, 5585305, 5404056, 5212932, 4845878, 4999477, 4973563, 5004348, 4919624, 5069565, 5057281, 4407567, 4767418, 4761362, 5071867, 5045067, 4886113, 4919917, 4659310, 4359869, 4597871, 4752601, 4553626, 4396415, 4269741, 4103713, 4256693, 4101107, 4060022, 4024389, 3821366, 4312141, 4315191, 3908104, 3590452, 3638873, 3402989, 3573261, 4121210, 4254389, 4658723, 4448143, 4392063, 4212477, 4049287]
2945D049287J98245J46038n25848l3369J41048K12873j81109j02964O162j46968
2935C763395M39652r8582J29956k57554l78333l1120M89479L5894l41570M8375
2925C799592M89815N1918n10171L40177P9128Q2965n6462l8647j17568K05703
2915D326450l02676M21629q8240k03580l49276o4631m81824J26232J94457J83288
2905C761829L20210k00298o88967J91771M39236K68612k90772k54288j46642J6554
2895C417245M47979k76974o5501K46269K99212L5396j17021j4345L10394n17524
2885C765130K31115k20783J8653J20852k49381O2853M60467J26407J73286J68548
2875D657147k08886J67342J56454r494N9806j6495P17903J04972K051k12033K79247
$$ y = [4049287, 4247532, 4393570, 3867722, 3834353, 3975401, 4188274, 4007165, 3904201, 3910363, 3763395, 4203047, 4104465, 4234421, 3976867, 3598534, 3567414, 4056893, 4092787, 3751217, 3799592, 4289407, 4341325, 3831154, 4171331, 4250459, 4333424, 4276962, 4238315, 4120747, 4326450, 4023774, 4445403, 4357163, 4153583, 3804307, 3739676, 3257852, 3384084, 3578541, 3761829, 4082039, 3881741, 3192774, 3384545, 3823781, 4092393, 3801621, 3547333, 3400691, 3417245, 3865224, 3588250, 3522749, 3769018, 4068230, 4103626, 3986605, 3972260, 4282654, 3765130, 3996245, 3775462, 3794115, 3914967, 3665586, 3728439, 4188906, 4315313, 4488599, 4657147, 4448261, 4615603, 4772057, 4762563, 4822369, 4805874, 5523777, 5628749, 5630800, 5418767, 5698014]
2864E698014l91745R7522J8974J11256O5606k41534m26589r3017k87322k45573
2854D305592O68184l75239m18488P34942K90738j95051L13511M88811M78522K19859
2844F511381K49381p621J20453N93682N6034p3332J017001J44275m23415l67590
2834G820249P8550k26040l9795k10708j88647j91103j12590j96671l31477n14709
2824E887059J37588j61501o13365R6405m32203N76242l60098Q3458J25609J75657
2814E514851k91098N0782K4547O0435k84311L47480P44421L86722L04668M95618
2804G354115j03207k69220l59859l68171J80164k52896K09342k52314j52363k7591
2794E958000l81922l83060J08071k16677q6794k18596R1238j07984K51888l0320
$$ y = [5698014, 5306269, 5403791, 5422765, 5534021, 5599627, 5358093, 4931504, 4838487, 4551165, 4305592, 4973776, 4598537, 4180049, 4914991, 5205729, 5010678, 5324189, 5813000, 6291522, 6511381, 6760762, 6753141, 6873594, 7467276, 7523310, 7449978, 8466979, 8611254, 8187839, 7820249, 7898799, 7672759, 7632964, 7422256, 7233609, 7042506, 6929916, 6733245, 6401768, 5887059, 6024647, 5863146, 5249781, 5346186, 4913983, 5490225, 5130127, 5213585, 5339194, 5514851, 5223753, 5274535, 5299082, 5359517, 5075206, 5422686, 6167107, 6553829, 6858497, 7354115, 7250908, 6981688, 6621829, 6253658, 6433822, 6180926, 6390268, 6137954, 5985591, 5958000, 5576078, 5193018, 5301089, 5084412, 4997618, 4779022, 4870260, 4762276, 5014164, 4983844]
2784D983844J50259m00124k40958L04107K139o9839l85697K51654k96214k05076
2774D094095L13299J34539K79819k04805k33269r9494m16241j14567N37099m04292
2764C886183r056O5054l91417K66393N21003n7274K71136m35299k13897q0623
2754C822203Q3184N6751J93478l919J55633Q1640k18994K82610p14901J96759
2744C934444k3650l56315J61751N13178K51593K3711k05418Q1212M92529O4818
2734D937853j50851L1397J92403m34588m9311K33260J15409J99799J08864K10630
2724E394865k72896J62435k44140M95067Q19169o3077M8358j85080j20137J80777
2714F215341k01597m83524l27620l78890j26289j63019j58940j5263p5256n35838
$$ y = [4983844, 5134103, 4733979, 4493021, 4797128, 4799267, 4729428, 4343731, 4595385, 4299171, 4094095, 4407394, 4541933, 4821752, 4616947, 4383678, 4284184, 3867943, 3753376, 4290475, 3886183, 3877127, 3942181, 3550764, 3817157, 4338160, 4280886, 4552022, 4116723, 3902826, 3822203, 3905387, 3962138, 4155616, 4151697, 4307330, 4388970, 4169976, 4452586, 3737685, 3934444, 3910794, 3554479, 3716230, 4229408, 4481001, 4504712, 4299294, 4380506, 4873035, 4937853, 4787002, 4818399, 5010802, 4576214, 4526903, 4760163, 4875572, 5075371, 5184235, 5394865, 5121969, 5284404, 5040264, 5535331, 6354500, 6291423, 6339781, 6154701, 6034564, 6215341, 6013744, 5530220, 5202600, 4823710, 4697421, 4534402, 4375462, 4360199, 4284943, 3749105]
2704C749105j15626j07375k33074j04864k96565k88087N3669Q0722M14807k28770
2694B923942m05159k03793K33164o4626q0178R47l10142J80140K47723o09199
2684A912819O0808N7764K36156P6409k67759J88275k26443p7857J05414M04896
2674B470482p9685j55267J0928k02476n32043j4324L37092M3735j55159P3883
2664A797166O6398k54809P4052N2834n15241j48941K16776M41538K17050o26362
2654A320461M5106J54512k00815Q3310k55793M17952l9426j35055R7902k6065
2644A462089J57378j62709q2516l89579q4797L39451P1243k7776j76247L75120
2634A481657l32182L36948N8001m49993r2480L07264J26415k60340j77425Q5457
$$ y = [3749105, 3633479, 3526104, 3293030, 3188166, 2891601, 2603514, 2657183, 2737905, 3152712, 2923942, 2518783, 2314990, 2548154, 2483528, 2403350, 2404297, 2094155, 2274295, 2522018, 1912819, 1973627, 2031391, 2267547, 2343956, 2076197, 2264472, 2038029, 1960172, 2065586, 2470482, 2390797, 2235530, 2246458, 2043982, 1511939, 1497615, 1834707, 1878442, 1723283, 1797166, 1863564, 1608755, 1682807, 1735641, 1220400, 1071459, 1288235, 1729773, 1946823, 1320461, 1365567, 1520079, 1319264, 1402574, 1146781, 1564733, 1525307, 1390252, 1488154, 1462089, 1619467, 1456758, 1374242, 984663, 899866, 1239317, 1310560, 1282784, 1106537, 1481657, 1149475, 1486423, 1544424, 1094431, 1001951, 1309215, 1435630, 1175290, 997865, 1083322]
2624A083322L48282J70495m41400j50793J13676o4784k3429j44546l96360L83051
2614H77514q7058K81632n7560K8514J20533n2120K28293n18156j30943N84049
2604A274698o0343n45744R3932L77437r3366m976M8709J39663j94536n3467J70261
2593A152268L73281j9849k77790j91409j0807N5228l57913Q9056j04749M41873
2583A149189l85879j26293M895m4600M82169J73276L38123j09637j49349l4066
2573A297828O3291J48337j67567j31943k4737L39830j23193K61754l02825P013
2563A367788j51471J040N2541m515J35723J87361K15116j02073l06380K16612
2553A611742J23347J4846r5230J91781k46573J15731J61992k26822O1632J76355
$$ y = [1083322, 1431604, 1602099, 1160699, 1009906, 1123582, 1058798, 1035369, 890823, 494463, 877514, 790456, 1072088, 1014528, 1043042, 1163575, 1111455, 1339748, 821592, 690649, 1274698, 1214355, 668611, 762543, 1139980, 1046614, 1041638, 1090347, 1230010, 1035474, 982007, 1152268, 1525549, 1505700, 1227910, 1036501, 1025694, 1080922, 723009, 812065, 707316, 1149189, 763310, 637017, 641912, 597312, 1079481, 1252757, 1590880, 1481243, 1331894, 1297828, 1361119, 1509456, 1341889, 1209946, 1185209, 1525039, 1401846, 1663600, 1360775, 1367788, 1216317, 1217357, 1269898, 1265383, 1401106, 1588467, 1803583, 1701510, 1395130, 1611742, 1735089, 1749935, 1654705, 1846486, 1599913, 1715644, 1877636, 1650814, 1712446, 1888801]
2543A888801Q8752k75764K47826l91922K09740N97433n83797K35201N87946K9367
2533B633583n12802j50184r3147J54486J84449m2034J90953k39125k98600L42089
2523B169668m1413K26258n6501J58657P0337M90230m34597j91206K82239j06606
2513B567066J14793m11899j73567k0504M34767j29960M16661n4815m75465N21017
2503B788094J73704l50835j31319j38026J87155M81894L71898l98317N32517k3643
2493C493122l77427k67483n9258r6077p4306J66768l79365L1793M7152J74246
2483B659165M0747l54241m6548k42133L12611j14600J65737K94697j376k36013
2473B478046m05941O8062L44987J31631k93972q9334M96035l69857l98952Q33872
$$ y = [1888801, 1977553, 1701789, 1949615, 1557693, 1767433, 2364866, 1781069, 2016270, 2604216, 2633583, 2120781, 1970597, 1877450, 2031936, 2216385, 2174351, 2365304, 2126179, 1827579, 2169668, 2128255, 2354513, 2298012, 2456669, 2527006, 3017236, 2582639, 2391433, 2673672, 2567066, 2681859, 2269960, 2096393, 2075889, 2510656, 2380696, 2797357, 2742542, 2267077, 2788094, 2961798, 2610963, 2479644, 2341618, 2528773, 3010667, 3382565, 2984248, 3516765, 3493122, 3115695, 2848212, 2788954, 2692877, 2618571, 2785339, 2405974, 2437767, 2484919, 2659165, 2699912, 2345671, 2299123, 2056990, 2369601, 2255001, 2420738, 2715435, 2714059, 2478046, 2072105, 2140167, 2485154, 2616785, 2322813, 2233479, 2729514, 2359657, 1960705, 2794577]
2463B794577P1503j59933k95529L9281q5485n61498J76370M9033K00735m71169
2453A757885l32187N7862O32001m7153k60582n1708J29368n15265Q0219K01916
2443A652356k52202j02024k56299J22758k9375Q9120j92067j25728K57294J60204
2433A324037Q5349L76797k97380m36506J20399n221M7083l57687j56209L00986
2423A001648L55884l9388J0891M05833j82026o62727o0498J81449k40170J13645
2413H84541j16150j81246j71569J07088R1045L37484J56325p5722L18959k58089
2403A092666q98836k48739j32059O34466M5103n9749L04722L2686j59127l18543
2393B92590P0083J59366J72291j56645O03823K97440k88489r4656J95268K84224
$$ y = [2794577, 2866080, 2706147, 2410618, 2449899, 2364414, 1802916, 1979286, 2028319, 2229054, 1757885, 1425698, 1483560, 2115561, 2068408, 1807826, 1756118, 1885486, 1370221, 1450440, 1652356, 1400154, 1298130, 1041831, 1164589, 1135214, 1224334, 1032267, 906539, 1163833, 1324037, 1409386, 1786183, 1488803, 1052297, 1172696, 1167475, 1214558, 856871, 700662, 1001648, 1357532, 1318144, 1329035, 1734868, 1552842, 890115, 829617, 1011066, 770896, 884541, 768391, 587145, 415576, 522664, 613709, 951193, 1107518, 1031796, 1350755, 1092666, 193830, -54909, -186968, 447498, 492601, 432852, 737574, 770260, 611133, 292590, 362673, 522039, 694330, 537685, 1141508, 1438948, 1150459, 1055803, 1251071, 1535295]
2383A535295p40836j33689J89476n1683l76129L29317J25157j14245k45012j92801
2373C24850L18255K30145o50497k81544J44367L80717J03280J41585K76660l50602
2363F37216k36061K43741L00800M51384k54240k74961k09379J05246m9394k7748
2353F86604J73570m65505L861J7160j85591j02383m0414K52643k56966L49686
2343D32665K49577j30422J00725m53051K67982m69482j07717N62138P4798j06015
2333D21198k7064J80871J69943n56197L19681L75732j23847k34786k14549L2026
2323C43008K18781J36974O8606k40493K18601K55004J54344l41039m8516N26503
2313A291773m43725l63046L54430l06336l66754M80603K93355k01065M38929k10591
$$ y = [1535295, 794459, 660770, 850246, 798563, 422434, 751751, 876908, 762663, 517651, 324850, 643105, 873250, 222753, -58791, 85576, 466293, 569573, 711158, 987818, 637216, 401155, 644896, 945696, 1397080, 1142840, 867879, 658500, 763746, 714352, 686604, 860174, 394669, 398530, 415690, 230099, 127716, 87302, 339945, 82979, 432665, 682242, 551820, 652545, 199494, 467476, -2006, -109723, 452415, 527213, 421198, 394134, 575005, 744948, 188751, 508432, 884164, 760317, 525531, 310982, 343008, 561789, 698763, 767369, 526876, 745477, 1000481, 1154825, 813786, 765270, 1291773, 848048, 485002, 839432, 533096, 166342, 646945, 940300, 739235, 1178164, 967573]
2303I67573k39574M9573m6767J52282K35470n4888M99201j65911l76243J45613
2293A166329K03549p09995k45250K07310L93182r9707j7107k9343m12353j77739
2283B78876j7166j726J71140J16573k6671M97274q27202K14354K08576m41626
2273A72402R7621L27482O0808r102M2720j55440K98528m7709m2998j61092l25713
2262B57507M43356J52537k95208j41166j31622j78715K88889N5515k01423o52498
2252d02828N58138M99692O3901n44336L36243j77155j22747M68318J13161k13579
2242E78808n751l28434j81854N76789q3218p3658l4520j23641K03057K28401l15335
2231D40644j30134J50595L44512k3407k57184j7007o2392J40297j73044L2477
$$ y = [967573, 727999, 777572, 730805, 883087, 1118557, 1063669, 1562870, 1396959, 1020716, 1166329, 1369878, 659883, 414633, 621943, 1015125, 915418, 898311, 868968, 456615, 278876, 261710, 259984, 431124, 547697, 521026, 1018300, 191098, 405452, 614028, 172402, 270023, 597505, 658313, 649211, 691931, 536491, 835019, 787310, 744312, 583220, 257507, 700863, 853400, 558192, 417026, 285404, 106689, 395578, 451093, 249670, -402828, 155310, 655002, 718903, 174567, 510810, 333655, 210908, 679226, 792387, 578808, 573057, 244623, 62769, 639558, 556340, 482682, 448162, 324521, 527578, 755979, 440644, 310510, 461105, 805617, 782210, 525026, 508019, 445627, 585924, 412880, 445357]
2221D45357M6515L39021J4968n113N00094k54726m6115j4887K06241L19990m6830
2210A504515k47392n13427L27517k32943L74205o99709M30744n9702n81406K99287
2200F01689j67967M13234J80921r2860k68013M27820K81368R5643l87225m95882
2190E88728k95227r965J74550N59635K24237K76989l41144K38073K1233K65957
2180A703066k76890l82172o8560J58035N01735J11502n52933l92742J14775O57874
2170A573690l26367M66592J36441n34215j06509K30268l27960M95437M99146k32626
2160A873897n0358M73315J55725o402R8561m8694k84601j83492K99461j89747
2150B137665J67514L5707l16843K07617k43638n00425n0296K17290M75797L48555
$$ y = [445357, 491872, 830893, 845861, 840748, 1340842, 1086116, 1040001, 1025114, 1231355, 1551345, 1504515, 1257123, 743696, 1071213, 838270, 1212475, 512766, 943510, 883808, 302402, 601689, 433722, 846956, 1027877, 935017, 667004, 1094824, 1376192, 1471835, 1084610, 588728, 293501, 283536, 458086, 1017721, 1241958, 1518947, 1177803, 1415876, 1437109, 1703066, 1426176, 1044004, 975444, 1133479, 1635214, 1746716, 1193783, 801041, 915816, 1573690, 1247323, 1713915, 1850356, 1316141, 1209632, 1439900, 1111940, 1607377, 2106523, 1873897, 1823539, 2296854, 2452579, 2446177, 2544738, 2496044, 2211443, 2027951, 2327412, 2137665, 2305179, 2340886, 2024043, 2231660, 1988022, 1487597, 1437301, 1654591, 2130388, 2478943]
2140B478943J79526k80662J42359k38121M40920m7071R694P96003o4633o31933
2130B785025K26172k262j2208L79157J70714k71405N8656K97678J08004l4140
2120C705391k4096N5504J96972L84847l3060j27371l08103m6300L70539K60458
2110D434781L47841k96758p4237K67063J74168k65888L93270L27262J4504M07104
2100E729110l4883j44668J89316K71995m7138j3114K33352M28363L88102R79303
2090G979738J88381k70011J83944L91168J162129L23183L61677N13931J084769
2081A1918909J236736P56064Q67287J550604J212072J382719J274462J351112
2073B1549965L080551K926601K672621K897944K918933L423244M719574N821071
$$ y = [2478943, 2658469, 2377807, 2520166, 2282045, 2722965, 2675894, 2685588, 3481591, 3416958, 2785025, 3011197, 3008935, 2996727, 3375884, 3546598, 3275193, 3333849, 3631527, 3739531, 3705391, 3681295, 3736799, 3933771, 4318618, 4285558, 4158187, 3850084, 3803784, 4174323, 4434781, 4782622, 4485864, 4411627, 4678690, 4852858, 4586970, 4980240, 5307502, 5322006, 5729110, 5694227, 5549559, 5738875, 6010870, 5963732, 5950618, 6183970, 6612333, 7000435, 7979738, 8168119, 7898108, 8082052, 8473220, 9635349, 9958532, 10320209, 10834140, 11918909, 13155645, 13911709, 14778996, 16329600, 17541672, 18924391, 20198853, 21549965, 24630516, 27557117, 30229738, 33127682, 36046615, 39469859, 44189433, 50010504]
2065E0010504N848713P108085J0365875J2491061J3704991J4739028J3046826
2058A27315083J0808439j477361k1294537k4843874j8662425j2815768q481020
2051E0548537o877192m840091l910598k488754k562197k018326j906881j960670
2043B3983828j811187k339571j456367j209264j388078j589190q07418p12959
2035A2669794m77058k16374k92619m81261j148020n38793K9364m57486l89974
2026H697573k66600j86373l92386k37594o20531k09413l98778n57634l88343K43465
2016E683386m3611k03114l19259n82262J18040K69704K02385n14262k91419j797
2006D317791J76903j46618m61424r5526L40024p7508k06104k40033L00739j27292
$$ y = [50010504, 55859217, 62967302, 73333177, 85824238, 99529229, 114268257, 127315083, 138123522, 136646161, 115351624, 90507750, 71845325, 59029557, 50548537, 43671345, 38831254, 34920656, 32431902, 29869705, 27851379, 25944498, 23983828, 22172641, 19833070, 18376703, 17167439, 15779361, 14190171, 13382753, 12669794, 12192736, 11976362, 11683743, 11202482, 10054462, 9515669, 9545033, 9087547, 8697573, 8430973, 8244600, 7852214, 7614620, 6994089, 6784676, 6385898, 5828264, 5439921, 5683386, 5639775, 5436661, 5117402, 4535140, 4653180, 4922884, 5125269, 4611007, 4319588, 4317791, 4494694, 4348076, 3886652, 3791126, 4131150, 4053642, 3847538, 3607505, 3908244, 3780952]
1996C780952m94130M49976o41117k41574K44659j75030J78395N46681l14601l81653
1986B952558K23173l0427n53245P8934P3122j70370m206k35863k84040M10335
1976B459971j0758l53493k41753j61396L05025O122Q736r0438k43708N2939l56909
1965A374338M91131j39160j98405N6498K74644J17287k13629J27904k58087q43246
1955G89275K8699L81268K12680L27174m96083L54912k79006j81253k55525J78803
1945A060944p9752k31719K81434k97027K0855j4563m62866N02952J69580N66783
1935A516621k48729k65510K41581l72865j94729M86555Q2667K73205k27762l72328
1925I18706j69820K55580k14005j08861J17021j4424r8593m16083J0273L88093
$$ y = [3780952, 3286822, 3736798, 3095681, 2854107, 3098766, 2923736, 3102131, 3648812, 3334211, 2952558, 3175731, 3145304, 2592059, 2670993, 2744115, 2573745, 2569539, 2333676, 2049636, 2459971, 2449213, 2095720, 1853967, 1692571, 1997596, 2003718, 2012454, 1922016, 1678308, 1731247, 1374338, 1865469, 1726309, 1527904, 1584402, 1859046, 1976333, 1762704, 1890608, 1632521, 789275, 817974, 1199242, 1411922, 1739096, 1243013, 1597925, 1318919, 1137666, 882141, 1060944, 981192, 749473, 1030907, 733880, 754735, 740172, 277306, 780258, 949838, 1516621, 1267892, 1002382, 1243963, 871098, 676369, 1162924, 1245591, 1518796, 1291034, 918706, 748886, 1004466, 790461, 681600, 798621, 784197, 685604, 269521, 279794, 667887]
1915F67887R8190j7719J13645j71548m170j24536j62735L35331J94245j96991
1905G31599m9333m29420m17222M19050L93984P1286p6976J44573j99394l98115
1895A90032P5922L01557O30609j08306j63514N2989J7359k3531M3554l60872l8193
1884F17606j73387M7998K8124J79762L63588l10777q3604n9930l792K10586k46839
1873E69335K15738l31819k05837l22845J10362J64409N26410O13j85674J57838
1863F98530K90576j14869m1777J10674p43102l06933J13484P9222J26587M13464
1853F25856L77593k60410K28369j78427o18771K55396L60131p52157K45768J75789
1843D59137j799K28684j75080J99502j88835L90571m15697m06099L0590l067J27377
$$ y = [667887, 766077, 748358, 862003, 690455, 686285, 561749, 399014, 734345, 928590, 731599, 682266, 252846, -164376, 254674, 648658, 719944, 642968, 787541, 588147, 190032, 265954, 567511, 1198120, 1089814, 926300, 979289, 996648, 973117, 1016671, 655799, 617606, 444219, 492217, 520341, 700103, 1063691, 752914, 669310, 609380, 605588, 816174, 569335, 785073, 453254, 247417, -75428, 34934, 199343, 725753, 726366, 540692, 698530, 989106, 874237, 832460, 943134, 200032, -106901, 6583, 85805, 212392, 625856, 1003449, 743039, 971408, 792981, 174210, 429606, 789737, 37580, 283348, 459137, 457338, 686022, 510942, 710444, 521609, 912180, 496483, 90384, 120974, 117907, 245284]
1832B45284M89409k08569Q5614j13501l27254K38121L504R5636J6651k52224M84399
1821G57070O22050l94338N6090j0698k32856j70436K58586k0220j98035J71487
1811H38700q7044k47415l72796N6657l57784O9126k386M4155J17280N5627R0858
1800B04978m2055L78648k46777k24023K23874k75000n4074M63730K8493k1574
1790D36220j55385o3591P4863j43646n61267j85890P89055K60386J05046l36651
1780B19140l17217N8037L75288j00091J62096J72111P8674o3687J88560l60843
1770D12068n8462P651m0008j33036l10288M00259L42774n08028m36552L30708
1760G086k89107j63515L55806K38304j00480n3183n36646M43196O59886n3055
$$ y = [245284, 734693, 526124, 611738, 498237, 170983, 409104, 412608, 508244, 524895, 272671, 757070, 1379120, 984782, 1040872, 1030174, 797318, 626882, 885468, 865248, 667213, 838700, 751656, 504241, 131445, 188102, -169682, -100556, -102942, -58787, 58493, 114120, 204978, 162923, 541571, 294794, 70771, 294645, 19645, -34429, 429301, 457794, 436220, 280835, 217244, 292107, 148461, -412806, -598696, 190359, 450745, 555791, 219140, -98077, -40040, 335248, 235157, 397253, 569364, 648038, 584351, 772911, 412068, 353606, 361257, 321249, 188213, -122075, 278184, 620958, 112930, -323622, 7086, -282021, -445536, -89730, 148574, 48094, -5089, -541735, -98539, 561347, 508292]
1750E08292L18711l86186k70957L28489p7684n1013j14165m17962J9452L50948
1740B07925j65744J01697q0276k99619K82762m11741J78335N52031K40841m99582
1730A06629j91951k32530J73613M10242O3128m312m87242J77016l73127K98756
1720e9778K32627K40533N3298m60405p66025K63207l3547K64393J24947K72121
1710A31371Q709L10693J26087j81292J85254J54529n11196j63719K79847k06719
1700A33564k24228J88444L76537l02476K83698j6513M00293m57237K79001j31070
1690E30013k98348j4163o5986j14831k30202N26410J00039j16431n56474J54527
1680h5446M10757K24310j4254m26903k0033O5604M81696n7615r8299m20072j89037
$$ y = [508292, 827003, 440817, 169860, 498349, 420665, 369652, 255487, -162475, -143023, 207925, 42181, 143878, 63602, -236017, 46745, -364996, -186661, 365370, 606211, 106629, -85322, -317852, -144239, 266003, 329131, 324819, -162423, 14593, -358534, -59778, 172849, 413382, 466680, 6275, -759750, -496543, -530090, -265697, -140750, 131371, 140080, 450773, 576860, 395568, 580822, 735351, 224155, 60436, 340283, 133564, -90664, 97780, 474317, 171841, 455539, 439026, 839319, 382082, 661083, 530013, 231665, 217502, 151516, 36685, -193517, 332893, 432932, 316501, -239973, -85446, 325311, 549621, 535367, 108464, 88431, 154035, 635731, 578116, 479817, 59745, -129292]
1669a29292K37016L66230l91493j28666M18340Q1014M0668m64888m1861K54042
1659B41110j04843J60943N06093o05175J7880k25259J31066Q8152k21047J46292
1649A35212m58523K20486M25206J28247j15863k35814K13867K81344k28809l06763
1639E8590L1789k00077l6412O0582K84955k31501j66570l203N4158M99120K65480
1628F16911m03234l63065O3551P6529K21697k55657L51580J31941j97386J39855
1618C82722J9817M65397l49399r4542j696K11336m95020j85790M3169l13414j8958
1607c36378N31871j08740j64324N463k68222O15008J77265m33352l6220L23439
1597C05810j61452j60593L42668j00283l94940K52456l6654M6269k07634r7941
$$ y = [-129292, 107724, 473954, 82461, -46205, 372135, 453149, 493817, 28929, -12932, 241110, 136267, 297210, 803303, 198128, 216008, -9251, 121815, 209967, -11080, 135212, -323311, -102825, 322381, 450628, 334765, 98951, 312818, 594162, 365353, 58590, 90379, -109698, -146110, -85528, 199427, -32074, -198644, -201847, -147689, 351431, 616911, 213677, -149388, -85837, -9308, 212389, -43268, 308312, 440253, 242867, 382722, 402539, 867936, 518537, 423995, 422299, 633635, 138615, -47175, -4006, -317420, -336378, 195493, 86753, -77571, -72108, -340330, 274678, 451943, 18591, -17629, 305810, 144358, -16235, 326433, 226150, -168790, 83666, 47012, 93281, -114353, -212294]
1587b12294M1156K32695m13896K46566J24216k38856l1398J16486N52164J66442
1577E83281p04637j279J46671k38412N9278L12363K04143m11886J8836J05768
1567G4126M1575M51993n95677J37056J11938k29017l03844k7588J08264M25080
1557A93906M91177p0570j88351n87862j33174M38739o2067k7036k14487m48727
1547f08452L12777K00952K11995L93197j45610j97056l46918m2629M47523O9859
1537B95638l53359M82477j79431l78623n8878L23963J17657l63234j9143O0563
1527g2370M55799j66987l04180R2924r803M6814J96949m55662N9905J11119N39856
1516D94364o30774m18271J90136m5147N61716K22793l68333N1700q6463N06731
$$ y = [-212294, -171138, 61557, -352339, -105773, 18443, -220413, -251811, -135325, 416839, 583281, -121356, -122635, 24036, -214376, -155098, 157265, 361408, -50478, -31642, 74126, 115701, 567694, -27983, 109073, 221011, -8006, -311850, -339438, -231174, 193906, 685083, 614513, 426162, -161700, -294874, 143865, 81798, 54762, -159725, -608452, -295675, -94723, 117272, 510469, 364859, 167803, -179115, -221744, 225779, 295638, -57721, 424756, 245325, -133298, -192176, 131787, 249444, -113790, -132933, -72370, 383429, 216442, -87738, 5186, -4617, 42197, 239146, -216516, -156611, -45492, 494364, -136410, -554681, -364545, -409692, 152024, 374817, 6484, 58184, -28279, 478452]
1506D78452J95820l69018j08926r4434j7456l17290J4545R233j84452q5345N5316
1495d23555j79265N21145N47182l20865n01751L4253M29087K9007L81557R0414
1485F07209j83806q5274J26519J21519l01731n8661j23442n12775M1317K21564
1475a47561J57822O9568K04000p27242m4435L53075k4853J72912K54313J90598
1465D58197L29017l10090m27464J44816M6234k02426J70223P978l88018N9952
1455a11581R598J79662J66588k88792o18631M03201L72866r7025m1509M2463K09125
1444B25965L88899l12330j95430O2125l48010R0895m97716J39830K93819J0176
1434a41777k48251N48262P44917n14920l80410k09856k97437K77136J64824k84862
$$ y = [478452, 674272, 305254, 196328, 101894, 84438, -232852, -218307, -209074, -393526, -478871, -423555, -602820, -81675, 465507, 144642, -357109, -322856, 106231, 135238, 516795, 607209, 423403, 338129, 464648, 586167, 284436, 225775, 102333, -410442, -369125, -147561, 10261, 79829, 283829, -443413, -487848, -134773, -159626, 13286, 267599, 458197, 787214, 477124, 49660, 194476, 240710, 38284, 208507, 216485, -171533, -111581, -101983, 77679, 244267, -44525, -663156, -259955, 112911, 15886, -25623, 16840, 225965, 614864, 302534, 107104, 169229, -178781, -87886, -585602, -445772, -151953, -141777, -390028, 158234, 903151, 388231, 7821, -202035, -499472, -222336, -57512, -342374]
1424c42374K93976J23946R1354J94668L86120l75772m55448j93083m50709N65171
1414a62151L76812l98093n00326K71730J13013m38206P57018j93558j24414K2003
1404b76172j4560k14611j60008N41641j79834k8779J25319L74506k1046n01424
1394c54968J51684N62916k17957k25995K05054j12402L47598K10647q3068o23634
1384a40125P2218J03761M25860M4758o77235j48484K36041o3525L45764K28262
1374D27295K92793r7720j79492Q8051m98860K45515J6700k53941M90113L624k48916
1363B85162l00083J05411q2383l7340L29289l63291K3501l1778Q685r5756l05237
1352d63820M84385J11897k94884O78919k11277l21624k07588L43985L32167n18443
$$ y = [-342374, -48398, 75548, 166902, 361570, 747690, 371918, -83530, -276613, -727322, -162151, 214661, -183432, -683758, -412028, -299015, -737221, 19797, -173761, -298175, -276172, -290732, -505343, -665351, -123710, -303544, -332323, -207004, 167502, 146456, -354968, -203284, 359632, 141675, -84320, 120734, 8332, 355930, 566577, 483509, -140125, -67907, 35854, 461714, 506472, -170763, -319247, -83206, -146731, 199033, 427295, 720088, 622368, 442876, 530927, 32067, 277582, 294282, 40341, 530454, 534078, 285162, -14921, 90490, 8107, -29233, 300056, -63235, -39734, -71512, -62827, -158583, -463820, 20565, 132462, -162422, 516497, 305220, -16404, -223992, 119993, 452160, -66283]
1342f6283J17987L62796K51523m60869l44917j21848o0786M79002k3375o8636
1332F4594J25732n14836k29361R8599R1315l39815M03878J67312m24769O36802
1322G9451j72360j53569P6643j68882J05409N12317J24154k73783R5239J3327
1312B37946J018J81506k70273l64141M32993l13751Q9394k12460j79573n9716
1302d57057L13438O88679n07240r8817k64911m3249J85232M32945l11347N07382
1292D45055r7193n20517J20002k55993k90585J7755N88261K57034r2505M15173
1282E86487j82303l24771k58858q9340K84085M10811K94472m64665l06458m67121
1272e17661J28113L40854L07J69755K19115j33992k71153r0237j38136j35069
$$ y = [-66283, 51704, 414500, 666023, 205154, -139763, -261611, -322397, 156605, 133230, 64594, 190326, -324510, -553871, -455272, -363957, -703772, -299894, -132582, -557351, 79451, -92909, -246478, -169835, -338717, -233308, 279009, 403163, 129380, 224619, 237946, 238964, 420470, 150197, -213944, 219049, -94702, -5308, -217768, -397341, -457057, -143619, 545060, 37820, -60997, -325908, -369157, -183925, 249020, -62327, 445055, 347862, -172655, -52653, -308646, -599231, -581476, 6785, 263819, 171314, 586487, 404184, 79413, -179445, -268785, 15300, 426111, 720583, 255918, -50540, -517661, -389548, -48694, -48387, 121368, 340483, 206491, -64662, -154899, -293035, -428104]
1262d28104O41696M1199L85429k95982n90389q824J76720L96601m6170k4090J28256
1251C76342n76694k21073M0101q8223R4540J93359k56075L07602K1772j97294
1241c05643N64345j50872K61368O3532j14034j34045p5267k9479J42177l27182
1231a05100M34699M4502l55234k39293K64702q4724J0606j73699r5313K20362
1221g8492j77717l10449L89056N18556o75480M0221J28830N47N08274n33574k1024
1210b11252K70425J29896m89129N9611K83451J05029m38732j26154l41390L48400
1200d09845P4117k55107K5572M8834Q34614J87941l51890r5618k48720l73357
1190e63459m8345L53125P2247Q1330K82542k00753R4485k04194Q4651K79403L11117
$$ y = [-428104, 213592, 254791, 640220, 344238, -246151, -254975, -78255, 318346, 272176, 248086, 376342, -200352, -421425, -381324, -469547, -375007, -181648, -437723, -130121, -108349, -305643, 258702, 107830, 369198, 432730, 318696, 184651, 109384, 79905, 222082, -105100, 329599, 374101, 18867, -220426, 44276, -40448, -29842, -203541, -298854, -78492, -256209, -566658, -177602, 340954, -334526, -294305, -165475, -164928, 343346, -190228, -211252, 59173, 189069, -300060, -240449, 43002, 148031, -290701, -416855, -758245, -409845, -335728, -590835, -565263, -516429, 318185, 506126, 154236, 58618, -190102, -563459, -611804, -258679, -186432, -105102, 177440, -23313, 71172, -133022, -48371, 231032, 542149]
1179E42149r30037K60364J06963P0455J61491m55452l45074Q27024m03751M12741
1169B46873K61248m88240l25432J42610J7150l8518M34921J28410l8204l07607
1159C3211K89133j67867k02698j06272n1813J61191k1653k0146Q888j5037J0139
1148h2924L2311j68065p5915K41580J21166o1028J39083J19538p6030l25247J810
1137a33721J45088j0067r9586L81489l01408k34183j58920n7758J13329K54603
1127a01134k93637L53960l3406K3326J75644J02735m9176l10004k64240M65653
1117F9721N12504m90115J5320M9136k9452j28214j66568N9188j42247L04003j77083
1106a23807m91203O95265j62786l27264j35516N13498j19648L04508K54298j66738
$$ y = [542149, -387888, -127524, -20561, 49894, 211385, -244067, -589141, 237883, -165868, 246873, 508121, 19881, -305551, -162941, -145791, -184309, 250612, 379022, 340818, 33211, 322344, 154477, -48221, -154493, -206306, -45115, -66768, -86914, -78026, -93063, -82924, -50613, -218678, -294593, -53013, 68153, 7125, 146208, 265746, 189716, -135531, -133721, 11367, 1300, -98286, 283203, -18205, -252388, -411308, -469066, -355737, -101134, -394771, -40811, -74217, -50891, 124753, 227488, 178312, -131692, -395932, 69721, 582225, 92110, 107430, 156566, 127114, -1100, -167668, -108480, -250727, 53276, -123807, -615010, 80255, -82531, -409795, -545311, -31813, -151461, 153047, 407345, 240607]
1096B40607K7692k9520j59896N9381K86346K9207j75310O4380n10661N87608l65534
1085E4300k43695M25793J95180J73525l17519J04460q4351q3323j41805J29562
1075B12127L18760k05046J278k1266j56267l7483J71435l11607j85888M64159
1065B50202M6901k17481Q7810l33411L50580l6081q7738k10571L02648M073J94581
1054C51513r0404j37919L32614l59756l9634K47537k96638k73220j97844K89109
1044a74642J03017M07683j01035l52077K09369k31645N2905k43199K55685J13459
1034C9520j82425K22719n13090M7436J37643L59857q2504L37081K77444m11459
1024B32222j52546l06669M00719J14291J60320o9905l23891j17288N18668k38457
$$ y = [240607, 268299, 238779, 78883, 138264, 424610, 453817, 278507, 342887, -167774, 419834, 54300, -189395, 236398, 431578, 605103, 287584, 392044, 307693, 224370, 82565, 212127, 530887, 325841, 327119, 305853, 149586, 112103, 283538, -28069, -213957, 250202, 297103, 79622, 167432, -165979, 184601, 148520, 60782, -149789, 152859, 156932, 351513, 261109, 123190, 455804, 96048, 56414, 303951, 7313, -265907, -463751, -174642, -71625, 336058, 235023, -117054, 92315, -139330, -86425, -329624, -73939, 39520, -142905, 79814, -433276, -385840, -248197, 111660, 29156, 366237, 643681, 232222, 79676, -226993, 173726, 288017, 448337, 378432, 54541, -62747, 455921, 217464]
1014B17464K4647k43350j98937R2086K60083k03554j1809j88571j58651L23539
1004h7053L53131m52884J10974P3154K47844k31770j07801j66754K44448J43304
994A26593Q0000J46845J76353k05756j26907l54608J38363N15960j04417k5194
984C67232n6438n2302j8755n5712m15641k66069J82195J94202L09077L36838n32237
973g610l17656M22888o5405J78012k56013j96954L31459N52611k09497p49989
963c18154M92060l21827K69041J65290j23952j22751K9255k73290J26363L21587
953B43622j38565q2426j35179K3695K36437L01947m37202K17429M27192m61229
943A95721J15926j53927j99709l32333k33011J37358M54994M76995n77532M0262
$$ y = [217464, 242111, -1239, -200176, -108090, 151993, -51561, -63370, -251941, -410592, -87053, 266078, -186806, -75832, -2678, 245166, 13396, -94405, -261159, -16711, 126593, 206593, 353438, 529791, 324035, 197128, -157480, -19117, 496843, 392426, 367232, 310794, 258492, 239737, 184025, -231616, -497685, -315490, -121288, 187789, 524627, -7610, -325266, 97622, 32217, 210229, -45784, -242738, 88721, 641332, 431835, -318154, 173906, -147921, 121120, 286410, 162458, 39707, 68962, -204328, -77965, 243622, 105057, 22631, -112548, -88853, 147584, 449531, 12329, 229758, 656950, 195721, 311647, 157720, -41989, -374322, -607333, -469975, -14981, 462014, -115518, -75256]
933g5256J19220R0485j26313m40089K69668m98845j01046M00667J19690j48838
923c90657L14841N22855m76981o78622k9295M4972K66148N10353k19696k4040
913a60122k4445J44678N2026l89975L05216p9749k47637l19628K05370L08038
903b06228j22277j8076K81944J5477j51581j5325l36752K83611j46068o05520
893a020795P17237M49955K48738l75044l05983O7531j10027R1997J70135L3365
883c2891m34239L79637R4963r5876L92266j28003p3254j24146j65871J53826J29713
872I6125j81485J56355J11492K10210r4774j09968j33084m9381L26150j38790
862A92850P8019r3464l24760J05390M3537l90754j33124M08745M70123l596k8180
$$ y = [-75256, 43964, 134449, 8136, -431953, -162285, -661130, -762176, -361509, -241819, -390657, -75816, 447039, -29942, -708564, -737859, -692887, -426739, 83614, -136082, -160122, -184567, -39889, 12137, -377838, -72622, -152371, -400008, -719636, -514266, -206228, -328505, -346581, -64637, -49160, -200741, -216066, -552818, -269207, -415275, -1020795, -303558, 146397, 395135, 20091, -285892, -218361, -328388, -236391, -66256, -32891, -467130, -87493, 7470, -88406, 303860, 175857, 102603, -21543, -187414, -33588, 96125, -85360, 70995, 182487, 392697, 297923, 187955, 54871, 5490, 331640, 192850, 270869, 177405, -147355, -41965, 1572, -389182, -522306, -113561, 356562, 352966, 324786]
851C24786l59137n84957M11767L43317o0590N0238j96504N1968K30383m64029
841b52758k16938L84513k27502J1862j09846M03313p0073l97576J01075K71124
831a02806M7766j52858L1834m52970m2228J76909L27363K08620O4066J16833l4004
820A88525J21935r3222l94968k39100L9872J81425J08511K13211k41403K14119
810I8905m3235j75068K21776n6813l19324j6543K24140l27779p340K23581J90388
799A2688r6845J60956k73759k4058J33364N10137q2823l30946j87961K80356j45053
788d3944j54795L13204J14568q01559K6849j82146L66012L10721k38247N85228
778B95891k82672J40617n0992j3169M09863k32717l77298J26357j30029M9939
$$ y = [324786, -34351, -619308, -207541, 135776, 75186, 125424, -71080, -19112, 211271, -252758, -469696, -85183, -312685, -300823, -410669, -7356, -77429, -475005, -373930, -102806, -55040, -207898, -176064, -629034, -671262, -494353, -166990, 41630, 105696, 222529, 188525, 310460, 217238, -177730, -416830, -376958, -195533, -87022, 126189, -115214, 98905, 55670, -119398, 102378, 45565, -273759, -290302, -66162, -393941, -401281, -177700, 12688, -84157, 76799, -196960, -221018, -87654, 422483, 339660, 8714, -179247, 101109, -43944, -198739, 114465, 229033, -572526, -545677, -727823, -361811, -51090, -289337, 295891, 13219, 153836, 102844, 89675, 499538, 266821, -110477, 15880, -114149, -64210]
768f4210j05752j73558N96606J90166l84706l78104L8289J34699P4939J61107
758H9476l0274L30659R1907J8876o39757l60164L41897J60241l80115J41729K74554
747C9029j60057j18438J37362J24339m6194l63893L67093O02130P0948j62506
737D89813l06941r3271o15658J95913J45743m2005K73253J90382Q7510n25128
727b00389J0343K03289L61372n41269K38726j16343j73037J23024l33m81684l98798
716i75099K86262J90396L23247K44405l51338R8141l18618M17753M51064n02108
706a35895K73937r6700k65057j05479K92096j47336l81103L54991K24625L6296
696E0375j78064O4303m6730n85882J33049M28287j31933L53819l1202J47386Q2373
$$ y = [-64210, -169962, -343520, 253086, 443252, 58546, -319558, -281269, -146570, -71631, 89476, 59202, 389861, 481768, 500644, -139113, -499277, -157380, 2861, -377254, -235525, 39029, -121028, -239466, -102104, 22235, -23959, -387852, -20759, 581371, 652319, 489813, 182872, 89601, -526057, -330144, -184401, -226406, 46847, 237229, 324739, -200389, -190046, 13243, 374615, -166654, 72072, -44271, -217308, -94284, -94617, -576301, -975099, -688837, -498441, -175194, 69211, -282127, -183986, -502604, -84851, 366213, -135895, 138042, 41342, -223715, -329194, -37098, -184434, -565537, -210546, 14079, 50375, -127689, -63386, -110116, -695998, -562949, -134662, -266595, 87224, 56022, 203408, 285781]
685B85781O5783k15227l3581K18335l58984J12958l06203K32998l22614O95517
675C74763o796k15765j506J23671j58657j31414k80804M51460j15059j82502R314
664a33295q1552M37595l57200l03073M2262K99938l25502R6024K98163K4641J35825
653A33826K912K54312l00383m73228q0046j54933M14350k06297j53282L46717
643b16052L16794j58395j23645J91909j02054J06290m74891L48418n80597M40393
633b51830M37172m8684l34950n905K02465j97799M80824k14577k54819p5320J38607
622a24816j54338M15001P9697m82070J42490P0997m01224L15870M11859j02850
612A70616M4072J36734o08708l22335j42396L36923J33399L9303n6217J43892
$$ y = [285781, 351564, 136337, 102756, 321091, -37893, 75065, -231138, 1860, -320754, 374763, 367967, 152202, 150696, 274367, 115710, -15704, -296508, 154952, 39893, -142609, -133295, -214847, 222748, -134452, -437525, -395263, -95325, -420827, -324803, -26640, -1999, 133826, 136738, 391050, 90667, -382561, -462607, -617540, -203190, -409487, -562769, -216052, 100742, -57653, -181298, 10611, -91443, 14847, -460044, -111626, -692223, -251830, 185342, 136658, -198292, -204197, -1732, -199531, 281293, 66716, -188103, -263423, -124816, -279154, 135847, 215544, -266526, -124036, -53039, -454263, -138393, 273466, 170616, 214688, 351422, -257286, -579621, -722017, -385094, -251695, -212392, -268609, -124717]
602a24717l33391J14859M0810m72882J24483Q43208M23772m19310l7248O0185
592B19769k83623j59917L00091k55253J66866O7436k12056k14426J81616N17231
582C27734j6636J41775l34185P545j78779k82233j73741O6481j36370P1664k40486
571g47231k03243N01571J692j25964K97234M01839n09420R0681M57525n6816k42748
560a34880k48131L72519k30713j45630J25644J3543K66316K7850j48522J58540
550E6536m80379M67728L7681j39305j78494m1294M16524l30280k78340J58408
540c11215j36037O0687k6101J6710M67421k16016O1180q8970K11002l49789J57641
529a53487K44041l71328Q1970L43591m09795J27199j96749L10724J43032k973
$$ y = [-124717, -458108, -343249, -302439, -775321, -650838, 192370, 616142, 196832, 159584, 219769, -63854, -223771, 76320, -178933, -12067, 55369, -156687, -371113, -189497, 327734, 311098, 452873, 118688, 126233, -52546, -334779, -508520, -442039, -578409, -506745, -747231, -950474, -448903, -447211, -573175, -275941, 125898, -383522, -292841, 164684, 107868, -134880, -383011, -10492, -241205, -386835, -261191, -247648, 18668, 46518, -102004, 56536, -423843, 43885, 81566, -57739, -236233, -277527, 138997, -191283, -469623, -311215, -447252, -386565, -412666, -395956, 71465, -144551, -83371, -172341, 38661, -311128, -153487, 90554, -280774, -198804, 144787, -265008, -137809, -334558, -23834, 119198, 116225]
519A16225j27596K24594n36819J3408j1761M568L32292K49879L48435k31709P709
508C89225l87876p3294R844j48373K59882j45610K2862o28519K55870K47204j35146
497c33931k21495K20669J23921l7717j44470j80491M01128Q3889J69295J65353
$$ y = [116225, -11371, 213223, -323596, -310188, -321949, -317381, 14911, 264790, 613225, 381516, 389225, 1349, -71945, -62101, -210474, 49408, -96202, -73340, -701859, -445989, -198785, -333931, -555426, -334757, -210836, -248553, -393023, -573514, -172386, -88497, 80798, 246151]
$$ [...]
##END NTUPLES=NMR SPECTRUM
##END=
