##TITLE=1H_CA-8875
 CDCl3, 8 sc, 
 10.06.2021
##JCAMPDX= 6.0         $$ Bruker NMR JCAMP-DX V2.0
##DATA TYPE= NMR SPECTRUM
##DATA CLASS= NTUPLES
##ORIGIN= UXNMR, Bruker Analytische Messtechnik GmbH
##OWNER= root
$$ XWIN-NMR		Version 3.5
$$ Thu Jun 10 11:14:58 2021 Russian Standard Time (UT+4h)  she@DPX200
##.OBSERVE FREQUENCY= 200.131506
##.OBSERVE NUCLEUS= ^1H
##.ACQUISITION MODE= SIMULTANEOUS
##.ACQUISITION SCHEME= undefined
##.AVERAGES= 8
##.DIGITISER RES= 18
##SPECTROMETER/DATA SYSTEM= spect
##.PULSE SEQUENCE= zg30
##.SOLVENT NAME= D2O
##.SHIFT REFERENCE= (INTERNAL, D2O, 0, 17.4641)
##AUDIT TRAIL= $$ (NUMBER, WHEN, WHO, WHERE, WHAT)
$$ ##TITLE= Audit trail, XWIN-NMR		Version 3.5
$$ ##JCAMPDX= 5.01
$$ ##ORIGIN= Bruker BioSpin GmbH
$$ ##OWNER= she
$$ F:/spectra/data/she/nmr/H-F/1/pdata/1/auditp.txt
$$ ##AUDIT TRAIL=  $$ (NUMBER, WHEN, WHO, WHERE, WHAT)
(   1,<2021-06-10 11:13:38.21 +0400>,<she>,<DPX200>,
      <created by zg, POWCHK disabled, PULCHK disabled
       configuration hash MD5:
       00 E9 B6 7A A2 85 ED C7 34 08 36 98 17 FE 4E 26
       data hash MD5: 16K
       76 E2 5C DC C6 0C 34 AB DF CD DC 64 DB B6 21 19>)
(   2,<2021-06-10 11:13:40.82 +0400>,<she>,<DPX200>,
      <Start of raw data processing
       efp BC_mod = 2 LB = 0.24 FT_mod = 6 PKNL = 1 PHC0 = -11482.12 PHC1 = 8.601007 SI = 16K 
       data hash MD5: 16K
       CE AE 2B B8 1A 7D DF 21 6A 1C 72 A9 07 5C AD 52>)
(   3,<2021-06-10 11:14:01.21 +0400>,<she>,<DPX200>,
      <pk PHC0 = 0.1198926 PHC1 = 0.4 
       data hash MD5: 16K
       59 98 16 C5 98 F6 E0 3E 77 D6 AD 99 DB 0C DC 86>)
(   4,<2021-06-10 11:14:04.64 +0400>,<she>,<DPX200>,
      <abs ABSG = 5 
       data hash MD5: 16K
       19 0F 40 61 DC A4 20 CA F6 57 EF AC 30 89 CC FD>)
$$ ##END=
$$ 
$$ hash MD5
$$ 49 C3 70 E2 36 28 52 BA 7C 00 EC DE F3 87 33 4E
##$RELAX= 
##$RELAX= 
##$RELAX= 
##$RELAX= 
##$RELAX= 
##$RELAX= 
$$ Bruker specific parameters
$$ --------------------------
##$DU= <F:/spectra>
##$EXPNO= 1
##$NAME= <H-F>
##$PROCNO= 1
##$TYPE= <nmr>
##$USER= <she>
##$AMP= (0..31)
100 100 100 100 100 100 100 100 100 100 100 100 100 100 100 100 100 100 
100 100 100 100 100 100 100 100 100 100 100 100 100 100 
##$AQSEQ= 0
##$AQ_mod= 1
##$AUNM= <au_zg>
##$AUTOPOS= <>
##$BF1= 200.13
##$BF2= 200.13
##$BF3= 200.13
##$BF4= 200.13
##$BF5= 200.13
##$BF6= 200.13
##$BF7= 200.13
##$BF8= 200.13
##$BYTORDA= 1
##$CFDGTYP= 0
##$CFRGTYP= 5
##$CHEMSTR= <none>
##$CNST= (0..31)
1 1 145 1 1 1 1 1 1 1 1 1 1 1 1 1 1 1 1 1 1 1 1 1 1 1 1 1 1 1 1 1 
##$CPDPRG= <>
##$CPDPRG1= <>
##$CPDPRG2= <>
##$CPDPRG3= <>
##$CPDPRG4= <mlev>
##$CPDPRG5= <mlev>
##$CPDPRG6= <mlev>
##$CPDPRG7= <mlev>
##$CPDPRG8= <mlev>
##$CPDPRGB= <>
##$CPDPRGT= <>
##$D= (0..31)
0 1.2 0 0 0 0 0 0 0 0.06 0 0.03 0 0 0 0 0.0002 0 0 0 0 0 0 0 0 0 0 0 0 
0 0 0 
##$DATE= 1623309217
##$DBL= (0..7)
120 120 120 120 120 120 120 120 
##$DBP= (0..7)
150 150 150 150 150 150 150 150 
##$DBP07= 0
##$DBPNAM0= <>
##$DBPNAM1= <>
##$DBPNAM2= <>
##$DBPNAM3= <>
##$DBPNAM4= <>
##$DBPNAM5= <>
$$ [...]
##$SUBNAM3= <"">
##$SUBNAM4= <"">
##$SUBNAM5= <"">
##$SUBNAM6= <"">
##$SUBNAM7= <"">
##$SUBNAM8= <"">
##$SUBNAM9= <"">
##$SW= 20.0188882624521
##$SWIBOX= (0..15)
0 0 2 0 0 0 0 0 0 0 0 0 0 0 0 0 
##$SW_h= 4006.41025641026
##$TD= 16384
##$TD0= 1
##$TE= 0
##$TE2= 300
##$TE3= 300
##$TEG= 300
##$TL= (0..7)
0 120 120 120 120 120 120 120 
##$TP= (0..7)
150 150 150 150 150 150 150 150 
##$TP07= 0
##$TPNAME0= <>
##$TPNAME1= <>
##$TPNAME2= <>
##$TPNAME3= <>
##$TPNAME4= <>
##$TPNAME5= <>
##$TPNAME6= <>
##$TPNAME7= <>
##$TPOAL= (0..7)
0.5 0.5 0.5 0.5 0.5 0.5 0.5 0.5 
##$TPOFFS= (0..7)
0 0 0 0 0 0 0 0 
##$TUNHIN= 0
##$TUNHOUT= 0
##$TUNXOUT= 0
##$USERA1= <user>
##$USERA2= <user>
##$USERA3= <user>
##$USERA4= <user>
##$USERA5= <user>
##$V9= 5
##$VALIST= <valist>
##$VCLIST= <CCCCCCCCCCCCCCC>
##$VD= 0
##$VDLIST= <DDDDDDDDDDDDDDD>
##$VPLIST= <PPPPPPPPPPPPPPP>
##$VTLIST= <TTTTTTTTTTTTTTT>
##$WBST= 1024
##$WBSW= 4
##$XGAIN= (0..3)
0 0 0 0 
##$XL= 0
##$YL= 0
##$YMAX_a= 256094
##$YMIN_a= -191924
##$ZGOPTNS= <>
##$ZL1= 120
##$ZL2= 120
##$ZL3= 120
##$ZL4= 120
##$ABSF1= 17.6584
##$ABSF2= -2.360641
##$ABSG= 5
##$ABSL= 3
##$ALPHA= 0
##$AQORDER= 0
##$ASSFAC= 0
##$ASSFACI= 0
##$ASSFACX= 0
##$ASSWID= 0
##$AUNMP= <proc_1d>
##$AZFE= 0.1
##$AZFW= 0.1
##$BCFW= 0
##$BC_mod= 2
##$BYTORDP= 0
##$COROFFS= 0
##$CY= -3
##$DATMOD= 1
##$DC= 0
##$DFILT= <>
##$DTYPP= 0
##$F1P= 0
##$F2P= 0
##$FCOR= 1
##$FTSIZE= 16384
##$FT_mod= 6
##$GAMMA= 0
##$GB= 0
##$INTBC= 1
##$INTSCL= 1.334414e-10
##$ISEN= 128
##$LB= 0.24
##$LEV0= 0
##$LPBIN= 0
##$MAXI= 10000
##$MC2= 0
##$MEAN= 0
##$ME_mod= 0
##$MI= 1.114404
##$NCOEF= 0
##$NC_proc= -6
##$NLEV= 6
##$NOISF1= 3.799351
##$NOISF2= 2.8
##$NSP= 0
##$NTH_PI= 0
##$NZP= 0
##$OFFSET= 17.46412
##$PC= 1
##$PHC0= -11482
##$PHC1= 9.001007
##$PH_mod= 1
##$PKNL= yes
##$PPARMOD= 0
##$PSCAL= 0
##$PSIGN= 0
##$REVERSE= no
##$SF= 200.130014110495
##$SI= 16384
##$SIGF1= 3
##$SIGF2= 2
##$SINO= 5.538805
##$SIOLD= 16384
##$SREGLST= <1H.CDCl3>
##$SSB= 0
##$STSI= 16384
##$STSR= 0
##$SW_p= 4006.41025641026
##$SYMM= 0
##$S_DEV= 0
##$TDeff= 16384
##$TDoff= 0
##$TI= <>
##$TILT= no
##$TM1= 0
##$TM2= 0
##$TOPLEV= 0
##$USERP1= <user>
##$USERP2= <user>
##$USERP3= <user>
##$USERP4= <user>
##$USERP5= <user>
##$WDW= 1
##$XDIM= 16384
##$YMAX_p= 335004756
##$YMIN_p= -251937
$$ End of Bruker specific parameters
$$ ---------------------------------
##NTUPLES= NMR SPECTRUM
##VAR_NAME=  FREQUENCY,     SPECTRUM/REAL,   SPECTRUM/IMAG
##SYMBOL=    X,             R,               I
##VAR_TYPE=  INDEPENDENT,   DEPENDENT,       DEPENDENT
##VAR_FORM=  AFFN,          ASDF,            ASDF
##VAR_DIM=   16384,         16384,           16384
##UNITS=     HZ,            ARBITRARY UNITS, ARBITRARY UNITS
##FACTOR=    0.24454680195387, 1,            1
##FIRST=     3495.09475511346, 0,            0
##LAST=      -511.315501296804, 0,           0
##MIN=       -511.315501296804, -251937,     0
##MAX=       3495.09475511346, 335004756,    0
$$ Real data points
##PAGE= N=1
##DATA TABLE= (X++(R..R)), XYDATA
$$ [...]
7454E2708k4832O9191k249k3873j5913J76851j22081j19827l6241J4718K19818
$$ 52708 27876 97067 94818 70945 55032 231883 109802 -10025 -46266 -31548 188270
7443A88270j03428o5811K7949J58553k8790m3886p1398k484r3687k8856Q9870
$$ 188270 84842 19031 46980 205533 176743 132857 61459 58975 -34712 -63568 26302
7432B6302P5691j621o3780n0845M0810j9057p7092N6052J92076j30879q5177J15545
$$ 26302 101993 100372 36592 -14253 26557 7500 -69592 -13540 178536 47657 -37520 78025
7420G8025j4974m1164k3688l6126J09154M7967q0050J4873N0298r6477l2972K824
$$ 78025 63051 21887 -1801 -37927 71227 119194 39144 54017 104315 7838 -25134 -22310
7408b2310l1625M2264R3823j22387M4099N9810n0339m7094J6347R8316j33815
$$ -22310 -53935 -11671 82152 -40235 3864 63674 13335 -33759 -17412 80904 -52911
7397e2911J50896j6420j17154K3907J48133j20913j138j5625Q3616P619j24276
$$ -52911 97985 81565 -35589 -11682 136451 15538 14400 -1225 82391 90010 -34266
7386c4266J0689N2610J9315K148j15397Q4554k8563n0486J12725L9284l9270o2044
$$ -34266 -23577 29033 48348 50496 -64901 19653 -8910 -59396 53329 92613 53343 -8701
7374h701m5586P6071K5939K6415n14L3393P9665j53440N1560N4599r2312n4108
$$ -8701 -54287 21784 47723 74138 73624 107017 186682 33242 84802 139401 47089 -7019
7362g019n0403o9012k3582J0404J80128j17168j8980N1538M0532j31576l7664
$$ -7019 -57422 -126434 -150016 -139612 40516 -76652 -95632 -44094 -3562 -135138 -172802
7351a72802m6680Q5465J9705r1565Q8427R2018K2124N4302j5920L2947j02481
$$ -172802 -219482 -134017 -114312 -205877 -117450 -25432 -3308 50994 35074 68021 -34460
7340c4460j63297J45291O2050J728j704n2665p7826j390K6637M1572J17197j3725
$$ -34460 -197757 -52466 9584 11312 9608 -43057 -120883 -122273 -95636 -54064 63133 49408
7328D9408j42369o4350N4058L8523N8103m2750L1050O4992j1285K8739l0630k4199
$$ 49408 -92961 -157311 -103253 -64730 -6627 -49377 -18327 46665 35380 64119 33489 9290
7316I290p8910K8473M785P2193p0157N4042Q2876j23093O5J0165j29237J37456
$$ 9290 -69620 -41147 -36362 35831 -34326 19716 102592 -20501 -20436 -10271 -139508 -2052
7304b052k7916q0189J20183k229K4401j3062k9498n4996N0682J12030j26081q8726
$$ -2052 -29968 -110157 10026 7797 32198 19136 -10362 -65358 -14676 97354 -28727 -117453
7292a17453J9530L9200l6623o1243J07698Q2680l3634J403q8388J1401L1422M1129
$$ -117453 -97923 -58723 -95346 -156589 -48891 33789 155 1558 -86830 -75429 -44007 -2878
7280b878q9267K8919J24444j8023o6985K3142J070l8464J8599O9942m5883j0102
$$ -2878 -92145 -63226 61218 43195 -23790 -648 422 -38042 -19443 50499 4616 -5486
7268e486j3654K4664Q9376l7683p9778j20508M9014K5925J26638j13481p1843
$$ -5486 -19140 5524 94900 57217 -22561 -143069 -94055 -68130 58508 -54973 -126816
7257a26816L6707J46903m9162o2079n006R6055J025p3001n826M1016Q80j4423
$$ -126816 -90109 56794 7632 -54447 -59453 36602 37627 -35374 -41200 -184 696 -13727
7245a3727l2168k890K2247j32681K5311J10336j643N953J915k058n3184P282J7992
$$ -13727 -45895 -48785 -26538 -159219 -133908 -23572 -25215 -19262 -17347 -19405 -72589 -65307 -47315
7232d7315J5792O351k502k3198l3989R4277j8575O6077k4461l4735K8507l9401
$$ -47315 -31523 -25172 -27674 -50872 -84861 9416 -9159 56918 32457 -2278 26229 -13172
7220a3172m9859P5398m8232M3499o2158r790N2319p6022N0376j0442m0407p6475
$$ -13172 -63031 12367 -35865 7634 -54524 -64314 -11995 -88017 -37641 -48083 -88490 -164965
7208a64965J00424l3942J9549k6865J2240l5022r9994k3362Q1193K9213j7954
$$ -164965 -64541 -98483 -78934 -105799 -93559 -128581 -228575 -251937 -170744 -141531 -159485
7197a59485Q4294P477M252j6573N5442L392J6986J4240j0264r5621L971O1881
$$ -159485 -75191 -67714 -63462 -80035 -24593 -21201 -4215 10025 -239 -95860 -91889 -30008
7185c0008N1613k4514j8271j3139J24574j42982r8622R4840J04817j16592m4413
$$ -30008 21605 -2909 -21180 -34319 90255 -52727 -151349 -56509 48308 -68284 -112697
7174a12697J41079K8431o6127n9222J30589p9777j3666L1515l0997j44701J260
$$ -112697 28382 56813 -9314 -68536 62053 -17724 -31390 125 -30872 -175573 -174313
7163a74313N8435R8589R9272j38062N2976j06050j6359L3927l0260K9763l6016
$$ -174313 -115878 -17289 81983 -56079 -3103 -109153 -125512 -91585 -121845 -92082 -128098
7152a28098L5897M1873J45233n4202p6668N0748P613M935r0180p7544L3159m2634
$$ -128098 -92201 -50328 94905 40703 -35965 14783 22396 27331 -62849 -140393 -107234 -149868
7140a49868R0154K4971L4756l7827l4898K8684N5662p6373p6346J79335O0711
$$ -149868 -59714 -34743 13 -37814 -72712 -44028 11634 -64739 -141085 38250 98961
7129I8961r8924o3052m2452P90M6167n5141l0752N3588m0580L5104J67463j7176
$$ 98961 37 -63015 -105467 -104677 -58510 -113651 -144403 -90815 -131395 -96291 71172 53996
7117E3996l7834j57524m4508N7732O2256M3616m3765p540O6808P7974J0953j23276
$$ 53996 16162 -141362 -185870 -128138 -65882 -22266 -66031 -73571 -6763 71211 82164 -41112
7105d1112M065L5304l0687k7468n2890j704Q9210R4125p4091j27702m6939J13544
$$ -41112 -37047 -1743 -32430 -59898 -112788 -114492 -25282 68843 -5248 -132950 -179889 -66345
7093f6345N6117j1047j33715k5143Q590J22094Q4233j38786j42N3663J6407j94818
$$ -66345 -10228 -21275 -154990 -180133 -171543 -49449 34784 -104002 -104144 -50481 -34074 -228892
7081b28892L5517J40151p248R8905r2439R8103J83311j36440l6387n301K3047
$$ -228892 -193375 -53224 -60472 38433 -54006 44097 227408 90968 54581 49280 72327
7070G2327k3166j13193m5411J2132M3265q7131J29058L2105l7005n9291k5052
$$ 72327 49161 -64032 -109443 -97311 -54046 -141177 -12119 19986 -17019 -76310 -101362
7059a01362O7824q9735l219K7269J3132O699m7556N3755M1164j15039Q3224r3812
$$ -101362 -33538 -123273 -126492 -99223 -86091 -79392 -126948 -73193 -32029 -147068 -63844 -157656
7047a57656N7684J18199k6558L1817k3308j17518Q8717J9498K9471K089O5433
$$ -157656 -99972 18227 -8331 23486 178 -117340 -28623 -9125 20346 22435 87868
7036H7868o616r1634J8024n6577q318l5738n753L0896K5444j8028m1623k5589
$$ 87868 81252 -10382 7642 -48935 -57253 -92991 -98744 -67848 -42404 -60432 -102055 -127644
7024a27644J8741K4215j8107J5061k6347N4503L8007k6493P903K1329L5982j9030
$$ -127644 -108903 -84688 -102795 -87734 -114081 -59578 -21571 -48064 -40161 -18832 17150 -1880
7012a880K2805k6137L9573j09288L0858p8763P422p605R6747N0108j3255j14571
$$ -1880 20925 -5212 34361 -74927 -44069 -122832 -115410 -123015 -26268 23840 10585 -103986
7000a03986O6235K0290J8520L9169r7513o5533o5444N4113R8855N0989L9632r4969
$$ -103986 -37751 -17461 1059 40228 -57285 -122818 -188262 -134149 -35294 15695 55327 -39642
6988c9642k1903J7474n5713M9467n403p0488O1912J25936k6493j03562j21018
$$ -39642 -61545 -44071 -99784 -50317 -55720 -126208 -64296 61640 35147 -68415 -189433
6977a89433O9141J09159K387K2908K1577j33826N0905k39l9600n6417J40277k1152
$$ -189433 -120292 -11133 -8746 14162 35739 -98087 -47182 -47421 -87021 -143438 -3161 -24313
6965b4313j45737R8975J08415j11781l8249l8179J59768J2324r7889o1294r98
$$ -24313 -170050 -71075 37340 -74441 -112690 -150869 8899 21223 -76666 -137960 -138958
6954a38958Q6461J111j2358p1285k2006R1679J07824m4289n5347j3638r370M5561
$$ -138958 -52497 -51386 -63744 -135029 -157035 -65356 42468 -1821 -57168 -70806 -80176 -34615
6942c4615l7416m05Q6721l3809Q4012o9080r1315L6022J6881q3062J43986m4077
$$ -34615 -72031 -72436 14285 -19524 64488 -4592 -95907 -59885 -43004 -126066 17920 -26157
6930b6157k9411k662j43537J01752m9305K1563M6178j03071K2302O7622O8447
$$ -26157 -55568 -58230 -201767 -100015 -149320 -127757 -81579 -184650 -162348 -94726 -26279
6919b6279K743M2614O9898j47136K538j1296j0799N717l1583P8291n1543l6100
$$ -26279 -23536 19078 88976 -58160 -55622 -66918 -77717 -72000 -103583 -25292 -76835 -112935
6907a12935N0311M0798N038k0396J92961l4693p9666n7115O0349j9772p9568J1531
$$ -112935 -62624 -21826 -16788 -37184 155777 121084 41418 -15697 44652 24880 -54688 -43157
6895d3157j01944M215Q0785J9492R2857q9484L1535N214k7178Q0677j10864j00571
$$ -43157 -145101 -140886 -60101 -40609 52248 -37236 -5701 -487 -27665 53012 -57852 -158423
6883a58423L4524J57812j0965l2027J7554J06146j38104l7255N2982n7125K6184
$$ -158423 -123899 33913 22948 -9079 8475 114621 -23483 -60738 -7756 -64881 -38697
6872c8697l1370n6023L0132J286o2599J6610N3362k0061K6446J5783r6015M1998
$$ -38697 -70067 -126090 -95958 -94672 -157271 -140661 -87299 -107360 -80914 -65131 -161146 -119148
6860a19148n836J09363J16284n0217r862q1680K1035o0482M6221j02282k895L5969
$$ -119148 -124984 -15621 100663 50446 40584 -41096 -20061 -80543 -34322 -136604 -139499 -103530
6848a03530J51316L1747l3798m0494k23786q637N2331L1045J50099m4830l2168
$$ -103530 47786 79533 45735 5241 -218545 -227182 -174851 -143806 6293 -38537 -70705
6837g0705L7350j8643L1211q8061R102K5272Q3806L6666o7831r6286j12667J53320
$$ -70705 -33355 -51998 -20787 -108848 -99746 -74474 9332 45998 -21833 -118119 -230786 -77466
6825g7466L0823l6209k1424R4715m9641n6479M7331m7241k7958J03051L3852o1990
$$ -77466 -46643 -82852 -104276 -9561 -59202 -115681 -68350 -115591 -143549 -40498 -6646 -68636
6813f8636o8684j6218k5976Q6201J26624j05710J2975n9282j7588k6173K00053
$$ -68636 -137320 -153538 -179514 -93313 33311 -72399 -59424 -118706 -136294 -162467 37586
6802C7586k7194Q574M9615r3941J08592l0736j37729l7824r675O8202o181o2027
$$ 37586 10392 18966 68581 -25360 83232 52496 -85233 -123057 -132732 -64530 -70711 -132738
6790a32738l5035l3378P5726Q0319k5455J03900l235j3865K1755j41329L5336
$$ -132738 -167773 -201151 -125425 -45106 -70561 33339 30104 16239 37994 -103335 -67999
6779f7999l5159p1082J82436p9962k0484K1093M1275J15932q267j83426n6090
$$ -67999 -103158 -174240 8196 -71766 -92250 -71157 -29882 86050 77783 -105643 -161733
6768a61733P6983J16768n2146K696M6915m0694l8570N6852j51842N6038J63009
$$ -161733 -84750 32018 -20128 -17432 29483 -11211 -49781 7071 -144771 -88733 74276
6757G4276j29240K5677n7342P025l0908N0843j7097M9816j1966K3862K2938l8501
$$ 74276 -54964 -29287 -86629 -79604 -110512 -59669 -76766 -26950 -38916 -15054 7884 -30617
6745c0617O9899n0196M5704M4986l460l6028k9133j25408j5311P977J27725J7408
$$ -30617 39282 -10914 34790 79776 76316 40288 11155 -114253 -129564 -121587 6138 23546
6733B3546p2505J1496M433k656L0013J24931n2432j6649j08779p9432O0967P1222
$$ 23546 -48959 -37463 -33030 -35686 -5673 119258 66826 50177 -58602 -138034 -77067 -5845
6721e845j06182l1650J10064j0264r0055O7668J9897J02944k5721K7257j9957
$$ -5845 -112027 -143677 -33613 -43877 -133932 -66264 -46367 56577 30856 58113 38156
6710C8156m1757O1405l9172K6074j16790K176O7651j0582l9086m7082M6162m1315
$$ 38156 -3601 57804 18632 44706 -72084 -69908 -2257 -12839 -51925 -99007 -52845 -94160
6698i4160Q849k525k7624K2143O8620L9350k1594r8232m8317J10625Q0130j15977
$$ -94160 -85311 -87836 -115460 -93317 -24697 14653 -6941 -105173 -153490 -42865 37265 -78712
6686g8712o272Q9453j33998q5458M6347J58707N4879j53521M4198R7593J719l2813
$$ -78712 -84984 4469 -129529 -214987 -168640 -9933 44946 -108575 -64377 33216 34935 2122
6674B122r4103l9678N5852J20331p8286k4596O8982r195Q3635p8540q4872n0936
$$ 2122 -91981 -131659 -75807 44524 -33762 -58358 10624 1429 85064 6524 -78348 -129284
6662a29284Q3527K6101P3736r3816M448N1915l9976J4145l6535j07792q0495J44558
$$ -129284 -45757 -19656 54080 -39736 -35288 16627 -23349 -9204 -45739 -153531 -234026 -89468
6650h9468n1873R6603M1257L6764M2430L7358o0847l4980M5467j39151n3003J6497
$$ -89468 -141341 -44738 -3481 33283 75713 113071 52224 17244 62711 -76440 -129443 -112946
6638a12946R3954l2071q1799J8146K2838L3304k8823O8963P3204o7900J4457O7773
$$ -112946 -18992 -51063 -132862 -114716 -91878 -58574 -87397 -18434 54770 -13130 1327 69100
6626F9100r9420K0426J15473J7843j21630K7241J6336o409j2613Q061J8843m7815
$$ 69100 -30320 -9894 105579 123422 1792 29033 45369 38960 26347 34408 53251 5436
6614E436q820J4417J0182O5856o8937j20412P237m8726J4860K3988N3731q111
$$ 5436 -3384 11033 21215 87071 18134 -102278 -95041 -143767 -128907 -104919 -51188 -59299
6602e9299O614J01854k4172l7374J4222o2348l027N3494o6333K8386J58600j8857
$$ -59299 -52685 49169 24997 -12377 1845 -60503 -63530 -10036 -76369 -47983 110617 91760
6590I1760o288j51821P0630J01725q2218P2364j86484j975p7428J9431J53358
$$ 91760 85472 -66349 4281 106006 23788 96152 -90332 -92307 -169735 -150304 3054
6579C054M160q0303L9105Q7113j56732K2450K5394K9828m681J5162L8711M0706
$$ 3054 7214 -73089 -33984 53129 -103603 -81153 -55759 -25931 -30612 -15450 23261 63967
6567F3967j32221P4997N3138j09607L210Q2112k2979L3022M8134o3304K6667n8323
$$ 63967 -68254 6743 59881 -49726 -46516 35596 12617 45639 93773 30469 57136 -1187
6555a187j6102P62j32900q076J88900k39874J9882R4299k1645M4167k8614l9708
$$ -1187 -17289 -16527 -149427 -157503 31397 -208477 -188595 -94296 -115941 -71774 -100388 -140096
6543a40096J2214N5974k8942j25330J05516O0283K4419M4613j22866N8721J5961
$$ -140096 -127882 -71908 -100850 -226180 -120664 -60381 -35962 8651 -114215 -55494 -39533
6532c9533p2362L2678N7702P4192p1579j4398j9500O381N640O9658m8123N1424
$$ -39533 -111895 -79217 -21515 52677 -18902 -33300 -52800 -46419 -40779 28879 -19244 32180
6520C2180r5409k6065L3044K4532J10149m7524o8186J3507k9284j0942K6514o6088
$$ 32180 -63229 -89294 -56250 -31718 78431 30907 -37279 -23772 -53056 -63998 -37484 -103572
6508a03572P0198R0501m589j01419j1108K5684J18494k8190j4300j9588q562p35
$$ -103572 -33374 57127 52538 -48881 -59989 -34305 84189 55999 41699 22111 13549 12814
6496A2814j29105K9345J22594j11245O5396l1173M5623j9710J02735j6920j14370
$$ 12814 -116291 -86946 35648 -75597 -10201 -41374 4249 -15461 87274 70354 -44016
6485d4016P0155m8047j9888J24644K5023n4354l4289J15626j06686q0479l4101
$$ -44016 26139 -21908 -41796 82848 107871 53517 19228 134854 28168 -52311 -86412
6474h6412o4876n9339R0007n5048O6895O1590p2769l933K7534K5281M5604K5639
$$ -86412 -151288 -210627 -120620 -175668 -108773 -47183 -119952 -123885 -96351 -71070 -25466 173
6462A73o137M2177N4373l475J2539o6033j50263J34199J9819K9237K2919j4111
$$ 173 -5964 36213 90586 87111 99650 33617 -116646 17553 37372 66609 89528 75417
6450G5417l7348q2648O9210n0790J2721J9016r7317P0306r0530J37220q5358J8907
$$ 75417 38069 -44579 24631 -26159 -13438 5578 -91739 -21433 -111963 25257 -60101 -41194
6438d1194j4514j7009M4941o6361R997J08995O72L1782m9694M394J698o5021L3675
$$ -41194 -55708 -72717 -27776 -94137 -84140 24855 25527 57309 7615 12009 13707 -51314 -17639
6425a7639J2677Q755j7206n7300L3819R8971j46034o2765q6029R1001K40031k4495
$$ -17639 -4962 3793 -13413 -70713 -36894 62077 -83957 -146722 -232751 -141750 98281 73786
6413G3786P2938q660j71758K2314m6991l8991O0901P027q3328O3914L1148o5593
$$ 73786 146724 138064 -33694 -11380 -58371 -97362 -36461 -29434 -112762 -48848 -17700 -83293
6401h3293l6224K3934k3397J37966R6612M7436m57j67387l1664J1831l3773M7884
$$ -83293 -119517 -95583 -118980 18986 115598 163034 162577 -4810 -36474 -24643 -58416 -10532
6389a0532K1778j744m5955l3903P1680K0828K4043q4678o4612n7521P0064J9080
$$ -10532 11246 9502 -36453 -70356 1324 22152 46195 -38483 -103095 -160616 -90552 -71472
6377g1472j3879m9130P7632O7107j2050j9241q4813M5567M1569k3751O0593L8487
$$ -71472 -85351 -134481 -56849 10258 -1792 -21033 -105846 -60279 -18710 -42461 18132 56619
6365E6619l8592L5048L0174j29540l7701N8700K7313j34262L5766L3955L742m373
$$ 56619 18027 53075 83249 -46291 -83992 -25292 2021 -132241 -96475 -62520 -58778 -63151
6353f3151n791Q9901J4753p6008p0439K9814K7655k2884L4509j947J19206j1967
$$ -63151 -68942 20959 35712 -40296 -110735 -80921 -53266 -76150 -41641 -43588 75618 63651
6341F3651o1945Q4063K5412j74693N0993j4346l5562L4700j03449j9127P611K9493
$$ 63651 1706 85769 111181 -63512 -12519 -26865 -62427 -27727 -131176 -150303 -142692 -113199
6329a13199M1825L3386q1216J49498n9170l5282P0688P121k9538q8085Q4449K5543
$$ -113199 -71374 -37988 -119204 30294 -28876 -64158 6530 13651 -15887 -103972 -19523 6020
6317F020j42163M2896Q1796R0379l3214k2192j0960j48990R8575l6609J8987O1497
$$ 6020 -136143 -93247 -11451 78928 45714 23522 12562 -136428 -37853 -74462 -55475 6022
6305F022o2901N1608M4914N7235n9639K1520j0784q6250m1991m9772j13867J46806
$$ 6022 -56879 -5271 39643 96878 37239 58759 47975 -38275 -80266 -130038 -243905 -97099
6293i7099O3432k1640q7689J7691Q0479N1849l5010n6670n3086J16987l2908n5617
$$ -97099 -33667 -55307 -142996 -125305 -44826 7023 -27987 -84657 -137743 -20756 -53664 -109281
6281a09281O1308N3184n018K1693R8807j14052q7348R3823Q996q243l0737L719
$$ -109281 -47973 5211 193 21886 120693 6641 -80707 13116 22112 13869 -16868 -13149
6269a3149M6214l0854K2269j3910q4166O2554J7735k4929Q1975n6631L9291j12675
$$ -13149 33065 2211 24480 10570 -73596 -11042 6693 -18236 63739 7108 46399 -66276
6257f6276J3667K526L152L4115l4545M2808k5174l2962M0706M3535p1J2165K3489
$$ -66276 -52609 -50083 -46931 -12816 -47361 -4553 -29727 -62689 -21983 21552 21481 33646 57135
6244E7135j36974L856J51714l6183j20170R9493j3479m186Q6134r0437k3609n5183
$$ 57135 -79839 -75983 75731 39548 -80622 18871 5392 1206 87340 -3097 -26706 -81889
6232h1889K2176P5884N7109n0421J2348K5477Q3987l4285o0614J50705r017j42332
$$ -81889 -59713 16171 73280 22859 35207 60684 144671 110386 49772 200477 191460 49128
6220D9128j8187l1974J0237L1885p6464r983l7708M5739N6554m1688j7252l3653
$$ 49128 30941 -1033 9204 41089 -35375 -45358 -83066 -37327 19227 -22461 -39713 -73366
6208g3366O5730m2373K9363r1698J5251j4210M8895K37250l2661k4241m8634j48658
$$ -73366 -7636 -50009 -20646 -112344 -97093 -111303 -62408 174842 142181 117940 69306 -79352
6196g9352n9512O0232J1210O1337n8784R0556k1695p9731L1565j0010l4985R6180
$$ -79352 -138864 -78632 -67422 -6085 -64869 25687 3992 -75739 -44174 -54184 -89169 7011
6184G011o4355l7724M6061M6647J2716m2100l7117M3240K1052o3998K9884J37213
$$ 7011 -57344 -95068 -49007 -2360 10356 -31744 -68861 -25621 -4569 -68567 -38683 98530
6172I8530L9366K0075q2915p1756n7300o7644N6895J4987l7501K3788O9041K5382
$$ 98530 137896 157971 75056 3300 -54000 -121644 -64749 -49762 -87263 -63475 5566 30948
6160C0948j7607o7435J0344P5716j7753K826J2378l4702j02441O5935l4470Q289
$$ 30948 13341 -54094 -43750 31966 14213 17039 29417 -5285 -107726 -41791 -76261 -67972
6148f7972N0332N1115j5241J3373m097n1773n4036P1020n4254K8774L8812n1056
$$ -67972 -17640 33475 18234 31607 27510 -24263 -78299 -7279 -61533 -32759 6053 -45003
6136d5003O2045j4093L5562o6012L5273n2687R4067j7962J3598o5133m2862J01139
$$ -45003 17042 2949 38511 -27501 7772 -44915 49152 31190 44788 -20345 -63207 37932
6124C7932J1536K261l0557j54737Q6428K6491P1408L139q6016L7858j2975j62692
$$ 37932 49468 51729 21172 -133565 -47137 -20646 50762 53901 -32115 5743 -7232 -169924
6112a69924P5694P4353j07890J18482K4507Q9972p6027P7053n1673j3525K1101
$$ -169924 -94230 -19877 -127767 -9285 15222 105194 29167 106220 54547 41022 62123
6101F2123j31622N9667R1232p7132n86O0054r1247j06714J09920M2430o645N0023
$$ 62123 -69499 -9832 81400 4268 3682 63736 -27511 -134225 -24305 18125 11480 61503
6089F1503l8424L9257n62J8994O6417k2753j24982p288l216o3744P2637J01287
$$ 61503 23079 62336 61774 80768 147185 124432 -550 -7838 -11054 -74798 -2161 99126
6077I9126n7067N834l0342k3370j05018R2014R628N688l7621p7951p9175P0580
$$ 99126 42059 47893 17551 -5819 -110837 -18823 -9195 -3507 -41128 -119079 -198254 -127674
6065a27674N8158M6556J10622j12679j9633N6601L1438k301j90412J15577K2387
$$ -127674 -69516 -22960 87662 -25017 -44650 11951 43389 41088 -149324 -33747 -11360
6054a1360j465j41415R4199j1777O2788P2604j2595o3275j16072R2055o270J24179
$$ -11360 -12825 -154240 -60041 -71818 -9030 63574 50979 -12296 -128368 -36313 -42583 81596
6042H1596j10768l1490J11793o5859m5206k0670o0237N3815l5735O2431N5673
$$ 81596 -29172 -60662 51131 -14728 -59934 -80604 -140841 -87026 -122761 -60330 -4657
6031d657J750L1061n469p8515J6239J9772M1517j3656m9476j2088N8255M2235
$$ -4657 -2907 28154 22685 -55830 -39591 -19819 21698 8042 -41434 -53522 4733 46968
6019D6968j01436P5556R1582O276j3489P640j5213L0401q6021j03185J06143o5994
$$ 46968 -54468 21088 112670 118946 105457 113097 97884 128285 42264 -60921 45222 -20772
6007b0772K7921o0522n6750M2087M4658o4197k1217L6417Q9176q8890L1444N9012
$$ -20772 7149 -53373 -110123 -68036 -23378 -87575 -108792 -72375 16801 -72089 -40645 18367
5995A8367N1913q7605J07391K1397m2251m3280K406j2207k063J869J7814J0925
$$ 18367 70280 -17325 90066 111463 69212 25932 28338 16131 14068 15937 33751 44676
5983D4676O1303m6194j1432m1248m8058J3993m3812P3274O3916l1530O3614m4338
$$ 44676 105979 59785 48353 7105 -40953 -26960 -70772 2502 66418 34888 98502 54164
5971E4164l1185L9410P0264K6233K7189j51994o0000K4927k6413k965j03311J12387
$$ 54164 22979 62389 132653 158886 186075 34081 -25919 -992 -27405 -30370 -133681 -21294
5959b1294L1160Q1703q5973J1743J3844J6573K984m6849m2896R6151l0085m049
$$ -21294 9866 91569 5596 17339 31183 47756 50740 3891 -39005 57146 27061 23012
5947B3012j5317Q9346p5660L477N8856j44200m2206J17829o48L0147j67036O1804
$$ 23012 7695 97041 21381 24858 83714 -60486 -102692 15137 14489 44636 -122400 -60596
5935f0596J52071k8859j24386p3862O4183p8540J9846P3599q279o6875N6354Q6511
$$ -60596 91475 62616 -61770 -135632 -71449 -149989 -130143 -56544 -64823 -131698 -75344 11167
5923A1167O7033N1025l0210j2320L6654o6995P248o4180k529P3161j54067L6641
$$ 11167 78200 129225 99015 86695 123349 56354 63602 -578 -3107 70054 -84013 -47372
5911d7372J14730k2756J9253K8015L6942P693j03206O5212M9958P9608j62537
$$ -47372 67358 44602 63855 91870 128812 136505 33299 98511 148469 228077 65540
5900F5540q7537J17289j6661l1995o9420Q7661L8179K91M5868n6444n1003N7174
$$ 65540 -21997 95292 78631 46636 -22784 64877 103056 103347 149215 92771 41768 98942
5888I8942l9621P0982O1137q0040K0570J4155r4644j32093K1942N0944m4538l2803
$$ 98942 59321 130303 191440 111400 131970 146125 51481 -80612 -58670 -7726 -52264 -85067
5876h5067j1902Q7526L8340Q620m6042L2452K0095R754O3755L8013j00147r2661
$$ -85067 -96969 -9443 28897 37517 -8525 23927 44022 53776 117531 155544 55397 -37264
5864c7264J2002L5391J7541J65094o6107m84j3969j87056J24889J8846j04186
$$ -37264 -25262 10129 27670 192764 126657 126173 112204 -74852 50037 68883 -35303
5853c5303K2287K1584J1997K8673J3402l193q1579J9337J02654L9073l2355q6131
$$ -35303 -13016 8568 20565 49238 62640 59447 -22132 -2795 99859 138932 106577 20446
5841B0446q2188O0026j28333l878J33437l3371j3667J02167O1338j44414j13545
$$ 20446 -61742 -1716 -130049 -133927 -490 -33861 -47528 54639 115977 -28437 -141982
5830a41982J30252O9572l6624K4474j8728P809N2389J1346p5583q1192J27701
$$ -141982 -11730 57842 21218 45692 26964 34773 87162 98508 22925 -58267 69434
5819F9434K1065p6733L5991n0864k4128J5667N9685m0636o7633R0907K1330K5263
$$ 69434 90499 13766 49757 -1107 -25235 -9568 50117 9481 -58152 32755 54085 79348
5807G9348n5279K3345R7490o673K2338m257j6474k9269Q9589j30544K9657j52881
$$ 79348 24069 47414 144904 138231 160569 156312 139838 110569 200158 69614 99271 -53610
5795e3610j6485J58987j0828L5163k2386M858j65370K5771M1861o3780J19673
$$ -53610 -70095 88892 78064 113227 90841 95699 -69671 -43900 -2039 -65819 53854
5784E3854O9843J2918m1147o3420m5615L9433J09406L4361j24598m9613Q6771
$$ 53854 123697 136615 95468 32048 -13567 25866 135272 169633 45035 -4578 82193
5773H2193L4239m5747j4478n3197J5577Q4700j0893k8448q8892N6233R0171j9244
$$ 82193 116432 70685 56207 3010 18587 103287 92394 63946 -24946 31287 121458 102214
5761A02214L1442n8707K3601k5256l3324j575r622J5070L8443P1365j52378j2051
$$ 102214 133656 74949 98550 73294 39970 38395 28773 43843 82286 153651 1273 -10778
5749a0778J664J5415n876l9748K0553N2338N0144P583l7070l60L5078o023k3017
$$ -10778 -9114 6301 425 -39323 -18770 33568 83712 91295 54225 53865 88943 82920 59903
5736E9903J8910N1604j90180N66J13600O0077p475j40258m8365K3870O4923J7211
$$ 59903 78813 130417 -59763 -59197 54403 114480 107005 -33253 -81618 -57748 7175 24386
5724B4386M0251J5011o420N8195L3248k7066o2613n221L9645m632L262n1891J8868
$$ 24386 64637 79648 73228 131423 164671 137605 74992 69771 109416 104784 108046 56155 75023
5711G5023j7422m3647j4461J26121r8165O0840L1973n5954p0685O8819K6650M4820
$$ 75023 57601 13954 -507 125614 27449 88289 120262 64308 -6377 62442 89092 133912
5699A33912k7830M3539J229p2338L3439l0802J935Q0374p421J417l424J4502j6531
$$ 133912 106082 149621 150850 78512 111951 81149 83084 163458 156037 157454 154030 168532 152001
5686A52001j14675P1744R4067p1173M5185m6926l4431r0056r1279Q4550L2698
$$ 152001 37326 109070 203137 131964 177149 130223 95792 5736 -85543 -993 31705
5675C1705J03925o8095n424J1754O1288j00054R296P7181m315j06935j2406M7394
$$ 31705 135630 67535 62111 73865 135153 35099 44395 121576 117261 10326 -2080 45314
5663D5314J5159r8487J68688Q9544j25373l1710J7468j06653J2903J1973K6683
$$ 45314 60473 -38014 130674 220218 94845 63135 80603 -26050 -13147 -1174 25509
5652B5509J61750m6763l47M5439p9981m7382J7554M0069O3419Q3883K5547j17648
$$ 25509 187259 140496 140149 185588 105607 58225 75779 115848 179267 263150 288697 171049
5640A71049n3394N0076j57722M8466M898J0062l375J08452K1668J7372j39190
$$ 171049 117655 167731 10009 58475 63373 73435 70060 178512 200180 217552 78362
5629G8362n7448J00451l4863j362m1715o7456J345M4774N6730J1008K9428l2712
$$ 78362 20914 121365 86502 85140 43425 -24031 -22686 22088 78818 89826 119254 86542
5617H6542J423O9625m6961Q0709j16496j20028J24406P7271l8738m7603j8145
$$ 86542 87965 157590 110629 191338 74842 -45186 79220 156491 117753 70150 52005
5606E2005M0729J05415j35957J9273O740K2511R318p280N5153n6080N8039j2707
$$ 52005 92734 198149 62192 81465 88205 110716 120034 112754 167907 111827 169866 157159
5594A57159J4369q5585j8432P1755K7948o3391L4139M555R4703q2976n7834J4855
$$ 157159 171528 85943 67511 139266 167214 103823 137962 142517 237220 154244 96410 111265
5582A11265J4854k9758Q6669n5458q7409R0311P0106j7558N1642l2276k9408L9239
$$ 111265 126119 96361 183030 127572 40163 130474 200580 183022 234664 202388 172980 212219
5570B12219m2487J1356j3409j07898J18539K98n6000j3537P9526k7194n5479r1389
$$ 212219 169732 181088 167679 59781 178320 178618 122618 109081 188607 161413 105934 14545
5558A4545O6539L7569m630O0035J33930K9580j83433j03532R8399J29127q8204
$$ 14545 81084 118653 114023 174058 307988 337568 154135 50603 149002 278129 189925
5547A89925m4177m9044M2479o1152N3699P1597o1559L5653j6773p2309J63589
$$ 189925 145748 96704 139183 78031 131730 203327 141768 177421 160648 88339 251928
5536B51928j1629p6455o0158j7378l0231P019J8206P60P700m6844J1212M6030
$$ 251928 240299 163844 103686 86308 56077 63096 81302 82062 89762 42918 54130 100160
5524A00160K3004j37007N4960R3866j966J3336O4023K6928M3212m6466q049p6401
$$ 100160 123164 -13843 41117 134983 133017 146353 210376 237304 280516 234050 226001 149600
5512A49600o9129P3431p742k4932R0729j37461L953O7985q1014P5389k634o2640
$$ 149600 80471 153902 146160 121228 211957 74496 78449 146434 65420 140809 138175 75535
5500G5535N3782R3655q5483L4215M9370l1328j4335J16546j60025M012j7258K5717
$$ 75535 129317 222972 137489 171704 221074 189746 175411 291957 131932 135944 118686 144403
5488A44403L3023J2552O7897j9872n2144k5637j8645L3502J07079k5815j05538
$$ 144403 177426 189978 257875 238003 185859 160222 141577 175079 282158 256343 150805
5477A50805M3934J08511L9461j10193O3542j955q9479K6410K9629J07050m0897
$$ 150805 194739 303250 342711 232518 296060 294105 204626 231036 260665 367715 326818
5466C26818j7093q0020j28246J29844J0826J8302m265q6220J49611M467q2577
$$ 326818 309725 229705 101459 231303 242129 260431 256166 169946 319557 324024 241447
5455B41447Q167m9889J23472m2924l0497n1529k9172J81457L4963R436q239M2918
$$ 241447 249614 199725 323197 280273 249776 198247 169075 350532 385495 394931 386692 429610
5443D29610P111j70255j78059N9044j1558n9499J55649J39846o2935l8910p2314
$$ 429610 436721 266466 88407 147451 135893 76394 232043 371889 308954 270044 197730
5432A97730Q4687n9511n0651O4659J13154M0195q2059N278l304j0600J4750l3980
$$ 197730 282417 222906 172255 236914 350068 390263 308204 313482 310178 299578 314328 280348
5420B80348p9495K54025j531j30696N5121P69K1171L5248J0644M125j1017l537
$$ 280348 200853 454878 453347 322651 377772 378541 399712 434960 445604 449729 438712 435175
5408D35175r8885L58L4425R1517j5984p4719l1660Q8427j0562O540J08215L1557
$$ 435175 336290 336648 371073 462590 446606 371887 340227 428654 418092 424632 532847 564404
5396E64404J266k1734O4138l8370j07760M0648J4691j2576J25835j5252K278J43423
$$ 564404 565670 543936 608074 569704 461944 502592 517283 504707 630542 615290 617568 760991
5384G60991n8973Q978J38627L8368o594o6118J25088L3863R0828K0245j8279l9968
$$ 760991 702018 710996 849623 887991 881397 815279 940367 974230 1065058 1085303 1067024 1027056
5372A027056Q2126j8977N76P2496m7268m9545j39500o6750O8469o3407O3061M1223
$$ 1027056 1109182 1090205 1090781 1163277 1116009 1066464 926964 860214 928683 865276 928337 969560
5360I69560k18328j4829k5850j01687j17839k7855Q3861k2024R5078m7269J1545
$$ 969560 751232 736403 710553 608866 491027 463172 547033 525009 620087 572818 584363
5349E84363M1352p408j9412j4708O7055j37143m5309R5901N7501K7378j44032
$$ 584363 625715 618307 598895 584187 651242 514099 468790 564691 622192 649570 505538
5338E05538J3758o0701P6015k5699o8380M1340J36297j8863P352N8113r9376k3820
$$ 505538 519296 458595 534610 508911 440531 481871 618168 599305 606657 664770 565394 541574
5326E41574O9656J8255P721K964q3506O1685l6601N019r3282O863J72096j0652
$$ 541574 611230 629485 637206 640170 556664 618349 581748 586767 493485 500348 672444 661792
5314F61792p4554J2631l5933K4772o3312o3795N6881l7381P4507m424R6072l1351
$$ 661792 587238 599869 563936 588708 525396 461601 518482 481101 555608 551184 647256 615905
5302F15905m7211P9606Q821n2534K2090k8808l2042Q9338M3896K8412n9887J10845
$$ 615905 568694 648300 657121 604587 626677 597869 565827 655165 699061 727473 667586 778431
5290G78431k0432l1704n5560J2742j234j0171N4870J9159k1759O8978M8052m4684
$$ 778431 757999 726295 670735 683477 682243 672072 726942 746101 724342 793320 841372 796688
5278G96688l8484J0809l3108P2364k2136j2563N3110P6640o0713O2750J12980
$$ 796688 758204 769013 735905 808269 786133 773570 826680 903320 842607 905357 1018337
5267A018337R1728m5992m0807M1153Q2303L0066L1445O9211m315k0008L9770q691
$$ 1018337 1110065 1064073 1023266 1064419 1146722 1176788 1208233 1277444 1273129 1253121 1292891 1284200
5255A284200m085p9290K1286k461K032r9919M3919O9338L8262O4525j05152R7814
$$ 1284200 1280115 1200825 1222111 1219650 1221682 1121763 1165682 1235020 1273282 1337807 1232655 1330469
5243A330469Q5095O287J019k8076q457L6050p5926N1515J70426l8865j040N2128
$$ 1330469 1415564 1421851 1422870 1394794 1386337 1422387 1346461 1397976 1568402 1529537 1528497 1580625
5231A580625n2411j8585J52549j30629K0969k0573j07530J92280J43533N7371
$$ 1580625 1528214 1509629 1662178 1531549 1552518 1531945 1424415 1616695 1760228 1817599
5221A817599J8636j8192n209J00264N3092m483P3315N1891q6015K86687j29533
$$ 1817599 1836235 1818043 1812834 1913098 1966190 1961707 2035022 2086913 2000898 2287585 2158052
5210B158052Q795Q1863p168P5535l5075M999J52207n099P2381k8146p1159J88733
$$ 2158052 2166847 2248710 2241542 2317077 2282002 2287001 2439208 2434109 2506490 2478344 2407185 2595918
5198B595918J02117n9843Q3478P2818P7386o5060J57238P4028M5666J33936J52606
$$ 2595918 2698035 2638192 2721670 2794488 2871874 2806814 2964052 3038080 3083746 3217682 3370288
5187C370288Q242K3120J54411J99634p326M6848K02965J80141J84188R7581J62687
$$ 3370288 3378530 3401650 3556061 3755695 3748369 3795217 3998182 4178323 4362511 4460092 4622779
5176D622779Q2140J81804M6842K36640J31548J43380J47377J13806K39064K62091
$$ 4622779 4704919 4886723 4933565 5170205 5301753 5445133 5592510 5706316 5945380 6207471
5166F207471Q2170K37542J85460J08461J96681Q0943R7282J11306J38267J92327
$$ 6207471 6289641 6527183 6712643 6821104 7017785 7098728 7196010 7307316 7445583 7637910
5156G637910K51093K88472J66464J29792J62412K63358K14298J52952K61511K60990
$$ 7637910 7889003 8177475 8343939 8473731 8636143 8899501 9113799 9266751 9528262 9789252
5146I789252K87158L34839K62453K86531L60028L94281M48207M51694M81464N80829
$$ 9789252 10076410 10411249 10673702 10960233 11320261 11714542 12162749 12614443 13095907 13676736
5136A3676736M08463O07487O28432N58151O69777P97293Q01035R10578J029332
$$ 13676736 14085199 14692686 15321118 15879269 16549046 17346339 18147374 19057952 20087284
5127B0087284R71748J266459J263121J486174J505262J646271J930271J926007
$$ 20087284 21059032 22325491 23588612 25074786 26580048 28226319 30156590 32082597
5119C2082597K225816K678539K829015L173876L705114M185991M700365N445303
$$ 32082597 34308413 36986952 39815967 42989843 46694957 50880948 55581313 61026616
5111F1026616N979666O855372P839337Q518180Q916667Q998830Q799695Q120365
$$ 61026616 67006282 73861654 81700991 90219171 99135838 108134668 116934363 125054728
5103A25054728P182732O713357O388748O115649M556407J574751j910629n290645
$$ 125054728 132237460 138950817 145339565 151455214 156011621 157586372 155675743 150385098
5095A50385098p503610q549148q342752q353565q523691r044727r343046r414864
$$ 150385098 142881488 134332340 125989588 117636023 109112332 100067605 90724559 81309695
5087H1309695q631882p772018o699998n671695m886304m013574l611962l047363
$$ 81309695 72677813 64905795 58205797 52534102 47647798 43634224 40022262 36974899
5079C6974899k842412k498838k244138j953238j567894j372513j317988j203990
$$ 36974899 34132487 31633649 29389511 27436273 25868379 24495866 23177878 21973888
5071B1973888r61450q40416r18880q36362q36863p99002o64324o27322o22654
$$ 21973888 21012438 20172022 19253142 18416780 17579917 16780915 16116591 15489269 14866615
5062A4866615n83387m31039m33742m30506m40255m49283l96252k59191l21097
$$ 14866615 14283228 13852189 13418447 12987941 12547686 12098403 11702151 11442960 11121863
5053A1121863l24767m72818l08037k46171m69207l55613l46851l68766k03173
$$ 11121863 10797096 10324278 10016241 9770070 9300863 8945250 8598399 8229633 8026460
5044H026460k08352k89404k80773p3532r6508l30509j35739k21921k47917p0142
$$ 8026460 7818108 7528704 7247931 7174399 7077891 6747382 6611643 6389722 6141805 6071663
5034F071663j40421j52306p3308j69931j92834j48237j25265m9494p6569J01828
$$ 6071663 5931242 5778936 5705628 5535697 5342863 5194626 5069361 5019867 4943298 5045126
5024E045126r0284k52240j96189j45053k28486o0524j5120j23568j38515m4770
$$ 5045126 4954842 4702602 4506413 4361360 4132874 4072350 4057230 3933662 3795147 3750377
5014C750377K815j51349k1359j47038k60390n3151N6957j28725j20763n8038K2077
$$ 3750377 3753192 3601843 3580484 3433446 3173056 3119905 3176862 3048137 2927374 2869336 2891413
5003B891413j53399K4170M4115m4721l5418j45245j43320j80467J8050O2165P0898
$$ 2891413 2738014 2762184 2806299 2761578 2726160 2580915 2437595 2257128 2275178 2337343 2408241
4992B408241j5755j00731p5949k4011j06434J12910p932j49607n2401J5291j02670
$$ 2408241 2392486 2291755 2215806 2191795 2085361 2198271 2190339 2040732 1988331 2003622 1900952
4981A900952m4461M9139j17536K8136R538N784m0620j2555j01266l5334j10643
$$ 1900952 1856491 1905630 1788094 1816230 1825768 1831552 1790932 1778377 1677111 1641777 1531134
4970A531134n5284j6393Q4747J07915r3697n4333L4676j6550j71855N1137J48545
$$ 1531134 1475850 1459457 1544204 1652119 1558422 1504089 1538765 1522215 1350360 1401497 1550042
4959A550042m7876j69676j1860k5505K5969l7737l0951l5246j05537K0536J6236
$$ 1550042 1502166 1332490 1320630 1295125 1321094 1283357 1252406 1217160 1111623 1132159 1148395
4948A148395k5215l5038M5086m3781n3686l6036P08J2104J01946q7841N0604n8752
$$ 1148395 1123180 1088142 1133228 1089447 1035761 999725 1000433 1012537 1114483 1026642 1077246 1018494
4936A018494p9523o6298n1856Q4475M2532P0415N4119m8017m7842P1895n5497
$$ 1018494 938971 872673 820817 905292 947824 1018239 1072358 1024341 976499 1048394 992897
4925I92897j4858k7014P3752l4871j9695j4346P1438N2588p1307j09414N716Q8586
$$ 992897 978039 951025 1024777 989906 970211 955865 1027303 1079891 1008584 899170 904886 993472
4913I93472r2976n5077m4186J26716r5364N0873J5055j2148n7495Q5828N91j00606
$$ 993472 900496 845419 801233 927949 832585 883458 898513 886365 828870 914698 915289 814683
4901H14683l1532n2690Q3882j8481K0670J9538n9613K7845Q0727m7046m3722p2245
$$ 814683 783151 730461 814343 795862 816532 836070 776457 804302 885029 837983 794261 722016
4889G22016J56706K1297j91552j36385J33431J15815j05622Q9817M9525j51661
$$ 722016 878722 900019 708467 572082 705513 821328 715706 805523 855048 703387
4879G03387k5260P4477n076K6105K7069j7980K2430p921n7931l4182R778n3248
$$ 703387 678127 752604 747528 773633 800702 782722 805152 797231 739300 705118 714896 661648
4867F61648J39477P132j37515l8277k7950j00085L8047J54182M8374q2767K2855
$$ 661648 801125 808257 670742 632465 604515 504430 542477 696659 745033 662266 685121
4856F85121q5504L1390J03140O1157J10397j06698j32573K3919J19527k5600j07435
$$ 685121 599617 631007 734147 795304 905701 799003 666430 690349 809876 784276 676841
4845F76841K9541O9623J7025l7185j1568j23257K32992o8861l1322J21147O7329
$$ 676841 706382 776005 793030 755845 744277 621020 854012 785151 753829 874976 942305
4834I42305J09439j17197J1433Q0944J03060M4593M8603N0022N2506n5103P743
$$ 942305 1051744 934547 945980 1026924 1129984 1174577 1223180 1273202 1325708 1270605 1278348
4823A278348Q1597O1132j76660o9304R6815k1620r7893K74p8295j42452L7911
$$ 1278348 1359945 1421077 1244417 1175113 1271928 1250308 1152415 1152689 1074394 931942 969853
4812I69853o3509k3110K5519j85900l9390l1949k1278O6611j76694R2061O0605
$$ 969853 906344 883234 908753 722853 683463 651514 630236 696847 520153 612214 672819
4801F72819p659k8542j18774q177l97L4303l8889q4383M3861q84O6573L0588j45262
$$ 672819 665160 636618 517844 509667 509270 543573 504684 420301 464162 463278 529851 560439 415177
4788D15177Q9791N3145q4244p9639J55413L936M6047m6591J7626o4854r4071O2429
$$ 415177 504968 558113 473869 394230 549643 553579 599626 553035 570661 505807 411736 474165
4776D74165p499l7737j8460M176K101m15P3218m2754M4681L40J4013j1735K4597
$$ 474165 466666 428929 410469 414645 416746 416331 489549 446795 491476 491816 505829 494094 518691
4763E18691L3982j29861n663Q8970k1668j3213j05845R257O6568N9863J27666
$$ 518691 552673 422812 417149 506119 484451 471238 365393 374650 441218 501081 628747
4752F28747l7489j2971k4677m3803k9137L1884K1287N520p5023J7822J1699q3747
$$ 628747 591258 578287 553610 509807 480670 512554 533841 539361 464338 482160 493859 410112
4740D10112J22775J50905l0537o2114K968l6593j9186K3352Q7680J6014j04269
$$ 410112 532887 683792 653255 591141 594109 557516 538330 561682 649362 665376 561107
4729E61107K5777m6170l6895j06369l9892P6138J59961m7272J8931j3084m6426
$$ 561107 586884 540714 503819 397450 357558 433696 593657 546385 565316 552232 505806
4718E05806j43726O0179J22965R9233j53742n9009P0527Q318L3145L7356O8130
$$ 505806 362080 422259 545224 644457 490715 431706 502233 510551 543696 581052 649182
4707F49182j27236Q5128O7835L468j46000j6673P143J6295J15924L2258n4496
$$ 649182 521946 607074 674909 678377 532377 515704 522847 539142 655066 687324 632828
4696F32828j7239o9734q0316N1385Q2565L9900K0251p003q9483K9854K7145j9532
$$ 632828 615589 545855 465539 516924 599489 639389 659640 652637 563154 593008 620153 600621
4684F00621j06514L9239J7426M2975j3414J1401N1758p0075N7612j3932K8271
$$ 600621 494107 533346 550772 593747 580333 591734 643492 573417 631029 617097 645368
4673F45368L2838p1594j2499J33702n8889M5846P0811j43378N5601L6126N213
$$ 645368 678206 606612 594113 727815 668926 714772 785583 642205 697806 733932 739145
4662G39145l0639L1241q260j43233J24986O6349p8143N6420Q9680Q4379l7020
$$ 739145 708506 739747 731487 588254 713240 779589 701446 757866 847546 931925 894905
4651H94905n6305j63o2492p171N6159P2345P6707q5870k7762J89681K8842j01947
$$ 894905 838600 838437 775945 768774 824933 897278 973985 888115 860353 1050034 1078876 976929
4639I76929L197M5034j09827m4085N2607j17586Q8387n27j62053J00199J43249
$$ 976929 980126 1025160 915333 871248 923855 806269 894656 894129 732076 832275 975524
4628I75524R0883j17289j176J42943Q479K118K1607L3433Q7106Ml9927n9302j925
$$ 975524 1066407 949118 947942 1090885 1099364 1101482 1123089 1156522 1243628 1243632 1203705 1144403 1142478
4615A142478O82n0014q1813N5930r1775l7126m3613j7403O6690J08471k5373j50136
$$ 1142478 1143160 1093146 1011333 1067263 975488 938362 894749 877346 944036 1052507 1027134 876998
4603H76998j11961K08316k6481N3239O01K2476J04695j8446J00679q2055j6431
$$ 876998 765037 973353 946872 1000111 1000712 1023188 1127883 1109437 1210116 1128061 1111630
4592A111630j60709J544O6568N6186k2680q6047k9915J1395N8341q7775o1375
$$ 1111630 950921 952465 1019033 1075219 1052539 966492 936577 947972 1006313 918538 857163
4581H57163O402n066M6253K5396N5523M9089M0435j38331J1731K5422K435m4430
$$ 857163 863565 858499 904752 930148 985671 1034760 1075195 936864 948595 974017 976452 932022
4569I32022K0501k7268r9828J06827P6934j31752L8777J19402Q5057o8462j3395
$$ 932022 952523 925255 825427 932254 1009188 877436 916213 1035615 1120672 1052210 1038815
4558A038815L3335L341M9086J1004L732j12900n173J33842k2189j060N3040Q7842
$$ 1038815 1072150 1075491 1124577 1135581 1139313 1026413 1021240 1155082 1132893 1131833 1184873 1272715
4546A272715n1803l0102p645L5253P7719L9364j8722j9078j13886M3380k463m7204
$$ 1272715 1220912 1190810 1183165 1218418 1296137 1335501 1316779 1297701 1183815 1227195 1224732 1177528
4534A177528J03560m7534o4841J82623J04338J0546m3096M42L1905l7617J67120
$$ 1177528 1281088 1233554 1168713 1351336 1455674 1466220 1423124 1423566 1455471 1417854 1584974
4523A584974j4380J655n1430R2106K1852K4443Q0727k4869J4381k5134L1339M0915
$$ 1584974 1570594 1572249 1520819 1612925 1634777 1659220 1739947 1715078 1729459 1704325 1735664 1776579
4511A776579J8951O6888P7162l2242K0613Q8343Q6713l8470r1162Q0696J02868
$$ 1776579 1795530 1862418 1939580 1907338 1927951 2016294 2103007 2064537 1973375 2054071 2156939
4500B156939j1742J43267J10423o9202P3834j05918Q6994O6482K4500J13443J62293
$$ 2156939 2145197 2288464 2398887 2329685 2403519 2297601 2384595 2451077 2475577 2589020 2751313
4489B751313j05954r5655J23782J105j64127P6051J46322L3534K1662K2997Q0323
$$ 2751313 2645359 2549704 2673486 2674591 2510464 2586515 2732837 2766371 2788033 2811030 2891353
4478B891353J71346Q870P784R2373q157K7264M1440j04284J25936J09354l8992
$$ 2891353 3062699 3071569 3079353 3171726 3163569 3190833 3232273 3127989 3253925 3363279 3324287
4467C324287R8988R3716L2313k8186J80963R2347L8151J77917M8362K09783J73754
$$ 3324287 3423275 3516991 3549304 3521118 3702081 3794428 3832579 4010496 4058858 4268641 4442395
4456D442395J73058K30822J45200J34121j24834J4181j14499j84752j38516k0445
$$ 4442395 4615453 4846275 4991475 5125596 5000762 5014943 4900444 4715692 4577176 4556731
4446D556731k9522k5398m7802O3675Q1826N8352M6334J03209j35306K04326J10099
$$ 4556731 4527209 4501811 4454009 4517684 4599510 4657862 4704196 4807405 4672099 4876425 4986524
4435D986524n481P675n349J84119N8759J41232R0371J56028J29607J18526R5808
$$ 4986524 4981043 4988718 4983369 5167488 5226247 5367479 5457850 5613878 5743485 5862011 5957819
4424E957819J25085J04778K22254K03223J62583R7603J98593K25707J19046J52522
$$ 5957819 6082904 6187682 6409936 6613159 6775742 6873345 7071938 7297645 7416691 7569213
4414G569213K34520K01777K50036J20948J65203J43046J79841K92040K90716J89854
$$ 7569213 7803733 8005510 8255546 8376494 8541697 8684743 8864584 9156624 9447340 9637194
4404I637194K30450L58253K98303M09452K93186L01655N24298M74084L59936M70352
$$ 9637194 9867644 10225897 10524200 10933652 11226838 11528493 12052791 12526875 12886811 13357163
4394A3357163M98659N69733N82732O31598N71134O81558Q72676Q87457Q94387
$$ 13357163 13855822 14425555 15008287 15639885 16211019 16892577 17765253 18652710 19547097
4385A9547097R88889J197252J303132J461107J866048J853618K003852K206039
$$ 19547097 20535986 21733238 23036370 24497477 26363525 28217143 30220995 32427034
4377C2427034K412772K458017K536743K306305J804172J444447J228844R53832
$$ 32427034 34839806 37297823 39834566 42140871 43945043 45389490 46618334 47572166
4369D7572166M27694Q7052j52653k76919k96544k02856J21298Q17249J049817
$$ 47572166 47999860 48086912 47934259 47657340 47360796 47157940 47279238 48096487 49146304
4360D9146304J452764K055282K737070L151369L900226M131898M630076M956463
$$ 49146304 50599068 52654350 55391420 58542789 62443015 66574913 71204989 76161452
4352G6161452M849385M775566M522153M083761L393308K359687N67298j643959
$$ 76161452 81010837 85786403 90308556 94392317 97785625 100145312 100712610 99068651
4344I9068651l914188n702443o534671n986471n076174l867747k932678j807310
$$ 99068651 95154463 89452020 82917349 76930878 71854704 67986957 65054279 63246969
4336F3246969q40803l07175M48833R93411J482400K243679K846020L372325L341275
$$ 63246969 62406166 62098991 62547824 63541235 65023635 67267314 70113334 73485659 76826934
4327G6826934K995368K025288R68187o17188k172993l437379m602454n439099
$$ 76826934 79822302 81847590 82815777 82198589 80025596 76588217 71985763 66546664
4319F6546664n477754n161962m690901m097923l609085k984237k560035k155672
$$ 66546664 61068910 55906948 51216047 47118124 43509039 40524802 37964767 35809095
4311C5809095j923879j670725j559106j389150j037267r84288r30013p66088o98515
$$ 35809095 33885216 32214491 30655385 29266235 28228968 27244680 26314667 25548579 24850064
4302B4850064l88576l75059l81270l89689k75831j91192J2685k50846k08118q1697
$$ 24850064 24461488 24086429 23705159 23315470 23039639 22848447 22861132 22610286 22402168 22320471
4292B2320471p6334o2559J10604J15745n6929j3859J86869J11443K55567L63593
$$ 22320471 22244137 22181578 22292182 22407927 22350998 22337139 22524008 22635451 22891018 23254611
4282B3254611L11926L67119N03845N74528O00384O33271O40416O53516R07668
$$ 23254611 23566537 23933656 24437501 25012029 25612413 26245684 26886100 27539616 28447284
4273B8447284J016912R12831J138958J220140J502905J669511J650620J988430
$$ 28447284 29464196 30377027 31515985 32736125 34239030 35908541 37559161 39547591
4265C9547591K308298K478667L020761L030248L241808L408866L490530L529441
$$ 39547591 41855889 44334556 47355317 50385565 53627373 57036239 60526769 64056210
4257F4056210L370862L287359L039116K708170K344099J951518J358494R08498
$$ 64056210 67427072 70714431 73753547 76461717 78805816 80757334 82115828 83024326
4249H3024326N25683j68456n89744o11246o12063o30714k69191m9059L11340R04319
$$ 83024326 83550009 83381553 82791809 82180563 81568500 80937786 80668595 80619536 80930876 81835195
4239H1835195J268541J645821J888215K072183K206122K195485K189712K364191
$$ 81835195 83103736 84749557 86637772 88709955 90916077 93111562 95301274 97665465
4231I7665465K069822J744546J043984L04339n19505j230511j457475j844614
$$ 97665465 99735287 101479833 102523817 102828156 102308651 101078140 99620665 97776051
4223I7776051j905823k264582k315303k310813k409304j992807j749932j354974
$$ 97776051 95870228 93605646 91290343 88979530 86570226 84577419 82827487 81472513
4215H1472513q21370k50912L1386K51209O42572J091236J336186J497877J643375
$$ 81472513 80651143 80400231 80431617 80682826 81325398 82416634 83752820 85250697 86894072
4206H6894072J742937J741851J760300J916970J819701K033196K324564K768454
$$ 86894072 88637009 90378860 92139160 94056130 95875831 97909027 100233591 103002045
4198A03002045L366736M164028N119531O202719P427775Q819642J0519239J2433714
$$ 103002045 106368781 110532809 115652340 121855059 129282834 138102476 148621715 161055429
4190A61055429J4465703J6940080J9690085K2843234K6080877K8325486K6403426
$$ 161055429 175521132 192461212 212151297 234994531 261075408 289400894 315804320
4183C15804320J7286602J913834j5664405k9770966l6426237l5561825l0091286
$$ 315804320 333090922 335004756 319340351 289569385 253143148 217581323 187490037
4176A87490037k4063997j8949074j5196604j2526216j0527481r273196q260173
$$ 187490037 163426040 144476966 129280362 116754146 106226665 96953469 88693296
4169H8693296p290558o418745n547288n061860m357373l787623l457297l000133
$$ 88693296 81402738 74983993 69436705 64374845 60017472 56229849 52772552 49772419
4161D9772419k678639k218299k100832j790655j444570j455994j479586j387777
$$ 49772419 47093780 44875481 42774649 40983994 39539424 38083430 36603844 35216067
4153C5216067j217613j254527j135137j140550j295620j252938j246289r02280
$$ 35216067 33998454 32743927 31608790 30468240 29172620 27919682 26673393 25771113
4145B5771113r04706q34061q35190q16866p73168p43836o56510n97905n48371
$$ 25771113 24866407 24032346 23197156 22380290 21607122 20863286 20206776 19608871 19060500
4136A9060500n87198n71932n79189m08541l74916n17687m01166m87986m22898
$$ 19060500 18473302 17901370 17322181 16913640 16538724 16021037 15619871 15131885 14708987
4127A4708987l95271l69188k27068l91028m52263l84180k90343l11757l80184
$$ 14708987 14313716 13944528 13717460 13326432 12874169 12489989 12199646 11887889 11507705
4118A1507705l32678k25091j85694k25055j97830j23149j62939k37215k10447
$$ 11507705 11175027 10949936 10764242 10539187 10341357 10218208 10055269 9818054 9607607
4109I607607j98679k84428k61785o4427j19454j60196j05746k53493j59066j16221
$$ 9607607 9408928 9124500 8862715 8798288 8678834 8518638 8412892 8159399 8000333 7884112
4099G884112j67280j65035k89609m2192j03472j09324j91909j66095k2669j86038
$$ 7884112 7716832 7551797 7262188 7219996 7116524 7007200 6815291 6649196 6626527 6440489
4089F440489j64873j63732j43674j38090m7092L2603o443j9520k23831l3091o2418
$$ 6440489 6275616 6111884 5968210 5830120 5783028 5815631 5809188 5789668 5565837 5532746 5470328
4078E470328j01727m6324m7739p2496j79553j46484Q2313K4649j37500r296j12717
$$ 5470328 5368601 5322277 5274538 5202042 5022489 4876005 4958318 4982967 4845467 4836171 4723454
4067D723454n9973o897j1251k5791k07894j13131n9147k11603n6732m043m3484
$$ 4723454 4663481 4656584 4645333 4619542 4411648 4298517 4239370 4027767 3971035 3966992 3923508
4056C923508p2271m1687j134m1298j07813n7971j74366N0079l227r6055p7683
$$ 3923508 3851237 3809550 3808416 3767118 3659305 3601334 3426968 3477047 3473820 3377765 3300082
4045C300082j7603j02236k1836n6980j00127j54793j70751m2813n8500q8626J1005
$$ 3300082 3282479 3180243 3158407 3101427 3001300 2846507 2675756 2632943 2574443 2485817 2496822
4034B496822O7838k9089J3145L5214n7419j14326m8296j00486K6005l6931m9124
$$ 2496822 2564660 2535571 2548716 2583930 2526511 2412185 2363889 2263403 2289408 2252477 2203353
4023B203353l0026L4054L8523j32441J353l2838j51064m077J21695O6440j2702
$$ 2203353 2173327 2207381 2245904 2113463 2114816 2081978 1930914 1926837 2048532 2114972 2102270
4012B102270N9776j41965N5130J17182q0685J25803p7838o1618J47063l8637o8566
$$ 2102270 2162046 2020081 2075211 2192393 2111708 2237511 2159673 2098055 2245118 2206481 2137915
4001B137915J2683p4052n9523O2713m7982n9303O2809j5749j06375K0031Q7691
$$ 2137915 2150598 2076546 2017023 2079736 2031754 1972451 2035260 2019511 1913136 1933167 2020858
3990B020858j27316J1878m2948k6409P0671o1312J0502k2112j07726N3095j4262
$$ 2020858 1893542 1905420 1862472 1836063 1906734 1845422 1855924 1833812 1726086 1779181 1764919
3979A764919j47459k6352M1824n8246l1461o9978K6066N5227P532J11617m2591
$$ 1764919 1617460 1591108 1632932 1574686 1543225 1473247 1499313 1554540 1562072 1673689 1631098
3968A631098R0348m7810l0369J19564k426j06033j94017l828L8803r7941J6832
$$ 1631098 1721446 1673636 1643267 1762831 1760405 1654372 1460355 1456527 1495330 1397389 1414221
3957A414221n4925O5103r9915n5347J17479o6643Q5321r6132r4244n2235K1668
$$ 1414221 1359296 1424399 1324484 1269137 1386616 1319973 1405294 1309162 1214918 1162683 1184351
3946A184351n1281M9294N7276p5852J13955O2509j18009K40278q4248k12696J03631
$$ 1184351 1133070 1182364 1239640 1163788 1277743 1340252 1222243 1462521 1378273 1165577 1269208
3935A269208j14447J33569o564k08498q4075J13679J50582j15026Q557o4114l6990
$$ 1269208 1154761 1288330 1281766 1073268 989193 1102872 1253454 1138428 1146985 1082871 1045881
3924A045881k911R2974l967J46072J52997n309K6714q7561M8773P6790R6635J07104
$$ 1045881 1042970 1135944 1131977 1278049 1431046 1425737 1452451 1364890 1413663 1490453 1587088 1694192
3912A694192K30637R5416J01097L2328J57433j77341k16362r2490p6315j38311
$$ 1694192 1924829 2020245 2121342 2153670 2311103 2133762 1917400 1824910 1748595 1610284
3902A610284j85357j59192j68374k06774R0364P4039j48627o4808o8574R1821
$$ 1610284 1424927 1265735 1097361 890587 980951 1054990 906363 841555 772981 864802
3892H64802o618j07942k1898j77982P4208O0173J04456m6574j35742K5664m5078
$$ 864802 858184 750242 728344 550362 624570 684743 789199 742625 606883 632547 587469
3881E87469J4819m9788o1291j6791l5852R1911P5779o5069J6022o6888q4864Q2282
$$ 587469 602288 552500 491209 474418 438566 530477 606256 541187 557209 490321 405457 487739
3869D87739R272M4413m3504j3095P9705j25274o0592M3754L3447j505M9623L239
$$ 487739 497011 541424 497920 484825 564530 439256 378664 422418 455865 454360 503983 507222
3857E07222o964j17031L5020n5094q4604L5201K9565J3343k3359J8613N8947r2256
$$ 507222 500258 383227 418247 363153 278549 313750 343315 356658 333299 351912 410859 318603
3845C18603l8629P6739o640n268m0712k71o0955J01290L1471K7816P239J7682
$$ 318603 279974 356713 350073 344805 304093 303822 242867 344157 375628 403444 410683 428365
3833D28365P3920j18803m0888L5927n4958J1626j10621K6286J26209L2778J15971
$$ 428365 502285 383482 342594 378521 323563 335189 224568 250854 377063 409841 525812
3822E25812p0092J6813m9562l6457M4762r8431p9252N2171k2712l2178n2197J1332
$$ 525812 455720 472533 422971 386514 431276 332845 253593 305764 283052 250874 198677 210009
3810B10009Q7694p1633j8122J56176j57335L7549k8212j3937R6692N028k15142
$$ 210009 297703 226070 207948 364124 206789 244338 216126 202189 298881 303909 88767
3799H8767M8792J75869L316K4449N7773j02878q4903n3863J53375m115k4267P7462
$$ 88767 137559 313428 316744 341193 398966 296088 211185 157322 310697 306582 282315 359777
3787C59777l0655N6157L3850j03010J03833r5201j03545j6421k4969j1405j0234
$$ 359777 329122 385279 419129 316119 419952 324751 221206 204785 179816 168411 158177
3776A58177L325p9496K5887L1201j0318J7909J92052k5635o6302j9741j955r1719
$$ 158177 161502 82006 107893 139094 128776 146685 338737 313102 246800 227059 225104 133385
3764A33385J02969M5399m3984q534n6209M5279j2157J9337K625r3968N0115n0601
$$ 133385 236354 281753 237769 229235 173026 218305 206148 225485 228110 134142 184257 133656
3752A33656N8457L5319l9849q6162J22490N1276J149n3386q7021N8693m3065o7728
$$ 133656 192113 227432 187583 101421 223911 275187 276336 222950 135929 194622 151557 83829
3740H3829J03827J1594k8931j1395Q1639P249m4452o4384O7322R179m7635j2008
$$ 83829 187656 199250 170319 158924 240563 247812 203360 138976 206298 215477 167842 155834
3728A55834Q238k1900j32631J75006J9561n7348J06219q1403p4522k0521L7168
$$ 155834 164072 142172 9541 184547 204108 146760 252979 171576 97054 76533 113701
3717A13701k1289J58968n0456j04238k689q4995J31744M5527l2805Q5662o5814
$$ 113701 92412 251380 200924 96686 93997 9002 140746 186273 153468 239130 173316
3706A73316n6004j02891n5553J26928L2811m1037k7039L5444j8407o1010L9814
$$ 173316 117312 14421 -41132 85796 118607 77570 50531 85975 67568 6558 46372
3695D6372K5292L6626J31650m6492j93680K5828L4677K6924K4199m2241L635J7213
$$ 46372 71664 108290 239940 193448 -232 25596 60273 87197 111396 69155 72790 90003
3683I0003J10030j18901k4190P0347l5028l6850O9617n0728k540l4761j1127L3935
$$ 90003 200033 81132 56942 127289 92261 55411 125028 74300 71760 36999 25872 59807
3671E9807P513m4836M3906P557j33743j3135K1062R1222P8139J96175k08736n1974
$$ 59807 67320 22484 66390 73947 -59796 -72931 -51869 39353 117492 313667 104931 52957
3659E2957M1372R8639o1925n0915l10l5358K9531J1376j4953k9780o76n4883J83110
$$ 52957 94329 192968 131043 80128 79818 44460 73991 85367 70414 40634 39958 -14925 168185
3646A68185j62016o740J20421m1572p1198Q922O8399j19796q0913J65264K5028
$$ 168185 6169 -571 119850 78278 7080 16002 84401 -35395 -116308 48956 73984
3635G3984j8904m2049Q2215L1693n446K7624K2164r0720j55263k36O3866Q1045
$$ 73984 55080 13031 95246 126939 121493 149117 171281 80561 -74702 -74938 -11072 69973
3623F9973r7410j52222J20129O9676j798m7907P0711j6818O5535j0332P927K7524
$$ 69973 -27437 -179659 -59530 10146 8348 -39559 31152 14334 79869 69537 77464 104988
3611A04988j56909K3434K5980M4188L8820j05482O3101N3157N6050L7828o7385
$$ 104988 -51921 -28487 -2507 41681 80501 -24981 38120 91277 147327 185155 117770
3600A17770l6020j8589J4455l8081L3874o3519l7335N1838j8793p840L3654l0684
$$ 117770 81750 63161 77616 39535 73409 9890 -27445 24393 5600 -2240 31414 730
3588G30R6085K5887j4130k5252L001M7609n9917l6025l5927k507R0244k10484
$$ 730 96815 122702 108572 83320 86321 133930 74013 37988 2061 -446 89798 -120686
3576a20686M0211J41940j58578N5768R4611M8415n279q8238r193K0074l5115J3860
$$ -120686 -80475 61465 -97113 -41345 53266 101681 96402 8164 -1029 19045 -16070 -2210
3564b210o2967J6661o1806j8443J93509m7142j3739j5264m9485J6402J12235K1815
$$ -2210 -65177 -48516 -110322 -128765 64744 17602 3863 -11401 -60886 -44484 67751 89566
3552H9566r8037N6965k7192Q7425n1884j6784n6273m85P0819l8527q9791O2744
$$ 89566 -8471 48494 21302 108727 56843 40059 -16214 -16699 54120 15593 -74198 -11454
3540a1454K8850n0991J04220p3744m6039M9140N7903k5689q7755R3325J2225l7344
$$ -11454 17396 -33595 70625 -3119 -49158 -18 57885 32196 -55559 37766 49991 12647
3528A2647O5709J6131r8164N3603m1814j36438l0477j2799J75943L4770j3998
$$ 12647 78356 94487 -3677 49926 8112 -128326 -158803 -171602 4341 39111 25113
3517B5113j8843Q1887k2287K5005k357o3361n732r5846m1843k404L8340P3387
$$ 25113 6270 88157 65870 90875 88518 25157 19425 -76421 -118264 -120668 -82328 -8941
3505h941N9052r6938k2619R5300K6241l6233n0239P6939m791O1985l5516k8810
$$ -8941 50111 -46827 -69446 25854 52095 15862 -34377 42562 37771 99756 64240 35430
3493C5430m6184n6799P2552J04387m4886K5265p249K1331p835K1466l9261q7865
$$ 35430 -10754 -67553 4999 109386 64500 89765 82516 103847 96012 117478 78217 -9648
3481i648l6436P63l485l7014P4619J80473r2461j68065m3433J32238M0366M9744
$$ -9648 -46084 -45321 -48806 -85820 -11201 169272 76811 -91254 -134687 -2449 37917 87661
3469H7661m7732N1282m5412l8831n4733j6410J05803j03835Q5730m1420J7691
$$ 87661 39929 91211 45799 6968 -47765 -64175 41628 -62207 23523 -17897 -206
3458b06q106J7259J44296k1283l3976J4039l0326m2651r225R736M7445l1860L0097
$$ -206 -8312 8947 153243 131960 97984 112023 81697 39046 29821 39557 87002 55142 85239
3445H5239m1684j47162P8543Q6792O4511O9138N6964r3858R6623p2718q9874L6235
$$ 85239 43555 -103607 -25064 61728 126239 195377 252341 158483 255106 182388 92514 128749
3433A28749j42724J01120M558O076M2926P5572R4736p2509j17806k0326P3628
$$ 128749 -13975 87145 91703 97779 140705 216277 311013 238504 120698 100372 174000
3422A74000M3908M6891r0776K1684j24059J28866L3223p3120j8537M4845j53849
$$ 174000 217908 264799 174023 195707 71648 200514 233737 160617 142080 186925 33076
3411C3076M9261M8446Q5251Q621n9444M6597K8278j0805r9288k9498J8095M5242
$$ 33076 82337 130783 216034 224655 165211 211808 240086 229281 129993 100495 118590 163832
3399A63832R3464p2588q8108Q5608K7445l1940m7140o4547O5378M9881K0778q0590
$$ 163832 257296 184708 96600 182208 209653 177713 130573 66026 131404 181285 202063 121473
3387A21473l3283L5282q1485m025P9901j715Q7002q1500O5847o8989N4822j5892
$$ 121473 88190 123472 41987 37962 117863 116148 203150 121650 187497 118508 173330 157438
3375A57438j6361N5032j11095O6652q366k0890j0702m1481k3959J976j26295R1087
$$ 157438 141077 196109 85014 151666 143300 122410 111708 70227 46268 48244 -78051 13036
3363A3036N4319Q3986n5492K4415j3172Q77L864R6849j14117K8669k0460j3372
$$ 13036 67355 151341 95849 120264 107092 107969 111833 208682 94565 123234 102774 89402
3351H9402r0212O7261P628k3170P9827K4628K1194n0535q5811K3901M6053K2794
$$ 89402 -810 66451 74079 50909 130736 155364 176558 126023 40212 64113 110166 132960
3339A32960J01675P690m5334j51215p1075J14585R0339k4497m3947j4650M2078
$$ 132960 234635 242325 196991 45776 -25299 89286 179625 155128 111181 96531 138609
3328A38609j04579l4745l3929j2233J5014J0643J65794J03621p1503q3543R185
$$ 138609 34030 -715 -34644 -46877 -31863 -21220 144574 248195 176692 93149 102334
3317A02334N724L6692l9393k8505J8478J7658N9098m5030p2510j08365M1499J76691
$$ 102334 108058 144750 105357 76852 95330 112988 172086 127056 54546 -53819 -12320 164371
3305A64371j7212r4980l3006n0522N0927k0062j27426Q5157J09353J5953o797
$$ 164371 147159 52179 19173 -31349 19578 -484 -127910 -42753 66600 82553 75756
3294G5756L8624L2205r3005l0248N0096n0907O8220J4302j49581R2231K5679k4416
$$ 75756 114380 146585 53580 23332 73428 22521 90741 105043 -44538 47693 73372 48956
3282D8956k8952p1017J30790l308M1199P425j13036o1120J18232N5487m0547K5019
$$ 48956 20004 -51013 79777 76469 117668 125093 12057 -49063 69169 124656 84109 109128
3270A09128q2720M7240Q0674j15746K9620n8521n7713J46226j12542o796o4801
$$ 109128 26408 73648 154322 38576 68196 9675 -48038 98188 -14354 -21150 -85951
3259h5951O7068m8288j039L9037J6615l20j5417r710k7295L7801m0015J21988
$$ -85951 -18883 -67171 -68210 -29173 -12558 -12878 -28295 -38005 -65300 -27499 -67514 54474
3247E4474L6247n4093q244n7241n6183J14021J9083J5471K482m2068Q9691j71632
$$ 54474 90721 36628 28384 -28857 -85040 28981 48064 63535 66017 23949 113640 -57992
3235e7992Q8590J432j17089p6234O2479J24914l8633j8641O5449o7481m015n1342
$$ -57992 30598 32030 -85059 -161293 -98814 26100 -12533 -31174 34275 -33206 -37221 -88563
3223h8563J4526J49205j49347k2643J15424N0863o0855J39669j19781k4037j5729
$$ -88563 -74037 75168 -74179 -96822 18602 69465 8610 148279 28498 4461 -11268
3212a1268o1676O3173R3990j22269N4211L3343n6888L8747l6511j04903N8356
$$ -11268 -72944 -9771 84219 -38050 16161 49504 -7384 31363 -5148 -110051 -51695
3201e1695O3629K0807N1763L2199j00478p2472J15687k0937l6997R3484j02860
$$ -51695 11934 32741 84504 116703 16225 -56247 59440 38503 1506 94990 -7870
3190g870n3114R864J7021J04868N045L6859o712n7796k2038m531L2654O2633o7772
$$ -7870 -60984 -51120 -34099 70769 75814 112673 105961 48165 26127 21596 54250 116883 49111
3177D9111Q5125k11258K7323J14300l4716p6051O8812J16914j5978K1707m6383
$$ 49111 134236 -77022 -49699 64601 29885 -46166 22646 139560 123582 145289 98906
3166I8906r9043p7395M3478P4065k8169k752P0248Q207L9609K0161l5834n1200
$$ 98906 -137 -77532 -34054 40011 11842 9090 79338 87545 127154 147315 111481 60281
3154F0281n9095K2228O9365J0701M7176j2799l5382J5639O0298m8988O6709r3697
$$ 60281 1186 23414 92779 103480 150656 137857 102475 118114 178412 129424 196133 102436
3142A02436P609j6108j5051K29746m1051j32813N4571l5078q4942J4327J6100
$$ 102436 110045 93937 78886 308632 267581 134768 189339 154261 69319 83646 99746
3131I9746K27274r3922j2815J6169R7708K5529O1660m450O8643L655n6412L0583
$$ 99746 327020 233098 220283 236452 334160 359689 421349 416899 485542 489197 432785 463368
3119D63368K3069M2755j0557n3665j4358J4626M018k4795j4690l7437l8794M6458
$$ 463368 486437 529192 518635 464970 450612 465238 469256 444461 429771 392334 353540 399998
3107C99998q2767K2034P9324m136l5911l1358j3003k0831j633R8575l6524r876
$$ 399998 317231 339265 418589 414453 378542 347184 334181 313350 311717 410292 373768 363892
3095C63892P9291P2211l2928R7742J67386N1210P1343l3365L3639K18337l372
$$ 363892 443183 515394 482466 580208 747594 798804 870147 836782 870421 1088758 1085386
3084A085386k30855j06367j42766m8389l7469p3884R3571j12693j9411P8030M9230
$$ 1085386 854531 748164 605398 557009 519540 445656 539227 426534 407123 485153 534383
3073E34383q7960J1549m4602p4288R90P3876R2981N6821P4097J61190L5196N292
$$ 534383 446423 457972 413370 339082 340072 413948 506929 563750 637847 799037 834233 839525
3061H39525M4438O7995K45817J75669K12296P8067j32672k72579k51325j64370
$$ 839525 883963 951958 1197775 1373444 1585740 1663807 1531135 1258556 1007231 842861
3051H42861j37613j5772r3444r7303q6185N8423o6309n756N7799m6824P4654o9180
$$ 842861 705248 689476 596032 498729 412544 470967 404658 398902 456701 409877 484531 415351
3039D15351o3307M9319M188R122N1192N1962m2257J09971J8369K01J90644J97981
$$ 415351 352044 401363 405551 414673 465865 517827 475570 585541 603910 604111 794755 992736
3027I92736n0808j95172j64841j25521o2433l9159l2440j42560O7713R949M612
$$ 992736 941928 746756 581915 456394 393961 354802 322362 179802 247515 257464 262076
3016B62076j45867k123J07254j24317n1100j5892N6319j6646L1620M6876n1291
$$ 262076 116209 114086 221340 97023 45923 30031 86350 69704 101324 148200 96909
3005I6909N5165j05111n8164Q1288n8941q756P1561P0827K680q6454q6954M7075
$$ 96909 152074 46963 -11201 70087 11146 2390 73951 144778 147458 61004 -25950 21125
2993B1125M7855k3961N9647N7425j04188O4316N2618K6082j39194j22908P81O848
$$ 21125 68980 45019 104666 162091 57903 122219 174837 200919 61725 -61183 -60402 -53554
2981e3554n5707L3777J04689q9018J2603Q8233j3098j16854J33594O557k4737
$$ -53554 -109261 -75484 29205 -59813 -47210 41023 27925 -88929 44665 51222 26485
2970B6485m4711N4810O783l7117o741p4369R9933R2022Q5167j26186p8991R0488
$$ 26485 -18226 36584 43367 6250 -491 -74860 25073 117095 202262 76076 -2915 87573
2958H7573n2331j4134J3925r3654J2574m0102P9412P4618r317j0731J6720j863
$$ 87573 35242 21108 35033 -58621 -46047 -86149 -6737 67881 58564 47833 64553 62690
2946F2690j81176J9323l3161P8422J16597R7526r9155j3801m0133k878L3061O7724
$$ 62690 -118486 -99163 -132324 -53902 62695 160221 61066 47265 7132 4254 37315 105039
2934A05039m1149j12541R8582J2620j43422n4840M2242o999Q26L5044m3610J3134
$$ 105039 63890 -48651 49931 62551 -80871 -135711 -93469 -100468 -99642 -64598 -108208 -95074
2922i5074P5375J5032n5657p5625P9018K257M2982m6159l4517M0175n9387P7116
$$ -95074 -19699 -4667 -60324 -135949 -56931 -54674 -11692 -57851 -92368 -52193 -111580 -34464
2910c4464j9305j41897J3152M6245M6361N7930L0390M039n2552N0882N2831o588
$$ -34464 -53769 -195666 -182514 -136269 -89908 -31978 -1588 2451 -50101 781 53612 47024
2898D7024k9818p9799k1603P1408k4908M8009o1529Q022k2656N6514N8037j09865
$$ 47024 17206 -62593 -84196 -12788 -37696 10313 -51216 -43194 -65850 -9336 48701 -61164
2886f1164L9087m8306M741M4694M6830n1529j8340L4533L6103l7526n8867J2106
$$ -61164 -22077 -70383 -65642 -20948 25882 -25647 -43987 -9454 26649 -10877 -69744 -57638
2874e7638N5834m7612R3958n2002K0002l3746M2356k0209k6924j9213K7901K6797
$$ -57638 -1804 -49416 44542 -7460 12542 -21204 21152 943 -25981 -45194 -17293 9504
2862I504j11457K1240Q4277k9251p3657M9082L1125k2502l0348j4987j4078L0960
$$ 9504 -101953 -80713 3564 -25687 -99344 -50262 -19137 -41639 -71987 -86974 -101052 -70092
2850g0092q392P3160J24484r7338K8595L4028j24544K2008L1462k0355R7920L8195
$$ -70092 -78484 -5324 119160 21822 50417 84445 -40099 -18091 13371 -6984 90936 129131
2838A29131l4608k2519j00351N0998o4567k6388J03549R5069L5683j04981n0416
$$ 129131 94523 72004 -28347 22651 -41916 -68304 35245 130314 165997 61016 10600
2827A0600j5579K2210P6132j32725L5452N5529l2242m1878M8861q333J0837K909
$$ 10600 -4979 17231 93363 -39362 -3910 51619 19377 -22501 26360 18027 28864 31773
2815C1773q0249j06435J47283P9067o8094K4156L8180l1448l6739m1264l6601
$$ 31773 -48476 -154911 -7628 71439 3345 27501 65681 34233 -2506 -43770 -80371
2804h0371L8278P9924N4844j23785j5730j51111R6650J50427J20967j21580J07879
$$ -80371 -42093 37831 92675 -31110 -46840 -197951 -101301 49126 170093 48513 156392
2793A56392M2934k01251o4788K8M7814L0837P4022N9594q1154m1232Q945M8823
$$ 156392 199326 -1925 -66713 -66685 -18871 11966 85988 145582 64428 23196 32141 80964
2781H0964J3277l0931j40477Q4045m7618O1573J5403j45441R619J3592J20662
$$ 80964 94241 63310 -77167 6878 -40740 20833 36236 -109205 -99586 -85994 34668
2770C4668j5023K0160m9142M2621j4123K5022j12734l4563J33594N9619O3283
$$ 34668 19645 39805 -9337 33284 19161 44183 -68551 -103114 30480 90099 153382
2759A53382j3492j18587K644k6251R1557l957K998j08544l9936K9596m7936N0147
$$ 153382 139890 21303 23947 -2304 89253 85296 88294 -20250 -60186 -30590 -78526 -28379
2747b8379N9144J9526J9599j12067J9327k1893K1981L2005L2845m2887o9557j1760
$$ -28379 30765 50291 69890 -42177 -22850 -44743 -22762 9243 42088 -799 -70356 -82116
2735h2116r510O9347K6707k3124k1413m1598p2009P2055L0808L4943j36956Q7499
$$ -82116 -91626 -22279 4428 -18696 -40109 -81707 -153716 -81661 -50853 -15910 -152866 -65367
2723f5367r240m0871J03468p0913J3370M337j7305K3678k7142J59757O152l8313
$$ -65367 -74607 -115478 -12010 -82923 -69553 -65216 -82521 -58843 -85985 73772 79924 41611
2711D1611l6190j3887n9487j2429l8722K2268J24659l1486j4511j24364L6604
$$ 41611 5421 -8466 -67953 -80382 -119104 -96836 27823 -3663 -18174 -142538 -105934
2700a05934M5022M6363n0077j08628J38883L2609p5801m4158N0860Q2809P1785
$$ -105934 -60912 -14549 -64626 -173254 -34371 -1762 -77563 -121721 -70861 11948 83733
2689H3733j02479O2375Q5909j50912M6961j1234k473l2841j1446K8623N756l2788
$$ 83733 -18746 43629 129538 -21374 25587 14353 11880 -20961 -32407 -3784 1972 -30816
2677c0816R0134l1384q8533l7105N5325p4698l8290J06927N2466N8839n4018r794
$$ -30816 59318 27934 -60599 -97704 -42379 -117077 -155367 -48440 4026 62865 8847 -947
2665i47j27906R0279J21665J9455j29536j19523R5695N3725j240K443O5308n7367
$$ -947 -128853 -38574 83091 102546 -26990 -146513 -50818 2907 1667 4110 69418 12051
2653A2051J2350p7306r8957P6559P8122j20088M8242k8798j6552J52531j9797
$$ 12051 24401 -52905 -151862 -75303 2819 -117269 -69027 -97825 -114377 38154 18357
2642A8357J4685n4906P0282k1172o7541J277k1973n1562q351J39719O14l7816
$$ 18357 33042 -21864 48418 27246 -40295 -39018 -60991 -112553 -120904 18815 19429 -18387
2630a8387K1040n4741j0879Q0462J4304p6698J2113l4426l7352M4543n6777J6976
$$ -18387 2653 -52088 -62967 17495 31799 -44899 -32786 -67212 -104564 -60021 -116798 -99822
2618i9822R757K730P6285P1402O1779p833o9533J2685J0092o3246q7398J62489
$$ -99822 -90065 -87335 -11050 60352 122131 114298 44765 57450 67542 4296 -83102 79387
2606G9387r5283r9232L6436L9485k0311j76722L1357J11797J39690J7823m5939
$$ 79387 -15896 -115128 -78692 -39207 -59518 -236240 -204883 -93086 46604 64427 18488
2595A8488p0495k8595q9674R6898N1092M087l9836q6072j8832k0476Q4888J12816
$$ 18488 -52007 -80602 -170276 -73378 -22286 -18199 -58035 -144107 -162939 -183415 -98527 14289
2583A4289q6310k4678k527M627J33n0012m7118L0645J7418J7917O1307J5512l9190
$$ 14289 -72021 -96699 -99226 -94599 -94466 -144478 -191596 -160951 -143533 -125616 -64309 -48797 -87987
2570h7987O139m9505m6031J23851L0958J3809j18516m1185J00801k3537P827o368
$$ -87987 -81848 -131353 -177384 -53533 -22575 -8766 -127282 -168467 -67666 -91203 -83376 -89744
2558h9744M0120P3087m7838j56677J2608O1873K17l6504J62878J082l1485J7526
$$ -89744 -49624 23463 -24375 -181052 -168444 -106571 -106354 -142858 20020 21102 -10383 7143
2546G143J1652r920p112M3398j15753k6200K6235M8856O8279l56L6657j22044
$$ 7143 18795 8875 1763 45161 -70592 -96792 -70557 -21701 46578 46222 82879 -39165
2534c9165K1477p6653m0464K6519O0457K0591j5005o0162N4571L2858j13827O5981
$$ -39165 -17688 -94341 -134805 -108286 -47829 -27238 -42243 -102405 -47834 -14976 -128803 -62822
2522f2822L940M4664o1783K3588q8484L2485O6920M1300o9303n7100L6250j8352
$$ -62822 -58882 -14218 -76001 -52413 -140897 -108412 -41492 -192 -69495 -126595 -90345 -108697
2510a08697J5846J11924n042K9368n0903k809j2789r0327J06584p469O529R712
$$ -108697 -92851 19073 14031 43399 -7504 -10313 -23102 -113429 -6845 -14314 -7785 1927
2498A927k4870l3149M391N5342q9079J9213L8801r244p5670J14500m0226N6l4351
$$ 1927 -22943 -56092 -51701 3641 -85438 -66225 -27424 -36668 -112338 2162 -38064 -38008 -72359
2485g2359J0885M2613K8226Q6344q7490L5178m7982j42177J27602M2985k9133
$$ -72359 -61474 -18861 9365 95709 8219 43397 -4585 -146762 -19160 23825 -5308
2474e308o9098m66n342l5391P2286J27843L9278j26280J2901l48m5919N2690r4080
$$ -5308 -74406 -74872 -80214 -115605 -43319 84524 123802 -2478 10423 10075 -35844 16846 -77234
2461g7234j71699K2088J04631k8675P2287j0066m1677M9436O8710k7838j28966
$$ -77234 -248933 -226845 -122214 -150889 -78602 -88668 -130345 -80909 -12199 -40037 -169003
2450a69003k0575N9686J24972o2673N7316L7951q6596k1800j3011M7920J24167
$$ -169003 -189578 -129892 -4920 -67593 -10277 27674 -58922 -80722 -93733 -45813 78354
2439G8354l3825o9148m9492n1687P1311k6839J07832R0777n1057j3769l6337L946
$$ 78354 44529 -24619 -74111 -125798 -54487 -81326 26506 117283 66226 52457 16120 20066
2427B0066k6235J9905L5858r7007N0565m2543P9349R7132l4038l5602o0824O7246
$$ 20066 -6169 13736 49594 -47413 3152 -39391 39958 137090 103052 67450 6626 73872
2415G3872r0711J7047K0736k7207j3401J7667j8532o9850j6802m8743P8284L7123
$$ 73872 -16839 208 20944 -6263 -19664 -1997 -20529 -90379 -107181 -155924 -77640 -40517
2403d0517J8109O706o6885N0114P914L7786o7418J11909j15509m9964M3215p294
$$ -40517 -22408 -15702 -82587 -32473 -24559 13227 -54191 57718 -57791 -107755 -64540 -71834
2391g1834L3441J17698p519K9549j05442l0280Q3571o2136L0209j30343j92J76670
$$ -71834 -38393 79305 71786 101335 -4107 -34387 49184 -12952 17257 -113086 -113278 63392
2379F3392r7940p4124K6369m47m0625P1586R06k1095N1275k4632p9890J40403
$$ 63392 -34548 -108672 -82303 -82750 -123375 -51789 -50883 -71978 -20703 -45335 -125225 15178
2367A5178L2875j00399N5593j3950l4419k091L2307O6356J0985j23489k8685o2921
$$ 15178 48053 -52346 3247 -10703 -45122 -47213 -14906 51450 62435 -61054 -89739 -152660
2355a52660O2489J32540n8655o6528M3342J178J22P1332j6929o8596J45219j8765
$$ -152660 -90171 42369 -16286 -82814 -39472 -38294 -38172 33160 16231 -52365 92854 74089
2343G4089K0537k8632j33727R0026J77726r6523o2625P8372Q9247K8081O9216
$$ 74089 94626 65994 -67733 22293 200019 103496 40871 119243 208490 236571 305787
2332C05787j93448q8139M7070O338L8841j18499O3283R7375m167k2444r9686p628
$$ 305787 112339 24200 71270 77608 116449 -2050 61233 158608 154441 131997 32311 24683
2320B4683l4096n5583L2861Q5260J35309j77364K3255j4913Q7498q5477m9719
$$ 24683 -9413 -64996 -32135 53125 188434 11070 34325 19412 106910 21433 -28286
2309b8286M7104N2929Q157M301N6451q0954q0236r962J75672l5051o3155n4166
$$ -28286 18818 71747 79904 84205 140656 59702 -20534 -30496 145176 110125 46970 -7196
2297g196J8071K7482O6952O0871p3218r6803K4257J5076o4464J4414J8781O3767
$$ -7196 10875 38357 105309 166180 92962 -3841 20416 35492 -28972 -14558 4223 67990
2285F7990L4006p168J02317j58298K3281l8002L7284j8921k5146J69670j50260
$$ 67990 101996 94828 197145 38847 62128 24126 61410 42489 17343 187013 36753
2274C6753m0731R6760K1645J0791j17674K7342N9702l2330l3515q5617n12j8249
$$ 36753 -3978 92782 114427 125218 7544 34886 94588 62258 28743 -56874 -57386 -75635
2262g5635O4832J13894k3544k7193o2051O2574Q4077L9930L5883k3205q7012p8823
$$ -75635 -10803 103091 79547 52354 -9697 52877 136954 176884 212767 189562 102550 23727
2250B3727J37741L3785p0354k299k0820n560j6429p2588J17774J1191j42230Q9307
$$ 23727 161468 195253 124899 122600 101780 96220 79791 7203 124977 136168 -6062 83245
2238H3245O6127L5160J1309q2704N5011M7024k3983K7088q7143K4703k735J0127
$$ 83245 149372 184532 195841 113137 168148 215172 191189 218277 131134 155837 153102 163229
2226A63229l7120k4280k810P0067l7872R594o3745M089J60546o9257n671m0269
$$ 163229 126109 101829 99019 169086 131214 140808 77063 81152 241698 172441 166770 126501
2214A26501n1543O3554p3013Q7835J21108n5169K3467p2222j7875M1787P0234
$$ 126501 74958 138512 65499 153334 274442 219273 242740 170518 152643 194430 264664
2203B64664m2912P2837j5216n3418p6684O1741J01609K0014J9168L0991k0124
$$ 264664 221752 294589 279373 225955 149271 211012 312621 332635 351803 382794 362670
2192C62670n1581j4899o6634Q4755J06911j8979N2338j1544p9099K6875M2306
$$ 362670 311089 296190 229556 314311 421222 402243 454581 443037 363938 390813 433119
2181D33119j08156N1084J05451N8073J8863k1512p6934O9222R9813n9356K5225
$$ 433119 324963 376047 481498 539571 558434 536922 459988 529210 629023 569667 594892
2170E94892J3981n4074n9181Q8825J34823M3849p2521O1922m61r2955L9907l59
$$ 594892 608873 554799 495618 584443 719266 763115 690594 752516 752055 659100 699007 698648
2158F98648N5482m5589J56036N4644q3362O3209o6132M9937K7413R62J11445J3132
$$ 698648 754130 708541 864577 919221 835859 899068 832936 882873 910286 911248 1022693 1035825
2146A035825P9341k9921m0040k3581n8464J14792J33373J4609R187J8680J56095
$$ 1035825 1115166 1085245 1045205 1021624 963160 1077952 1211325 1225934 1235121 1253801 1409896
2135A409896P8493M7068N7734l5907J30501J67852Q3022j42945N737J66712J49671
$$ 1409896 1488389 1535457 1593191 1557284 1687785 1855637 1938659 1795714 1801451 1968163 2117834
2124B117834J51132J14415N4745K64930L7906P1479K12507J11149K48591L87517
$$ 2117834 2268966 2383381 2438126 2703056 2740962 2812441 3024948 3136097 3384688 3772205
2114C772205J67187Q4962L53170M44330K83838K09205M19664N13863N27280N88785
$$ 3772205 3939392 4024354 4377524 4821854 5105692 5314897 5734561 6248424 6775704 7364489
2104G364489P80559P46613Q77050J034137J391814J613335J934748K033578K672495
$$ 7364489 8145048 8891661 9768711 10802848 12194662 13807997 15742745 17776323 20448818
2095B0448818L255418L963296L743689K141487k85727l087813m666294m946636
$$ 20448818 23704236 27667532 31411221 33552708 33266981 30179168 25512874 20566238
2087B0566238l894540k778062j896913j569240j264518p66566o84374n80339o33923
$$ 20566238 16671698 13893636 11996723 10427483 9162965 8396399 7712025 7131686 6497763
2078F497763m78729l41908o49295n33171k76342m61371k13913k02208k74475j23612
$$ 6497763 6019034 5677126 5027831 4494660 4218318 3756947 3543034 3340826 3066351 2942739
2068B942739l9325n0296j67256j83407q1410P901k06482P115k34646m0056m5127
$$ 2942739 2903414 2853118 2685862 2502455 2421045 2428946 2222464 2229579 1994933 1954877 1909750
2057A909750j35062q1471q6765j55009J8336L3082o5468r2677n0166j4463r0343
$$ 1909750 1774688 1693217 1606452 1451443 1469779 1502861 1437393 1344716 1294550 1280087 1189744
2046A189744n3462K3037r2707p386n7368k1664n6035o1395O0451o3310O4373L21
$$ 1189744 1136282 1159319 1066612 1059226 1001858 980194 924159 862764 923215 859905 924278 924599
2034I24599r2636M3067m0830j23784p9669K5195L500M6407m8186q3622j0129j118
$$ 924599 831963 875030 834200 710416 630747 655942 659442 705849 657663 574041 563912 562794
2022E62794R24k5026O5969M7118p5514j62840n9718k2802J22481L3479l8630o602
$$ 562794 563718 538692 604661 651779 576265 413425 353707 330905 453386 486865 448235 441633
2010D41633L7092L3372j04602L816k4202j2298L0806M8610r9626l4725m455J06039
$$ 441633 478725 512097 407495 411311 387109 374811 405617 454227 354601 319876 315421 421460
1998D21460l8440j45573l6004q3416l2289N9574Q2516J03599K5780p2122l0186
$$ 421460 383020 237447 201443 118027 85738 145312 227828 331427 357207 285085 254899
1987B54899o6420K6017j7505M1595L9769K0099q1754p1579K0895P647o762J2063
$$ 254899 188479 214496 196991 238586 278355 298454 216700 145121 166016 173663 166901 178964
1975A78964l1535k6155m5563m8551p899J7189j4684Q3547O145M972M2219P4609
$$ 178964 147429 121274 75711 27160 19261 36450 21766 105313 111458 116430 158649 233258
1963B33258j44529N7405m3338J23877j8059j2633n7224k9729n0248j06696R3372
$$ 233258 88729 146134 102796 226673 208614 195981 138757 109028 58780 -47916 45456
1952D5456N4256M2836p1696j04995J00504M9778L2001L9087r0455o5698r5492
$$ 45456 99712 142548 70852 -34143 66361 116139 148140 187227 96772 31074 -64418
1941f4418L5367l6798K5828O7030Q149Q1643M3232K7089j08342O9687j0204j27795
$$ -64418 -29051 -65849 -40021 27009 35158 116801 160033 187122 78780 148467 138263 10468
1929A0468O422r1542l6051M6843J18351j1682N1215J0219J00913n344m9025N0926
$$ 10468 16890 -74652 -110703 -63860 54491 42809 94024 104243 205156 199812 150787 201713
1917B01713j46531N2481q4418q4408Q8401M3651P3640j31966q185K7334m3456
$$ 201713 55182 107663 23245 -61163 27238 70889 144529 12563 4378 31712 -11744
1906a1744k0984R8961O865r8299n4724J01128k1370n2182o3095R7220O3549m4795
$$ -11744 -32728 66233 73098 -25201 -79925 21203 -167 -52349 -115444 -18224 45325 530
1894E30O1670Q779n0592o1358l5782p4494Q8377q7883O2585J01657o8368o940
$$ 530 62200 70979 20387 -40971 -76753 -151247 -62870 -150753 -88168 13489 -54879 -61819
1882f1819J16139J4105L7211m9547o8800O5808q3509J04992o178P1987o9041k3667
$$ -61819 54320 68425 105636 56089 -12711 53097 -30412 74580 68402 140389 71348 47681
1870D7681l8968J5782L3767p3556P5004k6800j27273O6665K3615J6475j44107
$$ 47681 8713 24495 58262 -15294 59710 32910 -94363 -27698 -4083 12392 -131715
1859a31715J29711P664K3616L2624M5624n6521j3099Q5297j4944l0550K7482J35264
$$ -131715 -2004 5660 29276 61900 107524 51003 37904 123201 108257 77707 105189 240453
1847B40453p4901K566N0461j25460j13352j4716K7335J39624q8010N5945q0715
$$ 240453 165552 168118 218579 93119 -20233 -34949 -7614 132010 44000 99945 19230
1836A9230l5868J9000J9883p444r2108m1201Q9022K3765K7943m8961n2577R7080
$$ 19230 -16638 2362 22245 14801 -77307 -118508 -29486 -5721 22222 -26739 -79316 17764
1824A7764R0948o8694l2626o5927q884n3691O5906R0860j25277n779K00332L1983
$$ 17764 108712 40018 7392 -58535 -67419 -121110 -55204 35656 -89621 -95400 104932 136915
1812A36915K2166o4116j49269J8405Q1331l899j53218J15771j03867Q2294O5267
$$ 136915 159081 94965 -54304 -35899 45432 41533 -111685 4086 -99781 -17487 47780
1801D7780m2386k6960r8853M6751R565N8748L9987k2080r2166J1385J02993j00399
$$ 47780 5394 -21566 -120419 -73668 -64103 -5355 34632 12552 -79614 -68229 34764 -65635
1789f5635P6150M3512j38687M1831j9917Q8318j3681o4568q6168L5596R6687q0961
$$ -65635 10515 54027 -84660 -42829 -62746 25572 11891 -52677 -138845 -103249 -6562 -87523
1777h7523k6846O170p648o4463M1200J04053L0944n2456l7750R8096r874J6619
$$ -87523 -114369 -108199 -115847 -180310 -139110 -35057 -4113 -56569 -94319 3777 -6097 10522
1765A0522p4821k2103K8260P0970P1918q5555j45233J1606M3542J04673O8225
$$ 10522 -64299 -86402 -58142 12828 84746 -809 -146042 -134436 -90894 13779 82004
1754H2004p8348j2223q2360J21230p7241j3255O0692M8292k8884p9635K0746J6469
$$ 82004 3656 -8567 -90927 30303 -46938 -60193 499 48791 19907 -59728 -38982 -22513
1742b2513l1230R0789l4308o4674L4952O0971Q8322m7805o1932q5246o989o169
$$ -22513 -53743 37046 2738 -61936 -26984 33987 122309 74504 12572 -72674 -79663 -85832
1730h5832P193J46452k3290q8051M7211O8850O2191n2490j5795j58051K356Q8067
$$ -85832 -78639 67813 44523 -43528 3683 72533 134724 82234 66439 -91612 -89256 -1189
1718a189K3508J6422n8704J940M457K0765M628k4039M6362j31363P6249j3336
$$ -1189 22319 38741 -19963 -18023 -13566 7199 11827 -12212 34150 -97213 -20964 -34300
1706c4300o790J7212J2520l6016l3613M7438J14919k3244m6280O2032J6747N7082
$$ -34300 -41090 -23878 -11358 -47374 -80987 -33549 81370 58126 11846 73878 90625 147707
1694A47707p4078j0605p9502p999J4794q4172J8702J4428j6316L0371k2201K4699
$$ 147707 73629 63024 -16478 -24477 -9683 -93855 -75153 -60725 -77041 -46670 -68871 -44172
1682d4172j6089m7966R7932m2868l3836P5602m1505j0823o887L8217k3999L1770
$$ -44172 -60261 -108227 -10295 -53163 -86999 -11397 -52902 -63725 -70612 -32395 -56394 -24624
1670b4624l0458R4882o0165O4829R5945p9426j60571N5672M0089N921j8662j3293
$$ -24624 -55082 39800 -20365 44464 140409 60983 -99588 -43916 -3827 2094 -16568 -29861
1658b9861O9092j6461m7157K8152k3568k329p0658N3747J57458o2157m2865O4581
$$ -29861 39231 22770 -24387 3765 -19803 -22132 -92790 -39043 118415 56258 13393 77974
1646G7974J7492m2346N4255J9936L5997r6406l9584j149o9480J2504Q3154O311
$$ 77974 95466 53120 107375 127311 163308 66902 27318 26169 -43311 -30807 52347 58658
1634E8658l6588n4776Q2402J0887l4312M7463n6342O1695q2153q8410J6826R4675
$$ 58658 22070 -32706 49696 60583 26271 73734 17392 79087 -3066 -91476 -74650 20025
1622B0025o9707K7425k0968n2419O0320O0106M2829l7741P3367n4035j40798m3240
$$ 20025 -49682 -22257 -43225 -95644 -35324 24782 67611 29870 103237 49202 -91596 -134836
1610a34836J4839q821P4294M1600m4659l3577M4389P3507Q9089k2512o7077j82493
$$ -134836 -119997 -128818 -54524 -12924 -57583 -91160 -46771 26736 115825 93313 26236 -156257
1598a56257J44169p1515K5586J6234L9091R825k1796p7047N7509J0269O3616N3909
$$ -156257 -12088 -83603 -58017 -41783 -2692 7133 -14663 -91710 -34201 -23932 39684 93593
1586I3593k5612l6284k8191n3523M9751r3477J14336m3672r8940L1617k5685P1950
$$ 93593 67981 31697 3506 -50017 -266 -93743 20593 -23079 -122019 -90402 -116087 -44137
1574d4137J05444j11742q3386J15256N921P5395m45m8686l542P9028j28979j5346
$$ -44137 61307 -50435 -133821 -18565 -12644 62751 62306 13620 10078 89106 -39873 -55219
1562e5219l2646O3422q1724K4676m7508M971J4748M7128R711N6541q5665o0475
$$ -55219 -87865 -24443 -106167 -81491 -128999 -124028 -109280 -62152 -52441 4100 -81565 -142040
1550a42040Q249L7732Q1583j0102O162P0396j9626J3692n7156M2505p0584l8891
$$ -142040 -133791 -96059 -14476 -24578 -18416 51980 32354 46046 -11110 31395 -39189 -78080
1538g8080p2097j2208J3537R1349M5159O8947q2792O5085j0073J2833p3291o786
$$ -78080 -150177 -162385 -148848 -57499 -12340 56607 -26185 38900 28827 41660 -31631 -38417
1526c8417Q3636M8036j12487k9452M151n9059J03392p9899J36264j17872K6183
$$ -38417 45219 93255 -19232 -48684 -44533 -103592 -200 -80099 56165 -61707 -35524
1515c5524J9571J3058n2103J2798m8041R304K2424J6650j44857R0845P1990j4234
$$ -35524 -15953 -2895 -54998 -42200 -90241 -80937 -58513 -41863 -186720 -95875 -23885 -38119
1503c8119m0242J166P6584j9424l1144R717K894k5578l4817L0926P4672m4639
$$ -38119 -78361 -77195 -611 -20035 -51179 -41462 -38568 -64146 -98963 -68037 6635 -38004
1491c8004K3618k0174q3783N6287J5667m6049j14474J20797K6976J8768Q3911
$$ -38004 -14386 -34560 -118343 -62056 -46389 -92438 -206912 -86115 -59139 -40371 43540
1480D3540j2984K6443j8425K6791j20160k0667L1072r4537M9297L2715k1066K6442
$$ 43540 30556 56999 38574 65365 -54795 -75462 -44390 -138927 -89630 -56915 -77981 -51539
1468e1539N7281J22889r9637k8764n1242K7868L538r670n0909j8482o9684O9038
$$ -51539 5742 128631 28994 230 -51012 -23144 -19606 -29276 -80185 -98667 -168351 -99313
1456i9313R3332J5476P4569m1831p2052k8823O3338o2923l6477N2119N3457K7340
$$ -99313 -5981 9495 84064 42233 -29819 -58642 4696 -58227 -94704 -42585 10872 38212
1444C8212j2434k1304l6987N6952N0252o1377P5796l7541n7732k8435M2485n1928
$$ 38212 25778 4474 -32513 24439 74691 13314 89110 51569 -6163 -34598 7887 -44041
1432d4041j8054M3142q3945M299J24016j0764o4187l2188Q3714j6448k6116N7013
$$ -44041 -62095 -18953 -102898 -98599 25417 14653 -49534 -81722 1992 -14456 -40572 16441
1420A6441m5864m9918r1783N1914j3365O2742Q585L2976K1134L2652m1025j75643
$$ 16441 -29423 -79341 -171124 -119210 -132575 -69833 -61248 -28272 -7138 25514 -15511 -191154
1408a91154J58222J83027q1571m0665P4509q5046n457J5788n2264l7332N2086
$$ -191154 -32932 150095 68524 27859 102368 17322 11865 27653 -24611 -61943 -9857
1397i857j9401J7129J72800j2805j12357m2046J1509p1179l3187l2759M2657O2237
$$ -9857 -29258 -12129 160671 147866 35509 -6537 4972 -66207 -99394 -132153 -89496 -27259
1385b7259n481N5475J9945O5487j37361j0873j06747l3886J25216j0139q9742
$$ -27259 -32740 22735 42680 108167 -29194 -40067 -146814 -180700 -55484 -65623 -155365
1374a55365K5447R4281N7336j5335o7384M1255L5526j1180J43190j1787o0770
$$ -155365 -129918 -35637 21699 6364 -61020 -19765 15761 4581 147771 135984 75214
1363G5214K5379j00609o9634n3217P9114k1704p589L1345K3881O9693m2076j24865
$$ 75214 100593 -16 -69650 -122867 -43753 -65457 -73046 -41701 -17820 51873 9797 -115068
1351a15068P9757K5178l3630j6997J0991M2351L7339q8166L7848L548L5737j0372
$$ -115068 -35311 -10133 -43763 -60760 -49769 -7418 29921 -58245 -20397 -16849 18888 8516
1339H516n5255n922m0264j6227R6743q3028m1490R6958K0655J3083K0012o1174
$$ 8516 -46739 -52661 -92925 -109152 -12409 -95437 -136927 -39969 -19314 -6231 13781 -47393
1327d7393j145m5796J14411m4882m25N0797p8798M4268M814R292o4522J4236P263
$$ -47393 -48538 -94334 20077 -24805 -25230 25567 -53231 -8963 -4149 5143 -59379 -45143 -37880
1314c7880J5194J06809k9508J3527L1905k11119M1765M1039K8026J6496M2364
$$ -37880 -22686 84123 54615 68142 100047 -111072 -69307 -28268 -242 16254 58618
1303E8618j23364l5852L8392M4466k4547n5520n0618J46829j2860n0900O7813
$$ 58618 -64746 -100598 -62206 -17740 -42287 -97807 -148425 -1596 -14456 -65356 2457
1292B457K0387L5115l420j5869p7293L4842J200J9495q2850L5512r29j14135O5806
$$ 2457 22844 57959 54539 38670 -38623 -3781 -2581 16914 -65936 -30424 -31353 -145488 -79682
1279g9682R2684n7802K5979J6855p1130Q171Q7342J1539k4593q2021j5036J02941
$$ -79682 13002 -44800 -18821 -1966 -73096 -64925 22417 33956 9363 -72658 -87694 15247
1267A5247j57140r572l5290M8467j176M6728P4992N1521K0671r5865L2092j7191
$$ 15247 -141893 -151465 -186755 -138288 -139464 -92736 -17744 33777 54448 -41417 -9325 -26516
1255b6516M2868N8986K4666j70633N2497l0945o606K7314M4491O523L2857m6503
$$ -26516 16352 75338 100004 -70629 -18132 -49077 -55683 -28369 16122 22645 55502 8999
1243H999m9721j19858n8689J81358J21219j1682m3109r2694m6656l4507J47912
$$ 8999 -40722 -160580 -219269 -37911 83308 71626 28517 -64177 -110833 -145340 2572
1232B572m2482k1455J54306n8276m8518j31224J9363N9429J34973J0044l8793
$$ 2572 -39910 -61365 92941 34665 -13853 -145077 -125714 -66285 68688 78732 39939
1221C9939n1984r2176L9505m4463P3003J84086j06170P1974o3360k0243K1455
$$ 39939 -12045 -104221 -64716 -109179 -36176 147910 41740 113714 50354 30111 51566
1210E1566M1053j0840J05197k7911r6466q0091J01639j4790m8473r4954k0688
$$ 51566 92619 81779 186976 159065 62599 -17492 84147 69357 20884 -74070 -94758
1199i4758k2857J04566r4274n1400J17606L347P873n9838R4873N051o1936M7437
$$ -94758 -117615 -13049 -107323 -158723 -41117 -37770 -29897 -89735 5138 10189 -51747 -4310
1187d310N5633k3254P2594J1880m0424j70010J24423K6330j09950M0260m6123
$$ -4310 51323 28069 100663 112543 72119 -97891 26532 52862 -57088 -16828 -62951
1176f2951j09846J08449M1775N1511k5478O8143o8992r306M4187j32521j12706
$$ -62951 -172797 -64348 -22573 28938 3460 71603 2611 -6695 37492 -95029 -207735
1165b07735J33794J54189q2110R8072n2696j2757R736m8l0720m9511L9331j6644
$$ -207735 -73941 80248 -1862 96210 43514 30757 40493 40445 9725 -39786 -455 -17099
1153a7099L3095j35417R2484n5233n2594N8702O4923J307Q950N1519P4723p9333
$$ -17099 15996 -119421 -26937 -82170 -134764 -76062 -11139 -9832 -882 50637 125360 46027
1141D6027L4104n3240m9159m1595K4287K9613n7849J85022m4922j41329J0128
$$ 46027 80131 26891 -22268 -63863 -39576 -9963 -67812 117210 72288 -69041 -58913
1130e8913M0731M4848p9573j20681L3276r069J40880r2867N9284Q0656n7632j19914
$$ -58913 -18182 26666 -52907 -173588 -140312 -149381 -8501 -101368 -42084 38572 -19060 -138974
1118a38974L2270J50691q7240L406j5315j9569M3880m2468K8384M796L9447j00968
$$ -138974 -106704 43987 -43253 -39847 -55162 -74731 -30851 -73319 -44935 -40139 -692 -101660
1106a01660O5208J37407r3995m3989J1260M7162L1068q6450q8322Q3343J11803
$$ -101660 -36452 100955 6960 -37029 -25769 21393 52461 -33989 -122311 -38968 72835
1095G2835l1466m2077n4546k1733N4512K2179m8399o3655L4081P1204O7452k3751
$$ 72835 41369 -708 -55254 -76987 -22475 -296 -48695 -112350 -78269 -7065 60387 36636
1083C6636J5433K8134q4477k0906J7057j16184R206J02762K4092j07970m603J35830
$$ 36636 52069 80203 -4274 -25180 -8123 -124307 -115101 -12339 11753 -96217 -100820 35010
1071C5010q53j2689n0566L593j8308J36560K4151j09127o7687R4659R2283k53820
$$ 35010 34157 21468 -29098 -25505 -43813 92747 116898 7771 -59916 34743 127026 -126794
1059a26794J8420J34453Q4656q5321q8035m3151Q7950J47448r649p8324K8807
$$ -126794 -108374 26079 110735 25414 -62621 -105772 -17822 129626 119977 41653 70460
1048G0460j6226j26459K4191M6962M0419r7747Q6946n8640L8684K3474J8081L2607
$$ 70460 54234 -72225 -48034 -1072 39347 -58400 28546 -30094 8590 32064 50145 82752
1036H2752l5963m9552M1195n3010o7442P6239K6428O896p5805J9472n4651L7618
$$ 82752 46789 -2763 38432 -14578 -82020 -5781 20647 27543 -48262 -28790 -83441 -45823
1024d5823Q8129M3872n2487J9574m3157O9885J364n1693M0054J6110r5043J3806
$$ -45823 42306 86178 33691 53265 10108 79993 81357 29664 69718 85828 -9215 4591
1012D591j33903k7902K20187k0815o5699m5989q1986J24274K9572M8344j935j24180
$$ 4591 -129312 -157214 62973 42158 -23541 -69530 -151516 -27242 2330 50674 48739 -75441
1000g5441O401K08064m1601K0254j3338j01933M4340m0524l5935M00m7436N207
$$ -75441 -69040 139024 97423 117677 104339 2406 46746 6222 -29713 -29313 -76749 -71542
988g1542M8050o4481J06576Q9878o6555j3712O2414o910q7601O8220J115o6897
$$ -71542 -23492 -87973 18603 108481 41926 28214 90628 83718 -3883 64337 65452 -1445
976a445R4135j50765R060r941J4941n0304j10188M5098P6398K9183n3282Q0178
$$ -1445 92690 -58075 -49015 -58956 -44015 -94319 -204507 -159409 -83011 -53828 -107110 -26932
964b6932J03173j65121O0533O4733m92n4641Q2473k4707m0273P1179O0376j03285
$$ -26932 76241 -88880 -28347 36386 35894 -18747 63726 39019 -1254 69925 130301 27016
952B7016r5711M3177m163p7091N7091N3449o0601n5531n9711J05015Q3828o2877
$$ 27016 -68695 -25518 -29681 -106772 -49681 3768 -56833 -112364 -172075 -67060 16768 -46109
940d6109M3095L4237K9770J4696o142j38536o7097R0969J0852k0523J9426K5850
$$ -46109 -3014 31223 60993 75689 69547 -68989 -136086 -45117 -34265 -54788 -35362 -9512
928i512K0376M1405N8342j5566k0944o4770r3667O1045p2766K512J22392o580
$$ -9512 10864 52269 110611 95045 74101 9331 -84336 -23291 -96057 -93545 28847 22267
916B2267r8266Q0967K2106p5603O1246l2903N4329l5716k443N3206o7145J3763
$$ 22267 -75999 4968 27074 -48529 12717 -20186 34143 -1573 -4016 49190 -17955 -4192
904d192k3090k463L2050M8776L382L074n8141P4407K953N0181j03473q7438K4334
$$ -4192 -27282 -29745 2305 51081 54463 57537 -604 73803 76756 126937 23464 -63974 -39640
891c9640O6518q7727Q9705N7468l4678J1010N6935l3349j42988p7231N9011Q3118
$$ -39640 26878 -60849 28856 86324 51646 62656 119591 86242 -56746 -133977 -74966 8152
879H152j4322r6309j09768J53560J39895j25458J8467m8986P4646R615p9221q1590
$$ 8152 -6170 -102479 -212247 -58687 81208 -44250 -25783 -74769 -123 9492 -69729 -151319
867a51319Q4262Q362m4619K359Q2568P0675m6769q5624Q7589L1538j08022J71625
$$ -151319 -67057 -58695 -103314 -100955 -18387 52288 5519 -80105 7484 39022 -69000 102625
855A02625k5982r6772r748K4098M3533J31389p7705M6237l2043n1256q8364p5975
$$ 102625 76643 -20129 -29877 -5779 37754 169143 91438 137675 105632 54376 -33988 -109963
843a09963J13537J39130n8493j09287o5738N1290J46587j9805o9827M1631k7095
$$ -109963 3574 142704 84211 -25076 -90814 -39524 107063 87258 17431 59062 31967
832C1967K7898k3892p0819m5121J4467J7647J36658o0168j19540K3743J13772
$$ 31967 59865 35973 -34846 -79967 -65500 -47853 88805 28637 -90903 -67160 46612
821D6612r2682O0725j3038Q299n2299p031R2266l6354K5281k8693N3196n1724
$$ 46612 -46070 14655 1617 9916 -42383 -49414 42852 6498 31779 3086 56282 4558
809D558o1943Q821k4057k4062R4380K7456N102o0974J26424p9256m1221J21277
$$ 4558 -57385 -48564 -72621 -96683 -2303 25153 30255 -30719 95705 16449 -24772 96505
$$ [...]
##END NTUPLES=NMR SPECTRUM
##END=
