##TITLE=1H_CA-8874-1
 CDCl3, 8 sc, 
 10.06.2021
##JCAMPDX= 6.0         $$ Bruker NMR JCAMP-DX V2.0
##DATA TYPE= NMR SPECTRUM
##DATA CLASS= NTUPLES
##ORIGIN= UXNMR, Bruker Analytische Messtechnik GmbH
##OWNER= root
$$ XWIN-NMR		Version 3.5
$$ Thu Jun 10 11:34:37 2021 Russian Standard Time (UT+4h)  she@DPX200
##.OBSERVE FREQUENCY= 200.131506
##.OBSERVE NUCLEUS= ^1H
##.ACQUISITION MODE= SIMULTANEOUS
##.ACQUISITION SCHEME= undefined
##.AVERAGES= 8
##.DIGITISER RES= 18
##SPECTROMETER/DATA SYSTEM= spect
##.PULSE SEQUENCE= zg30
##.SOLVENT NAME= CDCl3
##.SHIFT REFERENCE= (INTERNAL, CDCl3, 0, 17.5313)
##AUDIT TRAIL= $$ (NUMBER, WHEN, WHO, WHERE, WHAT)
$$ ##TITLE= Audit trail, XWIN-NMR		Version 3.5
$$ ##JCAMPDX= 5.01
$$ ##ORIGIN= Bruker BioSpin GmbH
$$ ##OWNER= she
$$ F:/spectra/data/she/nmr/H-F/1/pdata/1/auditp.txt
$$ ##AUDIT TRAIL=  $$ (NUMBER, WHEN, WHO, WHERE, WHAT)
(   1,<2021-06-10 11:32:58.29 +0400>,<she>,<DPX200>,
      <created by zg, POWCHK disabled, PULCHK disabled
       configuration hash MD5:
       00 E9 B6 7A A2 85 ED C7 34 08 36 98 17 FE 4E 26
       data hash MD5: 16K
       9A 26 44 34 79 A1 37 F4 4A 57 C3 32 6F 14 EF F6>)
(   2,<2021-06-10 11:33:00.82 +0400>,<she>,<DPX200>,
      <Start of raw data processing
       efp BC_mod = 2 LB = 0.24 FT_mod = 6 PKNL = 1 PHC0 = -11483.6 PHC1 = 11.00101 SI = 16K 
       data hash MD5: 16K
       4A 35 5C C6 33 C0 A0 DE 51 11 F1 70 35 59 F9 9C>)
(   3,<2021-06-10 11:33:30.29 +0400>,<she>,<DPX200>,
      <pk PHC0 = 0.1429992 PHC1 = 0.2 
       data hash MD5: 16K
       36 12 93 49 3A F9 DC 23 5F 6B FC 84 AB E9 F0 46>)
(   4,<2021-06-10 11:33:33.87 +0400>,<she>,<DPX200>,
      <abs ABSG = 5 
       data hash MD5: 16K
       5E 0B D0 94 E8 F2 3B 70 55 9D 07 62 EE 30 F9 A8>)
$$ ##END=
$$ 
$$ hash MD5
$$ F2 28 8D 7F 7E 0D 94 38 DC C4 23 28 89 36 B2 1E
##$RELAX= 
##$RELAX= 
##$RELAX= 
##$RELAX= 
##$RELAX= 
##$RELAX= 
$$ Bruker specific parameters
$$ --------------------------
##$DU= <F:/spectra>
##$EXPNO= 1
##$NAME= <H-F>
##$PROCNO= 1
##$TYPE= <nmr>
##$USER= <she>
##$AMP= (0..31)
100 100 100 100 100 100 100 100 100 100 100 100 100 100 100 100 100 100 
100 100 100 100 100 100 100 100 100 100 100 100 100 100 
##$AQSEQ= 0
##$AQ_mod= 1
##$AUNM= <au_zg>
##$AUTOPOS= <>
##$BF1= 200.13
##$BF2= 200.13
##$BF3= 200.13
##$BF4= 200.13
##$BF5= 200.13
##$BF6= 200.13
##$BF7= 200.13
##$BF8= 200.13
##$BYTORDA= 1
##$CFDGTYP= 0
##$CFRGTYP= 5
##$CHEMSTR= <none>
##$CNST= (0..31)
1 1 145 1 1 1 1 1 1 1 1 1 1 1 1 1 1 1 1 1 1 1 1 1 1 1 1 1 1 1 1 1 
##$CPDPRG= <>
##$CPDPRG1= <>
##$CPDPRG2= <>
##$CPDPRG3= <>
##$CPDPRG4= <mlev>
##$CPDPRG5= <mlev>
##$CPDPRG6= <mlev>
##$CPDPRG7= <mlev>
##$CPDPRG8= <mlev>
##$CPDPRGB= <>
##$CPDPRGT= <>
##$D= (0..31)
0 1.2 0 0 0 0 0 0 0 0.06 0 0.03 0 0 0 0 0.0002 0 0 0 0 0 0 0 0 0 0 0 0 
0 0 0 
##$DATE= 1623310377
##$DBL= (0..7)
120 120 120 120 120 120 120 120 
##$DBP= (0..7)
150 150 150 150 150 150 150 150 
##$DBP07= 0
##$DBPNAM0= <>
##$DBPNAM1= <>
##$DBPNAM2= <>
##$DBPNAM3= <>
##$DBPNAM4= <>
$$ [...]
##$SUBNAM3= <"">
##$SUBNAM4= <"">
##$SUBNAM5= <"">
##$SUBNAM6= <"">
##$SUBNAM7= <"">
##$SUBNAM8= <"">
##$SUBNAM9= <"">
##$SW= 20.0188882624521
##$SWIBOX= (0..15)
0 0 2 0 0 0 0 0 0 0 0 0 0 0 0 0 
##$SW_h= 4006.41025641026
##$TD= 16384
##$TD0= 1
##$TE= 0
##$TE2= 300
##$TE3= 300
##$TEG= 300
##$TL= (0..7)
0 120 120 120 120 120 120 120 
##$TP= (0..7)
150 150 150 150 150 150 150 150 
##$TP07= 0
##$TPNAME0= <>
##$TPNAME1= <>
##$TPNAME2= <>
##$TPNAME3= <>
##$TPNAME4= <>
##$TPNAME5= <>
##$TPNAME6= <>
##$TPNAME7= <>
##$TPOAL= (0..7)
0.5 0.5 0.5 0.5 0.5 0.5 0.5 0.5 
##$TPOFFS= (0..7)
0 0 0 0 0 0 0 0 
##$TUNHIN= 0
##$TUNHOUT= 0
##$TUNXOUT= 0
##$USERA1= <user>
##$USERA2= <user>
##$USERA3= <user>
##$USERA4= <user>
##$USERA5= <user>
##$V9= 5
##$VALIST= <valist>
##$VCLIST= <CCCCCCCCCCCCCCC>
##$VD= 0
##$VDLIST= <DDDDDDDDDDDDDDD>
##$VPLIST= <PPPPPPPPPPPPPPP>
##$VTLIST= <TTTTTTTTTTTTTTT>
##$WBST= 1024
##$WBSW= 4
##$XGAIN= (0..3)
0 0 0 0 
##$XL= 0
##$YL= 0
##$YMAX_a= 852856
##$YMIN_a= -585728
##$ZGOPTNS= <>
##$ZL1= 120
##$ZL2= 120
##$ZL3= 120
##$ZL4= 120
##$ABSF1= 17.50077
##$ABSF2= -2.518269
##$ABSG= 5
##$ABSL= 3
##$ALPHA= 0
##$AQORDER= 0
##$ASSFAC= 0
##$ASSFACI= 0
##$ASSFACX= 0
##$ASSWID= 0
##$AUNMP= <proc_1d>
##$AZFE= 0.1
##$AZFW= 0.1
##$BCFW= 0
##$BC_mod= 2
##$BYTORDP= 0
##$COROFFS= 0
##$CY= -3
##$DATMOD= 1
##$DC= 0
##$DFILT= <>
##$DTYPP= 0
##$F1P= 0
##$F2P= 0
##$FCOR= 1
##$FTSIZE= 16384
##$FT_mod= 6
##$GAMMA= 0
##$GB= 0
##$INTBC= 1
##$INTSCL= 1.334414e-10
##$ISEN= 128
##$LB= 0.24
##$LEV0= 0
##$LPBIN= 0
##$MAXI= 10000
##$MC2= 0
##$MEAN= 0
##$ME_mod= 0
##$MI= 1.114404
##$NCOEF= 0
##$NC_proc= -6
##$NLEV= 6
##$NOISF1= 3.799351
##$NOISF2= 2.8
##$NSP= 0
##$NTH_PI= 0
##$NZP= 0
##$OFFSET= 17.53132
##$PC= 1
##$PHC0= -11483.46
##$PHC1= 11.20101
##$PH_mod= 1
##$PKNL= yes
##$PPARMOD= 0
##$PSCAL= 0
##$PSIGN= 0
##$REVERSE= no
##$SF= 200.130000661519
##$SI= 16384
##$SIGF1= 3
##$SIGF2= 2
##$SINO= 5.538805
##$SIOLD= 16384
##$SREGLST= <1H.CDCl3>
##$SSB= 0
##$STSI= 16384
##$STSR= 0
##$SW_p= 4006.41025641026
##$SYMM= 0
##$S_DEV= 0
##$TDeff= 16384
##$TDoff= 0
##$TI= <>
##$TILT= no
##$TM1= 0
##$TM2= 0
##$TOPLEV= 0
##$USERP1= <user>
##$USERP2= <user>
##$USERP3= <user>
##$USERP4= <user>
##$USERP5= <user>
##$WDW= 1
##$XDIM= 16384
##$YMAX_p= 506984176
##$YMIN_p= -395686
$$ End of Bruker specific parameters
$$ ---------------------------------
##NTUPLES= NMR SPECTRUM
##VAR_NAME=  FREQUENCY,     SPECTRUM/REAL,   SPECTRUM/IMAG
##SYMBOL=    X,             R,               I
##VAR_TYPE=  INDEPENDENT,   DEPENDENT,       DEPENDENT
##VAR_FORM=  AFFN,          ASDF,            ASDF
##VAR_DIM=   16384,         16384,           16384
##UNITS=     HZ,            ARBITRARY UNITS, ARBITRARY UNITS
##FACTOR=    0.24454680195387, 1,            1
##FIRST=     3508.54319765153, 0,            0
##LAST=      -497.867058758728, 0,           0
##MIN=       -497.867058758728, -395686,     0
##MAX=       3508.54319765153, 506984176,    0
$$ Real data points
##PAGE= N=1
##DATA TABLE= (X++(R..R)), XYDATA
$$ [...]
6088A042308J3925M1165n0155M2350K7328K9773K7139n1762L2667L416M6001J8842
6076A222997j14549k7269m4795Q904J07956J106Q3155R7562n2431l704n3124m7333
6064A178475k1571Q1409l5313L359r1880Q8754J33453K8388o9039l2062K589K0255
6052A286817j6578M1366m345R9387M1428j37684M3639M432q8917J4939J77837
6041A462321p2488r25k2262p8402m8814J68885n596O5364l0285m6316J6879N5306
6029A463667J2290q272n7759q5644K6336k1012J15630M3409p2322K9592P499M2367
6017A495781p2078R5738P8887R528l7223q7454R3999O586j9093R9338J1505o5692
6005A609822O200n2856n5095k192K9055K0108L6296L0243O7711l6753o708o0041
$$ plain form
6088 1042308 1056233 1097398 1047243 1089593 1116921 1146694 1173833 1122071 1154738 1158154 1204155 1222997
6076 1222997 1108448 1081179 1036384 1045288 1153244 1154350 1237505 1335067 1282636 1278932 1225808 1178475
6064 1178475 1156904 1238313 1203000 1206359 1114479 1203233 1336686 1365074 1296035 1263973 1266562 1286817
6052 1286817 1270239 1311605 1307260 1406647 1448075 1310391 1354030 1358462 1269545 1284484 1462321
6041 1462321 1389833 1388908 1366646 1288244 1239430 1408315 1402719 1468083 1437798 1391482 1408361 1463667
6029 1463667 1475957 1467685 1409926 1324282 1350618 1329606 1445236 1488645 1416323 1445915 1453414 1495781
6017 1495781 1423703 1519441 1598328 1607856 1570633 1483179 1577178 1583764 1564671 1664009 1675514 1609822
6005 1609822 1616022 1563166 1508071 1505879 1534934 1555042 1591338 1621581 1689292 1652539 1645831 1585790
5993A585790P4820O259j15299J06668K3548N087j07183p018P0451J02159J03145
5982A848427M4638l0453m9562K7922r177n4131K8590Q9734N5662q8860o9254o0291
5970A733245L227J73698r2699l777O1059N7930o36j4414j19233p5374J42095n4952
5958A810169n712J85551K2322P0696j9796o5733p9720P2200L9021o3959J27188
5947B092227n5164j2002l9744J7533K3179K4913Q5744j3838j0548m616p5997P6865
5935B108552K8827m5718O8240J50445j2576l2046j30756R970L7028l9516P1711
5924B214161m8899P9191O1531J9753m003n8750N4434m1791K09445O605p0696p6552
5912B344429k99M727O6516L0766J702Q9852r5167L4820K5122J9267K0800q8239
$$ plain form
5993 1585790 1660610 1666869 1551570 1658238 1681786 1686873 1579690 1572672 1643123 1745282 1848427
5982 1848427 1893065 1862612 1813050 1840972 1831795 1777664 1806254 1895988 1951650 1862790 1793536 1733245
5970 1733245 1736472 1910170 1817471 1813694 1874753 1932683 1932047 1917633 1798400 1723026 1865121 1810169
5958 1810169 1804457 1990008 2012330 2083026 2063230 1997497 1917777 1989977 2028998 1965039 2092227
5947 2092227 2037063 2025061 1985317 2002850 2026029 2050942 2136686 2122848 2112300 2107684 2031687 2108552
5935 2108552 2137379 2091661 2159901 2310346 2297770 2265724 2134968 2144938 2181966 2142450 2214161
5924 2214161 2165262 2244453 2305984 2325737 2321734 2262984 2317418 2275627 2485072 2491677 2420981 2344429
5912 2344429 2344130 2348857 2415373 2446139 2447841 2537693 2442526 2477346 2502468 2521735 2542535 2454296
5900B454296j376P5790r3483K0474n423J14745J05386O315m7024o9410O3537j0898
5888B612929q6017K9157R7626J20619p3299j0519l9016N8749P8609j3459n1802
5877B723577P6850j65930P6379j8420j4149Q2833p8070J00009J56139j1444j4219
5866B913555K5614p6017M2806j2997j20450O3462J51942L0764o0143k8043R2973
5855C023466J3615j18962l6034Q6612P8134P8737J0424n1694P9756L0063Q1443
5844C275560K0636n8687J16039N6924p2558r0181K5032Q8867J0993k2615K7282
5833C377292k6842l0898P6838L9828M4077j5677L9398P5755j47716O3067Q5700
5822C580822n3662Q948M8963P369N3745M3949J16524m0557J8640J59876k1687
$$ plain form
5900 2454296 2452920 2528710 2435227 2455701 2450278 2565023 2670409 2676724 2629700 2560290 2623827 2612929
5888 2612929 2526912 2556069 2653695 2774314 2701015 2690496 2651480 2710229 2788838 2775379 2723577
5877 2723577 2800427 2634497 2710876 2692456 2678307 2761140 2683070 2783079 2939218 2927774 2913555
5866 2913555 2939169 2863152 2905958 2892961 2772511 2835973 2987915 3018679 2958536 2930493 3023466
5855 3023466 3037081 2918119 2882085 2968697 3046831 3125568 3135992 3084298 3164054 3194117 3275560
5844 3275560 3296196 3237509 3353548 3410472 3337914 3247733 3272765 3361632 3372625 3350010 3377292
5833 3377292 3350450 3319552 3396390 3436218 3480295 3464618 3504016 3579771 3432055 3495122 3580822
5822 3580822 3527160 3536108 3585071 3592440 3646185 3690134 3806658 3766101 3784741 3944617 3922930
5811C922930p6790j23570O955J97942m3377L8184J856J35743m6925p4572J18809
5800D057185n712N3692K7240K2069r118m3801j7775J47558L2914m0942J60172
5789D383482l0506m5843O6088j5646n601R5753P9911Q3375o7026R98J45572k5763
5777D664794p3064R4125P8O4530K9468q3642J68617J89236q6834J6987J12406
5766E096701q0942r6922N359K0916Q0186L7777R114N2798P6466L8122Q4758J387
5754E325720m6693m2109R6405J4453q5374J59959J1000O8983J19022R1674N6999
5743E770039M5380j8360Q3357j15526L4778P9182M9775N1249j1199K9963P3370
5732F072008J20555O6310q3078l8247M8799J14374M1321N9782L0124K8799J12286
$$ plain form
5811 3922930 3846140 3722570 3729525 3927467 3884090 3922274 3924130 4059873 4012948 3938376 4057185
5800 4057185 4051473 4105165 4132405 4154474 4145356 4101555 4083780 4231338 4264252 4223310 4383482
5789 4383482 4352976 4307133 4373221 4357575 4351974 4447727 4527638 4611013 4543987 4544985 4690557 4664794
5777 4664794 4591730 4685855 4685933 4750463 4779931 4696289 4864906 5054142 4967308 4984295 5096701
5766 5096701 5015759 4918837 4924196 4945112 5025298 5063075 5072189 5124987 5201453 5239575 5324333 5325720
5754 5325720 5279027 5236918 5333323 5347776 5262402 5422361 5433361 5502344 5621366 5713040 5770039
5743 5770039 5815419 5797059 5880416 5764890 5799668 5878850 5928625 5979874 5968675 5998638 6072008
5732 6072008 6192563 6258873 6175795 6137548 6186347 6300721 6342042 6401824 6431948 6460747 6573033
5721F573033j8903J00627J3614L1436J40447K2517J9668J82473Q9694k582N3672
5710G205696P9627J2461L6403J68597O6213j1347O9948O0509Q6277Q3624L4603
5699G892611k0498O8650J08133K4235J2643J04574K23582k03J62045M8921R8924
5688H723617L3271N0539O8177J49135J77124O8582J28576P3483n8J37160J03095
5677I712701R4406J59051J25913K39265K48185J87617J34205J23261K30055L69088
5667A1623747K30454J62677J50539L66806K18264L43484L32973K66451K24197
5658A3919592K90978L35740J88916J05416J65985K09980J61847Q6130K03317K09508
5648A5877409L97128L83395L36966L64710M48404N36016N54115P10184O22772
$$ plain form
5721 6573033 6554130 6654757 6668371 6699807 6840254 6862771 6882439 7064912 7154606 7152024 7205696
5710 7205696 7285323 7297784 7334187 7502784 7568997 7557650 7627598 7688107 7774384 7858008 7892611
5699 7892611 7872113 7940763 8048896 8073131 8085774 8190348 8413930 8413727 8575772 8624693 8723617
5688 8723617 8756888 8807427 8875604 9024739 9201863 9270445 9399021 9472504 9472446 9609606 9712701
5677 9712701 9807107 9966158 10092071 10331336 10579521 10767138 10901343 11024604 11254659 11623747
5667 11623747 11854201 12016878 12167417 12534223 12752487 13095971 13428944 13695395 13919592
5658 13919592 14210570 14546310 14735226 14840642 15006627 15216607 15378454 15464584 15667901 15877409
5648 15877409 16274537 16657932 16994898 17359608 17808012 18344028 18898143 19608327 20231099
5639B0231099O74157P57379P88765Q12253P07888M71181M78852K99466o4772j90580
5629B4965688k35440k86024j72141j65214k6139p2841k1263J29452K10533L91169
5619B4717780M09966N99656N15225P01964Q17083R05668R17250R49416R20130
5610C1454138P76062O07095J89841k35015m22578n93686q58077q45205p92729
5601B9279846p25115n94768m28802l38831k64411j72865j09616k7381J96030J34547
5591B6948634M23347K89887M73486L31267L48318M74963L75189P1561j71349k64773
5581B9300530n31160o56662o76665p47962p73586m74131o41328m41975m19016
5572B3938045l41511l37318k05093k77232k03710q2810l5513J3277M2532r3397
$$ plain form
5639 20231099 20905256 21662635 22451400 23263653 23971541 24442722 24921574 25221040 25156268 24965688
5629 24965688 24730248 24444224 24272083 24106869 24080730 24007889 23986626 24116078 24326611 24717780
5619 24717780 25127746 25727402 26242627 26944591 27761674 28667342 29584592 30534008 31454138
5610 31454138 32230200 32837295 33027136 32792121 32369543 31775857 30917780 30072575 29279846
5601 29279846 28554731 27959963 27531161 27192330 26927919 26755054 26645438 26618057 26814087 26948634
5591 26948634 27371981 27661868 28135354 28466621 28814939 29289902 29665091 29736652 29565303 29300530
5581 29300530 28769370 28112708 27436043 26688081 25914495 25440364 24799036 24357061 23938045
5572 23938045 23596534 23259216 23054123 22776891 22573181 22490371 22454858 22468135 22510667 22417270
5562B2417270l9150Q0545l526K8806k6544k22709k89514j20408j50642j55419
5552B1518709k31495k64275j40284j37400r2076l6855K5228k33795q1615P6645
5542B0402787j09780o1397m7228M9607J0455M6927j06822Q8698N1718M0260p4257
5531B0290968J00717J01201j08548j1651K28996K3677m7938J41353q7852o5383
5521B0565540Q4496J58752J19316j3667j8848P4793R3098p996J03528J42733K5114
5510B1326859J22305J5798K8859J0271J06657k0657P87P4586m0627J09084R6045
5499B1829967o2149Q481J21147M6116M5838J12515M9667k7622J55497L4457l1014
5488B2282900k820L2676O4671j06712M986J12545N6706o6508M787P0747J55853
$$ plain form
5562 22417270 22378120 22458665 22455139 22483945 22457401 22234692 21945178 21824770 21674128 21518709
5552 21518709 21287214 21022939 20882655 20745255 20653179 20616324 20641552 20407757 20326142 20402787
5542 20402787 20293007 20231610 20184382 20233989 20244444 20291371 20184549 20273247 20324965 20365225 20290968
5531 20290968 20391685 20492886 20384338 20372687 20601683 20625360 20577422 20718775 20630923 20565540
5521 20565540 20650036 20808788 20928104 20914437 20895589 20970382 21063480 21055484 21159012 21301745 21326859
5510 21326859 21449164 21464962 21493821 21504092 21610749 21590092 21590879 21665465 21624838 21733922 21829967
5499 21829967 21767818 21776299 21897446 21943562 21989400 22101915 22151582 22123960 22279457 22313914 22282900
5488 22282900 22280080 22312756 22377427 22270715 22275701 22388246 22444952 22378444 22383231 22453978 22609831
5477B2609831M6010r2316N5542L1954L8555j3616m9699L4392Q222p2070L8157
5466B2634962j4715K7603L089k31338R4198j7698j4792O8836M9705k2861q489
5455B2568500J2544P5815O4479j15246Q0500J7021n1667J8690J15683o9285o4788
5444B2652246J22982N1310r3374j6580K3920L9408J47932o1188K8237q0568j7494
5433B2796831L6114M0141K9137O9713J19405m2284J0888J21770j15826J7542J3844
5422B3097275j12515J30133K1839j03875J38507J61964m7464M6106L6850L6450
5412B3405270J20724L1632J57774J14519q3935Q9060Q8839Q9770M1505j5546K3784
5401B4063396J6332P6497O4999J35137J17051J07014Q9785O7305J16690R3552
$$ plain form
5477 22609831 22655841 22563525 22619067 22651021 22689576 22675960 22626261 22660653 22668875 22596805 22634962
5466 22634962 22620247 22647850 22650939 22419601 22513799 22496101 22481309 22550145 22599850 22576989 22568500
5455 22568500 22581044 22656859 22721338 22606092 22686592 22703613 22651946 22670636 22786319 22717034 22652246
5444 22652246 22775228 22826538 22733164 22716584 22740504 22779912 22927844 22866656 22894893 22814325 22796831
5433 22796831 22832945 22873086 22902223 22971936 23091341 23049057 23059945 23181715 23065889 23083431 23097275
5422 23097275 22984760 23114893 23136732 23032857 23171364 23333328 23285864 23331970 23368820 23405270
5412 23405270 23525994 23557626 23715400 23829919 23745984 23835044 23923883 24013653 24055158 24039612 24063396
5401 24063396 24079728 24156225 24221224 24356361 24473412 24580426 24670211 24737516 24854206 24947758
5391B4947758K27309J95881J94390J35009J8473K77317K51002J2228K26528K51062
5381B6736957K61689K82256K96074L34740M89622L81552M98177N29590P39253
5372C0549910P98553Q01507Q40813R71269J183387J248589J448113J583016J780928
5363D1206085K052108K227993K469643K887569L079455L204671L207303L011973
5355F3346800K415667J727040Q00163j64526r66553j273973j445925j386474j074204
5346F1978015o03952o4023L39409P69897J188280J695359K252322K690079L013590
5337G3258976L226335L217199K588291J375330k36413k083244l346820m339553
5329G3660101m946578m799462m395669m024055l427695l199627k775478k191557
$$ plain form
5391 24947758 25175067 25370948 25565338 25700347 25718820 25996137 26247139 26259367 26485895 26736957
5381 26736957 26998646 27280902 27576976 27911716 28401338 28782890 29281067 29810657 30549910
5372 30549910 31348463 32149970 32990783 33962052 35145439 36394028 37842141 39425157 41206085
5363 41206085 43258193 45486186 47955829 50843398 53922853 57127524 60334827 63346800
5355 63346800 65762467 67489507 68289670 68125144 67158591 65884618 64438693 63052219 61978015
5346 61978015 61374063 61310040 61649449 62419346 63607626 65302985 67555307 70245386 73258976
5337 73258976 76485311 79702510 82290801 83666131 83429718 81346474 77999654 73660101
5329 73660101 68713523 63914061 59518392 55494337 52066642 48867015 46091537 43899980
5321D3899980j974428j776270j697423j522229j166512j095483j003294r70912
5313C2693429q88178o83077o00016o52209n72994n93313l94213m55500l69908
5304B7484021m50965l20602k06059l07326l07645k45706j00531j80426j77968
5295B5186793j50668M452k7551m2965N415L4031m3809j390J7818P2225J16849
5284B5171200K29337J26677K25795K98743K24029K54206L64618J01326O2692J59119
5274B7217742p9052P0082K18967J01932K74524J98562L17548L96562K74364M02132
5264B9393363N76917N03722M70893L61054L73925K41646R8037o285l3616n5002
5254C1924654m737o334K75368J89303K52974L56846K22640K57326K54613J52859
$$ plain form
5321 43899980 41925552 40149282 38451859 36929630 35763118 34667635 33664341 32693429
5313 32693429 31805251 31122174 30522158 29869949 29296955 28703642 28309429 27853929 27484021
5304 27484021 27033056 26712454 26506395 26199069 25891424 25645718 25545187 25364761 25186793
5295 25186793 25036125 25040577 25013026 24970061 24975476 25009507 24965698 24964308 24982126 25054351 25171200
5284 25171200 25400537 25527214 25753009 26051752 26275781 26529987 26894605 26995931 27058623 27217742
5274 27217742 27138690 27208772 27427739 27529671 27804195 28002757 28320305 28716867 28991231 29393363
5264 29393363 29970280 30474002 30944895 31305949 31679874 31921520 32019557 32013272 31979656 31924654
5254 31924654 31919917 31913583 32188951 32378254 32631228 32988074 33210714 33468040 33722653 33875512
5244C3875512Q711j19144j54054p8291l74886m07732l08438k24371o4077j42869
5234C2010361j48638j09834j67435J10457q1651j114M74k41764m30632m57416
5224C0482808o03764o78616n55271p21401n63796o39312m97488n42357l35945
5215B5344858j06273k44881m864p2180j23826l07440l62326k27954m98305n30611
5205B2866198o68624o86224o12733o75619o99461o09924n33235m01615l96919
5196A7581844m52346l89404l70330j76370k30843j87483k19139j95708l10436
5187A5049785k54295l09175m52161k57851l16646k83008k89763l19299j99431
5178A2368156l42153k23995j53925j34951k85085k04437j83704k44689j92161
$$ plain form
5244 33875512 33884223 33765079 33611025 33532734 33157848 32750116 32441678 32217307 32153230 32010361
5234 32010361 31861723 31751889 31584454 31694911 31613260 31612146 31612620 31370856 30940224 30482808
5224 30482808 29879044 29200428 28645157 27923756 27359960 26720648 26223160 25680803 25344858
5215 25344858 25238585 24993704 24988840 24916660 24792834 24485394 24123068 23895114 23396809 22866198
5205 22866198 22197574 21511350 20898617 20222998 19523537 18913613 18380378 17978763 17581844
5196 17581844 17129498 16740094 16369764 16193394 15962551 15775068 15555929 15360221 15049785
5187 15049785 14795490 14486315 14034154 13776303 13459657 13176649 12886886 12567587 12368156
5178 12368156 12026003 11802008 11648083 11513132 11228047 11023610 10839906 10595217 10403056
5169A0403056K2225K8707r1307k50772j25015r4177j26475o2295j62791o5252
5159I475904k02159o9398n2875r2271L3351j69394j25258K9328K9277j18809Q534
5148H746230n9573M1933q3285q7757O97l7850o8861m627j5045j21664p7421k1172
5136H211605l1974j70174j43921P5293N9503K1589m7795j4100k5872j98053P169
5125G743270O6597O3014K4533J750J2758J0953o5700N7091q2729p4302l1498o861
5113G718876R0633L5753p8521j8124Q6754j7246j6138N8079j3905K9448j66471
5102G709138l2586O8815l7343j62608n4227J20588k4397n483Q9389N4249J4638
5091G740173N3673N376O8699N9588m6538Q3586N8896k62L618J14088n0349N8643
$$ plain form
5169 10403056 10425281 10453988 10362681 10111909 9986894 9892717 9766242 9703947 9541156 9475904
5159 9475904 9273745 9204347 9151472 9059201 9092552 8923158 8797900 8827228 8856505 8737696 8746230
5148 8746230 8686657 8728590 8645305 8557548 8558245 8520395 8451534 8446907 8431862 8310198 8232777 8211605
5136 8211605 8179631 8009457 7865536 7940829 8000332 8021921 7974126 7960026 7934154 7736101 7743270
5125 7743270 7809867 7872881 7897414 7899164 7911922 7922875 7857175 7914266 7831537 7757235 7725737 7718876
5113 7718876 7809509 7845262 7766741 7748617 7835371 7818125 7801987 7860066 7846161 7875609 7709138
5102 7709138 7676552 7745367 7708024 7545416 7491189 7611777 7587380 7581897 7671286 7725535 7740173
5091 7740173 7793846 7799222 7867921 7927509 7880971 7964557 8023453 8023191 8026809 8140897 8090548 8149191
5079H149191P5853L8868l2256M6598J24561j2901o1757p3627J63599m0090n4483
5068H323556j6515o4284O5163k5189j93506K1538N3937N3269J52249N1442K7777
5057H449437n6853J66204J99624J03207J50852O5767O271P0583K6940J24044J03108
5046I409184J16345J07307N5895n0853Q0220L0270k9838N5587J09976J34681K2467
5035A0041241M4709J2471L1326Q6306k2702p8208J19840J11490Q5303J09522J38512
5024A0679810K01692J61274L10249R7706J72083K60008R5938J71084r4918n7117
5014A1997809R2937j97251k25489J9945m6294M4247o2648J881l6308k7189P8621
5003A1640261J64104Q8044j08414p2905J3158J01079K12418J21170J7665N3396
$$ plain form
5079 8149191 8225044 8263912 8231656 8278254 8402815 8389914 8328157 8254530 8418129 8378039 8323556
5068 8323556 8307041 8242757 8307920 8282731 8089225 8110763 8164700 8217969 8370218 8421660 8449437
5057 8449437 8392584 8558788 8758412 8861619 9012471 9078238 9084509 9155092 9182032 9306076 9409184
5046 9409184 9525529 9632836 9688731 9637878 9718098 9748368 9718530 9774117 9884093 10018774 10041241
5035 10041241 10085950 10098421 10129747 10216053 10193351 10115143 10234983 10346473 10431776 10541298 10679810
5024 10679810 10881502 11042776 11353025 11450731 11622814 11882822 11978760 12149844 12054926 11997809
5014 11997809 12090746 11893495 11668006 11687951 11641657 11685904 11623256 11625137 11588829 11561640 11640261
5003 11640261 11804365 11892409 11783995 11711090 11724248 11825327 12037745 12158915 12176580 12229976
4993A2229976K44819J33588K06861J99966K51510L73902L82770M16814L07831
4984A4748037L47229K56441Q8223K1271l9186l7007j60463j91025j70354p9071
4974A4784095j27823q7014o4134O8265K3098J51613J36544J0366J44105k9377
4964A5009738P3383Q3815N2273N5259J35286J67264J58095Q8847J42292K13786
4954A6180038L4857j42075j53096j32232k90631m72227k48610l30566m76747k46801
4944A3721910l53653m34406k54310j79762j70084j40908k17553p7757j51261j25086
4934A1617130O0276m3888R8637p2441l7712j78522J3530K5699j8700j9826j867
4923A1442316p3702J39481K10207k1255O6203R4447L8990R483l8604l0946J3754
$$ plain form
4993 12229976 12474795 12608383 12815244 13015210 13266720 13640622 14023392 14440206 14748037
4984 14748037 15095266 15351707 15439930 15461201 15422015 15385008 15224545 15033520 14863166 14784095
4974 14784095 14656272 14569258 14505124 14573389 14596487 14748100 14884644 14895010 15039115 15009738
4964 15009738 15083121 15166936 15219209 15274468 15409754 15577018 15735113 15823960 15966252 16180038
4954 16180038 16214895 16072820 15919724 15787492 15496861 15024634 14776024 14445458 13968711 13721910
4944 13721910 13368257 12933851 12679541 12499779 12329695 12188787 11971234 11893477 11742216 11617130
4934 11617130 11677406 11633518 11732155 11659714 11622002 11443480 11457010 11482709 11464009 11444183 11442316
4923 11442316 11368614 11508095 11718302 11697047 11763250 11857697 11896687 11906170 11867566 11836620 11850374
4912A1850374o0508J23463j5928M2935R5545J90127J43449J27776l8909M60N7768
4901A2516552j06681p6920j3648q7279j94343l9010l5782j37794m492j18913j44822
4890A1556868k7241j100j34243j06385k7012R7522n7954m0004n4733Q1882J11414
4879A1399014l0386O8069L2331M7281N9962J16034O2120Q7753J95552L47885J76512
4868A2562127L77188K76972K32468L73579M02788N82565P15446O65978P22266
4859A6911377Q24599R65795J147337J079400J136307J369785J301830J183385
4851B5919815J116916P96436O72390N32924J66869j5311k08133j38418o4775j67226
4841B8611487k42270k84535k73114j02401N6349J49882M06174O30900P83991R20462
$$ plain form
4912 11850374 11789866 11913329 11897401 11940336 12035881 12226008 12369457 12497233 12458324 12458784 12516552
4901 12516552 12409871 12332951 12319303 12232024 12037681 11998671 11962889 11825095 11820603 11701690 11556868
4890 11556868 11529627 11528527 11394284 11287899 11260887 11358409 11300455 11260451 11205718 11287600 11399014
4879 11399014 11368628 11436697 11469028 11516309 11576271 11692305 11754425 11842178 12037730 12385615 12562127
4868 12562127 12939315 13216287 13448755 13822334 14225122 14807687 15523133 16189111 16911377
4859 16911377 17735976 18701771 19849108 20928508 22064815 23434600 24736430 25919815
4851 25919815 27036731 27833167 28505557 29038481 29205350 29190039 28981906 28843488 28778713 28611487
4841 28611487 28369217 28084682 27811568 27709167 27765516 27915398 28321572 28952472 29736463 30656925
4831C0656925J280632J503567J585151J859358J911312J887309J841401J682864
4823D4208519J430609J021983O39874L36464J46673Q5967p1670n41711q31892
4814D6424816j161947j582073k006263k048522j852626j772366j584247j293194
4806C3123578j094250p51176n37913l52236j00302P5693J55718K30854L90634
4797C1140600L52582L09284L01991J44952Q3288p6272n8870m45996p87636r33658
4787C0030265j347492j597186j586977j661618j625482j319037j523800j122104
4779A8246569j018985j081076r33611p52223o14939o49411o85327n68070n07212
4770A1435715m22771m79546k76538l88858k82896k91628k42844j21970k90236
$$ plain form
4831 30656925 31937557 33441124 35026275 36885633 38796945 40684254 42525655 44208519
4823 44208519 45639128 46661111 47300985 47637449 47784122 47870089 47798419 47256708 46424816
4814 46424816 45262869 43680796 41674533 39626011 37773385 36001019 34416772 33123578
4806 33123578 32029328 31278152 30740239 30388003 30287701 30363394 30519112 30749966 31140600
4797 31140600 31493182 31802466 32104457 32249409 32332697 32256425 32197555 31751559 30963923 30030265
4787 30030265 28682773 27085587 25498610 23836992 22211510 20892473 19368673 18246569
4779 18246569 17227584 16146508 15212897 14460674 13845735 13196324 12510997 11942927 11435715
4770 11435715 11012944 10533398 10256860 9868002 9585106 9293478 9050634 8928664 8638428
4761H638428j98619j60493j78788j83589k99908k44436p0270p4497j76255j4572
4751G037001j78088j43040l6577n9648j33486n3620j96382j25605j5570j93833
4741E901152l1448m6596O5731j03884r5578j49726l6929l6083j04343J38614M6241
4730E547151p5844o6274r4878O3541N1613L5406k10261m9285N5407j290j27357
4719E127929m3396J0389M3634q1082m0226l7692J30240J0265o0410j1954k5006
4708E022691R0423K3494q3656K6180m4196P9031N389p3505p4800R1050l8881n4618
4696D968602j6160J50837M5074r3257J0699Q3629L5400L477N8330O8110N7092
4685E371833m6767K18065M3276o5695J66833J34850m7235J00451Q9924R0647P5976
$$ plain form
4761 8638428 8439809 8279316 8100528 7916939 7617031 7372595 7302325 7227828 7051573 7037001
4751 7037001 6858913 6715873 6679296 6619648 6486162 6432542 6236160 6110555 6094985 5901152
4741 5901152 5869704 5823108 5888839 5784955 5689377 5539651 5502722 5466639 5362296 5500910 5547151
4730 5547151 5471307 5405033 5310155 5373696 5425309 5460715 5250454 5201169 5256576 5255286 5127929
4719 5127929 5084533 5094922 5138556 5057474 5017248 4979556 5109796 5120061 5059651 5047697 5022691
4708 5022691 5113114 5136608 5052952 5079132 5034936 5113967 5119356 5045851 4971051 5062101 5023220 4968602
4696 4968602 4952442 5103279 5148353 5055096 5065795 5149424 5184824 5188301 5246631 5314741 5371833
4685 5371833 5325066 5543131 5586407 5520712 5687545 5822395 5775160 5875611 5965535 6056182 6132158
4674F132158P1692N4605J71753O490J75131Q2472N1122J15756J45606J37646J76851
4663G321282K22871J11600J29664J73425K45938K83355L27226J04826M27440K94739
4653I642366K84673M07652M69804M80206N43788N48320O25042P79589O73478Q88690
4643A5343608R04631J084861J171968J268767J429217J658260J634058J805224
4635B6300594J856825J725179J412846J118235O06076L14073P505r4502k70779
4626C2976052m29948k31846k24391k69565l14044j55774l6848O3353L88696M93584
4616C2259269O51466R90951J183237J412181J657512J723077J724958J528212
4608D3130863J477476J026495O53250K59670q6349k25062m07838n10693n46059
$$ plain form
4674 6132158 6203850 6258455 6430208 6436698 6611829 6694301 6745423 6861179 7006785 7144431 7321282
4663 7321282 7544153 7655753 7785417 7958842 8204780 8488135 8815361 8920187 9347627 9642366
4653 9642366 9927039 10334691 10804495 11284701 11828489 12376809 13001851 13781440 14454918 15343608
4643 15343608 16248239 17333100 18505068 19773835 21203052 22861312 24495370 26300594
4635 26300594 28157419 29882598 31295444 32413679 33019755 33333828 33341333 33246831 32976052
4626 32976052 32546104 32314258 32089867 31820302 31506258 31350484 31313636 31376989 31765685 32259269
4616 32259269 32910735 33901686 35084923 36497104 38154616 39877693 41602651 43130863
4608 43130863 44608339 45634834 46288084 46547754 46461405 46236343 45828505 45317812 44771753
4599D4771753p45125j030434j249212j564207j735754j641290j949175j743455
4591C3113101j452589j238220j003080p79493o13822m77296k36544j31942N379
4582B7185494K9687J75457J59472J53249K82087o0250j9561j44304l60749o44822
4572B6755760j011420j064674j451795j556418j487362j288797j289137j063867
4564A6542290j075684q73836p62777o41688o30934o67042m07511l53465m53896
4555A0675457m19607m80454l18538k95306k34821l18822j81169j55552j38560
4546H132628k48026l15174k26708j20124r3636p6122p2747j97747j95194n0112
4536F537038q6755K4775r3783o5812q0068q1985j45250n153O1339o1585L0344
$$ plain form
4599 44771753 44026628 42996194 41746982 40182775 38447021 36805731 34856556 33113101
4591 33113101 31660512 30422292 29419212 28639719 28025897 27548601 27312057 27180115 27185494
4582 27185494 27215181 27390638 27550110 27703359 27985446 27925196 27905635 27761331 27400582 26755760
4572 26755760 25744340 24679666 23227871 21671453 20184091 18895294 17606157 16542290
4564 16542290 15466606 14592770 13829993 13188305 12557371 11890329 11482818 11129353 10675457
4555 10675457 10255850 9775396 9456858 9161552 8926731 8607909 8426740 8271188 8132628
4546 8132628 7884602 7569428 7342720 7222596 7128960 7052838 6980091 6782344 6587150 6537038
4536 6537038 6450283 6475058 6381275 6315463 6235395 6153410 6008160 6003007 6064346 6002761 6033105
4525F033105l156N6114J18700l5691n0872J12839L0832J3521l1204L1085P111
4514F282384r8110j09131q8271j22208K4889r137j09156r5502N076Q9042k5370
4503E744506P3063R8639m3036L0441j01830n0768L9161M8948N2712j13381j36213
4492E642242j53044j47753p0466O2664j25847k1651M3130k16791j37863j9269
4482D855352K8233l191J2538q683l0596j56045R2191J03368K1207M968j17640
4471D801702J21910O2397j82053m219M0658k6519m6108n0490q9577q4743R550
4460D552508N3220L9686O7183l1350j33137j4397j8509j16376k9177L1641M913
4449D406205L0172n4875l6197J51446p1679n6842R2878J55965l0967j8398J54011
$$ plain form
4525 6033105 6029949 6086063 6204763 6169072 6118200 6231039 6261871 6275392 6244188 6275273 6282384
4514 6282384 6184274 6075143 5986872 5864664 5889553 5880416 5771260 5675758 5680834 5769876 5744506
4503 5744506 5817569 5916208 5873172 5903613 5801783 5751015 5790176 5839124 5891836 5778455 5642242
4492 5642242 5489198 5341445 5270979 5333643 5207796 5186145 5229275 5012484 4874621 4855352
4482 4855352 4883585 4880394 4892932 4884249 4853653 4697608 4789799 4893167 4914374 4919342 4801702
4471 4801702 4923612 4986009 4803956 4799737 4840395 4813876 4767768 4717278 4627701 4542958 4552508
4460 4552508 4605728 4645414 4712597 4681247 4548110 4533713 4515204 4398828 4369651 4401292 4406205
4449 4406205 4436377 4381502 4345305 4496751 4425072 4368230 4461108 4617073 4586106 4567708 4721719
4438D721719N5178R0611Q2808J55183K34316K66027J82659J50917K55948R7776
4428F293142j6479n6295k9867j64840j75635j52460p9258p2757r2361J54483M3933
4417E651606j44032j39170q4934K6252M0903m6397o731j213p4878j4310q0696
4406E126400n9402M0076N3031J5997j67988L3263O0764o1966j70827Q3419K713
4395D955480p9079J12306l5687P8333k732J00687N2768J40428N4913N2403J62853
4384E592673k8549P8104J47064J42970K32421J36460K56243M52603J59760J71261
4374G341010J62873k00683r7442K0562l1382q5317J3344J06522Q4507L717O1335
4363G379046L13203O4945K82074L44458K35871K25207M34732M24649M08681N67578
$$ plain form
4438 4721719 4776897 4867508 4950316 5105499 5339815 5605842 5788501 5939418 6195366 6293142
4428 6293142 6276663 6220368 6190501 6025661 5850026 5697566 5618308 5545551 5453190 5607673 5651606
4417 5651606 5507574 5368404 5283470 5309722 5350625 5304228 5297497 5296284 5221406 5207096 5126400
4406 5126400 5066998 5107074 5160105 5176102 5008114 5041377 5102141 5040175 4869348 4952767 4955480
4395 4955480 4876401 4988707 4953020 5031353 5028621 5129308 5182076 5322504 5377417 5429820 5592673
4384 5592673 5564124 5642228 5789292 5932262 6164683 6301143 6557386 7009989 7169749 7341010
4374 7341010 7503883 7303200 7205758 7226320 7194938 7109621 7122965 7229487 7313994 7317711 7379046
4363 7379046 7692249 7757194 8039268 8383726 8619597 8844804 9279536 9704185 10112866 10680444
4353A0680444M29583N97039O16671O61418P67048O54087N97321M91582M09931
4344A5905124L3535j65854j51930n9954o9398j10434O0921Q6233L37251K17279
4334A6082773L45727M34338O22785N87200L27895J93014J13842k34931k89608
4325A8183035l35641k47442k35831l22924q0786j30671N3395J41419J82076K22997
4315A7429627M60343L86089L48663L88230N51440O98597N60617O45311O82184
4306B2151101P19984R84338J022993J158132J236979J166315J276971J225730
4298C0942543R87940P71438K92564k34536n88019o42102q30089q13546o95921
4289B9190272n05522m07748n5953M4094J20658J52392L44546J74570n513m37643
$$ plain form
4353 10680444 11110027 11707066 12323737 12985155 13752203 14406290 15003611 15495193 15905124
4344 15905124 15938659 15772805 15620875 15560921 15491523 15381089 15442010 15528243 15865494 16082773
4334 16082773 16428500 16862838 17485623 18072823 18400718 18593732 18707574 18472643 18183035
4325 18183035 17847394 17599952 17364121 17041197 16960411 16829740 16883135 17024554 17206630 17429627
4315 17429627 17889970 18276059 18624722 19012952 19564392 20262989 20823606 21468917 22151101
4306 22151101 22871085 23855423 24878416 26036548 27273527 28439842 29716813 30942543
4298 30942543 31930483 32701921 32994485 32759949 32171930 31529828 30699739 29886193 29190272
4289 29190272 28684750 28277002 28221049 28265143 28385801 28538193 28882739 29057309 29051796 28614153
4279B8614153p06379j005233j259409j331035j480314j161240j217331j017724
4271A9435488q36486p91378p05864n12565l68245l96699l76080l28235k06268
4262A4913668j00657k48926j88974k76889k4410j03028j10758k9248q5076q4773
4252A3660929J10633l667L7251J38599J46320J96174L27932K54937K19521L40015
4242A5428644J75578L84423K53800M58005N90425N53470N01605O22625R30915
4233A9899490R85792R72868J111015J216181J304695J437866J443237J189004
4225B9560148Q17568K90241r3344l24520n83445o36356p89683p82814n28115m46629
4215B6483051n22299j64107k36704k57197k12006j51262R5143J30965J71308K40274
$$ plain form
4279 28614153 27907774 26902541 25643132 24312097 22831783 21670543 20453212 19435488
4271 19435488 18599002 17807624 17101760 16589195 16220950 15824251 15448171 15119936 14913668
4262 14913668 14813011 14564085 14375111 14098222 14073812 13970784 13860026 13830778 13745702 13660929
4252 13660929 13771562 13767895 13805146 13943745 14090065 14286239 14614171 14869108 15088629 15428644
4242 15428644 15604222 15988645 16242445 16700450 17290875 17844345 18345950 18968575 19899490
4233 19899490 20885282 21858150 22969165 24185346 25490041 26927907 28371144 29560148
4225 29560148 30377716 30667957 30574613 30250093 29666648 29030292 28240609 27457795 26929680 26483051
4215 26483051 25960752 25796645 25559941 25302744 25090738 24939476 25034619 25165584 25336892 25577166
4205B5577166L31210M62882M93724N69472R11004J019008R48490R45812J064740
4196C2323508J210403J011682P32707M30950p4364k64277p13002r49112r58936
4187C2749559r10567o15396m41501k17176q4353J03289l763J92808L31051K74161
4177C1378112k7929o0809m66718o71008q45270r69193q64470q25742q00271n43804
4167B5302898o26308m54111k94071k29773j39025M2186L0083O3110K36565J47455
4157B4079009J54566J47560R1979j03432N3300J31504J82826L8117J59267L18185
4147B5252881L69722L83835J81197K8929j17570n71429o57239q72400q06503p56193
4137B2435230p27051n98663n98102n30344m27361n13671m93308o71227o23735
$$ plain form
4205 25577166 25908376 26371258 26864982 27434454 28345458 29364466 30312956 31258768 32323508
4196 32323508 33533911 34545593 35278300 35709250 35634886 35370609 34657607 33708495 32749559
4187 32749559 31838992 31223596 30782095 30564919 30480566 30583855 30580092 30772900 31103951 31378112
4177 31378112 31350183 31289374 30822656 30151648 29306378 28337185 27472715 26646973 25846702 25302898
4167 25302898 24676590 24222479 23928408 23698635 23559610 23601796 23631879 23694989 23931554 24079009
4157 24079009 24233575 24381135 24473114 24369682 24422982 24554486 24737312 24775429 24934696 25252881
4147 25252881 25622603 26006438 26187635 26216564 26098994 25527565 24870326 23997926 23191423 22435230
4137 22435230 21708179 21109516 20511414 19981070 19553709 19040038 18546730 17875503 17251768
4128A7251768o20048n50317m54913l40955m80233l83693m20549l06243j26820
4119A3567997j95177j63286k14934q7638q9556L1428n0458Q4951N4162J19517
4109A3057006P5255l6144k4177O7909j579l4017J8803j36486k9406j54711k98018
4098A2504435j08551k06340k90396j92230l49314l46030k64357k19908j77176
4089A0350133N5646j32152l0799k15152j67067j18268q9405K7651j82542k8602
4079I469443j6806k37849j48k18635j19185j15744l3821k2505n2665m8380O400
4068H610105M4212p7009m0921p9760Q6601M0935O8950M9729Q8547o7933N7690
4057H781146N8424O4780K5847P767k8255J28543O0267r2241q8028J4896N913N2185
$$ plain form
4128 17251768 16631720 16081403 15626490 15285535 14805302 14421609 14001060 13694817 13567997
4119 13567997 13372820 13209534 12994600 12906962 12817406 12848834 12798376 12883327 12937489 13057006
4109 13057006 13132261 13096117 13071940 13139849 13138270 13104253 13123056 12986570 12957164 12802453 12504435
4098 12504435 12395884 12189544 11899148 11706918 11357604 11011574 10747217 10527309 10350133
4089 10350133 10405779 10273627 10242828 10027676 9860609 9742341 9652936 9680587 9498045 9469443
4079 9469443 9452637 9214788 9214640 8996005 8876820 8761076 8727255 8704750 8652085 8603705 8610105
4068 8610105 8654317 8577308 8536387 8456627 8543228 8584163 8653113 8702842 8791389 8723456 8781146
4057 8781146 8839570 8904350 8930197 8937964 8909709 9038252 9098519 9006278 8918250 8933146 8939059 8991244
4045H991244j27336j40616Q1143J74928o1661K702M0999k3789l6910p086J7515
4034H911133K6000J22046J16287J17189O8578R3585J52179O6549J87861K3136
4024I884543J41789J25905K34451K05924J37289J76164K38072J22346O2437J46041
4014A1474961J38027P2464J93753J79083J66419K96881K70724M23405L65935O26700
4004A4208352N54698N98787O26448P49538Q10392Q39191R82528J125571J065583
3995B1561088J153725J355125J291790J587887J671572J594699J586992J220472
3987C3023350O25583k14141r29901j306316j524813j572253j422626j082641j082795
3978B4513447r05698q02534p15480n51153o42510m38131k99165l42286k39852
$$ plain form
4045 8991244 8863908 8723292 8804435 8979363 8917702 8920404 8961403 8937614 8900704 8893618 8911133
4034 8911133 8937133 9059179 9175466 9292655 9361233 9454818 9606997 9673546 9861407 9884543
4024 9884543 10026332 10152237 10386688 10592612 10729901 10906065 11144137 11266483 11328920 11474961
4014 11474961 11612988 11685452 11879205 12058288 12224707 12521588 12792312 13215717 13581652 14208352
4004 14208352 14763050 15361837 15988285 16737823 17548215 18387406 19369934 20495505 21561088
3995 21561088 22714813 24069938 25361728 26949615 28621187 30215886 31802878 33023350
3987 33023350 33648933 33434792 32504891 31198575 29673762 28101509 26678883 25596242 24513447
3978 24513447 23607749 22805215 22089735 21538582 20896072 20457941 20158776 19816490 19576638
3969A9576638n2993m0232j69438j48141j27421j12646r7914o5203m8249q1390
3959A8633011J14274J88749J18379K03644L64854L59537K73052L80487N39888
3950B1175875L44709N45748M92088M91103M80664L63811J69689L72484L45233
3941B4781404L47923K94027L32088N38832O93696O22589P37816P67337O03719
3932B9719431P14176P59528Q28437P95295Q87562Q36687R91076J235967J240019
3923C8008178J573804J752218J904296K331273K624494K995435L177610L361894
3915E7729202L438181K931488K238389J381744K15985n16039j220584j344299
3907F4854067j224859r31948n41169J98176Q58874J079254J648316K242293K761646
$$ plain form
3969 19576638 19523645 19483413 19313975 19165834 19038413 18925767 18827853 18762650 18714401 18633011
3959 18633011 18747285 18936034 19054413 19258057 19622911 19982448 20255500 20635987 21175875
3950 21175875 21520584 22066332 22558420 23049523 23530187 23893998 24063687 24436171 24781404
3941 24781404 25129327 25423354 25755442 26294274 26987970 27610559 28348375 29115712 29719431
3932 29719431 30433607 31193135 32021572 32816867 33704429 34541116 35532192 36768159 38008178
3923 38008178 39581982 41334200 43238496 45569769 48194263 51189698 54367308 57729202
3915 57729202 61167383 64098871 66337260 67719004 67934989 67418950 66198366 64854067
3907 64854067 63629208 62697260 62156091 62354267 63213141 64292395 65940711 68183004 70944650
3898G0944650L268080L796458M289317N021336N889441O954283Q289268R598619
3890A18051452J1230770J3397269J5491402J7330195J8849453J7667594J1626426
3883B23644561J264829q931779j5719518j8921705j8788126j6283522j3373648
3876A32891092j0727050q661308o886185n398138m438599l655817k723833k049301
3868H8350861j309277n76939K6266M78677L75699o04378k239240l446945m095381
3859G6959343m455463m348066l746477l325720k769074k488851k262649j972934
3851E1590109j691307j679455j487362j262723r91174q88201p66052n16975k65805
3842D2041055k33636o2821K07513K97397M39090O82105O43414O10791Q33874P71447
$$ plain form
3898 70944650 74212730 78009188 82298505 87319841 93209282 100163565 108452833 118051452
3890 118051452 129282222 142679491 158170893 175501088 194350541 212018135 223644561
3883 223644561 224909390 215977611 200258093 181336388 162548262 146264740 132891092
3876 132891092 122164042 113502734 106616549 101218411 96779812 93123995 90400162 88350861
3868 88350861 87041584 86464645 86490911 86969588 87345287 86740909 84501669 81054724 76959343
3859 76959343 72503880 68155814 64409337 61083617 58314543 55825692 53563043 51590109
3851 51590109 49898802 48219347 46731985 45469262 44478088 43589887 42823835 42306860 42041055
3842 42041055 41807419 41744598 41952111 42249508 42688598 43370703 44014117 44624908 45458782 46230229
3832D6230229R61811J006820J052070J307415J317903N92712l49665j442010k080621
3823D8596664k345349k310287k047638j874429j574764j240803j159031j285496
3815C4758867r70891r61792o72892o76208m59592m20438j82645k36636k95195
3806B9882578r5333k0020J13889P0597K04224R6879Q5537P9924K10060k7894K15387
3795C0815828K41732L68795M42218M74602N92374O10263P43743Q72854Q17465
3786C5979874J082922J167521J189149J501308J648223J693835J812841J989938
3778D8065611J910341J563542J002953R9409k65781p49378r40334q25569o17717
3769D9243077k68799k8707J65275M87864O14883P17771P12983P56893P13212O22492
$$ plain form
3832 46230229 47192040 48198860 49250930 50558345 51876248 52468960 52119295 50677285 48596664
3823 48596664 46251315 43941028 41893390 40018961 38444197 37203394 36044363 34758867
3815 34758867 33787976 32826184 32153292 31477084 31017492 30597054 30414409 30177773 29882578
3806 29882578 29787245 29767225 29881114 29951711 30155935 30252814 30338351 30418275 30628335 30600441 30815828
3795 30815828 31057560 31426355 31868573 32343175 32935549 33545812 34289555 35162409 35979874
3786 35979874 37062796 38230317 39419466 40920774 42568997 44262832 46075673 48065611
3778 48065611 49975952 51539494 52542447 52641856 52376075 51626697 50686363 49860794 49243077
3769 49243077 48974278 48945571 49110846 49598710 50213593 50931364 51644347 52401240 53114452 53736944
3759E3736944Q85845P62078J045345J202499J333015J575774J735725J907104
3751F4184329K162645K283035K539105K634324K886554L043628L148613L452527
3743H6334760L499995L738073L953162L972557M324615M390994M422442M821264
3735A19457862M928804M995116N112407N097524N209745N145845N353719N096797
3727A60397819N068069N094188N128456M980217M955067M717187M481689M426048
3719A99248740M038108L826063L396044L183111K836852K434954K154429J712461
3711B22830762J444552J151902Q41500N29611J70881l78784r46842j347476j522659
3702B22773447j919430k420954k589705k876044l052422l239902l570418l672759
$$ plain form
3759 53736944 54622789 55384867 56430212 57632711 58965726 60541500 62277225 64184329
3751 64184329 66346974 68630009 71169114 73803438 76689992 79733620 82882233 86334760
3743 86334760 89834755 93572828 97525990 101498547 105823162 110214156 114636598 119457862
3735 119457862 124386666 129381782 134494189 139591713 144801458 149947303 155301022 160397819
3727 160397819 165465888 170560076 175688532 180668749 185623816 190341003 194822692 199248740
3719 199248740 203286848 207112911 210508955 213692066 216528918 218963872 221118301 222830762
3711 222830762 224275314 225427216 226268716 226798327 226969208 226590424 225643582 224296106 222773447
3702 222773447 220854017 218433063 215843358 212967314 209914892 206674990 203104572 199431813
3694A99431813l884772l985182m195751m538598m543448m710868m829323m735400
3686A64008471m691938m476637m522736m715050m478701m373115m354946m269503
3678A28125845m277603m301632m135096m047981l926996l833568l621952l501709
3670I6479308l360386l415417l129206k971272k927773k928969k732281k543570
3662G2470434k578017k411003k183902k358085k038812k022003k100808j879570
3654E4898234j894910j758868j671242j605532j655233j416306j460705j481232
3646D1954206j285990j238404j244992j067793r80667r86345q48470r59041j030388
3637C2312116p15510p79064o32800o99253p18712n17232m13635n42876n00859
$$ plain form
3694 199431813 195547041 191561859 187366108 182827510 178284062 173573194 168743871 164008471
3686 164008471 159316533 154839896 150317160 145602110 141123409 136750294 132395348 128125845
3678 128125845 123848242 119546610 115411514 111363533 107436537 103602969 99981017 96479308
3670 96479308 93118922 89703505 86574299 83603027 80675254 77746285 75014004 72470434
3662 72470434 69892417 67481414 65297512 62939427 60900615 58878612 56777804 54898234
3654 54898234 53003324 51244456 49573214 47967682 46312449 44896143 43435438 41954206
3646 41954206 40668216 39429812 38184820 37117027 36136360 35150015 34301545 33342504 32312116
3637 32312116 31596606 30817542 30184742 29485489 28766777 28249545 27835910 27293034 26792175
3628B6792175k96865m00604l50665m04648k75869k72110k52778l28613k22923
3619B3987100l16597l77613m06490l71463j58915k27043l05490k27940k17343
3610B1378206j10193j24353r1929r6661p013j0386k782K08924K22957R5086K27442
3599B1689298L28690L60857M67688K19657L93121N62356P15455N90836N11615
3590B5839573O80618O41394O44712R14629J037580J064812J312043J365446J586978
3581C5087785J609286J519536J111964K90978q80454j642281k019571k267519
3573C2809724k109736j876918j614157j420765j205180j066374q27557q28007
3565B1861030o39988p26875o45167m57037m02237m50502l52401l00589k94330
$$ plain form
3628 26792175 26495310 26094706 25744041 25339393 25063524 24791414 24538636 24210023 23987100
3619 23987100 23670503 23292890 22886400 22514937 22356022 22128979 21823489 21595549 21378206
3610 21378206 21268013 21143660 21051731 20955070 20948057 20937671 20934889 21143813 21366770 21461856 21689298
3599 21689298 22017988 22378845 22846533 23066190 23459311 24021667 24737122 25327958 25839573
3590 25839573 26520191 27161585 27806297 28720926 29758506 30823318 32135361 33500807 35087785
3581 35087785 36697071 38216607 39328571 39619549 38739095 37096814 35077243 32809724
3573 32809724 30699988 28823070 27208913 25788148 24582968 23516594 22689037 21861030
3565 21861030 21221042 20494167 19849000 19391963 18989726 18539224 18186823 17886234 17591904
3556A7591904l46805k76264j85054l03254k10790q3157j73875j82530k55407j12649
3546A5462119K8045J4150m9715r9170j09153k4809o5687M6839R6881n1109p884
3535A5240507K1485J01938J21280J20641L0756J41418J04663L8121J64331K00599
3525A6285739Q6219K28838O1686R6865J41333K61312J80261j570J36121L8609
3515A7515413R0554K82414J00633Q6216K20121N5233K34600M7061L5016R0162
3505A8757423K60867R5261J05813K30733Q6104K00450K89280J42828L10473L12152
3495B0791384J47507J35085N14975L72695L33690M97109L88431M73942M26389
3486B4081207O04463N50231N07385N45421O82569O70466O73860N96631P36272
$$ plain form
3556 17591904 17245099 16968835 16783781 16480527 16269737 16186580 16012705 15830175 15574768 15462119
3546 15462119 15490164 15504314 15454599 15355429 15246276 15221467 15155780 15202619 15299500 15248391 15240507
3535 15240507 15261992 15363930 15485210 15605851 15636607 15778025 15882688 15920809 16085140 16285739
3525 16285739 16371958 16600796 16662482 16759347 16900680 17161992 17342253 17340683 17476804 17515413
3515 17515413 17605967 17888381 17989014 18075230 18295351 18350584 18585184 18632245 18667261 18757423
3505 18757423 19018290 19113551 19219364 19450097 19536201 19736651 20025931 20168759 20479232 20791384
3495 20791384 20938891 21073976 21588951 21961646 22295336 22792445 23180876 23654818 24081207
3486 24081207 24685670 25235901 25743286 26288707 26971276 27641742 28315602 28912233 29648505
3477B9648505P97795P65212O45821P05479P04468P95996P85389O74170P43286
3468C6266121P49216Q15023O03469O06936P71407N68431O55928N38696N54841
3459D2130068N55690M61005N25818M81385O16565O46756N49383N06039N14345
3450D6987054M58935O87016P30988N99696P14784Q25419R92259Q97861J063371
3441E3957383J172936J333211J390237J526654J728111J702638J808500K049701
3433F6669371K015230K075499K162475K268744K510722K289801K379222K426178
3425H4797242K493300K470104K449176K509053K187891K447811K250521K020556
3417A03625654J987614J870271J831001J759095J518714J435523J258001J138290
$$ plain form
3477 29648505 30446300 31211512 31857333 32562812 33267280 34063276 34848665 35522835 36266121
3468 36266121 37015337 37830360 38433829 39040765 39812172 40380603 41036531 41575227 42130068
3459 42130068 42685758 43146763 43672581 44153966 44770531 45417287 45966670 46472709 46987054
3450 46987054 47445989 48133005 48863993 49463689 50178473 51003892 51996151 52894012 53957383
3441 53957383 55130319 56463530 57853767 59380421 61108532 62811170 64619670 66669371
3433 66669371 68684601 70760100 72922575 75191319 77702041 79991842 82371064 84797242
3425 84797242 87290542 89760646 92209822 94718875 96906766 99354577 101605098 103625654
3417 103625654 105613268 107483539 109314540 111073635 112592349 114027872 115285873 116424163
3409A16424163J183992J115243J024421J027163R47928R50807R09228Q85847J032908
3400A25501700J062638J182137J475350J419732J618071K177085K352555K569485
3392A39358753K922814L077719L453335L842514M150098M556355M937450N358458
3384A71657496N572441N951014O229425O462756O822990O930075P138052P362754
3376B24127003P525487P633504P755117P971989P831798P818812P724518P490284
3368B85878512O990389O767255O350289O001236N552620N275367M889478M629305
3360C32334451M176547L790697L445292L047966K739404K390982K077050J777163
3352C55779552J655367J640180J434958J500604J658408J793162J868352K198071
$$ plain form
3409 116424163 117608155 118723398 119747819 120774982 121722910 122673717 123582945 124468792 125501700
3400 125501700 126564338 127746475 129221825 130641557 132259628 134436713 136789268 139358753
3392 139358753 142281567 145359286 148812621 152655135 156805233 161361588 166299038 171657496
3384 171657496 177229937 183180951 189410376 195873132 202696122 209626197 216764249 224127003
3376 224127003 231652490 239285994 247041111 255013100 262844898 270663710 278388228 285878512
3368 285878512 292868901 299636156 305986445 311987681 317540301 322815668 327705146 332334451
3360 332334451 336510998 340301695 343746987 346794953 349534357 351925339 354002389 355779552
3352 355779552 357434919 359075099 360510057 362010661 363669069 365462231 367330583 369528654
3344C69528654K307177K691111K700206L015751L128327L233215L372475L547289
3336C93524205L648644L617883L611414L496287L488906L330814L161809K951785
3328D20831747K703922K824169K692651K526621K503733K717313K982157L110099
3320D42892412L604300L796023M392512M893052N436323O070120O376363O547937
3312D84009042O550234N750050M924329L477442J870541M02538j360741k606377
3304E03017058l618527m614025n027372n407865n751735o481498p083954q116659
3296D56915423r397943j0783287j2114885j3328881j3999041j4294401j4164761
3289C68832224j3699233j2704473j1765951j0417664r106005p726244o446616
$$ plain form
3344 369528654 371835831 374526942 377227148 380242899 383371226 386604441 389976916 393524205
3336 393524205 397172849 400790732 404402146 407898433 411387339 414718153 417879962 420831747
3328 420831747 423535669 426359838 429052489 431579110 434082843 436800156 439782313 442892412
3320 442892412 446496712 450292735 454685247 459578299 465014622 471084742 477461105 484009042
3312 484009042 490559276 496309326 501233655 504711097 506581638 506984176 505623435 503017058
3304 503017058 499398531 494784506 489757134 484349269 478597534 472116036 465032082 456915423
3296 456915423 447517480 436734193 424619308 411290427 397291386 382996985 368832224
3289 368832224 355132991 342428518 330662567 320244903 311138898 303412654 296966038
3282B96966038n212288m143397l055553k135959q72404L7978R37002K094234K848012
3273B87463663L751678M498638N044495N637831N571723M863418M232852L161682
3265C24225980J925487M78381o41310j930338k694994l267631l682407m251036
3257C10162132m652130n030483n860202o719596p834802q821120r860793j0794516
3249B50588490j1426780j1821731j1590571j1225964j0890992j0104374r323648
3242A74204430q659081p801403p171033o372346n738274n332658m730570m202093
3234A24196972l740321l280200l060657k702600k257182j856058j758019j427931
3226A04114004j138335q80920p37472m62970l16916k44138k88339k11231j97430
$$ plain form
3282 296966038 291753750 287610353 284554800 282418841 281546437 281584415 282521417 284615651 287463663
3273 287463663 291215341 295713979 300758474 306396305 311968028 316831446 321064298 324225980
3265 324225980 326151467 326629848 325988538 324058200 321363206 318095575 314413168 310162132
3257 310162132 305510002 300479519 294619317 287899721 280064919 271243799 261383006 250588490
3249 250588490 239161710 227339979 215749408 204523444 193632452 183528078 174204430
3242 174204430 165545349 157743946 150572913 144200567 138462293 133129635 128399065 124196972
3234 124196972 120456651 117176451 114115794 111413194 109156012 107299954 105541935 104114004
3226 104114004 102975669 102094749 101357277 100894307 100577391 100333253 100044914 99833683 99636253
3217I9636253m50805o36172o91315o98393r98270j155559j265655j253687j573869
3208I0912528j586885j585003j785367j888093k143061k285474k402489k428210
3200G4807946k588177k736695k670536k563845k504929k377175k306428k247560
3192E4812601j949510j977347j925276j610642j596955j500223j323108j250209
3184D1679331j207453j222900j007932j011251q93740q54057q78216p71108p94300
3175C3038374q22366p68265p50673o49863n49915o43878n41457l66996n33888
3166B7411073o00846m45159m45881l47512m45189n94839m74004m99061l40363
3157B3218219m79154m02215m36093l44933k62128m06715l65573l45739m39416
$$ plain form
3217 99636253 99185448 98549276 97857961 97159568 96161298 95005739 93740084 92486397 90912528
3208 90912528 89325643 87740640 85955273 84067180 81924119 79638645 77236156 74807946
3200 74807946 72219769 69483074 66812538 64248693 61743764 59366589 57060161 54812601
3192 54812601 52863091 50885744 48960468 47349826 45752871 44252648 42929540 41679331
3184 41679331 40471878 39248978 38241046 37229795 36336055 35481998 34603782 33832674 33038374
3175 33038374 32216008 31447743 30697070 30047207 29497292 28853414 28311957 27944961 27411073
3166 27411073 26810227 26365068 25919187 25571675 25126486 24531647 24057643 23558582 23218219
3157 23218219 22739065 22336850 21900757 21555824 21293696 20886981 20521408 20175669 19736253
3148A9736253l46710k94195l66181k88107l53699k15642l01281k98331l49563
3139A6922544l17459k44847j40888l32885k42562k18128k26338l68154k59481
3130A4571802j05132o4647j16380k20546k37873j11516k70546j52178o2021K6097
3120A3257060p4785k35493j80987j5071l3947j28710r7406k28181p2349J256j95945
3109A1995442j14609r1750n4861M614j39701k7354m5700j33099r2691R388j33785
3098A1175894j9842j63586j10246q3885K2667p3283j00759j0424j74600r6748
3088A0365188o3769j42726j32722k5757K1519j15240j38658J2868J10910j61226
3078I730387M324k4625Q485J48809j3835m4754N2774J6883p4125J23009J23766
$$ plain form
3148 19736253 19389543 19095348 18729167 18441060 18087361 17871719 17570438 17272107 16922544
3139 16922544 16605085 16360238 16219350 15886465 15643903 15425775 15199437 14831283 14571802
3130 14571802 14466670 14402023 14285643 14065097 13827224 13715708 13445162 13292984 13230963 13257060
3120 13257060 13182275 12946782 12765795 12750724 12716777 12588067 12490661 12262480 12190131 12191387 11995442
3109 11995442 11880833 11789083 11734222 11738836 11599135 11571781 11526081 11392982 11300291 11309679 11175894
3098 11175894 11156052 10992466 10882220 10798335 10821002 10747719 10646960 10636536 10461936 10365188
3088 10365188 10301419 10158693 10025971 10000214 10021733 9906493 9767835 9780703 9891613 9730387
3078 9730387 9734711 9710086 9718571 9867380 9853545 9808791 9861565 9878448 9804323 9927332 10051098
3067A0051098j31386P8988N0525N2357J01886J1703m8634j32115J1944j71507
3057I874859k42790q9361k15994j46161j17617r3442p6014j53576p3854m2762
3047H623288j01923j69220j59755j33575r8615o8260n9753j15569p9038n9849
3037G577731j60557j42709j47159j85655l0320j48105j47686k11241j99843j20733
3027F083723j29799p7105k193j26562j11471m7656J1576j7080N9490j8828j03776
3016E520319q8804p7053K1873m7102J23234O3736M9572l1373k2696p8006j42499
3005E291201j15061n1864j76302j16741j4937k16093r653m7876j03481o8852p3413
2994D296928j43703m3845k5900j00477j61745n4051o90q5043j42167q3797R853
$$ plain form
3067 10051098 9919712 9998700 10049225 10101582 10203468 10215171 10166537 10034422 10046366 9874859
3057 9874859 9632069 9542708 9326714 9180553 9062936 8969494 8893480 8739904 8666050 8623288
3047 8623288 8521365 8352145 8192390 8058815 7960200 7891940 7832187 7716618 7637580 7577731
3037 7577731 7417174 7274465 7127306 6941651 6911331 6763226 6615540 6404299 6204456 6083723
3027 6083723 5953924 5876819 5874626 5748064 5636593 5588937 5600513 5583433 5642923 5624095 5520319
3016 5520319 5431515 5354462 5376335 5329233 5452467 5516203 5565775 5534402 5511706 5433700 5291201
3005 5291201 5176140 5124276 4947974 4831233 4816296 4600203 4590550 4542674 4439193 4370341 4296928
2994 4296928 4153225 4109380 4083480 3983003 3821258 3767207 3766517 3681474 3539307 3455510 3465363
2983C465363j9325j3182L90k757n5798j40643j82981j39271Q1072j06356j26682
2972B759830o2705j35787m0838R736o2864m9196J5007r814M0563P9152K4482j36268
2960B431298q4395K2784k3688j20722J13878j35249K1632k1092o8678j6484J07691
2949B226975j63854r2003Q7485j27793K8213r4131k8212O8638m0793j21662p0131
2938A672732M4410l8141P4522p9010n5390N7680k7024q477r1809M9642l105N8051
2926A654081m5121r2327n9815k546n7184Q3234l1347L2944j0488M569k2020k135
2914A451845J0624l9430N92k7M3009N3225n8802l6193o3101M1236n627J4670J4679
2901A426700k6135J14766o794J44334m361r8907q5650j04304m5485L6101J55258
$$ plain form
2983 3465363 3446038 3432856 3433246 3430489 3374691 3234048 3051067 2911796 2992868 2886512 2759830
2972 2759830 2697125 2561338 2520500 2530236 2467372 2418176 2433183 2423369 2463932 2543084 2567566 2431298
2960 2431298 2346903 2369687 2345999 2225277 2339155 2203906 2225538 2204446 2135768 2119284 2226975
2949 2226975 2063121 1971118 2058603 1930810 1959023 1864892 1836680 1905318 1864525 1742863 1672732
2938 1672732 1717142 1679001 1753523 1674513 1619123 1676803 1649779 1641302 1549493 1599135 1596030 1654081
2926 1654081 1608960 1516633 1456818 1454272 1397088 1480322 1448975 1481919 1471431 1476000 1453980 1451845
2914 1451845 1462469 1423039 1423631 1423604 1466613 1519838 1461036 1424843 1361742 1402978 1397351 1412021 1426700
2901 1426700 1400565 1515331 1508537 1652871 1648510 1549603 1463953 1359649 1314164 1350265 1505523
2890A505523P70r7765J309j8664N1058L7313p4242j61672l141l3973N7530J9113
2878A283159o9165j02814k5934J03194P748l1820j5886K7097k7731o5840n980
2867A076028K4746K2242K421r8013r6867N3437J17001q1772N2641K4327l9490
2856A056701k690N4203J9596K7020p7004j00908Q8023J63127J08977j06887l7614
2845A192544l9871j6581r9081j35425O1535j9270q627J00589j2323p5228m368
2834I43894Q104j01470j19423P2164J31671j151n4911O1716r2639r3816K02807
2823I56946q386q4095L7392p7830O4464L4527r3907Q8058p1605Q5150M4621n6868
2811I18467r9095m7203n717k7791Q8584l314j05366P9351K8745r8055O6785j32037
$$ plain form
2890 1505523 1506293 1408528 1409837 1391173 1442231 1479544 1405302 1243630 1240489 1206516 1264046 1283159
2878 1283159 1213994 1111180 1085246 1188440 1196188 1164368 1148482 1175579 1147848 1082008 1076028
2867 1076028 1100774 1123016 1125437 1027424 930557 983994 1100995 1019223 1071864 1096191 1056701
2856 1056701 1054011 1108214 1127810 1154830 1077826 976918 1064941 1228068 1337045 1230158 1192544
2845 1192544 1152673 1136092 1037011 901586 963121 943851 935224 1035813 1023490 948262 943894
2834 943894 951998 850528 731105 803269 934940 933789 878878 940594 847955 754139 956946
2823 956946 948560 864465 901857 824027 888491 923018 829111 917169 845564 930714 975335 918467
2811 918467 819372 772169 766452 738661 827245 823931 718565 797916 826661 728606 795391 663354
2799F63354M9953j3069j860L2340j09202R6432m6310m4367o0505J662K4509K5781
2787F18718P5863M876O1523m8825l8569K5808r276J2853J9328L5062m256q1182
2775F71923k3702k4564J9394J23471r9262K7430j18487J14663o5736k075j6419
2764F06636j1656J73496n2305J5950n8504n7096P402R0579o2412q0946J5015K2959
2752F09118L25k3046m7429K2482m7630J0587K3888J1804m5902J9114j7278p1812
2740D44221L1888K3627j1416M9249L7420N641K9683p6646j26197K8426L5134J17991
2728E89021j62296j4916N5779q833l9870j2804L9684r9734K9634J28834m5750
2717D58749m2193R204n5695N3065l1164O3431J3409o9472N6458o9402o7168J26112
$$ plain form
2799 663354 713307 700238 698378 730718 621516 717948 671638 627271 566766 568428 592937 618718
2787 618718 694581 699457 760980 712155 673586 699394 690118 702971 722299 757361 753105 671923
2775 671923 648221 623657 643051 766522 667260 694690 576203 690866 625130 623055 606636
2764 606636 594980 768476 716171 732121 673617 616521 623923 714502 652090 571144 586159 609118
2752 609118 609443 586397 538968 561450 513820 524407 548295 560099 514197 533311 516033 444221
2740 444221 476109 499736 488320 537569 574989 580630 610313 533667 407470 435896 471030 589021
2728 589021 426725 411809 467588 458755 418885 406081 445765 346031 375665 504499 458749
2717 458749 416556 425760 370065 423130 391966 455397 468806 399334 455792 386390 319222 445334
2705D45334n133m2178r3830M575m5216l8975J14076j0036n983O1412O5744j38373
2693C11417l5436p1803N3098k4174K4194l91l9931k6110o597Q97m8923Q1936Q3961
2680C02138j11583n3269L3176r8930M9198l1500J0434j1036J02564M475n3714
2669A41953l6617o6960m4636L0205r901J26112J4383o5920J09582o0360J0302
2658A48143k2297N4362N9400q6930O1488p6637k46617M8459J11033n017N4011
2647I9398o3709o8439j7819J9065J59732l8647K9520l9366r8712J00513R331K6132
2635A16999l2159k0312M4659R1052j02384l7182K290J68173j6560j77945O428
2624D3059j8631O893K0724P8219m7106m2213l4051K0126Q0222k1545j6133J3942
$$ plain form
2705 445334 440201 398023 304193 308768 263552 224577 338653 328617 322634 384046 449790 311417
2693 311417 275981 204178 257276 233102 257296 256905 216974 190864 184267 185164 136241 218177 302138
2680 302138 190555 137286 170462 71532 120730 89230 99664 88628 191192 195667 141953
2669 141953 105336 38376 -6260 23945 14044 140156 154539 88619 198201 137841 148143
2658 148143 125846 180208 239608 152678 214166 137529 -109088 -60629 50404 45387 99398
2647 99398 35689 -32750 -50569 -31504 128228 89581 119101 79735 -18977 81536 90867 116999
2635 116999 84840 64528 109187 200239 97855 60673 62963 231136 214576 36631 43059
2624 43059 24428 31321 52045 130264 83158 40945 6894 27020 107242 85697 69564 83506
2612H3506n0198j5966K24J2621O0878j30522J3937M6412q8036L7220j26689J165
2600a55448J40522j8111O3803j2992m9910o318P966N5658J6696L6533j4367N646
2588F9678R0550J4716j14267m41r7887r13P1689k0000p9916j47600M2835M0226
2576a31330k5161Q4403L119o138r0438j5021j8823j7784Q0236M1165P3273K7084
2564D585M6805j582k1625L9670K261l8600M3262r7239j21013J07365j2933j2005
2552f1049r8993o4262L8754K7004k8525k7147M8677K8906J957p8317P0694J0774
2540a31527r659M8551M5562r9644P7962M5738p5651o8216J44470j1591l4487o7745
2528a36237J23136M8159M290j21026n5554J10120p0709M8993L9042j4428j61767
$$ plain form
2612 83506 33308 17342 17566 30187 91065 -39457 -25520 20892 -67144 -29924 -156613 -155448
2600 -155448 -14926 -33037 30766 17774 -32136 -38454 -30488 25170 41866 78399 64032 69678
2588 69678 160228 174944 60677 60236 -37651 -38564 33125 13125 -66791 -214391 -171556 -131330
2576 -131330 -156491 -72088 -68969 -75107 -165545 -180566 -199389 -217173 -136937 -95772 -22499 4585
2564 4585 51390 49808 28183 67853 70114 31514 74776 -22463 -143476 -36111 -49044 -61049
2552 -61049 -160042 -224304 -185550 -158546 -187071 -214218 -165541 -136635 -134678 -212995 -142301 -131527
2540 -131527 -141186 -92635 -47073 -146717 -68755 -23017 -98668 -166884 -22414 -34005 -68492 -136237
2528 -136237 -13101 35058 39348 -81678 -137232 -27112 -97821 -48828 -9786 -24214 -185981
2517a85981M5266J84506K4342q8884J41548J06997j34066l3155N3206r0648n8981
2506c5850N5747l1322q3865L9529n3809J6099N8029J6487j8267N3812P101j29645
2494a05954l4663P6862L6895q5208O5124J10430K6191j5994m3551j05586l8334
2483a13788J17930m974N7031j28529o634P285J18683P312M6519o1814k9697m5197
2471c5873l7961O9315n0490K0753m415m9945k3626O8870J19559L3291o9707J3384
2459E3155j40906M1857K2037o2076J2411K9456j6392k7375k998N9262J9400o601
2447a8770R6464p8379q8599Q4973o0773O5038J4469o1013M0264K3801L075K524
2435B3074J4813n2424K0526j09553j5478M4394j1874N4725M0339r0887J13076
$$ plain form
2517 -185981 -140715 43791 68133 -20751 120797 227794 93728 60573 113779 23131 -35850
2506 -35850 19897 -11425 -95290 -55761 -109570 -93471 -35442 -18955 -37222 16590 23691 -105954
2494 -105954 -140617 -63755 -26860 -112068 -46944 63486 89677 73683 30132 -75454 -113788
2483 -113788 4142 -832 56199 -72330 -78964 -71679 47004 54316 100835 39021 9324 -35873
2471 -35873 -73834 -4519 -55009 -34256 -38671 -88616 -112242 -43372 76187 109478 39771 53155
2459 53155 -87751 -45894 -23857 -85933 -73522 -44066 -60458 -87833 -90831 -31569 -12169 -18770
2447 -18770 77694 -685 -89284 -4311 -65084 -46 14423 -46590 -6326 17475 20550 23074
2435 23074 37887 -14537 5989 -103564 -119042 -74648 -86522 -31797 8542 -82345 30731
2424C0731J58051j28232j17856p683L0566m1858k6994J604q130k5072J12744N5982
2412C3853j72477R683L0036R0610p9640o2142J8538J8943k8855J8697Q3153j01435
2400a41036m3796J6635P6534P4220k3061r0058M473n0934m5470J18033L6058m3281
2388a11683M4721p0800Q5730L8730q7903n3970K1896R0688J3725o3655J18060
2377B5539r6565r8819L9340Q0825n1295j4645l0534m5495O6035P1387j0738N3359
2365a1606o9423N1774J0744j57885J4701O4755r1082K2729j9018o4788M3832M6135
2353a59132j01503J36365M5591n2380j4275j10568J34945N311M4045p8444o1048
2342b11093J24229o511J0523J6605j12932L2529N6463O2501r5942k5211o3410
$$ plain form
2424 30731 188782 60550 -57306 -64989 -34423 -76281 -103275 -101671 -109801 -134873 -22129 33853
2412 33853 -138624 -128941 -98905 -8295 -87935 -150077 -131539 -112596 -141451 -122754 -39601 -141036
2400 -141036 -184832 -168197 -91663 -17443 -40504 -130562 -126089 -177023 -222493 -104460 -68402 -111683
2388 -111683 -66962 -137762 -52032 -13302 -101205 -155175 -133279 -42591 -28866 -92521 25539
2377 25539 -71026 -169845 -130505 -49680 -100975 -115620 -146154 -191649 -125614 -54227 -64965 -11606
2365 -11606 -81029 -29255 -18511 -176396 -161695 -96940 -188022 -165293 -184311 -249099 -205267 -159132
2353 -159132 -260635 -124270 -78679 -131059 -145334 -255902 -120957 -115646 -71601 -150045 -211093
2342 -211093 -86864 -93375 -82852 -66247 -179179 -146650 -90187 -27686 -123628 -148839 -212249
2331b12249O4342K7816j35901J36762k415l3963K4791o4300P8146o5749M7528
2320a35192L2897r3331o4392Q8839M530o9068L8357M3256M7537N1984j3857o2573
2308a31013l1932k2672l0228O5003k8316M3770r087j30164J9909Q6513K0663N6642
2296i0912r0150M0196p9805p7479J43967m9419k024M0950N761J78427l2704l673
2284a6865n2326K1082L457o5702M0208p806N7793M4200R405J8610j03915l3390
2272h5249P3828J7163N3764j51271P901J19585K9404R456n4627J823q7190l8803
2260a04216L1925R551P7404j36686O9199L58P561r3325M97P6780l2889l2136J9160
2247a06817L8360M3510O776K6929k8482m1660L5482N9963l2305j41855l6507J1287
$$ plain form
2331 -212249 -147907 -120091 -255992 -119230 -121645 -155608 -130817 -195117 -116971 -182720 -135192
2320 -135192 -102295 -195626 -260018 -171179 -166649 -235717 -197360 -154104 -106567 -54583 -68440 -131013
2308 -131013 -162945 -185617 -215845 -150842 -179158 -135388 -144475 -274639 -254730 -168217 -147554 -90912
2296 -90912 -181062 -140866 -220671 -298150 -154183 -203602 -205626 -164676 -158915 19512 -13192 -16865
2284 -16865 -69191 -48109 -44652 -110354 -70146 -77952 -20159 24041 33446 52056 -51859 -85249
2272 -85249 -11421 5742 59506 -91765 -83864 35721 65125 74581 19954 21777 -65413 -104216
2260 -104216 -72291 -62740 14664 -122022 -52823 -52465 -44904 -138229 -137732 -60952 -93841 -125977 -106817
2247 -106817 -68457 -24947 -18171 8758 -19724 -61384 -25902 34061 1756 -140099 -176606 -165319
2235a65319m4889J6563K0203J27830k1738K1170q3254K0829J16467o1430l8337
2224i1905K7840J544k0074q568o3571L2060p2680J9029L5878j5365M5679P7093
2212c3040J02548j7836q161r1932n8281O2293J2546j16817p29O6555N8083N5775
2200C1004J1172n2709j79988j3736j1226K8349P8957O0045L0626K5454p7981j7309
2188h7342Q8715k559l1898L7876k4527J30920j78102P5502P408l4196m524j88169
2176b10896J22299k2407p7610L5150M6774O6935N5068N9628j9793o7708o7616
2165h0176Q213L1846n9614L4312k5794M8589R500N8366p1227P4275o7748M4536
2153E078O3144j14018O9163j5381R5134k9232p441M1742J9338K408J545o7498
$$ plain form
2235 -165319 -210208 -193645 -173442 -45612 -67350 -46180 -129434 -108605 7862 -53568 -91905
2224 -91905 -64065 -62521 -82595 -91163 -154734 -122674 -195354 -176325 -140447 -155812 -110133 -33040
2212 -33040 69508 51672 43511 -48421 -106702 -44409 -31863 -148680 -149409 -82854 -24771 31004
2200 31004 42176 -10533 -190521 -204257 -215483 -187134 -108177 -48132 -17506 7948 -70033 -87342
2188 -87342 1373 -1186 -33084 4792 -19735 111185 -66917 8585 15993 -18203 -22727 -210896
2176 -210896 -88597 -111004 -188614 -153464 -106690 -39755 15313 74941 55148 -12560 -80176
2165 -80176 -71963 -40117 -99731 -65419 -91213 -42624 -33124 25242 -45985 28290 -39458 5078
2153 5078 68222 -45796 23367 7986 103120 73888 66447 108189 127527 129935 131480 63982
2141F3982J1910K767j5490Q6066r3467j4448J61315q1297M7818l9352K3270K0784
2129A73858j3343l6892k3045J2808j8067o6861Q1270L4682P7137r9837j8195J12470
2117B15985K714l4908N6881J3081k004L5915L3563k8313k1860L9622M1022o8067
2105B83631P63L4830r4740J11585O1640P6838j9208Q3159r1713N7459L1290L1264
2093E66798j4364K00402l8203L9280N767j2520j6407n6879J0302P0108o8676O1472
2081G47080P8321L285l3924O9265J25158k1757P2245n509K2541k2683M182J10542
2069A148746J64210R1874J89837K9337Q9821J18449m046J37814j1351J55122O7214
2058B177027J88715K07896J75128K32860M04790L35331L44058M93847N04659N20052
$$ plain form
2141 63982 75892 78659 63169 149235 55768 41320 202635 121338 169156 129804 153074 173858
2129 173858 160515 123623 100578 113386 95319 28458 109728 144410 221547 121710 103515 215985
2117 215985 218699 183791 240672 253753 251749 287664 321227 292914 271054 310676 351698 283631
2105 283631 284394 319224 224484 336069 397709 474547 455339 538498 446785 504244 535534 566798
2093 566798 552434 752836 714633 753913 759680 747160 730753 673874 684176 754284 685608 747080
2081 747080 825401 828686 794762 864027 989185 967428 1039673 1034164 1056705 1034022 1038204 1148746
2069 1148746 1312956 1404830 1594667 1624004 1713825 1832274 1828228 1966042 1954691 2109813 2177027
2058 2177027 2365742 2573638 2748766 2981626 3386416 3721747 4065805 4559652 5064311 5584363
2048E584363N79107O71506M16637P63554R79299R99742J196309J664577K102868
2039A4957962K290927K807635L625668K887401k84436k200945k799360l397618
2031A7887234l028454k293789j554255j443830j055792q56201o73598o06420m85294
2022E889601m36041m21658m07858m30732l66178l14222k50809k50002j49086j52406
2012B710609j34088j65856k21181R127p7239q1173j57840q1799r8520j940j50671
2001A549429k8664Q3781j24200j02247j0594m7775l2758j18439l021j23328j00213
1990I41971o7602r3121Q8284R2759k8516k6066j34797k8338L7346n1521j57007
1979E73392m1109K1987N4732Q3568j21267k4337l1874m3060k8342n594p9261P598
$$ plain form
2048 5584363 6163470 6834976 7251613 8015167 8994466 9994208 11190517 12855094 14957962
2039 14957962 17248889 20056524 23682192 26569593 26285157 24084212 21284852 17887234
2031 17887234 14858780 12564991 11010736 9566906 8511114 7654913 6981315 6374895 5889601
2022 5889601 5453560 5031902 4624044 4193312 3827134 3512912 3262103 3012101 2863015 2710609
2012 2710609 2576521 2410665 2189484 2198611 2121372 2040199 1882359 1800560 1702040 1700100 1549429
2001 1549429 1520765 1604546 1480346 1378099 1367505 1319730 1286972 1168533 1165512 1042184 941971
1990 941971 874369 781248 869532 962291 933775 907709 772912 744574 781920 730399 573392
1979 573392 532283 554270 609002 692570 571303 546966 515092 472032 443690 438096 358835 366433
1967C66433P3303J12168J8784j00581j40365J09702j8034L3745n7043l9612j0746
1956C47754p2861l7319L4065q4055M4116o184L7968l8541L0690o9418J24650K6082
1944C36947j34728M1179n794l7799o3535L7264p9995m2237K6261k5912K3388J64938
1932B39977l6678o4582r1846j3326M5792j829p2063K8589J61626p5927q4251k3315
1920A2167q3069R8024J5853j07097N308N5979J28236r147J5656J31605j04779
1909A58736p5484Q234m3136o822L6944O3210j2973j54361k2793Q4028l4930M9341
1897D9994l0207m9703Q8700j51078o8134J07557m0309Q572J11307K2956N6396
1886A06051m8056o5575j9173K678k4781R3959R0266m4092q2974O006M2865j32330
$$ plain form
1967 366433 439736 551904 570688 470107 329742 439444 421410 455155 398112 358500 347754
1956 347754 274893 237574 271639 187584 231700 225516 263484 224943 255633 186215 310865 336947
1944 336947 202219 243398 237604 199805 136270 173534 93539 51302 77563 51651 75039 239977
1932 239977 203299 138717 46871 33545 79337 77508 5445 34034 195660 119733 35482 12167
1920 12167 -70902 27122 42975 -64122 -58814 -2835 125401 116254 131910 263515 158736
1909 158736 83252 91486 48350 41528 78472 141682 128709 -25652 -48445 35583 653 49994
1897 49994 19787 -29916 58784 -92294 -160428 -52871 -93180 -84608 26699 49655 106051
1886 106051 57995 -7580 -26753 -24075 -48856 45103 135369 91277 8303 14309 57174 -75156
1874g5156R7701j84248o8250J6048Q3097K9670N1077J39569m4312o0702n9877
1863g5383J10542o2868r8317M0413k8710l111q549J3661R4723r1113l2404R373
1851a31743j5592O3010o7403M467O3984M4854o6373L1142o0964k3192J23260Q1471
1839D6921l3942L5622k0494o0666N9625M7632L4906l0158m3500J1551K9878o590
1827G0785j0562q1615n7300j61517J65759L1410O4687r418k0066K0142j7525m0459
1815d5679o6117K4178p061K4500j1155j0767R0057l0982k2701p2421O5014K5865
1803c7269M8454k0385J6969L402j1077Q5120m5052j07352j2255K1855M9889N8713
1791E1012n5791L9295Q989j9849r4347m1891L7337p930k1263M6367K686k9953
$$ plain form
1874 -75156 22545 -161703 -229953 -213905 -130808 -101138 -50061 89508 45196 -15506 -75383
1863 -75383 35159 -27709 -126026 -85613 -114323 -117434 -125983 -112322 -17599 -108712 -141116 -131743
1851 -131743 -147335 -84325 -151728 -147261 -83277 -38423 -104796 -73654 -134618 -157810 -34550 46921
1839 46921 12979 48601 28107 -32559 27066 74698 109604 79446 35946 47497 77375 70785
1827 70785 60223 -21392 -78692 -240209 -74450 -43040 21647 12229 -7837 12305 -5220 -45679
1815 -45679 -111796 -87618 -94679 -70179 -81334 -92101 -2044 -33026 -55727 -128148 -63134 -37269
1803 -37269 11185 -9200 7769 11171 94 85214 40162 -67190 -79445 -57590 -7701 51012
1791 51012 -4779 34516 43505 23656 -70691 -112582 -75245 -83175 -104438 -58071 -55385 -85338
1779h5338m5392j5283O3400m7582J03119L5272j9232l6525Q477J2129q9579K3005
1767i3529J9781N7573n3668P156l0416Q3122J3976o102j17192l1231p6553R2720
1755a34363P4428n451J08716j19004q6987N101N1657Q0677o7462L8141q5044K2894
1743a16697K05716r2262j9861J5489j5304r8341k8841j4275O6431L3716j03739
1732a67968J6358P8180L0644r429j2366o5646R436R8592O6374m7895j02021n7606
1720a63347J8157O6982l8184q2168q639j5834J30395N8530m3026j33965P4820
1709a36279J38767n1461j5276K3828P4264j46233K5629Q3532j24887m1015l1952
1698b01083N6331J2752P5067j4886l197L6793p7329Q487R7855k6929k8476p5220
$$ plain form
1779 -85338 -130730 -146013 -82613 -130195 -27076 8196 -11036 -47561 -39084 -26955 -116534 -93529
1767 -93529 -73748 -16175 -69843 -62687 -93103 -9981 3995 -2107 -119299 -150530 -227083 -134363
1755 -134363 -59935 -65386 43330 -75674 -162661 -157560 -105903 -25226 -92688 -54547 -139591 -116697
1743 -116697 89019 -3243 -23104 -7615 -22919 -121260 -150101 -164376 -97945 -64229 -167968
1732 -167968 -151610 -73430 -42786 -52215 -64581 -130227 -120791 -22199 44175 -3720 -105741 -163347
1720 -163347 -145190 -78208 -116392 -198560 -207199 -223033 -92638 -34108 -77134 -211099 -136279
1709 -136279 2488 -48973 -64249 -40421 33843 -112390 -86761 -3229 -128116 -169131 -201083
1698 -201083 -144752 -132000 -56933 -71819 -75016 -38223 -115552 -107065 -9210 -36139 -64615 -139835
1686a39835p4720J02706R5001K6547Q319r259j17934k679M1951L8981k6392K864
1674e4450m8408L7180N4181m4317j938K659r9490L1704N9552n5312j6535J10785
1662b4389m1725l5125q0302P3783N5857j40783J37970n7421L580k624k5919Q6657
1650e0441n2933J36023l7435K7255j24377k5820R706J8076J47624j40654j1316
1639a04292k3241J0127M5125M709j80137J2978K85942k9372q9875q790p4672O7775
1627h3723n0852M177N9407J6723k587m4843n9304J076O2721L7931J26393n2184
1615A4935o2666p2287K3668m472q2041M7066N305q143l7390L3584N8130L8545
1603d5766Q5645J7816q9704P3567k1847l9797K6325j92533j9208J09020m4876
$$ plain form
1686 -139835 -214555 -111849 -16848 9699 18018 8759 -109175 -111854 -69903 -30922 -57314 -54450
1674 -54450 -102858 -65678 -11497 -55814 -57752 -55093 -154583 -122879 -63327 -118639 -135174 -24389
1662 -24389 -66114 -101239 -181541 -107758 -51901 -192684 -54714 -112135 -108555 -111179 -137098 -50441
1650 -50441 -103374 32649 -4786 22469 -101908 -127728 -118022 -99946 47678 -92976 -104292
1639 -104292 -127533 -117406 -72281 -67572 -247709 -234731 51211 21839 -68036 -76826 -151498 -83723
1627 -83723 -134575 -130398 -70991 -54268 -56855 -101698 -161002 -159926 -97205 -59274 67119 14935
1615 14935 -47731 -120018 -96350 -100822 -182863 -135797 -130492 -138635 -176025 -142441 -84311 -45766
1603 -45766 39879 57695 -32009 41558 19711 -20086 6239 -186294 -205502 -96482 -141358
1592a41358J21313o4202O2914j3405r2802N1872m2230K5747N6734j8990p4544
1581a28951m4609JJ04216L5281n1103L5413P391j44745q532K4309k4569M6676
1569a49222J4261j2019L051l952k8575L0187M2508K8819O0773J07858m6375j05295
1557e7981J29151o5618o3187J7068O7850j35631m2330J34136J1385L7735k3801
1546H777L6163j5396k1208q283o128p2078N2321J5774k5224J31325j29016n5135
1534h8108L5731K2825N6941o370r4374N6441K1192K6184J0428k7581M4414k458
1522E5265m0438o4966J07485j34720l5286N6654P829r6540J07874O9487K5179
1511E7823K3137j72243L3374Q0851j07254k7156j036m7202L7486Q412O7600K3691
$$ plain form
1592 -141358 -20045 -84247 -21333 -34738 -127540 -75668 -117898 -92151 -35417 -54407 -128951
1581 -128951 -173560 -173559 -69343 -34062 -85165 -49752 -42361 -187106 -195638 -171329 -195898 -149222
1569 -149222 -134961 -146980 -143929 -147881 -176456 -146269 -103761 -74942 -14169 93689 47314 -57981
1557 -57981 71170 5552 -57635 -40567 27283 -108348 -150678 -16542 -5157 32578 8777
1546 8777 44940 29544 8336 53 -6075 -78153 -25832 -10058 -35282 96043 -32973 -88108
1534 -88108 -52377 -29552 27389 21019 -73355 -16914 4278 30462 40890 13309 57723 55265
1522 55265 14827 -50139 57346 -77374 -112660 -56006 -48177 -144717 -36843 32644 57823
1511 57823 80960 -91283 -57909 22942 -84312 -111468 -112504 -159706 -122220 -113808 -46208 -22517
1499b2517Q1216l5339j26584j5948O1143J16611j80992R7342P655j28433J22303
1488b3543q118l5538K7628N3146k3294O957l0036L1441M0462k572j41604Q8357
1476a6714k0279r878j20118O0705M2370L1791l3580m2421J4333j2724M0157K2585
1464d3773L3144J0965q7037o2666J6829N8894K983j7849M1017k0906J1532p954
1452f4821Q2720j19289O7280l4389j01034J8069l3719O3144J6930O0837m0459
1441h4731l0534R3647R00q2952j9610o581N7144L9648k6555L2402n3167M0496
1429c9893K6036l0764r3661l0696K5686K9043N8269j5619M198O5224J27j1277
1417a3327o9688m0431O3573m8872M9003R6164q0166n5161l8703N4119R1575K4593
$$ plain form
1499 -22517 58699 23360 -103224 -119172 -58029 58582 -122410 -25068 -17413 -145846 -23543
1488 -23543 -31661 -67199 -39571 13575 -9719 -2762 -32798 -1357 39105 36533 -105071 -16714
1476 -16714 -36993 -46871 -166989 -106284 -63914 -32123 -65703 -108124 -93791 -106515 -66358 -43773
1464 -43773 -10629 336 -86701 -149367 -132538 -73644 -70661 -88510 -47493 -68399 -56867 -64821
1452 -64821 17899 -101390 -34110 -68499 -169533 -151464 -185183 -122039 -105109 -44272 -84731
1441 -84731 -115265 -21618 -20718 -103670 -123280 -129861 -72717 -33069 -59624 -27222 -80389 -39893
1429 -39893 -13857 -44621 -138282 -168978 -143292 -114249 -55980 -71599 -67401 -2177 -2050 -13327
1417 -13327 -83015 -123446 -59873 -108745 -59742 36422 -43744 -98905 -137608 -83489 8086 32679
1405C2679j23015j212l2306Q8759O8433Ql3744j6965j2577p116k7625M4314l2932
1392e3299m168m5752n4O5471j58763j5733M3492K065K7183P028Q881O8253J4776
1379d0620N5426N2741q1808o6026M3526m5320n7797J03817p2896N6861P5026n0835
1367b7905N4919O7296K5907j11320p8279o5746K0325J4351J1562n1998j2532M750
1355a48670p621J90859M397l301K8841q6475l8378J9874J0689n0980J11127j5151
1343A5211q4269M2943J03043n5528k7885K7066oo6712N1338Q5593o4469n129J0698
1330C1894j40950J2003R5208K6531J02413J0274j16485p435J736m1398P5668J7320
1318F6779p6769O9314N2034j17727m5152j7198N1584j0603r0805O7547N1066n1697
$$ plain form
1405 32679 -90336 -91548 -123854 -35095 33338 33346 -398 -17363 -29940 -37056 -64681 -20367 -53299
1392 -53299 -57467 -103219 -103273 -37802 -196565 -212298 -168806 -166741 -139558 -132530 -123649 -55396 -40620
1379 -40620 14806 67547 -14261 -80287 -36761 -82081 -139878 -36061 -108957 -52096 22930 -27905
1367 -27905 27014 94310 120217 8897 -69382 -135128 -114803 -100452 -88890 -140888 -153420 -148670
1355 -148670 -156291 34568 38965 35664 64505 -21970 -60348 -40474 -29785 -80765 30362 15211
1343 15211 -69058 -26115 76928 21400 -6485 20581 20575 -46137 5201 90794 26325 21196 31894
1330 31894 -109056 -97053 -1845 24686 127099 137373 20888 13453 15189 -26209 49459 66779
1318 66779 -9990 59324 111358 -6369 -51521 -68719 -17135 -27738 -118543 -50996 70 -51627
1306e1627m3029J13139N4615l0996j64859J07986J6283m1258k5800K4960J9184
1295b1402m4472m2671N6888r4517j056J20598k9912Q4934K6065J01553k12788
1284e6780q1727j788J23729L1006q60l4839j04821l13K048K6049l3484J14969
1272a6811O1851k6151j10686J49148K1033o2601J9720j3374P6100L0753m7270
1261H1712n9904q5401N5817J6262o2595N5123Q1777n9917q7930L3262Q1164R602
1249E8972O104P7788q8410j7966l5071L9488J9675J00364p7949N327J8144j21384
1237a4918j10115J12564m3389j2401M8118k5887M2172J7308M8440K3184p2758
1226A2318o3806k4076M9444K9097N05N4289m2984J56293L0943j15161o6794N2948
$$ plain form
1306 -51627 -94656 18483 73098 42102 -122757 -14771 1512 -39746 -65546 -40586 -21402
1295 -21402 -65874 -108545 -51657 -146174 -147230 -26632 -56544 28390 54455 156008 -56780
1284 -56780 -138507 -140295 -16566 14440 13580 -21259 -126080 -126393 -124345 -98296 -131780 -16811
1272 -16811 45040 18889 -91797 57351 78384 15783 35503 22129 98229 128982 81712
1261 81712 21808 -63593 -7776 8486 -54109 1014 82791 22874 -65056 -31794 49370 58972
1249 58972 65076 142864 54454 36488 1417 40905 60580 160944 82995 88322 106466 -14918
1237 -14918 -125033 -12469 -55858 -68259 -20141 -46028 -3856 13452 61892 85076 12318
1226 12318 -51488 -75564 -26120 2977 3482 57771 14787 171080 202023 86862 20068 73016
1214G3016M1661k3007j61839J10330q412J22046p4787j10411n4496j19161P1803
1203a33257J04129Q2246n1393j8386M9939K9651p4910r5069J0202m7802K2370
1192a22280J42296j27886J3047L205N0091n018P0425r8177k8232Q9664K5315n4146
1180d1696k6966n5343P1377Q2242k5636m5271J8460m3808R5797P0974j49590n3780
1168a03240J69364n1259k04655J20520J47094k1293l3717L035r6491l5911O3315
1157d3238R2878o22r2819n1413r661M7009j08996J09796j1919N1015j2563j3489
1145d4022J05436J19l4455j54066L9813o807M4838j4465N0333K0652r1818k8583
1133a13025J58141N0322o0020r3657J7076K3498O4654K4547q7006p3567Q5805
$$ plain form
1214 73016 114677 91670 -70169 40161 31749 153795 79008 -31403 -85899 -205060 -133257
1203 -133257 -29128 53118 1725 -16661 33278 62929 -11981 -107050 -96848 -144650 -122280
1192 -122280 20016 -107870 -94823 -91618 -41527 -46545 23880 -74297 -102529 -12865 12450 -41696
1180 -41696 -68662 -124005 -52628 29614 3978 -41293 -22833 -66641 29156 100130 -49460 -103240
1168 -103240 66124 14865 -189790 -69270 77824 56531 22814 25849 -70642 -106553 -43238
1157 -43238 49640 49018 -43801 -95214 -104875 -57866 -166862 -57066 -68985 -17970 -30533 -44022
1145 -44022 61414 61533 27078 -126988 -87175 -93982 -49144 -63609 -13276 7376 -84442 -113025
1133 -113025 45116 95438 35418 -58239 -41163 -17665 46989 71536 -15470 -89037 -3232
1122c232k6819p8263K3423N557L1122K2748n1806P575J2468o7727M0158P9990
1110d806k2389n5559p8340p4121M3270J50979n1151J4158L8276J08471j18471
1099d9683Q5408p7764o5250L3396k065J39636o0021n121p274N6499m0010J44614
1087A52365k7277k77635M7505J37850N2495M0545o1429k4962n6642P0866k596
1076E1085r9985J10982O4287M414j01698m2334q0197J27279j07507R7037J9291
1065D2654o0736K2465p2014R5662Q127p2030k3175N6449p607O9862j6273j4888
1053B8496P297K0719J5040n509L7057o7776j05702K7522n7596J33685J9639k2190
1041C0682L1205L5153r2657o0303M9943m0120J7175Q6237m311j70438m5778R048
$$ plain form
1122 -3232 -30051 -108314 -84891 -79334 -48212 -25464 -77270 -69695 -57227 -124954 -84796 -4806
1110 -4806 -27195 -82754 -161094 -235215 -191945 -40966 -92117 -77959 -39683 68788 -49683
1099 -49683 35725 -42039 -107289 -73893 -75958 63678 3657 -1464 -8738 47761 7751 152365
1087 152365 125088 -152547 -105042 32808 85303 125848 64419 39457 -17185 53681 51085
1076 51085 -48900 62082 126369 130783 29085 -13249 -93446 33833 -73674 23363 42654
1065 42654 -18082 4383 -67631 28031 36158 -35872 -59047 -2598 -10205 59657 43384 28496
1053 28496 35793 56512 71552 66043 103100 35324 -70378 -42856 -100452 33233 52872 30682
1041 30682 61887 97040 4383 -55920 -5977 -46097 -28922 57315 53004 -117434 -163212 -154164
1029a54164R8902K3650j29963J20884K0909O7328Q8150j2676j31367m0236P0918
1018B2335p733j56553J63285K1090k0166L9274m9236P455K5312M4892n1408r5213
1006e6666P0492K2255o8403O247J1472j8816Q966K5804J24219J0477j04679L0071
994F1439o3799n9878j1937P0594O4222l6584J1308l8457j538J2326m6187K0592
982a7899R004P9998K031o9140p4584J03129R1205j16252j9069R1870j32771J3554
970c8924P4231o973l0936j05960M7829R435J12918N1163k3804j0409j07706j0597
958c9733K7428O6724p8752m4430m1900l5297R6470M0771M2715j02793j6287J26548
946D1464K2j923j00750L271L6545Q9623K989p4920R5972J8516n4315J21289j6526
$$ plain form
1029 -154164 -55262 -31612 -161575 -40691 -19782 47546 135696 123020 -8347 -48583 22335
1018 22335 14602 -141951 21334 42424 22258 61532 12296 19751 45063 89955 38547 -56666
1006 -56666 13826 36081 -32322 -26075 -14603 -33419 -24453 1351 125570 136047 31368 61439
994 61439 -2360 -62238 -74175 -3581 60641 24057 35365 -3092 -4630 7696 -38491 -17899
982 -17899 -8895 71103 73134 3994 -70590 32539 123744 7492 -11577 80293 -52478 -38924
970 -38924 35307 28334 -2602 -108562 -60733 -51298 61620 112783 88979 78570 -29136 -39733
958 -39733 -12305 54419 -24333 -68763 -110663 -145960 -49490 -8719 33996 -68797 -85084 41464
946 41464 41486 39563 -61187 -57916 -21371 68252 71241 -3679 92293 110809 56494 177783 161257
933A61257j17306O158j25599R6109m2008Q1J41559p5774J5093N0147j07104l2755
921c0142J341K6537P6198k0565j7138O0586O0198m6827k4941j7711j7268J0109
909F0377J41390j24986k1139m827j47693L836L9292Q6792O1585L6775M9288L3281
897B13971r4986l5241q2055l9747R1584q1963M5677r748O3738k4059n9863L9452
885B6760J00930J1580o2057j15866O037k96N832P9998l5099p6024m3932M8907
873e3230J3027K7672Q7749R8099n6769n380p0706R5841l3580L7064j00812n6003
861a7028Q9633k2212q7930l5765P1551n731O6228k9829J00463n3185j67591N9350
849c2046J14599m8230J7561M7861Q1724O2689j0533o3846k8528p9578K3995Q3891
$$ plain form
933 161257 43951 50109 -75490 20619 -21389 -21308 120251 44477 59570 109717 2613 -30142
921 -30142 -28801 -2264 73934 53369 36231 96817 157015 110188 85247 67536 50268 60377
909 60377 201767 76781 55642 50815 -96878 -93042 -53750 33042 94627 131402 180690 213971
897 213971 118985 83744 1689 -38058 53526 -28437 17240 7492 71230 47171 -12692 26760
885 26760 127690 139270 77213 -38653 -32616 -32912 -27080 52918 17819 -58205 -102137 -53230
873 -53230 -40203 -12531 75218 173317 116548 111168 40462 136303 102723 139787 38975 -17028
861 -17028 72605 50393 -37537 -73302 -1751 -7482 58746 28917 129380 76195 -91396 -32046
849 -32046 82553 34323 51884 99745 181469 244158 233625 169779 141251 61673 85668 169559
837A69559p1130k0981N8213q4047Q516Q9455O4970j4666j21282n0052L7322m8959
825A6918q3707J05558m3776J0824Q4549o5606o2457J48515j52324P4248j6162
814A6580l0915M0780J8605m9243Q2970o361o1713j5285Q4461Q8929j15647m4370
802H791L061J27151m0350j28693j2874J11214M5604q442o4189L9687M4169K4477
790A49606K5133k8125n5849L3081l5053J1918m955l286l4656k9313N271j09245
778g5473P7513j6567J3716O8651m0598L86n2590J83540k3793l4562J6780K6650
766A43653l0574J171j150q5146k0298k2560M0519L2869k0376l627O2768M1429
754A38678j1316q1028M8112l6743k8359O9541n5032m1025l1026j5139L6766K5249
$$ plain form
837 169559 98429 77448 135661 51614 60130 149585 214555 199889 78607 28555 65877 16918
825 16918 -66789 38769 -5007 5817 90366 24760 -37697 110818 -41506 32742 16580
814 16580 -14335 26445 45050 -4193 78777 72416 10703 -4582 79879 168808 53161 8791
802 8791 11852 139003 98653 -30040 -42914 68300 113904 105462 41273 80960 125129 149606
790 149606 174739 146614 90765 123846 88793 100711 95756 92470 57814 28501 33772 -75473
778 -75473 2040 -14527 -811 67840 27242 27628 -24962 158578 134785 100223 117003 143653
766 143653 113079 114250 113100 27954 7656 -14904 25615 58484 38108 34481 97249 138678
754 138678 127362 46334 94446 57703 29344 98885 43853 2828 -28198 -43337 -6571 18678
742A8678K9910N3356K5072j64961k7101J10014J12302L1240j30902K2940p2312
731H236n1572O7865p5992Q7531K9128n8653O1505J1995m7268m86P1929r2888r485
718A845R7758j7345j06496J9498J25378j03266n9878l1626n6099K3779Q7882N662
706a2908r786l941o7601R2867L0996n7066J00098m252K1828n559K2541k0054J21414
693B08577j4874j07629j30844n5521J95864N8433n0240q2903j0026L2912P1402
682A15151k6132L3213k5851L1951p1597q9883O8656m8010J68R8253q1510j28744
670a24335J16853P2504l1293m9764j35850m4654J13660L6065L969j02355n9801
659b05001J71394R1631m1919J9848J3225k160R8178n4731K3878O7066n4002J4962
$$ plain form
742 18678 48588 101944 127016 -37945 -65046 44968 157270 188510 57608 80548 8236
731 8236 -43336 24529 -51463 36068 65196 6543 68048 80043 32775 32289 104218 11330 1845
718 1845 99603 82258 -24238 -4740 120638 17372 -42506 -74132 -130231 -106452 -18570 -12908
706 -12908 -22694 -26635 -94236 -1369 29627 -27439 72659 68407 90235 84676 107217 87163 208577
693 208577 193703 86074 -44770 -100291 95573 154006 103766 20863 10837 43749 115151
682 115151 89019 122232 96381 128332 56735 -33148 35508 -12502 -12334 85919 4409 -124335
670 -124335 -7482 65022 33729 -16035 -151885 -196539 -82879 -46814 -42845 -145200 -205001
659 -205001 -33607 58024 16105 35953 49178 47018 145196 90465 114343 181409 127407 142369
647A42369j29750M4004J30977j60728l6588m680j4472R1365Q9064n9128l5778
636E6655p7392K8197P7643n9201J8744o0576J0926l7638o1013J28035N3716j4518
624F3578P0724p5440n0536J75931J8231j9047l5406j6417j34391j02944J15286
613I569l4502K8384p5205j13242J29845J26721j8484q2480M3456O3294k882n3432
601B1042j5879k6598O0319o0449N6582r313m4491n893n1628n943j8698J05014
589D065K8298J9879p1032j7836R7766o1634K9449k4728J08972J7056Q555m4041
577I4769j07590P9244m7567R1665k6580K7408N9161j02983J3255r8820r5256K6277
565h7017k7175P5241n930P8041J3593k840M3015o0129l1967j9325J1631P9468
$$ plain form
647 142369 12619 56623 187600 26872 -9716 -14396 -28868 62497 151561 92433 56655
636 56655 -20737 7460 85103 25902 44646 -15930 -5004 -42642 -103655 24380 78096 63578
624 63578 134302 58862 8326 184257 202488 183441 148035 131618 -2773 -105717 9569
613 9569 -24933 3451 -71754 -184996 -55151 71570 53086 -29394 14062 77356 74474 21042
601 21042 5163 -21435 38884 -21565 35017 25704 -18787 -24680 -76308 -82251 -100949 4065
589 4065 32363 52242 -18790 -36626 61140 -494 28955 4227 113199 130255 138810 94769
577 94769 -12821 66423 18856 110521 83941 111349 170510 67527 80782 -18038 -113294 -87017
565 -87017 -114192 -38951 -44881 33160 46753 43913 86928 26799 -5168 -24493 -12862 66606
553F6606j4707J16N5120k662J0938n1018N7041m1105j24734J28792L7805j29968
541g776r069K24481p7453j19204J05989j07445m0744K919o7495J01027Q056j9308
529f022L0815M7167M9664j34863j940M704k3896k2648q5199J41707j7350k9213
517d7074R0292L2190k0668L4415m5340J16988N3858j29730o1273K1100J3541o6606
505h307n4402K5105j9343N1175M7420N5801L4450p5933n518o0226j0600J3132
493g246O7469J0970j8116k8109o2395M9133L4160j28281M2432L7183R3192l4905
481E5487m2183P859K3849K2414j9966j04643O4600R2113k0765k6931M2759m420
469I0173l7324o3483p0415M0116N2130M6669R191R8967j15507J7372n6438q67
$$ plain form
553 66606 51899 52015 107135 104473 115411 64393 121434 80329 -44405 84387 122192 -7776
541 -7776 -16845 207636 130183 10979 116968 9523 -31221 -28302 -95797 5230 13286 -6022
529 -6022 24793 71960 121624 -13239 -15179 -10475 -34371 -57019 -142218 -511 -17861 -47074
517 -47074 43218 75408 54740 89155 43815 160803 214661 84931 23658 44758 58299 -8307
505 -8307 -62709 -37604 -56947 -5772 41648 97449 131899 55966 50448 -9778 -20378 -7246
493 -7246 60223 71193 53077 24968 -37427 11706 45866 -82415 -39983 -2800 90392 55487
481 55487 13304 21163 45012 67426 47460 -57183 7417 99530 78765 51834 94593 90173
469 90173 52849 -10634 -81049 -40933 11197 57866 67057 166024 50517 67889 11451 10584
457A0584J230Q9199m8665p4128k1513N8196L9943n0042q016j0310K3341L4572
445D4391k4034J4140M0249m9213N126j4640Q0578k6692K9237J4013j9268K543
433I6430q9050K4619J8793K4340Q344J5346J6736O128n2558j4490r0476J9225
421a6613J23203Q2327j59937j8220R7741P6140J6953j1741m7908j39178K8912
410C1679L1115J29063j28732q2964k7996J38030L8747j31400Q640q1454n3217
399a28489N7410j6996Q4567r051P7568p0018P0319o6625L3534M1326R5213o7616
387A01142l4828j08365J5106M4040L3274m8659L1576O8147j76183M2246j772O6580
375C2304L0520k1583p669n8149j07412j956j1017O9647O8487J35687k1766n4393
$$ plain form
457 10584 11814 101013 52348 -21780 -43293 14903 54846 4804 -3212 -13522 9819 44391
445 44391 20357 34497 74746 25533 30659 16019 96597 69905 99142 113155 93887 96430
433 96430 7380 31999 50792 75132 83476 98822 115558 121686 69128 54638 -35838 -16613
421 -16613 106590 188917 28980 10760 108501 184641 201594 189853 141945 2767 31679
410 31679 62794 191857 63125 -19839 -47835 90195 128942 -2458 6182 -75272 -128489
399 -128489 -71079 -88075 -3508 -12559 65009 -5009 65310 -1315 32219 73545 168758 101142
387 101142 66314 -42051 -26945 17095 50369 1710 33286 101433 -74750 -32504 -34276 32304
375 32304 62824 41241 33572 -24577 -131989 -133945 -144962 -75315 -6828 128859 107093 52700
363E2700K0339q7499J01360N1056n8978P171L3864L2580L7947r922j01476o1375
351A7767P2217p9421o4646J1504j9424P3656J9762O4874r7283o3660K5106j3076
339e2624O2051o779p0357O9753j0682N0187l560M3191L8584o937J11735K1744
327B46306k17042r841J2854m4674n9472M9988P4155P4877j11542j08858J12239
316A8990q984l5189k5675M610Q9556j47377j6598J25850N8606l3261j5608j54086
304a39166R0410K2072l1836P7477n3777j3198L2564M6903R367l6058L5186j1690
292B8254k6267j1213p1706O74J32573l2980m1686Q7436o5301p6298Q2402M761
280A0649n0410J49573r782L3354N7262j75866m9794n805Q812J22729j9167q303
$$ plain form
363 52700 73039 -14460 86900 137956 78978 86149 120013 152593 190540 180618 79142 17767
351 17767 89984 10563 -54083 -42579 -62003 11653 31415 96289 -994 -64654 -39548 -52624
339 -52624 9427 2648 -67709 2044 -8638 41549 37989 81180 119764 112827 224562 246306
327 246306 29264 19423 32277 -12397 -71869 -21881 52274 127151 15609 -93249 18990
316 18990 10006 -25183 -50858 -46248 43308 -104069 -120667 5183 63789 30528 14920 -139166
304 -139166 -48756 -26684 -58520 18957 -34820 -48018 -15454 31449 40816 4758 39944 28254
292 28254 1987 -9226 -80932 -80258 52315 19335 -22351 65085 -216 -76514 5888 10649
280 10649 -39761 109812 100030 133384 190646 14780 -35014 -40819 -32007 90722 71555 63252
268F3252r2795N7595O2672j7801p6202N4832j5114q794R504O2477J0404r9503
256A0527R6401l424q0558J8434M535l6571P1523k1962n8697l4313Q9448m499o6249
243a5405Q9676n5588k8445m9327M7197l0168j5357J12751N2852O4028q5049L827
231I0992k6323m5262J296M0425j16630l65Q8446o1391J0855O7712L7429j0786
219G6398m9105j9249Q4653p7253o6690R003K5006O5698r641o7470J21059j13448
207b1039p1593J10611r0781J7048O5629M8949J0135n570K4663q7140J6211L2569
195D9692r3515J2419J30412o0461j1075n9085R0123j86060N7507N1713M6617o7702
183c9415K8027j6440K5554K2279L7835m7790P1779l3767k21048J22992K9036J16219
$$ plain form
268 63252 -29543 28052 90724 72923 -3279 51553 36439 27645 37149 99626 110030 10527
256 10527 106928 103504 22946 41380 45915 9344 80867 58905 208 -34105 55343 50844 -15405
243 -15405 74271 18683 -9762 -59089 -11892 -42060 -57417 55334 108186 172214 87165 90992
231 90992 64669 19407 20703 61128 -55502 -55867 32579 -28812 -17957 49755 87184 76398
219 76398 27293 8044 92697 15444 -51246 -42243 -17237 48461 38820 -28650 92409 -21039
207 -21039 -92632 17979 -72802 -55754 9875 58824 68959 63389 88052 912 17123 49692
195 49692 -43823 -31404 99008 38547 27472 -31613 58510 -127550 -70043 -18330 28287 -39415
183 -39415 -11388 -27828 -2274 20005 57840 10050 81829 48062 -172986 -49994 -20958 95261
171I5261m4157k7900o9758L5157M477L8392o9404L2325J02024j785m5551j751
159D7330o4309K3926N084l5537M464N0519J0559n1983P1861R1470o3325j0296
147G9763O810k1474p3672J40525k5007q4340q278j9111L937K2144n1660L7293
135F930K9118n2944l0475l4575Q7907J3645J268j8027j3707K3051P9280J7490
123A08961o0794K010J17337j2239j32796l8567o3180n1480P0535J07948L5362
112H3097m8303l4725m1772L653l2955N4513N2124k5081l1773o1192O8703Q5773
100G2062p4834o30L7985l2134J4492J1562l1985M1524k2569p8915M2195R0275
88F9028j8387o3407Q0048n2674l0101j1816k153P8942P0004n4157n8586O8607
$$ plain form
171 95261 51104 23204 -46554 -11397 -6920 31472 -37932 -5607 96417 94632 49081 47330
159 47330 -16979 6947 12031 -23506 -19042 31477 42036 -9947 61914 153384 90059 79763
147 79763 86573 65099 -8573 131952 106945 22605 14327 -4784 -847 21297 -30363 6930
135 6930 36048 -16896 -47371 -81946 5961 19606 20874 2847 -10860 12191 91471 108961
123 108961 48167 50177 167514 155275 22479 -16088 -79268 -130748 -60213 47735 83097
112 83097 34794 69 -41703 -38050 -71005 -16492 35632 10551 -21222 -82414 -13711 72062
100 72062 -2772 -3402 34583 2449 16941 28503 -3482 38042 15473 -63442 -21247 69028
88 69028 50641 -12766 67282 14608 -15493 -27309 -29462 49480 119484 65327 6741 75348
76G5348j0443p3800J05839l6600j16611j762J04307j2646m0129K8916R18L6357
64E9694N3946r1158J0998J5809q690N7825o0001n6489R2954L1673o8728N598L1837
51G5268p9425N2922Q679L5321j2007j04237n1589R1765p0111J1439K9747r714
$$ plain form
76 75348 64905 -8895 96944 60344 -56267 -58029 46278 33632 -6497 22419 23337 59694
64 59694 113640 22482 33480 49289 40599 98424 38423 -18066 74888 106561 37833 43431 75268
51 75268 -4157 48765 57444 92765 80758 -23479 -75068 16697 -53414 -41975 -12228 -21942
$$ [...]
##END NTUPLES=NMR SPECTRUM
##END=
