##TITLE=1H_CA-8873-1
 CDCl3, 8 sc, 
 9.06.2021
##JCAMPDX= 6.0         $$ Bruker NMR JCAMP-DX V2.0
##DATA TYPE= NMR SPECTRUM
##DATA CLASS= NTUPLES
##ORIGIN= UXNMR, Bruker Analytische Messtechnik GmbH
##OWNER= root
$$ XWIN-NMR		Version 3.5
$$ Wed Jun  9 11:43:47 2021 Russian Standard Time (UT+4h)  she@DPX200
##.OBSERVE FREQUENCY= 200.131506
##.OBSERVE NUCLEUS= ^1H
##.ACQUISITION MODE= SIMULTANEOUS
##.ACQUISITION SCHEME= undefined
##.AVERAGES= 8
##.DIGITISER RES= 18
##SPECTROMETER/DATA SYSTEM= spect
##.PULSE SEQUENCE= zg30
##.SOLVENT NAME= CDCl3
##.SHIFT REFERENCE= (INTERNAL, CDCl3, 0, 17.5264)
##AUDIT TRAIL= $$ (NUMBER, WHEN, WHO, WHERE, WHAT)
$$ ##TITLE= Audit trail, XWIN-NMR		Version 3.5
$$ ##JCAMPDX= 5.01
$$ ##ORIGIN= Bruker BioSpin GmbH
$$ ##OWNER= she
$$ F:/spectra/data/she/nmr/H-F/1/pdata/1/auditp.txt
$$ ##AUDIT TRAIL=  $$ (NUMBER, WHEN, WHO, WHERE, WHAT)
(   1,<2021-06-09 11:41:39.25 +0400>,<she>,<DPX200>,
      <created by zg, POWCHK disabled, PULCHK disabled
       configuration hash MD5:
       00 E9 B6 7A A2 85 ED C7 34 08 36 98 17 FE 4E 26
       data hash MD5: 16K
       E2 92 9A 10 37 6A CD 56 FD EE 57 C9 46 BA 41 77>)
(   2,<2021-06-09 11:41:46.31 +0400>,<she>,<DPX200>,
      <Start of raw data processing
       efp BC_mod = 2 LB = 0.24 FT_mod = 6 PKNL = 1 PHC0 = -11486.75 PHC1 = 14.40101 SI = 16K 
       data hash MD5: 16K
       98 C3 E1 92 85 4E E6 66 FC 4A D5 FD A9 B5 5B 9F>)
(   3,<2021-06-09 11:42:18.43 +0400>,<she>,<DPX200>,
      <pk PHC0 = 0.004998688 PHC1 = -1.2 
       data hash MD5: 16K
       58 8E CE 52 27 3E C2 4C 1A A1 B0 37 48 98 EF 77>)
(   4,<2021-06-09 11:42:23.60 +0400>,<she>,<DPX200>,
      <abs ABSG = 5 
       data hash MD5: 16K
       CF 48 E2 A4 4C 57 23 6E 3D BE 33 78 2D 14 93 25>)
(   5,<2021-06-09 11:43:08.28 +0400>,<she>,<DPX200>,
      <pk PHC0 = -4.621811 PHC1 = 8.799998 
       data hash MD5: 16K
       99 87 B6 E0 F3 5C E5 58 81 C4 92 F1 0E EA 09 CD>)
$$ ##END=
$$ 
$$ hash MD5
$$ 6B AD 81 29 0E 64 FF 89 BA 08 6D BC 77 0E 0C 56
##$RELAX= 
##$RELAX= 
##$RELAX= 
##$RELAX= 
##$RELAX= 
##$RELAX= 
$$ Bruker specific parameters
$$ --------------------------
##$DU= <F:/spectra>
##$EXPNO= 1
##$NAME= <H-F>
##$PROCNO= 1
##$TYPE= <nmr>
##$USER= <she>
##$AMP= (0..31)
100 100 100 100 100 100 100 100 100 100 100 100 100 100 100 100 100 100 
100 100 100 100 100 100 100 100 100 100 100 100 100 100 
##$AQSEQ= 0
##$AQ_mod= 1
##$AUNM= <au_zg>
##$AUTOPOS= <>
##$BF1= 200.13
##$BF2= 200.13
##$BF3= 200.13
##$BF4= 200.13
##$BF5= 200.13
##$BF6= 200.13
##$BF7= 200.13
##$BF8= 200.13
##$BYTORDA= 1
##$CFDGTYP= 0
##$CFRGTYP= 5
##$CHEMSTR= <none>
##$CNST= (0..31)
1 1 145 1 1 1 1 1 1 1 1 1 1 1 1 1 1 1 1 1 1 1 1 1 1 1 1 1 1 1 1 1 
##$CPDPRG= <>
##$CPDPRG1= <>
##$CPDPRG2= <>
##$CPDPRG3= <>
##$CPDPRG4= <mlev>
##$CPDPRG5= <mlev>
##$CPDPRG6= <mlev>
##$CPDPRG7= <mlev>
##$CPDPRG8= <mlev>
##$CPDPRGB= <>
##$CPDPRGT= <>
##$D= (0..31)
0 1.2 0 0 0 0 0 0 0 0.06 0 0.03 0 0 0 0 0.0002 0 0 0 0 0 0 0 0 0 0 0 0 
0 0 0 
##$DATE= 1623224498
$$ [...]
##$SUBNAM3= <"">
##$SUBNAM4= <"">
##$SUBNAM5= <"">
##$SUBNAM6= <"">
##$SUBNAM7= <"">
##$SUBNAM8= <"">
##$SUBNAM9= <"">
##$SW= 20.0188882624521
##$SWIBOX= (0..15)
0 0 2 0 0 0 0 0 0 0 0 0 0 0 0 0 
##$SW_h= 4006.41025641026
##$TD= 16384
##$TD0= 1
##$TE= 0
##$TE2= 300
##$TE3= 300
##$TEG= 300
##$TL= (0..7)
0 120 120 120 120 120 120 120 
##$TP= (0..7)
150 150 150 150 150 150 150 150 
##$TP07= 0
##$TPNAME0= <>
##$TPNAME1= <>
##$TPNAME2= <>
##$TPNAME3= <>
##$TPNAME4= <>
##$TPNAME5= <>
##$TPNAME6= <>
##$TPNAME7= <>
##$TPOAL= (0..7)
0.5 0.5 0.5 0.5 0.5 0.5 0.5 0.5 
##$TPOFFS= (0..7)
0 0 0 0 0 0 0 0 
##$TUNHIN= 0
##$TUNHOUT= 0
##$TUNXOUT= 0
##$USERA1= <user>
##$USERA2= <user>
##$USERA3= <user>
##$USERA4= <user>
##$USERA5= <user>
##$V9= 5
##$VALIST= <valist>
##$VCLIST= <CCCCCCCCCCCCCCC>
##$VD= 0
##$VDLIST= <DDDDDDDDDDDDDDD>
##$VPLIST= <PPPPPPPPPPPPPPP>
##$VTLIST= <TTTTTTTTTTTTTTT>
##$WBST= 1024
##$WBSW= 4
##$XGAIN= (0..3)
0 0 0 0 
##$XL= 0
##$YL= 0
##$YMAX_a= 440979
##$YMIN_a= -306598
##$ZGOPTNS= <>
##$ZL1= 120
##$ZL2= 120
##$ZL3= 120
##$ZL4= 120
##$ABSF1= 17.51055
##$ABSF2= -2.50849
##$ABSG= 5
##$ABSL= 3
##$ALPHA= 0
##$AQORDER= 0
##$ASSFAC= 0
##$ASSFACI= 0
##$ASSFACX= 0
##$ASSWID= 0
##$AUNMP= <proc_1d>
##$AZFE= 0.1
##$AZFW= 0.1
##$BCFW= 0
##$BC_mod= 2
##$BYTORDP= 0
##$COROFFS= 0
##$CY= -3
##$DATMOD= 1
##$DC= 0
##$DFILT= <>
##$DTYPP= 0
##$F1P= 0
##$F2P= 0
##$FCOR= 1
##$FTSIZE= 16384
##$FT_mod= 6
##$GAMMA= 0
##$GB= 0
##$INTBC= 1
##$INTSCL= 1.334414e-10
##$ISEN= 128
##$LB= 0.24
##$LEV0= 0
##$LPBIN= 0
##$MAXI= 10000
##$MC2= 0
##$MEAN= 0
##$ME_mod= 0
##$MI= 1.114404
##$NCOEF= 0
##$NC_proc= -7
##$NLEV= 6
##$NOISF1= 3.799351
##$NOISF2= 2.8
##$NSP= 0
##$NTH_PI= 0
##$NZP= 0
##$OFFSET= 17.52643
##$PC= 1
##$PHC0= -11491.37
##$PHC1= 22.00101
##$PH_mod= 1
##$PKNL= yes
##$PPARMOD= 0
##$PSCAL= 0
##$PSIGN= 0
##$REVERSE= no
##$SF= 200.130001639595
##$SI= 16384
##$SIGF1= 3
##$SIGF2= 2
##$SINO= 5.538805
##$SIOLD= 16384
##$SREGLST= <1H.CDCl3>
##$SSB= 0
##$STSI= 16384
##$STSR= 0
##$SW_p= 4006.41025641026
##$SYMM= 0
##$S_DEV= 0
##$TDeff= 16384
##$TDoff= 0
##$TI= <>
##$TILT= no
##$TM1= 0
##$TM2= 0
##$TOPLEV= 0
##$USERP1= <user>
##$USERP2= <user>
##$USERP3= <user>
##$USERP4= <user>
##$USERP5= <user>
##$WDW= 1
##$XDIM= 16384
##$YMAX_p= 507691327
##$YMIN_p= -1948931
$$ End of Bruker specific parameters
$$ ---------------------------------
##NTUPLES= NMR SPECTRUM
##VAR_NAME=  FREQUENCY,     SPECTRUM/REAL,   SPECTRUM/IMAG
##SYMBOL=    X,             R,               I
##VAR_TYPE=  INDEPENDENT,   DEPENDENT,       DEPENDENT
##VAR_FORM=  AFFN,          ASDF,            ASDF
##VAR_DIM=   16384,         16384,           16384
##UNITS=     HZ,            ARBITRARY UNITS, ARBITRARY UNITS
##FACTOR=    0.24454680195387, 1,            1
##FIRST=     3507.56449065412, 0,            0
##LAST=      -498.845765756135, 0,           0
##MIN=       -498.845765756135, -1948931,    0
##MAX=       3507.56449065412, 507691327,    0
$$ Real data points
##PAGE= N=1
##DATA TABLE= (X++(R..R)), XYDATA
$$ [...]
7261E42235l86079l59447j00864k19251q0515M60894Q26465n46109P2428P11379
7251I21136r9097k29808m43799m26117N22641j3410K04683j97337j98887m32235
7241c92230J182932J92791Q5556O9216Q04640j275160n13735k2870r13095J243729
7231D61774j26491O74302L21738j021855o14685Q04816k37242K17328j81183o69648
7221c71146O94617m06386Q50647M5924j479914N44999l48110l10694K80353p15038
7211a214748L14949M66612j49275K41157L54913m88346K26092J50544K80252M42308
7201F24458j88616m45600l33893n4506k21571K41812k27650M62088M45667p70360
7191d68171L287P351l39779P26342p75601P4620M85869r27683K93673r3837o79089
$$ plain form
7261 542235 156156 -203291 -304155 -523406 -603921 -143027 683438 137329 209757 921136
7251 921136 822039 592231 148432 -277685 244956 231546 436229 238892 40005 -392230
7241 -392230 790702 983493 1069049 1138265 1942905 667745 154010 131140 -781955 461774
7231 461774 335283 1009585 1331323 309468 -305217 499599 262357 479685 298502 -371146
7221 -371146 323471 -82915 767732 813656 -666258 -121259 -469369 -780063 -499710 -1214748
7211 -1214748 -899799 -433187 -582462 -341305 13608 -474738 -248646 -98102 182150 624458
7201 624458 435842 -9758 -343651 -398157 -619728 -377916 -605566 -143478 302189 -468171
7191 -468171 -464884 -457533 -797312 -70970 -846571 -771951 -286082 -1213765 -920092 -1013929 -1693018
7180a693018Q22864m5323j37648N29296M51427K47513n5321j90170l9692J49249
7170C9177m31764M52996o73338k15141O2444L07805j21444M54835J04484p61432
7160g81378J06849p36138M89411M88908o67915L54917R23019k58808j212185P5849
7150a217471Q49344M77692P4781k14131P23490o20844J92432m19791j13301N00572
7140B32773m55996l90360m1079J93090o3653n02823q90748J057150m83130L14493
7130a030283P98625K32870n49309P68019K6463q80652N16662q19719o7214Q01719
7120b02819j89555K24916j24633L4516j26336m15774N74942l62848J8784L53460
7110b15347j29414p267K66615o28835K35409j068054O93213l37122O04986M68385
$$ plain form
7180 -1693018 -870154 -915477 -1053125 -523829 -72402 175111 119790 -70380 -110072 39177
7170 39177 -392587 60409 -612929 -828070 -765626 -457821 -579265 -124430 -19946 -781378
7160 -781378 -674529 -1410667 -921256 -432348 -1100263 -745346 177673 -81135 -1293320 -1217471
7150 -1217471 -368127 109565 184346 -29785 693705 72861 265293 -154498 -267799 232773
7140 232773 -223223 -613583 -654662 -461572 -525225 -1028048 -1918796 -861646 -1344776 -1030283
7130 -1030283 -231658 1212 -548097 219922 246385 -634267 -117605 -937324 -1004538 -202819
7120 -202819 -392374 -167458 -292091 -257575 -383911 -799685 -224743 -587591 -568807 -215347
7110 -215347 -344761 -352028 -85413 -714248 -478839 -1546893 -853680 -1190802 -585816 -117431
7100a17431k2981L00853M0965j07635o56234r172n82334J58806L0250M05523k79797
7089h39187j56520R77849r88849M49299J47647j42858l86519p1115K17137q1944
7079h75060J116237L81623j086515m65112L18577k40767J020333m86320j27544
7070d44548J7195m31780r2713n21237R5266J339970o64317j71826L99627J19933
7060c54430O03975j56389q70177M12614m87605m45556J61928o11058R71516R02487
7050A27305J32179p63108r7592p5031K50062L00500m98221O85149K75180q12340
7040d75917k62472Q89837n95515m8696L69194j70637Q0248J76317p58909K60803
7030e35747N46699m24172m95278N05574q4362n81863Q4685N12819O38799P2176
$$ plain form
7100 -117431 -140412 160441 201406 93771 -562463 -571635 -1153969 -995163 -964913 -559390 -839187
7089 -839187 -995707 -17858 -1006707 -557408 -409761 -552619 -939138 -1010253 -793116 -875060
7079 -875060 241177 622800 -463715 -928827 -610250 -851017 169316 -317004 -444548
7070 -444548 -427353 -859133 -951846 -1473083 -1377817 -37847 -702164 -873990 -474363 -354430
7060 -354430 249545 93156 -777021 -364407 -852012 -1297568 -1135640 -1746698 -775182 127305
7050 127305 259484 -503624 -601216 -676247 -426185 -125685 -623906 61243 336423 -475917
7040 -475917 -738389 151448 -444067 -492763 -123569 -294206 -213958 -37641 -796550 -535747
7030 -535747 10952 -413220 -908498 -402924 -487286 -1069149 -984464 -471645 167154 239330
7020B39330k29982R7457k56855j88279j09021N8874k83530Q2630M23084q67083
7010a033375k44495J33887j53344J209655J35928K90226j32371j146240J295760
7001C55631j16051m40530k5308J00090j22102m250K62036M49543n58776m71186
6991e70903j47824n11291O97359J36353q08813J264390n05583K10391n91418o26927
6981a454266R32077l6657P84638j39769M65478m71196o10704m10153O05310J52824
6971a82418L44028k07320l53644n59491n5549Q43944n05134K41531J89534L53646
6961A09127l56514j81697k48463P16044K94970l05564k8294k36300l27373J55159
6951d08905r90804M57777M55500k16540m43726K90165M88884r31983J85580M07713
$$ plain form
7020 239330 9348 106805 -150050 -338329 -447350 -388476 -672006 -589376 -166292 -1033375
7010 -1033375 -1277870 -1143983 -1297327 -87672 48256 338482 206111 -940129 355631
7001 355631 239580 -200950 -226258 -126168 -248270 -252520 9516 459059 -99717 -570903
6991 -570903 -718727 -1230018 -532659 -396306 -1205119 59271 -446312 -235921 -827339 -1454266
6981 -1454266 -522189 -558846 225792 86023 551501 80305 -530399 -940552 -335242 -182418
6971 -182418 161610 -45710 -399354 -958845 -1014394 -170450 -675584 -434053 -244519 109127
6961 109127 -247387 -429084 -677547 38497 333467 27903 -391 -236691 -564064 -408905
6951 -408905 -1399709 -941932 -486432 -702972 -1146698 -856533 -367649 -1299632 -1114052 -706339
6941g06339R41480k08372K65367m72074j77626N85427n89778J1024N04459l89037
6931b35469Q3545p98719r0425N20162m22979l53048N33475N91477K18521K95051
6921C41591q61308M15524J87700j14020o61611Q01462R61333n43619n06784O1818
6911H2086l01255M60749k68303l26065l80467l55073J414406J26016K22212R9157
6901G73463j052722l6327O98726q79170M50798K14494n80598K20760p08385l68954
6891a267915K87637J53062J0521M06873N74391q95391K94790M84589L72002J53773
6881E74332m34157M78746q2m40962l83765J59620l63908L69736l45520J49404
6871b36556K56208k54276k51847O2444L93289k21429J09778m35429l31150J40308
$$ plain form
6941 -706339 235141 26769 292136 -179938 -357564 227863 -361915 -350891 153568 -235469
6931 -235469 -151924 -950643 -1041068 -520906 -943885 -1296933 -763458 -171981 46540 341591
6921 341591 -519717 -104193 83507 -30513 -692124 109338 1070671 527052 20268 82086
6911 82086 -219169 241580 -26723 -352788 -733255 -1088328 326078 452094 674306 773463
6901 773463 -279259 -315586 383140 -496030 -45232 169262 -411336 -190576 -898961 -1267915
6891 -1267915 -980278 -827216 -816695 -409822 164569 -730822 -436032 48557 420559 574332
6881 574332 140175 618921 618839 177877 -205888 -46268 -410176 -40440 -385960 -236556
6871 -236556 19652 -234624 -486471 -424027 -30738 -252167 -142389 -577818 -908968 -768660
6861g68660L07736o51518J140720l33284o7764l50404M6036N0274N68300l55101
6851d13665j50468K24705N08074n74593m1481m51635j29564Q41894l82329K61278
6841c07784r6560m5734q77326P11193j38989l23377P70318P39014r5680j4278
6831C20797k25993L83866j15226L33926q85480j83797K41516k84021P0342j64964
6821e09034l32378M9234K89369L13006j97070j48227J2572N47458M61764l09646
6811A77048n6123n05781P90253J57520k01674k03875M2714o65628J62654J00847
6801b02045Q49263m67264n70721J125270j127361O79298k00662P04089l30760
6792D59107l49995j7753J1627P00593l50895l49701m42611J44683P13696l09215
$$ plain form
6861 -768660 -460924 -1112442 28278 -305006 -372770 -723174 -677138 -626864 -58564 -413665
6851 -413665 -564133 -339428 168646 -405947 -447428 -899063 -1028627 -186733 -569062 -307784
6841 -307784 -404344 -450078 -1327404 -616211 -755200 -1078577 -308259 430755 335075 320797
6831 320797 94804 478670 363444 697370 -188110 -371907 -130391 -414412 -344070 -509034
6821 -509034 -841412 -792178 -502809 -189803 -386873 -535100 -522528 24930 486694 177048
6811 177048 120925 -384856 405397 562917 361243 157368 200082 -465546 -302892 -202045
6801 -202045 647218 179954 -390767 734503 -392858 286440 85778 789867 459107
6792 459107 109112 91359 102986 803579 452684 102983 -339628 -194945 518751 209536
6782B09536M73775k12916J68960m65980r33605Q86967M43631n8518o29909K55446
6772A37387L6992p01864j53488l83353O2499J024696j76050K48126Q9670r2239
6762I2376k63747N43864j20820m27260j62230K03664o6873j69696j91947Q88292
6752C25623J58770j158045M97703m56781j02727l19857R5131J522102o58071j040386
6742a136538P12421j54969M93873k95502o41581O9526j37509j5145O10414k48863
6732g43873L44183J68769M65708R41545p72542M67761j052566J04347R60345m15722
6722D67955q2408P07093l26960j37782N18093n07157l49910L6386l45901m8951
6712f9542k15423O26934J03666l76892k41336q3515q2878k19362R39207M44906
$$ plain form
6782 209536 683311 470395 639355 173375 -760230 126737 570368 511850 -118059 137387
6772 137387 174379 -527485 -680973 -1064326 -1001827 22869 -153181 94945 184615 92376
6762 92376 -171371 372493 251673 -175587 -337817 -134153 -201026 -370722 -562669 325623
6752 325623 484393 -673652 -175949 -632730 -735457 -1055314 -960183 561919 -96152 -1136538
6742 -1136538 -424117 -579086 -85213 -380715 -1022296 -952770 -1090279 -1105424 -495010 -743873
6732 -743873 -399690 -230921 234787 1176332 403790 871551 -181015 -76668 883677 467955
6722 467955 385547 1092640 765680 627898 1145991 638834 288924 325310 -20591 -69542
6712 -69542 -284965 341969 445635 68743 -172593 -256108 -338986 -558348 380859 825765
6702H25765M7815J39369k00488o75501O36362j80703m35462J93743L00576M40886
6692A092362q66910K35075O45395o52929j11617l03017r8440Q02456n6419K25444
6682I11400m47563l90023J231388l56872J31016o12724j065786O15465m22736
6673d06435K04259L56490K93400n13338j2410O90638l45290j51967p3479L43696
6663C85564n32130j52193K66723k01838K19461Q51983K09064o89242N21957l05407
6653E73942j33982o83895Q21228k17443K99454P71127o97600k76553K65123K63679
6643I85080m15543M05972R2534n11145Q5644P47209o18417O45251N98873m79187
6633A536271r83848k94762O66187N92599k26223O9671j53209j77138O42172P2728
$$ plain form
6702 825765 873580 1012949 812461 136960 773322 592619 157157 350900 651476 1092362
6692 1092362 225452 460527 1105922 452993 341376 38359 -60081 742375 685956 911400
6682 911400 463837 73814 1305202 948330 1079346 466622 -599164 16301 -406435
6673 -406435 -202176 154314 447714 -65624 -78034 612604 267314 115347 41868 385564
6663 385564 -146566 -298759 -32036 -233874 -14413 837570 1046634 357392 879349 573942
6653 573942 439960 -243935 577293 359850 659304 1430431 732831 456278 721401 985080
6643 985080 569537 975509 1068043 556898 642542 1389751 771334 1416585 2015458 1536271
6633 1536271 552423 257661 923848 1516447 1290224 1359895 1206686 1029548 1671720 1744448
6623A744448j076680L03890k13078N51706L46226J66523K76372L33870L16699
6614B749976j056187j30011L18324L61091J29746o04867R4198N13258n59096L34783
6604B151215J1570l20517P73668q9684p20701J001177L6297q02005Q89230K16355
6594C146605l38230M32105J287244p60233M88195M30074l35755J24739K67144
6585D741888P31680m08210N18914l9788p5751M05693M59533M21403J295064N61951
6575H612377J56758N32744M90401l81968r8521q80351j47186R55464P29727N0346
6565A0019791L66259O63969L57413K6629J084127J152269P72946J821564O15747
6556A6880714O06035L125647K295023J665876L007810L674319M296147M929349
$$ plain form
6623 1744448 667768 971658 758580 1310286 1656512 1823035 2099407 2433277 2749976
6614 2749976 1693789 1563778 1882102 2243193 2372939 1768072 1862270 2375528 1816432 2151215
6604 2151215 2162785 1842268 2615936 2526252 1805551 2806728 2843025 2041020 2930250 3146605
6594 3146605 2808375 3240480 4527724 3767491 4255686 4685760 4350005 4474744 4741888
6585 4741888 5473568 5065358 5584272 5544484 5468733 5874426 6333959 6755362 8050426 8612377
6575 8612377 8769135 9301879 9792280 9410312 9311791 8431440 8284254 9239718 9969445 10019791
6565 10019791 10386050 11050019 11407432 11434061 12518188 13670457 14443403 16264967 16880714
6556 16880714 17486749 20612396 22907419 24573295 27581105 31255424 35551571 40480920
6548D0480920N624712P466682P572538Q026057O324646L100694j048972n502527
6540G2044750r515390q934817q140525p308416m380254m548750l831368k843082
6532B2542148j777870k165291j349555j202243j587112r61142j302621j084235
6524A1112079l30217q14519l59463o35381m13621j166897K3347K16126l38339
6515G293115p08389m09306j306876R67428p41465l94238K44289l85136J81984
6506D741406N8201p84614k5023q8453K91055r04947K35288M67412k83739n85174
6496C121412J46063J65544j31545K66886m08672n30620n61805N86121l83949j48639
6486B120796N92800j34845j071953L65680j01315k58784J77385J00737m58034
$$ plain form
6548 40480920 46105632 53572314 61144852 69170909 75495555 78596249 77547277 72044750
6540 72044750 62529360 53594543 45454018 38145602 33765348 29216598 25385230 22542148
6532 22542148 20764278 18598987 17249432 16047189 14460077 13498935 12196314 11112079
6524 11112079 10781862 9967343 9607880 8972499 8558878 7391981 7415328 7631454 7293115
6515 7293115 6584726 6175420 4868544 5835972 5094507 4700269 4944558 4559422 4741406
6506 4741406 4799607 4014993 3989970 3901517 4192572 3287625 3522913 3990325 3706586 3121412
6496 3121412 3267475 3433019 3301474 3568360 3159688 2629068 2067263 2653384 2269435 2120796
6486 2120796 2713596 2578751 1506798 1872478 1771163 1512379 1689764 1790501 1332467
6477A332467l5487o10611J159681j001321j1904N33655q9548k22195l17387l5082
6467G02268P14621R17816j26172j65236j8270o49880j22832q1080J95340m09617
6457I56958k60045L50210q2418k60023n91843P31589O69801L98394m83277p96593
6447F32753Q77182o54312m65657K36316l58805m64263M80848J78546j0256N82833
6437A035185l49451m28282J345020k4838j050360r4274K19150l42260L41519o24776
6427B6633r0234O2306j7930P93366l6794k8760o25429K5359L19779k1225P9769
6416D86840J73853J60973l2078o259K93239N230J04101m91873R1657m47723Q7509
6405D25469L65287l23130j38477k48626M05626J92748o4858N64920o16276k54862
$$ plain form
6477 1332467 1296980 686369 1846050 844729 832825 1366480 1276932 1054737 737350 702268
6467 702268 1416889 2334705 2208533 2043297 2025027 1375147 1252315 1171235 1366575 956958
6457 956958 696913 1047123 964705 704682 112839 844428 1514229 1912623 1429346 632753
6447 632753 1509935 855623 389966 626282 267477 -196786 284062 462608 452352 1035185
6437 1035185 685734 257452 1602472 1577634 527274 433000 652150 309890 651409 26633
6427 26633 -63601 -1295 -19225 774141 737347 708587 83158 108517 428296 407071 486840
6416 486840 660693 821666 789588 783329 1076568 1081798 1185899 694026 785683 337960 425469
6405 425469 790756 467626 329149 80523 486149 678897 614039 1178959 562683 307821
6395C07821N71637K53196j715894K63185K91735q85810N92672p753M10668r6911
6385a5454m51534J27019m08409J48978p8810N93584K26914m20978m33794M33328
6375b79156o19669j050106J502129K17289l24190O26321n05651j33791L52765
6366b14059j8386M11377k9444q50175M77383R21385J4612L73089r61534L19781
6356D44029L77941q59658m50390O45851N11440k91329m46406l47969K64926M37425
6346B85860l06523k87530L98285j18000r3688l28566P46289n68898N58321J72470
6336D58020j0899M76656q55333l79571j92328N0411J69378R2016J01102J14001
6326B3453j95461L55414L23242p14094J81773k20951P75304J07490r46217j83853
$$ plain form
6395 307821 879458 1132654 -583240 -320055 -28320 -914130 -321458 -329211 81457 -15454
6385 -15454 -466988 -339969 -748378 -599400 -678210 -84626 142288 -278690 -712484 -279156
6375 -279156 -898825 -1948931 -446802 -229513 -553703 72618 -433033 -566824 -214059
6366 -214059 -232445 178932 149488 -700687 -223304 698081 712693 1085782 124248 444029
6356 444029 821970 -37688 -488078 157773 669213 377884 -68522 -416491 -151565 285860
6346 285860 -20663 -308193 90092 -27908 -121596 -450162 296127 -272771 285550 458020
6336 458020 447121 923777 68444 -311127 -503455 -453044 -283666 -191650 -90548 23453
6326 23453 -172008 183406 506648 -207446 -25673 -246624 528680 636170 -310047 -493900
6316d93900N33198o3448L94751k40193r68275M41707L70634j61045M13602j09229
6306A17802n59343K73253j5732J46477j60640P32752l0636Q78418J48966j759762
6296b28445L13564o15040m73702Q58152K8041K01744j83498L5899n09905J060
6286e72130M74579j22869K99362n63173M7380J24576l89651L84376L14432L14695
6276C11577j88648L01322o98712N65657m91488K90290P56020p22255M40529j364914
6266h00622j29366P00160R11274J103773j369537j68651J99618m96234n96108
6257f45693J93461k2887K40632M6271k64493P58630l28195k28611k35192M77596
6247h481Q4885l27666m81249L75414L78065q2392M1131o87467k63043J12413j64853
$$ plain form
6316 -493900 39298 -24150 370601 130408 -837867 -396160 -25526 -186571 227031 117802
6306 117802 -441541 -168288 -184020 -37543 -198183 534569 503933 1382351 1531317 -228445
6296 -228445 85119 -529921 -1003623 -145471 -117430 84314 -99184 -63285 -573190 -572130
6286 -572130 -97551 -220420 78942 -484231 -436851 -312275 -701926 -317550 -3118 311577
6276 311577 122929 424251 -274461 291196 -200292 89998 846018 123763 564292 -800622
6266 -800622 -929988 -229828 681446 1785219 415682 247031 446649 -49585 -645693
6257 -645693 -452232 -475119 -234487 -188216 -452709 305921 -22274 -250885 -486077 -8481
6247 -8481 76404 -251262 -732511 -357097 20968 -61424 -20293 -707760 -970803 -858390 -1023243
6236a023243L06596M32484o73219L43304K51611j09004p06348P36818L43033J24020
6226B6052Q5023k07560p12721q20055N22557J69109k18524K05586j93637O59557
6216d84613K22580L6727M01567P7567l9909p44321M07728N48715l32963o25683
6206e32605l26268P58614o43334J79652O6771O40218n61405j33846J283517O37079
6196A368393n34548o29751k18607M9299K37486j77331l34483K59778j68916q56985
6186a005665L37405N21423Q70621k24970N3326p19679P06862J6785k73748L76761
6176F59121K82955r52430o88066m6286n428O20858M14906j09813p50601K82098
6166b92686P3730j44834L44317q82483j29737Q18556K33357K85189o88453n10442
$$ plain form
6236 -1023243 -716647 -284163 -957382 -614078 -362467 -471471 -1177819 -441001 -97968 26052
6226 26052 111075 -96485 -809206 -1629261 -1106704 -937595 -1156119 -950533 -1144170 -484613
6216 -484613 -262033 -225306 176261 253828 213919 -530402 -122674 426041 93078 -532605
6206 -532605 -858873 -100259 -743593 -563941 -497170 143048 -418357 -552203 731314 1368393
6196 1368393 833845 204094 -14513 34786 272272 94941 -239542 20236 -148680 -1005665
6186 -1005665 -668260 -146837 723784 498814 552140 -167539 539323 556108 282360 659121
6176 659121 942076 -10354 -698420 -744706 -750134 -129276 285630 175817 -574784 -292686
6166 -292686 -218956 -363790 -19473 -901956 -1031693 -213137 20220 305409 -383044 -893486
6156h93486O28635l58982M30732k76268M02967J50487k57016L47368L61808o86801
6146a50556j3669j47897K70852j98897K09470n85221k08343N85285O26539J54393
6136E41956L61348j50749p69749M13929P4603k35444k16562j92114K65912r12000
6126h18870j86879P80237l38646N07592J55480m91067r36708P41566M52984k48749
6116c83060p7777j67039N60421K85886n8046K21104p48970M1382M90143J74912
6106C38956N08076n93976L93604L10597j020684p9094K30799k32072o4603k25545
6096d33942r6269J1112O73815k6811M4488p05730r35360J62287L52685M03954
6086e49771l90801J12310L03936Q08247o36470k94836J42603N47935k31277O80513
$$ plain form
6156 -893486 -264851 -623833 -193101 -469369 -66402 84085 -172931 174437 536245 -150556
6146 -150556 -164225 -312122 -41270 -240167 -30697 -615918 -824261 -238976 387563 541956
6136 541956 903304 752555 -17194 396735 471338 235894 19332 -172782 93130 -818870
6126 -818870 -1005749 -225512 -564158 -56566 98914 -392153 -1328861 -587295 -134311 -383060
6116 -383060 -460837 -627876 -67455 218431 160385 381489 -367481 -326099 164044 338956
6106 338956 847032 253056 646660 957257 -63427 -142521 88278 -143794 -208397 -433942
6096 -433942 -530211 -519099 154716 127905 172393 -533337 -1468697 -1306410 -953725 -549771
6086 -549771 -940572 -828262 -524326 283921 -352549 -647385 -504782 43153 -188124 492389
6076D92389P05627j611648O83228k04269k4661J96850l37694P81823j48283O27138
6066A160500m08927n25905k28495J04706l63786J79261q0936o13878P77806r0713
6056i0367j46749n65839L88784M18701K56006m87322M8131J207514n09037l90342
6046A29480j048284l54306J211756Q2268p11155N26128o43535Q88927q97790P98505
6036a8006M3892o70886M65306n06467j67058Q14258O4553n12784K16773R100N97516
6025C36197j28788p31384J206760l09695M28460n02674p51841K94294k58433o10791
6015a027895l89290R41954P014O89389L23856l78380k00899J13399L03771n62571
6005a79652M8826l61494p1194R11905R198o08147m45637L98352j82652m26942
$$ plain form
6076 492389 1198016 -413632 269596 65327 40666 237516 -100178 681645 533362 1160500
6066 1160500 751573 225668 -2827 101879 -261907 -82646 -163582 -777460 346 -90367
6056 -90367 -237116 -802955 -414171 4530 260536 -226786 -178655 1028859 519822 129480
6046 129480 -918804 -1273110 -61354 20914 -690241 -164113 -807648 81279 -816511 -18006
6036 -18006 25886 -645000 -179694 -686161 -853219 -38961 25592 -487192 -270419 -261319 336197
6025 336197 207409 -523975 682785 373090 801550 298876 -452965 -158671 -417104 -1027895
6015 -1027895 -1417185 -475231 -468217 221172 545028 166648 -34251 79148 382919 -179652
6005 -179652 -130826 -492320 -563514 348391 357589 -250558 -696195 -297843 -480495 -907437
5995i07437l1594P40109o02237k76480L18149J15474L60005N46668r52216l06899
5985i96458M1280O1369K19074K43802k64136l95011R35289P17942k21957R8281
5975D39475l98944M59754j185944L88077L37814j5034M67523j003405K64548L35876
5965H9740l16443r14727j23485O99877K20935n00366j54958Q76152k63209Q25776
5955D39292K39962j61959p28548P018Q06022R6801k95324N96089j018573r0620
5945a09840M86442o38707J02571P01451L7544k73441k28799l74121J46944J56218
5935F262j39856K19637l94048o12760j8152j24372M24786R13690M98957j189433
5925d15289K75967q06798l40804R85576J36308m54050K37262L63130L24979m65493
$$ plain form
5995 -907437 -939031 -198922 -801159 -1077639 -759490 -644016 -284011 262657 -689559 -996458
5985 -996458 -955178 -893809 -674735 -430933 -695069 -1090080 -154791 563151 341194 439475
5975 439475 40531 500285 -685659 -297582 40232 25198 492721 -510684 -246136 89740
5965 89740 -226703 -1141430 -1264915 -565038 -344103 -844469 -999427 -123275 -386484 439292
5955 439292 679254 517295 -211253 -204235 601787 698588 403264 999353 -19220 -109840
5945 -109840 376602 -262105 -159534 541917 579461 306020 77221 -296900 -149956 6262
5935 6262 -133594 86043 -308005 -920765 -938917 -1063289 -638503 275187 774144 -415289
5925 -415289 -139322 -946120 -1286924 -301348 -165040 -619090 -381828 -18698 306281 -159212
5915a59212J80122N50536r23232J07573M30836q3495R2906J55015n58638n20696
5905g28285R74944m6398j28203P06191J5066m73446N64384k19148J21066l47942
5895D38229K73793O3890q65135P8032J45213J23082K23416q26348k78747M29765
5885a94810J66330O8285N1735N75213n0176m21715r52731J185343N07364j191204
5875b56366J049j75656m37727M39001p69377M76418P24535m85135P97990q2787
5865B31945l58477j14659J80892n4722K7766M60753k54482m64444K73250k17144
5855b89322k11427K62025M02995M14976l82987J3896K47866J74041L65074p96822
5845B00315M7950O32527N09877j457795O7955r7923n40536M57644J9293R6792
$$ plain form
5915 -159212 20910 571446 -351786 -244213 186623 103128 196034 351049 -207589 -728285
5905 -728285 246659 200261 72058 778249 793315 319869 884253 665105 786171 438229
5895 438229 712022 775912 -89223 -11191 134022 257104 480520 -345828 -624575 -194810
5885 -194810 -28480 39805 91540 666753 616577 194862 -757869 427474 934838 -256366
5875 -256366 -255317 -430973 -868700 -429699 -1199076 -722658 1877 -483258 314732 231945
5865 231945 -126532 -241191 -60299 -115021 -87255 373498 119016 -345428 -72178 -289322
5855 -289322 -500749 -238724 164271 579247 196260 210156 458022 632063 997137 200315
5845 200315 248265 880792 1390669 -67126 829 -97094 -637630 -179986 -160693 -63901
5835f3901j69077M02218j45310L32207j74311K87284l41909K55464N16697j57001
5825G42361r36277Q6511k55332N71420M4481M75236j58502n6467K75521j97991
5815E90961J46326q45503l24422P2611P63431j55156k58152j81073n4948l37242
5805e83167Q5986J14576p8167J23874J86709k8679K13603N1722K09377r74162
5795f78328Q16744q885q7515J62910L9649J48259N01447j95785j75285k24708
5785B98503k15795j92339M48871J77408J36241m93357m0170j039322m9898O56412
5775c13446j96901J16771L00099K36944o22009M14346n32358Q4307J52551J61805
5765a97891l76187P5618o30793Q90540m32468j36710K40576Q13892K337m46982
$$ plain form
5835 -63901 -232978 169240 23930 356137 181826 469110 127201 382665 899362 742361
5825 742361 -193916 -107405 -362737 208683 253164 728400 569898 513431 788952 590961
5815 590961 737287 -108216 -432638 -360027 403404 248248 -9904 -190977 -245925 -583167
5805 -583167 -497181 -382605 -460772 -336898 -150189 -178868 34735 86457 295834 -678328
5795 -678328 138416 129531 42016 204926 244575 392834 894281 698496 523211 298503
5785 298503 82708 -109631 339240 516648 652889 159532 119362 -919960 -969858 -313446
5775 -313446 -510347 -393576 -93477 143467 -478542 -64196 -596554 -512247 -359696 -197891
5765 -197891 -574078 -498460 -1129253 -238713 -671181 -807891 -567315 246577 248914 -198068
5755a98068Q0875k76663l29952J030491k31256m13592J012210l27561K7954M5568
5745D20006N94106O79832p02455o96340m93071l9695Q14158l12364L90920K82592
5735I37689n02196P14874O2378l50480L01735n57405k39144O3565L0922K82990
5725G44928m099l26341N43637o33909j10432K53457k53235M89760J43849J14944
5715I62559l02971L05266L47043p1685O63969m36104o23355J75035M28789N29275
5705A977821o46496M86088l64793K9965Q65403r56648j43154O08574p7018J69806
5695A949548L16622j66888L0801L27889k08617J41722m2260o58608L84048O30167
5685B704424K64218m49j002210M49719N86325j235940J314750P47725p92507Q68947
$$ plain form
5755 -198068 -117193 -393856 -723808 306683 75427 -338165 674045 346484 374438 420006
5745 420006 1014112 1693944 991489 295149 -197922 -237617 576541 264177 655097 937689
5735 937689 435493 1150367 1212745 862265 1164000 606595 367451 431016 461938 744928
5725 744928 740829 414488 958125 324216 213784 467241 214006 703766 847615 962559
5715 962559 659588 964854 1311897 1240212 1904181 1468077 844722 1019757 1448546 1977821
5705 1977821 1331325 1817413 1452620 1482585 2347988 1391340 1248186 1856760 1779742 1949548
5695 1949548 2266170 2099282 2130083 2457972 2249355 2391077 2348817 1690209 2074257 2704424
5685 2704424 2968642 2968193 1965983 2415702 3002027 1766087 3080837 3828562 3036055 3905002
5675C905002q09794j01117j53462M3954J42973L68217m7023m88661L24830j22005
5665C062914q50049Q85300K97313R0587l9707m82653K25492N66219j12230o81431
5655B961755L06032n28829K29785M43853k67623L99052L89232M44769j81799o34183
5645C562044M3801K66747L36463J04080O52506l0841k07463j18261N6148l11370
5635D353854O264k03317k71526K67962l19450j76469K75342o97206R51241M81227
5625D667922l92887k58371l39598K84260M56163j79615n53499L70129l68623K00946
5615C886827M14992j136291Q42181Q37710L49107L01218j135467K6135J101357
5606E487769r4325q63273j72913j86062M04637j33930j24838M30358j33184M66208
$$ plain form
5675 3905002 3095208 2994091 2840629 2884583 3027556 3395773 3348750 2860089 3184919 3062914
5665 3062914 2212865 3098165 3395478 3486065 3446358 2963705 3189197 3755416 3643186 2961755
5655 2961755 3267787 2738958 2968743 3412596 3144973 3544025 3933257 4378026 4196227 3562044
5645 3562044 3605845 3872592 4209055 4313135 4965641 4934800 4727337 4609076 4665224 4353854
5635 4353854 4360118 4156801 3885275 4153237 3833787 3657318 3932660 3235454 4186695 4667922
5625 4667922 4275035 4016664 3677066 3961326 4417489 4237874 3684375 4054504 3685881 3886827
5615 3886827 4301819 3165528 4007709 4845419 5194526 5495744 4360277 4386412 5487769
5606 5487769 5393444 4530171 4357258 4171196 4575833 4441903 4317065 4747423 4614239 5080447
5596E080447p71512k16265k59115l97983L30914j42003k21062j47479n07490Q84094
5586C632546j56356j83733K41478k19407J11985J82021k72349M93403l29885O13235
5576D112938K8199R1215j08772n98667o12165o74160k20156J091863q54695L44653
5566B600253J07138o81464j39544N05394N48781p84524K53835j88940K18266n3816
5556B385379k22348J47978L58149J18798k16349m05077Q70809K0280p91114m97603
5546A768902P08947r75737R04001K3145o41943J40850M70666Q0955q3109K68989
5536B665666L56628j19253K35007n0585o86087l66968l61635l44036N25115o16172
5526A237680R10076M12426L93107K74989o16039j06160L32389J45264L06377m88097
$$ plain form
5596 5080447 4308935 4092670 3833555 3435572 3766486 3624483 3403421 3255942 2748452 3632546
5586 3632546 3476190 3292457 3533935 3314528 3426513 3608534 3336185 3829588 3499703 4112938
5576 4112938 4141137 4232352 4123580 3524913 2912748 2238588 2018432 3110295 2255600 2600253
5566 2600253 2707391 2025927 1886383 2391777 2940558 2156034 2409869 2220929 2439195 2385379
5556 2385379 2163031 2311009 2669158 2787956 2571607 2166530 3037339 3057619 2266505 1768902
5546 1768902 2477849 1502112 2406113 2429258 1787315 1928165 2398831 2479786 2396677 2665666
5536 2665666 3022294 2903041 3138048 3087463 2401376 2034408 1672773 1328737 1853852 1237680
5526 1237680 2147756 2560182 2953289 3228278 2612239 2506079 2838468 2983732 3290109 2802012
5516B802012K17838j11508l64463L53210L16204R9586m26243L13622K61303Q41198
5506D302759j06622k15628j95837q40223J32759J47494k96770j3299J73004O8481
5496C156118O97879j01173r00871l05365J81066n06118R94307m39365J88423O36390
5486C601291l80160K23070J79868Q1273r82084J08272N53412k56527M5308N55317
5476C729040j9806J33405l92180o38430o34619J149990o29698k76460j88020J332689
5466C565911j10586n33398N22474q42749P52044J01161l36481p410r1852K93076
5456C312190L41259J04714q2501r5769k48571l0308J163057M12110o59746M75978
5446D692413J45577p8239n31519M78640p46482M63685O35085J2325j25159l94026
$$ plain form
5516 2802012 3019850 2908342 2543879 2897089 3213293 3312879 2886636 3200258 3461561 4302759
5506 4302759 4196137 3980509 3784672 2944449 3077208 3224702 2927932 2914633 3087637 3156118
5496 3156118 3853997 3752824 2851953 2546588 2727654 2221536 3215843 2776478 2964901 3601291
5486 3601291 3221131 3444201 3624069 3705342 2723258 2831530 3384942 3128415 3173723 3729040
5476 3729040 3709234 3842639 3450459 2812029 2177410 3327400 2697702 2421242 2233222 3565911
5466 3565911 3455325 2921927 3444401 2601652 3353696 3454857 3118376 3110966 3019114 3312190
5456 3312190 3653449 3758163 3675662 3579893 3331322 3301014 4464071 4876181 4216435 4692413
5446 4692413 4837990 4759751 4228232 4706872 3960390 4424075 5059160 5071485 4946326 4552300
5436D552300n73299Q93499J046478l58502p24956J43127J561925n9189M73469
5427F954852m74144j6025P06594l41305L06150L00208m00786K08946K38544J80644
5417G663678M40331n38189k36004J36658M03189o536J153846n0620l02205J752360
5407A0416508k87851l73455l3344O09090J170082l17417L27567N91700K46521
5398A2349401Q02320J7603J222475Q31522m6121J039059J956452K54050J157770
5389A9584531J675293K807658J242917P24250J702866K544197L302746K621330
5381C6205788M235425L732032M517108M639177M081602N020854L514482K844028
5373F8790496J151162k662998k480759l056339l098336k145609j451094l28534
$$ plain form
5436 4552300 3979001 4872500 5918978 5560476 4835520 4978647 6540572 6481383 6954852
5427 6954852 6480708 6464683 7171277 6829972 7136122 7436330 7035544 7244490 7483034 7663678
5417 7663678 8104009 7565820 7329816 7466474 7869663 7863127 9016973 8966353 8664148 10416508
5407 10416508 10128657 9755202 9721858 10330948 11501030 11183613 11511180 12102880 12349401
5398 12349401 13151721 13169324 14391799 15223321 15177200 16216259 18172711 18426761 19584531
5389 19584531 21259824 24067482 25310399 26034649 27737515 30281712 33584458 36205788
5381 36205788 40441213 44173245 48690353 53329530 57411132 62431986 65946468 68790496
5373 68790496 69941658 67278660 64797901 61741562 58643226 56497617 55046523 54717989
5365E4717989j97825l66861M61551K287951L255105L970486N438576M716886N048380
5356G9332238M402131L732676J289735k352838o125067p831846p152947o943940
5348E8350142o101732n797426m644080l433672k743269k365338k633676k860750
5340B7770199k374480j137440p41669o44486j143644j474701p09225j471773p37758
5331A7335023j51390o64188l14033n04924m84476j37087q18993l44091l17028
5322A3598813J19539j3266m53451J52273l80081K07525j78032J17737J14154J65884
5312A3451095m59540o43283L55609R92540L21689J92884K72698l22796K90044
5303A4450940n4977j77058L11131P42432J09246P18808J13030Q17242L63909M56680
$$ plain form
5365 54717989 54520164 54153303 54614854 56902805 60157910 64128396 69566972 74283858 79332238
5356 79332238 83734369 87467045 88756780 86403942 80278875 72447029 65294082 58350142
5348 58350142 52248410 46450984 41806904 38373232 35629963 33264625 30630949 27770199
5340 27770199 25395719 24258279 23516610 22872124 21728480 20253779 19544554 18072781 17335023
5331 17335023 17183633 16519445 16205412 15700488 15216012 15078925 14259932 13915841 13598813
5322 13598813 13718352 13705086 13251635 13403908 13023827 13231352 13053320 13171057 13285211 13451095
5312 13451095 12991555 12348272 12703881 13696421 14018110 14210994 14483692 14160896 14450940
5303 14450940 14395963 14218905 14530036 15272468 15381714 16100522 16213552 17030794 17394703 17851383
5293A7851383K58882j034739j42859J277309P2315N25585j84608M00693Q25919
5284A9849880j55832R26538J249197J047231O38279m62959R41710O42648K0463
5275B4697155j82003l55089N2456k80794m40630O30081K84939R6283J16277N4032
5265B4672707J141712J37044K03581N76736J91967p2622m69962k83700O21524
5256B6718987p80356j67716q96426Q95885j55275m82645K80127n56005J359551
5247B6216127M29460K6903j14686n33985r6371p65870P0847j258582j470509o54443
5237B1848891M85060p51196r71190l42843p59303R7982R82960k02117n26045J085
5227A9863284j5088N78415o02586p21450j605825j67174q59799J25119q19758
$$ plain form
5293 17851383 18110265 17075526 16932667 18209976 18282291 18807876 18623268 19023961 19849880
5284 19849880 19694048 20620586 21869783 22917014 23555293 23092334 24034044 24676692 24697155
5275 24697155 24515152 24160063 24212519 23931725 23491095 24121176 24406115 24502398 24618675 24672707
5265 24672707 25814419 25951463 26155044 26731780 26923747 26851125 26381163 26097463 26718987
5256 26718987 25938631 25770915 24874489 25770374 25615099 25132454 25412581 24856576 26216127
5247 26216127 26645587 26672490 26557804 26023819 25927448 25161578 25232425 23973843 22503334 21848891
5237 21848891 22333951 21582755 20611565 20268722 19509419 19607401 20590361 20388244 19862199 19863284
5227 19863284 19848196 20426611 19824025 19102575 17496750 17329576 16469777 16594896 15775138
5218A5775138j643973m72018p15689K50623n33359p44983J52782J8331p27900
5209A1358952n64839l51439J90107j23709n14132q12686k09267p1152j53412p53340
5199G995083m43813j77841k42117J81563j39085J95030n16254j47183R60591n72693
5189G093281J25738K07207j140094K77387L15710P4145P45475j181563m25282
5180F092004O8369j2286N09116L60178k25940j9785K02995l83588m16166R30527
5170G105424n18545M8712O84363m59589j47657o34981O20443J51790O20553m76998
5160F993515j83450n8122R04658m71360r5955O7381R9450M67532J48080L15694
5150H187423k3785n31627l17336O68993j492K82531k24519m23495j02244N15574
$$ plain form
5218 15775138 14131165 13659147 12943458 13194081 12660722 11915739 12068521 12086852 11358952
5209 11358952 10794113 10442674 10632781 10509072 9994940 9182254 8972987 8901835 8748423 7995083
5199 7995083 7551270 7373429 7131312 7312875 7173790 7368820 6852566 6705383 7665974 7093281
5189 7093281 7219019 7426226 6286132 6563519 6879229 6953374 7698849 6517286 6092004
5180 6092004 6160373 6148087 6657203 7017381 6791441 6771656 6974651 6591063 6174897 7105424
5170 7105424 6586879 6635591 7319954 6860365 6712708 6077727 6698170 6849960 7470513 6993515
5160 6993515 6810065 6751943 7656601 7185241 7089286 7156667 7256117 7723649 7871729 8187423
5150 8187423 8163638 7632011 7314675 7983668 7982176 8264707 8040188 7616693 7514449 8030023
5140H030023M99123j04688J06435l58697p08138P05903K61193J22773M92635K2885
5130I069447q4625j0774J5381j016589J61322J275872J90884k14566k50273o99787
5120H436292j85833R4518n67718K66964J97776l2970M86295K494j164825m98891
5110G034102R62321K59972O11783j14032p41583P71079J085938k69224o46835
5101H953521O25098P52538J149789Q92423p72196n331o33126p42848k35604j6730
5091I967534n88239j7376r6092k40817O56550o32246R46158R10461O24807j78602
5081A1352138m37708k81837p44586j280375Q3403k58031M36005n97073k04806
5072H067130p1247N149K34062l25329O53874m30389l11457J76462l05146N14301
$$ plain form
5140 8030023 8529146 8424458 8530893 8172196 7464058 8169961 8431154 8553927 9046562 9069447
5130 9069447 8984822 8974048 8989429 7972840 8134162 9410034 9600918 9386352 9136079 8436292
5120 8436292 8250459 8344977 7777259 8044223 8241999 8209029 8695324 8697818 7532993 7034102
5110 7034102 7996423 8256395 8868178 8754146 8012563 8783642 9869580 9600356 8953521
5101 8953521 9578619 10331157 11480946 12373369 11601173 11595842 10962716 10219868 9984264 9967534
5091 9967534 9379295 9361919 9265827 9025010 9681560 9049314 9995472 10905933 11530740 11352138
5081 11352138 10914430 10632593 9888007 8607632 8691035 8433004 8869009 8271936 8067130
5072 8067130 7995883 8001032 8235094 7909765 8563639 8133250 7821793 7998255 7693109 8207410
5062H207410K36736L0922O53536j74202k70420J59772j83238J41557P45574N66908
5052A0114555R84970q4954k21223r30158j299897K15940M67781j25263n86163
5043H535588P52654N79719l8004K00661K78395M10699J44705P2108q58050j30316
5033I948159l54343J81960q63555K35887l14924k43894o87604J72001k03448K96834
5023H167073L33615K0930K69788p61813J078028L61870K4958L04165J19608l07593
5013I610629j36711M45170M8619n64039K77445r2019K16609k06753k00126o55910
5003H742914R39345p57319J555487k03915j194509J097206j15030R64951L76557
4994A1405687l63898l34622J111793k08465k45282k78755Q95416J0627J47542
$$ plain form
5062 8207410 8444146 8475068 9128604 8954402 8683982 8843754 8660516 8802073 9547647 10114555
5052 10114555 11099525 11014571 10793348 9863190 8563293 8779233 9247014 9121751 8535588
5043 8535588 9288242 9867961 9829957 10030618 10309013 10719712 10864417 10936525 10078475 9948159
5033 9948159 9593816 9775776 8912221 9148108 8833184 8589290 7901686 8073687 7870239 8167073
5023 8167073 8500688 8521618 8791406 8029593 9107621 9469491 9494449 9798614 9918222 9610629
5013 9610629 9473918 9919088 9967707 9403668 9681113 9589094 9805703 9598950 9398824 8742914
5003 8742914 9682259 8924940 10480427 10276512 9082003 10179209 10064179 11029130 11405687
4994 11405687 11041789 10707167 11818960 11610495 11365213 11086458 11981874 11992501 12140043
4985A2140043L36882J37236m41778K97680l69795M21157L67824q71174K7722O7997
4975A2113794m55590L33901m86730k86243J201391M9484K5737l78905p067l61177
4965A1748595J038675N86239K95098o50223N94398J648759j2326n2307k49848
4956A4947060P1312M24909N57609Q17877J74056P47633M61821J77304J82423J377504
4946A9939508J234269Q30389J265434J017391J081725N49784J115080K42627o71631
4937B6604576j574596p55553q73443j034098m74786j765246j50186l2384r7537
4928A9846747L7231r60453M60385M17682R04632O81562j28313O71395Q03371O26049
4918B3360288n11945r57277j01033n87181j89038j247834p58919r04643k66909
$$ plain form
4985 12140043 12476925 12614161 12172383 12470063 12100268 12521425 12889249 12018075 12045797 12113794
4975 12113794 11658204 11992105 11505375 11219132 12420523 12470007 12495744 12116839 12109772 11748595
4965 11748595 12787270 13373509 13668607 13018384 13612782 15261541 15249215 15196908 14947060
4956 14947060 15018372 15443281 16000890 16818767 16992823 17740456 18202277 18379581 18562004 19939508
4946 19939508 21173777 22004166 23269600 24286991 25368716 25918500 27033580 27276207 26604576
4937 26604576 25029980 24274427 23400984 22366886 21892100 20126854 19976668 19944284 19846747
4928 19846747 19883978 18923525 19383910 19801592 20706224 21387786 21259473 21930868 22734239 23360288
4918 23360288 22848343 21891066 21790033 21202852 21013814 19765980 19007061 18102418 17835509
4909A7835509n68640k88957k48767j048884j42903o07144j78990l81509l55939
4900A4013776m31381M50794p00043m82101K26414l88409M83197n91685o47531
4891A1933031j08983l12975l78376P56134J26490j233320J49692j15084J17014
4882A0933623K40830N03537j53576p6431K03903o25529r68318Q50112l87098P56151
4872A1277204R45745O9476K4700n97467n82973L01002L09828l5044o05147M24452
4862A1531776N7822p70048K76501N9413K20926q02849M793M62514k25283k25854
4852A0589711Q19286J99256N8564M26778k02550k97718m07564N39985R92923K96537
4842A3015208M6115M86554O07494m40867L48718J173414Q44128K86869j584359
$$ plain form
4909 17835509 17266869 16977912 16729145 15680261 15537358 14930214 14751224 14369715 14013776
4900 14013776 13582395 14033189 13333146 12851045 13077459 12689050 13172247 12580562 11933031
4891 11933031 11824048 11511073 11132697 11888831 12015321 10782001 10931693 10816609 10933623
4882 10933623 11174453 11677990 11524414 11447983 11651886 11026357 10058039 10908151 10521053 11277204
4872 11277204 12222949 12292425 12317125 11719658 11136685 11437687 11747515 11712471 11107324 11531776
4862 11531776 11589598 10819550 11096051 11155464 11376390 10573541 10578334 11040848 10815565 10589711
4852 10589711 11408997 11608253 11666817 12093595 11891045 11593327 11185763 11725748 12718671 13015208
4842 13015208 13061323 13547877 14155371 13714504 14063222 15236636 16080764 16367633 14783274
4833A4783274o01282J0990o97286l6641Q5294j95238L64989j19741n21801L9214
4823A3111772P79439l32536J84613J031527j33888N19338l09837O24799N59571
4814A6034798j08043l76212N79811j01060j039437r4934J00407L25361q6638q70182
4804A4363871N37188J70191p395m14080O19454Q87600K4567k33825n19462n48578
4794A4879531P32103Q31507N35269J37871N87638j55113k18769n92209J8650k94824
4784A6461654o27821L24285j356115L32022O43718Q61297n75426k058N95801n23296
4774A6134061Q29732l20002N25540M31543N66637o8521l64645L50492l52206j99023
4764A7533608p77123N44746j6585m78492J48748O0407k08413N81023l06185M64567
$$ plain form
4833 14783274 14181992 14192982 13495696 13459055 13544349 13349111 13714100 13594359 13072558 13111772
4823 13111772 13891211 13558675 13743288 14774815 14640927 15160265 14850428 15475227 16034798
4814 16034798 15926755 15550543 16130354 16029294 14989857 14894923 14995330 15320691 15234053 14363871
4804 14363871 14901059 15071250 15063855 14649775 15269229 16156829 16181396 15947571 15428109 14879531
4794 14879531 15611634 16443141 16978410 17116281 17703919 17548806 17330037 16737828 16756478 16461654
4784 16461654 15833833 16158118 14802003 15134025 15777743 16639040 16063614 16061556 16657357 16134061
4774 16134061 16963793 16643791 17169331 17600874 18167511 18098990 17734345 18084837 17732631 17533608
4764 17533608 16756485 17301231 17284646 16806154 16954902 17015309 16806896 17387919 17081734 17546301
4754A7546301L01501o93655L47469J118092j62387K40269k26980j16673M0399
4745A8394336o51194Q1932Q45019R43414n59197j48227J64349l95452j21034J141588
4735A9695534Q41517l95514m4076K54051N88761P66315R4953M34198R62164m10007
4725B2787896q62341L17857m03560m37519l21409J23933M36888j83201J17022
4716B1575566m48212m49770N86496p47168l00432j32013N9718m7790l98810k03819
4706A9493766N32025o7952K6144Q4475m20005J88400l39888M19689O12547j129621
4696A9399580j10611L49531K80805M61635m58570M35318J93152r128J72145n84278
4686B0129579m0258K27638m18192N57918l47304k59485O96651J47944Q43K20213
$$ plain form
4754 17546301 17847802 17154147 17501616 18619708 18457321 18697590 18470610 18353937 18394336
4745 18394336 17743142 17825074 18670093 19613507 19054310 18906083 19070432 18674980 18553946 19695534
4735 19695534 20537051 20141537 20097461 20351512 20940273 21706588 21801541 22235739 23197903 22787896
4725 22787896 21925555 22243412 21839852 21402333 21080924 21204857 21641745 21458544 21575566
4716 21575566 21127354 20677584 21264080 20516912 20216480 20084467 20144185 20096395 19697585 19493766
4706 19493766 20025791 19957839 19983983 20068458 19648453 19836853 19496965 19916654 20529201 19399580
4696 19399580 19288969 19638500 19919305 20380940 19922370 20357688 20550840 20541712 20713857 20129579
4686 20129579 20089321 20316959 19898767 20456685 20109381 19849896 20546547 20694491 20695334 20915547
4676B0915547n38793Q9782O40688j8721m3952N4124j58687K69756o84964k84272
4666B0240508l15560m10609N81830P48111R6044j11743o66579M04429l23263q9449
4656B0153719O81927o65981l37702k80834K50175k53169L89030L62861o22684
4647A9677342M79256J0529p25311p8077K58462l76503P1671o2958J76520n30840
4637A8900091Q11298k03062l1145J8875K94890K86304J19358q04940N1368J05291
4627A9548328M17460J48058o77928K37325N76934k13305K86030L85281K73581
4618B0981764K12557n03993N02254k95076K56590n22423r5341M34798o16866r6890
4608B0257374O74622O25181N28830j11267N07864N17582O61305q30629O22830
$$ plain form
4676 20915547 20376754 20466536 21107224 21088503 21044551 21098675 20939988 21209744 20524780 20240508
4666 20240508 19924948 19514339 20096169 20844280 20940324 20828581 20162002 20566431 20243168 20153719
4656 20153719 20835646 20169665 19831963 19551129 19801304 19548135 19937165 20300026 19677342
4647 19677342 20156598 20167127 19441816 19363739 19622201 19245698 19317369 19254411 19430931 18900091
4637 18900091 19711389 19508327 19477182 19496057 19790947 20077251 20196609 19391669 19443037 19548328
4627 19548328 19965788 20113846 19435918 19673243 20250177 20036872 20322902 20708183 20981764
4618 20981764 21194321 20690328 21192582 20897506 21154096 20631673 20536332 20971130 20354264 20257374
4608 20257374 20931996 21557177 22086007 21974740 22482604 23000186 23661491 22830862 23453692
4599B3453692j68435M68366r4835n97404j98641N92790o0719J12687J140977P92300
4589B5440778N01545J577037J77748J339631M86723N73357N95110j026821M7106
4580B9712214m74262O7649k740Q82280L95072O80160J195935O31161l7585j110398
4570C1939486J130733m54378J56707j68826k43689l0406O33412J57030p0545J129211
4560C4178735Q97740l78099J216845K71040o45704j420023j66403M28791n59186
4551C3823736l17021l71728N37476J689695J335556j366632k53282J20080n07994
4542C4689886q70516p04244j383292p38550l30992k70366r22342M67303j07911
4533B9828976k59287q656M54487m71146k68183p95899O03420j234553L8092j24814
$$ plain form
4599 23453692 23285257 23753623 23658788 23061384 22862743 23455533 23394814 23507501 24648478 25440778
4589 25440778 25942323 27519360 27697108 29036739 29523462 30096819 30691929 29665108 29712214
4580 29712214 29237952 29305601 29302861 30185141 30580213 31260373 32456308 33087469 33049884 31939486
4570 31939486 33070219 32615841 32772548 32603722 32360033 32329627 32963039 33120069 33049524 34178735
4560 34178735 35076475 34698376 35915221 36186261 35540557 34120534 33954131 34382922 33823736
4551 33823736 33506715 33134987 33672463 35362158 36697714 35331082 35077800 35197880 34689886
4542 34689886 33819370 33115126 31731834 30993284 30662292 30391926 29469584 29936887 29828976
4533 29828976 29569689 29561033 30015520 29544374 29276191 28480292 29083712 27849159 27887251 27762437
4523B7762437m1532M15212n39985N71367M46841O154J16750l28897l07787N26503
4513B8627063K2546J017961K30449o3832J109136k68129k96577L24299L38947
4504C1041863J386725j6896k16988M15024O3948J141819Q3730L48222J075769
4495C5323216O41229K21346J002136K70595j52508q80259J84533P93098Q01352
4486C8204738J222941J98426K025852P57847J115529J503142R04735J515223P41454
4477D8189887J643729R68694K670608K385984K438739L598545K709473K572514
4469F7178173L045688L747712L953235M720981M657584N224942O424717O709956
4461A05662988P473470R080829J1058537J3457030J5905259K0122880K4573688
$$ plain form
4523 27762437 27720905 28136117 27596132 28167499 28614340 28620494 28737244 28408347 28100560 28627063
4513 28627063 28649609 29667570 29898019 29834187 30943323 30675194 30378617 30702916 31041863
4504 31041863 32428588 32411692 32194704 32609728 32673676 33815495 33899225 34247447 35323216
4495 35323216 35964445 36185791 37187927 37458522 37306014 36425755 36610288 37403386 38204738
4486 38204738 39427679 39626105 41651957 42409804 43525333 45028475 45933210 47448433 48189887
4477 48189887 49833616 50802310 53472918 55858902 58297641 61896186 64605659 67178173
4469 67178173 70223861 73971573 77924808 82645789 87303373 92528315 98953032 105662988
4461 105662988 113136458 122217287 133275824 146732854 162638113 182760993 207334681
4454B07334681K9298165L7291269M6320112N4629213N7425137N4371758K1020992
4447E07691327j9904263n4508329p6898093o6095725m9232255l4311939k5289506
4440A81451217j8225238j4191056j1439631r601904r336882q332597m865307m754730
4432A00703872m825455l419391k215666j420918o59088j496626k74811j068405
4424H5323512l25891j696771k150225q82692j120441l27128J055904Q78246J811606
4415H2566120K070037O32321J924153K965154K543939K884317K788097K106479
4407A00480617K347802L298589L309082M373474N831994O607185R968979J0850473
4399A47068195J3835769J7491691K1395571K5760847L3666027M0941873M9476941
$$ plain form
4454 207334681 236632846 273924115 320244227 374873440 432298577 486670335 507691327
4447 507691327 487787064 433278735 356380642 290284917 241052662 206740723 181451217
4440 181451217 163225979 149034923 137595292 127993388 118656506 110323909 105458602 100703872
4432 100703872 95878417 92459026 90243360 88822442 88163354 86666728 86391917 85323512
4424 85323512 84997621 83300850 81150625 80267933 79147492 78820364 79876268 80754514 82566120
4415 82566120 84636157 85268478 87192631 90157785 92701724 95586041 98374138 100480617
4407 100480617 102828419 106127008 109436090 113809564 119641558 126248743 136217722 147068195
4399 147068195 160903964 178395655 199791226 225552073 259218100 300159973 349636914
4392C49636914N2637649N4284883L2690493p643120k4488991n1320337o6793035
4385C39004456n8328426m3294592k9259468k2209134j6511337j4498562j0962888
4378A43940049q976370p437549o155506m716640m818919n251791n786933m370837
4370I6425504m207393l149261l631713j787625k356313k671197j615467k112456
4362G4894079j232696o33014n38320r51251j159823j980329k902710l487019k802052
4353E9206865k295111j943109j010748l47480o09131j675274j085714M81326P62646
4344E1484270J06690P67751J458782L46150K187835K269944K166511K989030K813430
4335F6590393L710933K154432n63919o57997k865503l446421l610187k711472
$$ plain form
4392 349636914 402274563 456559446 489249939 481606819 457117828 405797491 339004456
4385 339004456 280676030 237381438 208121970 185912836 169401499 154902937 143940049
4378 143940049 134963679 127526130 121370624 116653984 111835065 106583274 100796341 96425504
4370 96425504 92218111 89068850 85437137 83649512 81293199 78622002 77006535 74894079
4362 74894079 73661383 73028369 72490049 71538798 70378975 68398646 65495936 62008917 59206865
4353 59206865 56911754 54968645 53957897 53610417 53001286 51326012 50240298 50721624 51484270
4344 51484270 51590960 52358711 53817493 54163643 56351478 58621422 60787933 63776963 66590393
4335 66590393 70301326 72455758 71891839 71233842 68368339 64921918 61311731 58600259
4327E8600259r89805l18042k16076R19877Q98485J602989J607930L324241J681378
4318F7111236J530964J391094l0204r10932k908662k621795l780562k866817m694541
4309E2219781m888983k627777j819044j736760j444661j792014j039833l63802
4301C6506907o05963j89067J213529Q78153R34833m32977o88312k614517l199646
4292C1802940k299403j315611j701268j576898n75786m82824J98824q53684n96746
4283B2599544K86092q95094J61462k41963q76432n46831j75417N74322j39584
4274B0746099o8536P7749k97125P47157j87831n0931Q75601l71719Q45822L98979
4264B2715265j42330P67911N6797N93287P16831P75398J090991J684417J335268
$$ plain form
4327 58600259 57610454 57292412 57076336 57996213 58894698 60497687 62105617 65429858 67111236
4318 67111236 68642200 70033294 70003090 69092158 66183496 63561701 59781139 56914322 52219781
4309 52219781 47330798 44703021 42883977 41147217 39702556 37910542 36870709 36506907
4301 36506907 35900944 35711877 36925406 37803559 38738392 38305415 37617103 35002586 31802940
4292 31802940 29503537 28187926 26486658 24909760 24333974 23851150 24049974 23196290 22599544
4283 22599544 22885636 21990542 22152004 21910041 21033609 20486778 20311361 20885683 20746099
4274 20746099 20677563 20755312 20458187 21205344 21017513 20966582 21842183 21470464 22316286 22715265
4264 22715265 22572935 23340846 23397643 23990930 24707761 25483159 26574150 28258567 29593835
4255B9593835K206827J359776J334205K460905J249368p1341l34569r13948k019582
4246C4865476j748748p62041q84255q02844q75867j331610p7273K90787L85575
4237B9059200q00946K18128O67200M0201M00363R03399J270234J737416J371579
4228C4866774K237506K581764K920755J863564K331378J986367K534202R5585
4220E1417895j275654j246511j213540j057761k199491k879196j731994j845712
4212C7968036j763965j758477k72082K89513P1841R7559J22864R61635J795321
4203C7512245J230297J202143J720663R04371J702848l2348j98343r27521j258032
4194D1856323j367788j450403k086840j808039l20264J81112J3888M4056J139734
$$ plain form
4255 29593835 31800662 33160438 34494643 36955548 38204916 38133575 37799006 36885058 34865476
4246 34865476 33116728 32354687 31470432 30667588 29791721 28460111 28382838 28673625 29059200
4237 29059200 28258254 28476382 29143582 29183783 29584146 30487545 31757779 33495195 34866774
4228 34866774 37104280 39686044 42606799 44470363 46801741 48788108 51322310 51417895
4220 51417895 50142241 48895730 47682190 46624429 44424938 41545742 39813748 37968036
4212 37968036 36204071 34445594 34173512 34463025 34534866 34632425 34755289 35716924 37512245
4203 37512245 38742542 39944685 41665348 42569719 44272567 44240219 44041876 43114355 41856323
4194 41856323 40488535 39038132 36951292 35143253 34822989 35004101 35017989 35062045 36201779
4185C6201779K043865J528221J581204J776812J321422o11142l95234p31230M15187
4176D3130884J614276J430945K365178K437986K637916J680835k41893k155046
4168E2901081l498584k852866l277673p48888j152910r39215M28280l23951k112153
4159C8423121k363380j688810j711377J65511n12843M78621O6890J810302J747180
4150C6415215M33135m40516k27928j719296k128869j537255k876913k059074j471405
4141B4387094j793739j281646p05981j017851j62181j132368n80244k5925o31381
4132A7055778k56979j079874m22318j84071q34478L81463l54276k07503o29019
4123A3468723o64879L55947n26477k14278k96888n91511j84644L51260n5699q98233
$$ plain form
4185 36201779 38245644 39773865 41355069 43131881 44453303 43842161 43446927 42715697 43130884
4176 43130884 44745160 46176105 48541283 50979269 53617185 55298020 55056127 52901081
4168 52901081 49402497 46549631 43271958 42523070 41370160 40430945 40859225 40535274 38423121
4159 38423121 36059741 34370931 32659554 32825065 32312222 32790843 32857733 34668035 36415215
4150 36415215 36848350 36407834 36179906 34460610 32331741 30794486 27917573 25858499 24387094
4141 24387094 22593355 21311709 20605728 19587877 19425696 18293328 17713084 17687159 17055778
4132 17055778 16798799 15718925 15296607 15112536 14278058 14659521 14305245 14097742 13468723
4123 13468723 12803844 13159791 12633314 12419036 12122148 11530637 11345993 11697253 11641554 10743321
4113A0743321K11012J049770L48933o36019K68421K13490j34588L54384N16613
4104A2935337k69813M7487N28050r8314r29978J9072n90209p77730J05156o26493
4094A0342565K38796K41800O73680o02162k49550L54804l46987o61553o34830
4085I356563j90754p1757j51386m5943N4851j21352m47240k15536O87292M48498
4075I303236m21451n08181P25785m99432l2019L60745m29467L49986l81204q15002
4065G652996M49887k60312k4525k13974r61834Q86012K72353N16317p6532p54389
4055G485999N64764L94773J60092L10049j306807L82005q3175n0584l54598l90377
4045G112141P73859j46235K10775J93435j74022m92086l18542J61642m25171n16920
$$ plain form
4113 10743321 10954333 12004103 12353036 11717017 11985438 12198928 12064340 12418724 12935337
4104 12935337 12665524 12713011 13241061 13142747 12212769 12231841 11641632 10863902 10969058 10342565
4094 10342565 10581361 10823161 11496841 10894679 10645129 10999933 10652946 9991393 9356563
4085 9356563 9165809 9094052 8942666 8896723 8951574 8830222 8382982 8167446 8854738 9303236
4075 9303236 8881785 8373604 9099389 8599957 8567938 8928683 8499216 8849202 8467998 7652996
4065 7652996 8102883 7842571 7818046 7604072 6642238 7528250 7800603 8316920 8240388 7485999
4055 7485999 8050763 8445536 8605628 8915677 7608870 7990875 7907700 7857116 7502518 7112141
4045 7112141 7886000 7739765 7950540 8143975 7969953 7477867 7159325 7320967 6895796 6378876
4035F378876L14257O5409j11024l2229Q77566J39186l00123j28098J64651M68306
4025G836777k20267k19357j69695N67604q3046j76800O03877q41315j87565N72277
4015G682490M25589L59672J61316J95344l617M44164j79823r17804M62681M11401
4005I041413N23054K48807L78771p4373O14966M91268l80923J62561K94719J041263
3995A2341526J129723j55509N31986J003710J565721K001766J589353J657842
3987B1666118K071745K064246J689695Q10341j248398k246550k771307k619786
3979A9416104k225329j168942o69421k23824k18159q05778J11057o20860l45391
3970A3249457Q10700n95481l68702k5848O54038o53080j97310n53784L96356L15722
$$ plain form
4035 6378876 6693133 6758542 6647518 6615289 7492855 7632041 7331918 7203820 7368471 7836777
4025 7836777 7616510 7397153 7227458 7795062 7712016 7535216 8139093 7297778 7110213 7682490
4015 7682490 8108079 8467751 8629067 8824411 8820794 9264958 9085135 8167331 8630012 9041413
4005 9041413 9564467 9813274 10192045 10117672 10732638 11223906 10842983 11005544 11300263 12341526
3995 12341526 13471249 13315740 13847726 14851436 16417157 18418923 20008276 21666118
3987 21666118 23737863 25802109 27491804 28302145 27053747 24807197 22035890 19416104
3979 19416104 17190775 16021833 15352412 15128588 14910429 14104651 14215708 13594848 13249457
3970 13249457 14060157 13464676 13095974 13070126 13724164 13071084 12873774 12319990 12716346 13032068
3960A3032068J39328K1893O49751M63837m75175O08686L65407M54653j3284j42904
3950A5104260p3366L83795k08925M42950J26055K03748r8587Q05974N83416j062067
3940A6207253L96686L37368M50147R75722J06174L64374J16965L34140K75683
3931A9564512J27899O378J126111R90986O65077R82153P27423R67130J206817
3922B6364486J045247Q97210L35260R93540K129819J056294J040326J525941J468961
3913C6857084K819154K559233K083740L068985L542343L602683M449816N054013
3905F4037051M549011N994260P216203Q912618J1413973J3290805J4852524J8157650
3897A48424095K2240661K7648398K8917839K7483185J9037971j780028k2808615
$$ plain form
3960 13032068 13171396 13193289 13843040 14306877 13831702 14440388 14805795 15260448 15247164 15104260
3950 15104260 15030894 15414689 15205764 15648714 15774769 15978517 15879930 16685904 17269320 16207253
3940 16207253 16603939 16941307 17391454 18367176 18473350 18837724 18954689 19288829 19564512
3931 19564512 19692411 19698789 20824900 21815886 22480963 23463116 24190539 25157669 26364486
3922 26364486 27409733 28306943 28642203 29635743 31765562 32821856 33862182 35388123 36857084
3913 36857084 39676238 42235471 44319211 47388196 50930539 54533222 58983038 64037051
3905 64037051 68586062 74580322 81796525 90709143 102123116 115413921 130266445 148424095
3897 148424095 170664756 198313154 227230993 254714178 273752149 271972121 249163506
3890B49163506l6271673l5843343k9038985k1737160j6553055j3268897j0284295
3883H6166098p923227o890290o096719m273893l754124m286189k841659l583540
3875D6516457k776694k243496l253068j593623j436266j826238l08840j152180
3867C1926052j641003o27377n01199l34277j406496L8120J50877J81039j93420
3858B7592316k36092o95040q83468n13817l16788k42307l46991j221545l02892
3849B2833376K83501l42717K69049k71234m29788k51794n5214K87726k05040J282909
3839B3400774j5176J11996M23125M58959m96964Q9249l78801q3012o37957l91331
3829B2480862O42850l58381m69241p66169K72624J038459k34031M97294P65853
$$ plain form
3890 249163506 212891833 177048490 148009505 126272345 109719290 96450393 86166098
3883 86166098 78242871 71352581 65255862 60981969 57227845 52941656 50099997 46516457
3875 46516457 43739763 41496267 38243199 36649576 35213310 33387072 33078232 31926052
3867 31926052 30285049 29657672 29156473 28822196 27415700 27453820 27604697 27785736 27592316
3858 27592316 27356224 26661184 25777716 25263899 24947111 24704804 24357813 23136268 22833376
3849 22833376 23116877 22774160 23043209 22771975 22342187 22090393 22035179 22322905 22117865 23400774
3839 23400774 23385598 23497594 23920719 24379678 23882714 23971963 23593162 23510150 22872193 22480862
3829 22480862 23123712 22765331 22296090 21529921 21802545 22841004 22606973 23104267 23870120
3820B3870120M13260j01428l04070R91645L19874M37758j65201M3766K78419j17683
3810B5666460N13850L38656R2121J049347j68931R66731J38849P35306N84903
3801B9917292M01050K93082M67080P08714Q49939J056033M22451J927799J329898
3792C7373338J429086J887911J820948K463464L015538K848264L765621L690905
3784E8295075K546381L019704L79380k05002L20795P90543l45164j697463j391523
3775F1712726j124362p58756k92781O86978J519236M26912J059816J378265K182238
3766F6790272K066286K298882K978452L160798L299637L772065L028194K791667
3758I0186253M850812M769244L634291L633589K840398K216333K656965L075616
$$ plain form
3820 23870120 24283380 24181952 23877882 24869527 25189401 25627159 25461958 25505724 25784143 25666460
3810 25666460 26180310 26518966 26611087 27660434 27491503 28458234 28597083 29332389 29917292
3801 29917292 30318342 30611424 31078504 31787218 32637157 33693190 34115641 36043440 37373338
3792 37373338 38802424 40690335 42511283 44974747 47990285 50838549 54604170 58295075
3784 58295075 60841456 63861160 64240540 64035538 64356333 65146876 64801712 63104249 61712726
3775 61712726 60588364 59829608 59536827 60223805 61743041 62169953 63229769 64608034 66790272
3766 66790272 68856558 71155440 74133892 77294690 80594327 84366392 87394586 90186253
3758 90186253 95037065 99806309 103440600 107074189 109914587 112130920 114787885 117863501
3750A17863501L835840M756668L928288M048882M100576M394334M064919M371855
3742A51364863L932056M450174M992193L913758L500482L911389M327125M721828
3734A85113868L413885M074145M148904K253143K870206J708371K385560J056442
3726B07024524R89357Q58909R06845n42268q92019k31899q48350j169010k007972
3717B04088117k007805l208234l419297k947280l976789m155222m648142m201785
3709A75523563l928995l902586m317216m522096m866393l956374n536636n017065
3701A39476202m446795m244060m728293n303238n033447k922329m565053m415592
3693A03817395l052191l271149l757375m007877l973643l993166l000822k809981
$$ plain form
3750 117863501 121699341 126456009 130384297 134433179 138533755 142928089 146993008 151364863
3742 151364863 155296919 159747093 164739286 168653044 172153526 176064915 180392040 185113868
3734 185113868 188527753 192601898 196750802 199003945 201874151 203582522 205968082 207024524
3726 207024524 208013881 208872790 209779635 209237367 208345348 208113449 207265099 206096089 204088117
3717 204088117 202080312 198872078 195452781 192505501 188528712 184373490 179725348 175523563
3709 175523563 171594568 167691982 163374766 158852670 153986277 150029903 144493267 139476202
3701 139476202 135029407 130785347 126057054 120753816 115720369 112798040 108232987 103817395
3693 103817395 100765204 97494055 93736680 89728803 85755160 81761994 78761172 75951191
3685G5951191k972297k861445k466523k883420j912060k030150l077749j553393
3677E6194154k121464j994826r64022k747060j692460j114976k011709j899178
3669D1648459o03167k008774j118310j048543j071446n16920k48920j594172r84828
3660C2453379N42803k91736n79185j164740K52666n46188m56244k52958n5454
3651B9902343o92155j042295m28081N3666j100722j684357k97836q11762q86102
3642B3012699q96280l85532j082525j92850K9410k51438P83223l56510n84j19815
3632B0539798O58725r5275j038916l05497q09084p8937J60085o80874o33531K44727
3622A7961221j34310k97272J6901p7114l24625J14200L79812q4354n78436l09933
$$ plain form
3685 75951191 72978894 70117449 67650926 64767506 62855446 60825296 57747547 56194154
3677 56194154 54072690 52077864 51113842 48366782 46674322 45559346 43547637 41648459
3669 41648459 41045292 39036518 37918208 36869665 35798219 35281299 35032379 33438207 32453379
3660 32453379 32996182 32704446 32125261 30960521 31213187 30666999 30210755 29957797 29902343
3651 29902343 29210188 28167893 27739812 27793478 26692756 25008399 24710563 23898801 23012699
3642 23012699 22116419 21730887 20648362 20455512 20484922 20233484 21016707 20660197 20659613 20539798
3632 20539798 21198523 21103248 20064332 19758835 18949751 18870814 19030899 18350025 17716494 17961221
3622 17961221 17826911 17529639 17546540 17469426 17144801 17259001 17638813 17554459 16976023 16666090
3612A6666090n3484j19567l98865M49329L31983K43334n90262M19598k18006K20013
3602A6950163n86658l92382m52207Q92114j04854K11885k06715J61065N08169
3593A6980580m90846k62070L21k98183q18678k81537k80526Q969j123642m29770
3583A3004618m99172J80263M28078l15968l23936m47360L10142K00234m86034
3574A2050865K6418P7668k63928q69204j01958L997J74597q56567J27212K73691
3564A0642791j3420l56057j56917M0966K94994o6140q01069o98215P31378J26378
3554I744689n52513L7806Q4852L1973K50623m481L48517O40167n9893P47818o87575
3543A0581983l0293k49771k16514j52951r8477J75985n9304N34583N57546p9160
$$ plain form
3612 16666090 16612606 16493039 16094174 16543503 16875486 17118820 16528558 16948156 16730150 16950163
3602 16950163 16363505 15971123 15518916 16411030 16306176 16518061 16311346 16472411 16980580
3593 16980580 16489734 16227664 16227985 15929802 15111124 14829587 14549061 14558030 13434388 13004618
3583 13004618 12505446 12685709 13113787 12797819 12473883 12026523 12336665 12536899 12050865
3574 12050865 12077283 12154951 11891023 11021819 10919861 10923858 11098455 10241888 10369100 10642791
3564 10642791 10629371 10273314 10116397 10157363 10452357 10386217 9585148 8886933 9618311 9744689
3554 9744689 9192176 9229982 9314834 9346807 9597430 9592949 9941466 10581633 10521740 11269558 10581983
3543 10581983 10551690 10301919 10085405 9932454 9833977 10009962 9950658 10485241 11042787 10963627
3533A0963627k43108M38581k92518L44411l71039j30060L82207q7016K32423N91439
3523A1828947o61875P37030k11232j73554M23857o0421N81199M27244M01028L67985
3513A3660208l18286M98147O10098P6934m40956l1238O26926N63325J06891m81917
3503A4870132P93820k20982k04085r0345M22366J076573j96100M396J215024j29422
3493A7541377L6407J311524O19360N40145J16837L09269L40911k26104J328767
3484B1918493J035520K90643J090271O92661P40035J072572J161252P11716J767065
3475C0480228K229892J814949J810284K360354J872726J309007J799853L14125
3467D3991418k38207L63997l70511p78235j39614o0531Q91412J308240J601222
$$ plain form
3533 10963627 10720519 11159100 10866582 11210993 10839954 10709894 11092101 11005085 11237508 11828947
3523 11828947 11167072 11904102 11692870 11519316 11943173 11882752 12463951 12891195 13292223 13660208
3513 13660208 13341922 13840069 14450167 14527101 14086145 14054907 14681833 15245158 15352049 14870132
3503 14870132 15663952 15442970 15238885 15148540 15570906 16647479 16451379 16455775 17670799 17541377
3493 17541377 17577784 18889308 19508668 20048813 20165650 20474919 20815830 20589726 21918493
3484 21918493 22954013 23244656 24334927 25027588 25767623 26840195 28001447 28713163 30480228
3475 30480228 32710120 34525069 36335353 38695707 40568433 41877440 43677293 43991418
3467 43991418 43753211 44117208 43746697 42968462 42828848 42768317 43659729 44967969 46569191
3458D6569191P9280M32948J681923J975847K381024J066596K259250K793969K201709
3449F1441737K524933L208777K892160K570274K709529K796956L807439L023687
3441H4975492L283987K890498K771204K610324J933618J614155J396250K825108
3433A04300636K633601K247482L361280L072808K859363K345274K642040K691836
3425A26154320K821228K171920L680511K081368K168955K719758K285352K468102
3417A46551514J574252K289228K283481K409950J835389K066364L155365K815570
3409A64981113M194073L227958K459718M119586L394324L860484M560913N086680
3401A95884849M555442N852325N406155N506648N815839O591068P303976Q018522
$$ plain form
3458 46569191 46648471 47081419 48763342 50739189 53120213 54186809 56446059 59240028 61441737
3449 61441737 63966670 67175447 70067607 72637881 75347410 78144366 81951805 84975492
3441 84975492 88259479 91149977 93921181 96531505 98465123 100079278 101475528 104300636
3433 104300636 106934237 109181719 112542999 115615807 118475170 120820444 123462484 126154320
3425 126154320 128975548 131147468 134827979 136909347 139078302 141798060 144083412 146551514
3417 146551514 148125766 150414994 152698475 155108425 156943814 159010178 162165543 164981113
3409 164981113 169175186 172403144 174862862 178982448 182376772 186237256 190798169 195884849
3401 195884849 200440291 206292616 211698771 217205419 223021258 229612326 236916302 244934824
3393B44934824P216701Q731123Q791649Q347027Q557202Q200780Q570938Q398142
3385C11748386R085991Q380567Q973439Q987575R368474R485762J0231230J0839536
3377C87100960J0681322J1194871J1484714J0856025J1569567J1084128J0590715
3370D64562302R012141O403604N070580K949670P59462L27923j930517j399583
3362D85755582o21591p31090j264586j436739k244041k366172l003234n733589
3354D68354540q371074j0105098r755863r574931r766400q566799o552797o204005
3346C99457573n395738l635716k685166j643062J021905Q19541K250842L117642
3338C93307821L620534M811782N696672N670255O946424O498781M985775L045870
$$ plain form
3393 244934824 252151525 260882648 269674297 278021324 286578526 294779306 303350244 311748386
3385 311748386 320834377 329214944 338188383 347175958 356544432 366030194 376261424 387100960
3377 387100960 397782282 408977153 420461867 431317892 442887459 453971587 464562302
3370 464562302 473574443 479978047 485048627 487998297 488757759 489085682 487155165 485755582
3362 485755582 485133991 484402901 483138315 481701576 479457535 477091363 474088129 468354540
3354 468354540 459983466 449878368 440122505 430547574 420781174 412214375 405661578 399457573
3346 399457573 394061835 390426119 387740953 386097891 387119796 387939337 390190179 393307821
3338 393307821 396928355 401740137 407436809 413107064 420053488 426552269 431538044 434583914
3330D34583914L561720J474720L61691r93217l254797k368247m310237o407519
3322D22648028n551771n929552o454640p622406r451840j1055965j1513163j2311562
3314C52757129j3504030j4424214j4702784j3806468j3533376j3415851j2382483
3307B56987923j1912467j0410408q522873r137383p530299o954263p054724n730687
3299A89734819n705606m539584l872581m189757l436723l118971k387141k368012
3291A60116444j581118j084056l21881j331238j815237j816345k172808j842776
3283A48150985k398152l146787l264306l173985l792839k380239k590182k801567
3275A24602928k497281k553425l553515l853468m706083m473447l682223m504882
$$ plain form
3330 434583914 438145634 439620354 439982045 438988828 435734031 433365784 429055547 422648028
3322 422648028 417096257 411166705 404712065 397089659 387637819 376581854 365068691 352757129
3314 352757129 339253099 324828885 310126101 296319633 282786257 269370406 256987923
3307 256987923 245075456 234665048 226142175 217004792 209474493 202520230 195465506 189734819
3299 189734819 184029213 179489629 175617048 171427291 167990568 164871597 162484456 160116444
3291 160116444 158535326 157451270 157129389 155798151 153982914 152166569 149993761 148150985
3283 148150985 145752833 142606046 139341740 136167755 132374916 129994677 127404495 124602928
3275 124602928 122105647 119552222 115998707 112145239 107439156 102965709 99283486 94778604
3267I4778604m734812m222399l394688l767282k717383l397407k732868k518598
3259F7293167k176049j983781k117761k536992j718314j827615j838061r86906
3251E2107688j994356j407154o08061j509709p96233k40010j932310j208097n46102
3242D1865656j633928j60737r99524r17194L85278j151362j171093j028491j412118
3233C3776487o44433j400458L97419o66037m77186l39544m72712m22204o53511
3224B9097821j17654j207918J12820L17939p35241r00057j57700j14845r80278
3215B5314887L84528M67844N35562l24634n90088l47756P09504R90672q19605
3206B6320914L90514m70971o68285p03670o03043J95500l83015j32651r19786
$$ plain form
3267 94778604 90043792 85821393 82426705 78659423 75942040 72544633 69811765 67293167
3259 67293167 65117118 63133337 61015576 58478584 56760270 54932655 53094594 52107688
3251 52107688 50113332 48706178 48098117 46588408 45792175 45552165 43619855 42411758 41865656
3242 41865656 40231728 40070991 39071467 38154273 38539551 37388189 36217096 35188605 33776487
3233 33776487 33132054 31731596 32129015 31462978 30985792 30646248 30173536 29751332 29097821
3224 29097821 28980167 27772249 27885069 28203008 27467767 26567710 26410010 26295165 25314887
3215 25314887 25699415 26167259 26702821 26378187 25788099 25440343 26149847 27140519 26320914
3206 26320914 26711428 26240457 25572172 24868502 24265459 24460959 24077944 23945293 23025507
3197B3025507K85857M70101N8804O7847n59588k72114q46525j231881m55626L46835
3187B0889217j235404j430236k09783M66801o66058n47792j004502J45673L73910
3178A6781826m04005k08245k76431j03379k08582p76255j043485k38515J18566
3169A3641495k7917k72303l00642O57368m63210j46251l74617J08577n78281M5293
3159A2289512P77598m19217m18762O68922j969k43314j193441l24814M48852M13471
3149A1996838M32823Q6767K67752p89201j6153o43738l25975m35930k1797R98835
3139A1550221q39595K96450r3044m36920J341607K01739k85099l53416k15368
3130A1166575O97496j24233p42814j8359J83706m3960K07395l72659o99559Q17547
$$ plain form
3197 23025507 23311364 23781465 23840269 23908116 23348528 23076414 22229889 20998008 20542382 20889217
3187 20889217 19653813 18223577 18013794 18480595 17814537 17266745 16262243 16407916 16781826
3178 16781826 16377821 16169576 15893145 15789766 15581184 14804929 13761444 13522929 13641495
3169 13641495 13613578 13341275 13040633 13698001 13234791 13088540 12713923 12822500 12244219 12289512
3159 12289512 13067110 12647893 12229131 12898053 12896084 12652770 11459329 11134515 11583367 11996838
3149 11996838 12429661 12516428 12784180 11994979 11978826 11335088 11009113 10573183 10551386 11550221
3139 11550221 10710626 11007076 10914032 10477112 11818719 12020458 11735359 11381943 11166575
3130 11166575 11864071 11739838 10997024 10978665 11162371 11118411 11325806 10953147 10253588 11071135
3120A1071135J01690p01247K91889m39435m71960Q85580N02596K53037L59670
3111A1852955m18099j06256O17728n03202p5484M44673n39536j28224k19211l20976
3101A0604368K16846J33154K92264o64509p18107P26438J87160K94119L24788
3092A1396521k78453M15319J53862j52883P0139o59989K25452J007785q52061
3083A1325692m74081P21704r6395N51916N45182P0219N67588N29516M70319o61294
3073A3550366P78707J61559N45776M94188R3279R1472p16715J55347j10838p48189
3063A4294952k65355m70760l82266j062373o873J95490p01790j74565j29627j84297
3053A1112536l65018n14090r82707J2216P56665n98956m63961l99776q21483L68087
$$ plain form
3120 11071135 11172825 10471578 10763467 10324032 9852072 10737652 11240248 11493285 11852955
3111 11852955 11434856 11328600 11946328 11443126 11367642 11812315 11272779 11144555 10925344 10604368
3101 10604368 10821214 10954368 11246632 10582123 9864016 10590454 10777614 11071733 11396521
3092 11396521 11118068 11533387 11687249 11534366 11604505 10944516 11169968 12177753 11325692
3083 11325692 10851611 11573315 11476920 12028836 12574018 12644237 13211825 13741341 14211660 13550366
3073 13550366 14329073 14490632 15036408 15530596 15623875 15715347 14998632 15153979 15043141 14294952
3063 14294952 14029597 13558837 13176571 12114198 12107325 12302815 11601025 11426460 11296833 11112536
3053 11112536 10747518 10233428 9250721 9262937 10019602 9420646 8956685 8556909 7735426 8103513
3043H103513J13697m50940p8416q16423j71365m73404L81233K58250j91227m0064
3033F634854M72015m08884j91906L80845K86566M93529n82522m15344L04836m63615
3023F510374p6180k50944Q3614N85360J36054o37685r43718L984J61023O11518
3013F183400p95311m90584P1662Q07904N1534l60120M59681o3058J60696q00923
3003E224881k01916J24683K16352O42044m46155n81191K60068n03227L40473J70645
2993E246657l17655L62422R5114N2690l47983P0467j161022l19702l5972O7526
2983C712542K12750q5336p67218J078880K37912m6802M9019k15451N54887q03820
2973C927363l2299l07406L49693Q66436o535m72407l80433l9970m51973P6534
$$ plain form
3043 8103513 8217210 7766270 7687854 6871431 6700066 6226662 6607895 6866145 6674918 6634854
3033 6634854 7106869 6697985 6506079 6886924 7173490 7667019 7084497 6669153 6973989 6510374
3023 6510374 6434194 6183250 6266864 6852224 6988278 6350593 5406875 5410859 5571882 6183400
3013 6183400 5388089 4897505 4969167 5777071 5828605 5468485 5928166 5865108 6025804 5224881
3003 5224881 5022965 5147648 5364000 6006044 5559889 4978698 5238766 4735539 5076012 5246657
2993 5246657 4929002 5291424 5386538 5439228 5091245 5161712 4000690 3680988 3645016 3712542
2983 3712542 3925292 3839956 3072738 4151618 4389530 4342728 4391747 4176296 4731183 3927363
2973 3927363 3895064 3587658 3937351 4803787 4797252 4324845 3944412 3904442 3452469 3529003
2963C529003n53116O9156N11168L53581p75096R98842j98798m81261m31133n4063
2953B968283R22871j61515J43866m01966o2341L53593J97837m25784J66320N44632
2943D245796m39639O03353j32044Q9446k28142o44269o39205j95007R07537M55894
2933D023720o71495L81846K62155o90212O81501p30505q339Q44562j05218K46836
2923D234851n95676j1166l17770J03451L46977m78862m5336N11700K5508M51577
2913D225254R5968K02851P9703r55147k30679K83614N73016n63385o01046O82726
2903C792875O10971m99749j90974j49134j54719o51107L43039j69715J83458N901
2893C120846K02317o9002J81453l11641J54582J9292M87453j92572l1291N51363
$$ plain form
2963 3529003 2975887 3045043 3556211 3909792 3134696 4133538 3934740 3453479 3022346 2968283
2953 2968283 3891154 3729639 3873505 3471539 3409198 3762791 3960628 3534844 3701164 4245796
2943 4245796 3806157 4409510 4277466 4366912 4138770 3494501 2855296 2660289 3567826 4023720
2933 4023720 3352225 3734071 3996226 3306014 3987515 3257010 3248671 4093233 3988015 4234851
2923 4234851 3639175 3628009 3310239 3413690 3760667 3281805 3236469 3748169 3773677 4225254
2913 4225254 4321222 4524073 4603776 3648629 3417950 3701564 4274580 3711195 3110149 3792875
2903 3792875 4403846 3904097 3713123 3563989 3409270 2758163 3101202 2931487 3114945 3120846
2893 3120846 3323163 3254161 3435614 3123973 3278555 3297847 3785300 3592728 3561437 4112800
2883D112800o56684N4326l59183J52726J138137m90386o61974M16403K39109M48249
2873D393523O19303J17131m19415n0580l38968p29498M73590n85147P38715K07537
2863D426191O50325M4773p28713P9989m8057J122672J94527m75667l50877L28143
2853E243306P95938l88523j46312m36852P3051K23495N88512p09947o01058N78726
2843E220336o50362P33027J19181m60589n02491o31858J213728L95404N538n93225
2833D848689K67856L67051m17427N80608L12560M25895k40545j71710N48542R61521
2823G483040m51093L06521P2252j22345K45148j28063q1567j61755K52061k66739
2813G147460m49360J94162J906j06878k06398l0327l24589K74503r50838n13665
$$ plain form
2883 4112800 3456116 3510442 3151259 3303985 4442122 3951736 3289762 3706165 3945274 4393523
2873 4393523 5012826 5129957 4710542 4659962 4320994 3591496 4065086 3479939 4218654 4426191
2863 4426191 5076516 5121289 4392576 4472565 4424508 5547180 5741707 5266040 4915163 5243306
2853 5243306 6039244 5650721 5504409 5067557 5140608 5364103 5952615 5242668 4641610 5220336
2843 5220336 4569974 5303001 5422182 4961593 4459102 3827244 5040972 5436376 5441914 4848689
2833 4848689 5116545 5483596 5066169 5646777 5959337 6385232 6144687 5972977 6521519 7483040
2823 7483040 7031947 7338468 7410720 7288375 7533523 7405460 7323893 7162138 7414199 7147460
2813 7147460 6698100 6892262 6894168 6787290 6580892 6550565 6225976 6500479 5549641 5035976
2803E035976K33113J78207m7763J55029n29315k72040J268941K56612q29461k6121
2793E423178j28069N96615K61309l4017K65284m65881o0511J62576j53721j7186
2783E849577k08234M84686k36659Q4473J27783o99274k86324o7076M06715l05151
2773E150516k04013o4764n44768P04578n41671j42991m3246K22699l33221J0627
2763D213746j24197o33211M60476l75917K4011J00409M25888L2347j13432M90019
2753D500139m95751k48107O75433l33333J03351r5176j55602J76237k03520m17793
2743C505878R75336n96993j23792N68572k63013o42857J58216J48668l04721N26134
2733C951428O8955m52662J08232l17585J4464J92849l86636J31779j22640P26358
$$ plain form
2803 5035976 5269089 5447296 5399533 5554562 5025247 4753207 6022148 6278760 5449299 5423178
2793 5423178 5295109 5891724 6153033 6119016 6384300 5918419 5857908 6020484 5866763 5849577
2783 5849577 5641343 6126029 5889370 5973843 6101626 5402352 5116028 5048952 5455667 5150516
2773 5150516 4946503 4881739 4336971 5041549 4499878 4356887 4313641 4536340 4203119 4213746
2763 4213746 4089549 3456338 3916814 3540897 3564908 3665317 4091205 4123552 4010120 4500139
2753 4500139 4004388 3756281 4431714 4098381 4201732 4106556 3950954 4127191 3923671 3505878
2743 3505878 4481214 3884221 3760429 4329001 4065988 3423131 3581347 3730015 3425294 3951428
2733 3951428 4020383 3567721 3675953 3358368 3372832 3565681 3179045 3310824 3188184 3914542
2723C914542m94653j83015J45332O3554j61202n20770P0161K42108K3503K69044
2713C368604k95105l75585K72671L37236l21112M48718O43904j108568J32564
2704C103327O01692J4571k41738J00237m77307P0243O87740q91475n60585Q80677
2694C287382p55376M59296J38333q57949K14599L04145j7848l5664M73966J57780
2684C368664p69722l99023N16411Q0752l98455k52345n50699L86890L67416j63631
2674B186258J72960j76943K31122O78863q26047J4450L61497l64950L6421N22854
2664B836485j06022k90226J15121l02989O7244l02778l44597l6172J57441p81446
2654A012061M44204n4579q8700O43368k11301K2921Q8335k27672p99065k97246
$$ plain form
2723 3914542 3419889 3236874 3382206 3445760 3284558 2763788 2833949 3076057 3099560 3368604
2713 3368604 3073499 2697914 2970585 3307821 2986709 3435427 4079331 2970763 3103327
2704 3103327 3705019 3719590 3477852 3578089 3100782 3171025 3858765 2967290 2406705 3287382
2694 3287382 2532006 2991302 3129635 2271686 2486285 2790430 2772582 2736918 3210884 3368664
2684 3368664 2598942 2199919 2716330 2797082 2398627 2146282 1595583 1982473 2349889 2186258
2674 2186258 2359218 2182275 2413397 3092260 2266213 2280663 2642160 2277210 2313631 2836485
2664 2836485 2730463 2440237 2555358 2252369 2319613 2016835 1672238 1636066 1793507 1012061
2654 1012061 1456265 1401686 1312986 1956354 1745053 1767974 1856309 1628637 829572 532326
2644E32326j74591J206976P71231k53511p7209k00012L05227k02708l05535Q73723
2634B475917k73749J52348O82316o21467m7776O28796j53570k03745N00749o38325
2624B501494p31396J57168k86815n60814L97782O05422K58759l25244o65424j7661
2614A333271J051725O42589l45552o19508j8609K3376M9730J93079k30544j48670
2604A930887Q52430l72274p03143J09377J25720n86874m13597J166056J47273
2595B255855o34384j23555J03459M62924j99603j3223l3937L50534J26090m73689
2585A820471k88480J236316m23098q43025M20322n68177L73824O78208o79485
2576A726876k35700M35069J20590P01077p73746p22336N94871J70718M05236Q2061
$$ plain form
2644 532326 357735 1564711 2335942 2082431 2005222 1805210 2110437 1907729 1602194 2475917
2634 2475917 2202168 2354516 3036832 2415365 2367589 2996385 2842815 2639070 3139819 2501494
2624 2501494 1770098 1927266 1640451 1079637 1477419 2082841 2341600 2016356 1350932 1333271
2614 1333271 2384996 3027585 2682033 2062525 2043916 2067292 2117022 2310101 2079557 1930887
2604 1930887 2783317 2411043 1707900 1817277 1942997 1356123 942526 2108582 2255855
2595 2255855 1621471 1497916 1601375 2064299 1864696 1851473 1817536 2168070 2294160 1820471
2585 1820471 1531991 2768307 2345209 1502184 1922506 1354329 1728153 2406361 1726876
2576 1726876 1491176 1926245 2046835 2747912 1974166 1251830 1846701 2017419 2422655 2504716
2566B504716r6116r17880m2329J0806J22923M95523m8908K36276l37598M71291
2556B398704j93181n80379Q4725L82758m36591m18390j6994j36189P67019J24622
2546A976104J74150M04059R4371L47609q91734j44642O41202k4267K08104m68644
2536B316312k14015L80585n39511J36994q0548L43015Q28492n82189R50459o0377
2526C479217m05013p995k36493O4883K66967K10402k82975k79075l06143K77959
2516B781734K62194q82007j04045L61119j72193L20881p93508M73946P52751J15592
2506C116464K55076k37352p55837R41427k79434M11735N05901q63666l992k72822
2496B817500j82909m88608N03302P85704M6992L35723o85433k93212R6578M26139
$$ plain form
2566 2504716 2408600 1490720 1448391 1459197 1582120 2077643 2028735 2265011 1927413 2398704
2556 2398704 2205523 1625144 1709869 2092627 1656036 1237646 1220652 1084463 1851482 1976104
2546 1976104 2150254 2554313 2648684 2996293 2104559 1959917 2601119 2576852 2784956 2316312
2536 2316312 2102297 2482882 1943371 2080365 1999817 2342832 3171324 2589135 3539594 3479217
2526 3479217 3074204 3066209 2829716 2894599 3161566 3371968 3088993 2809918 2503775 2781734
2516 2781734 3043928 2161921 2057876 2418995 2246802 2567683 1774175 2248121 3000872 3116464
2506 3116464 3371540 3134188 2378351 3319778 3040344 3452079 3957980 3094314 3090322 2817500
2496 2817500 2634591 2145983 2649285 3434989 3481981 3817704 3132271 2839059 2935637 3361776
2486C361776K35863n66074m11703R27542N3857l67897N16064N57630o35434N84827
2476D256451m02788l07906M43981l45557l32525m45274K17184K88390n26943l22306
2466B522707M68890l04801M39948n19830L15375o35055p0542J53774m01751j41402
2456A827313Q95407O72636J84934P964k60012n40490k98785J242417m8309m84394
2446C198681J86347j53134L65335o4948p8636k24757k95749K04575j097555r4692
2436A945467j5877p38770K51873M62593R41732m08835m22545M9591L00997m9194
2426B317032m61081Q0280l0017J51162K39543n89656R851M75757K17604n20994
2416A889481k33766L77704O30701l6601j068558j31041K08989K22657L18149k4390
$$ plain form
2486 3361776 3597639 3031565 2619862 3547404 3601261 3233364 3749428 4307058 3671624 4256451
2476 4256451 3853663 3545757 3989738 3644181 3311656 2866382 3083566 3371956 2845013 2522707
2466 2522707 2991597 2686796 3126744 2606914 2922289 2287234 2216692 2370466 1968715 1827313
2456 1827313 2722720 3395356 3580290 3588254 3328242 2787752 2488967 3731384 3683075 3198681
2446 3198681 3385028 3231894 3597229 3532281 3453645 3228888 2933139 3137714 2040159 1945467
2436 1945467 1929590 1190820 1442693 1905286 2847018 2438183 2015638 2065229 2366226 2317032
2426 2317032 1855951 1936231 1906214 2057376 2296919 1707263 1717114 2192871 2410475 1889481
2416 1889481 1655715 2033419 2664120 2627519 1558961 1427920 1636909 1859566 2177715 2153325
2406B153325o23374J33582k17716l24887J11835Q12884L51679o84386l60478K94117
2396A646581q72171m32125k31239K74779N88016k14773M78167L4062K02403L63803
2386A837503L51532L85651l72194m40971Q7780m28602J31972J20549M20147p12982
2376A380385j25992O01852q9380M8904K80185n44092p07983N16262O84184m51540
2366A592785Q3835q49546K89507N07423n53677J07361N96688L21472J85584m23393
2356A858039M60370k12958o32319R56680L0844m55497j06944p904n56117m68083
2346H66111K36845m7358M76599k41014k40224L57622o48410P08985Q4783P752
2336A561691k15611Q0901Q3267k03265k22002K12538K5348K16253q10629O60258
$$ plain form
2406 2153325 1529951 1663533 1445817 1120930 1232765 2045649 2397328 1712942 1352464 1646581
2396 1646581 774410 342285 111046 385825 973841 759068 1237235 1271297 1473700 1837503
2386 1837503 2189035 2574686 2202492 1761521 1849301 1420699 1552671 1673220 2093367 1380385
2376 1380385 1254393 1856245 1766865 1815769 2095954 1551862 843879 1360141 2044325 1592785
2366 1592785 1676620 827074 1116581 1624004 1070327 1177688 1774376 2095848 2281432 1858039
2356 1858039 2318409 2105451 1473132 2429812 2460656 2005159 1898215 1890311 1334194 866111
2346 866111 1102956 1055598 1532197 1291183 1050959 1408581 760171 1469156 1553939 1561691
2336 1561691 1346080 1426981 1510248 1306983 1084981 1297519 1322867 1539120 728491 1388749
2326A388749J28637M2953K31324j13686n52721L43911k24531N40012p53707P27968
2316A758909r1826P4359N27932K40068k26146j16925K15197q0495L9127k96708
2306B043492L46999j94545P6768r36914O95798l51761q99186R29888j4835J07923
2296A803627O6929M7843M23484k08418J83420l98309M15504L91312J37411n74108
2286B288695j64454l43576M5684L48201L88847n36509p55769K38523j00604M07666
2276A816704N06989l28717k57888j35694J08340j50622m54052j79317N25137O46396
2266B097276p5959l66913k97411n0349J330838J84254m98314m38757m17102L70294
2256A837857n8098q91089j44647O92080R9606p61737P86169O33725m90088j48173
$$ plain form
2326 1388749 1517386 1560339 1791663 1677977 1125256 1469167 1244636 1784648 1030941 1758909
2316 1758909 1667083 1741442 2269374 2509442 2283296 2166371 2381568 2301073 2340200 2043492
2306 2043492 2390491 2195946 2272714 1335800 2031598 1679837 780651 1710539 1695704 1803627
2296 1803627 1870556 1918399 2341883 2133465 2316885 1918576 2334080 2725392 2862803 2288695
2286 2288695 2124241 1780665 1826349 2174550 2563397 2026888 1271119 1509642 1409038 1816704
2276 1816704 2323693 1994976 1737088 1601394 1709734 1559112 1105060 925743 1450880 2097276
2266 2097276 2021317 1654404 1356993 1306644 2637482 2821736 2323422 1884665 1467563 1837857
2256 1837857 1779759 888670 744023 1436103 1535709 773972 1560141 2193866 1703778 1555605
2246A555605M00402K2502n4121p88162p21329l34614P72411R0762r9438o68686
2236A75332J279013K49445m84025L77804m7165n3972K20612j17445j08881L04562
2226A795280P9679J18556p51673r0972L15573K09183q71995J52244O97699L42813
2216A996387o8413k51002l02435n7898J22558p51154K89246m17444l65153P93617
2206I88309K19897k77568J65679O28588r0991k87596l6902K0340p8977k67737
2196I83042l87594M36190J83540L75001O38287r70295p30733Q67743K80215m33345
2186A242051J3999K27025r2846k7467N1790L78619l32075J95871L37626n94855
2176A399738l62633l97894p3177O49349K87917J00802r9306J40217j32912j30977
$$ plain form
2246 1555605 1956007 1978509 1924388 1136226 414897 80283 852694 943456 844018 175332
2236 175332 1454345 1703790 1219765 1597569 1550404 1496432 1717044 1599599 1490718 1795280
2226 1795280 1874959 1993515 1241842 1150870 1466443 1675626 803631 955875 1653574 1996387
2216 1996387 1927974 1676972 1374537 1316639 1439197 688043 977289 559845 194692 988309
2206 988309 1208206 930638 1096317 1724905 1633914 1346318 1309416 1329756 1250779 983042
2196 983042 595448 1031638 1215178 1590179 2228466 1258171 527438 1395181 1675396 1242051
2186 1242051 1256050 1483075 1390229 1362762 1414552 1793171 1461096 1656967 1994593 1399738
2176 1399738 1037105 639211 566034 1215383 1503300 1604102 1504796 1645013 1512101 1381124
2166A381124l56725M63633p1895o01405Q98599K44266n16569J133002p65699m7457
2156A760874n2324K64662N58807k91467q85284M39489j28189J62325m64629r9289
2146A264975J02162P21360m2876q6111L3375r82039Q11272L09180j19878k54323
2136A757097m41479P22669m46207J28708L74537k69846K14519j12921j40018l16649
2126A470410P46518l04025o60641M77721K76422j97543j71950k51087K6748m10300
2116A002273p5283M22018M61872l48557Q17872p8668l67054N28454M12387j27256
2106B648058L48334p93887J25997K52712m97016O82332l1147j28139l66212m36554
2096A804478P80784l22209J82532M96086L28021m3869j007975J218774Q23421
$$ plain form
2166 1381124 1024399 1488032 1416137 814732 1713331 1957597 1441028 2574030 1808331 1760874
2156 1760874 1708550 1973212 2532019 2240552 1355268 1794757 1666568 1828893 1364264 1264975
2146 1264975 1367137 2088497 2045621 1959510 1992885 1010846 1822118 2131298 2011420 1757097
2136 1757097 1315618 2038287 1592080 1720788 2095325 1825479 2039998 1927077 1787059 1470410
2126 1470410 2216928 1912903 1252262 1729983 2006405 1808862 1636912 1385825 1412573 1002273
2116 1002273 926990 1349008 1810880 1462323 2280195 2201527 1834473 2362927 2775314 2648058
2106 2648058 2996392 2202505 2328502 2581214 2084198 2766530 2735383 2607244 2241032 1804478
2096 1804478 2585262 2263053 2445585 2941671 3269692 3225823 2217848 3436622 4260043
2087D260043n03831J67576j183902K87069L46101J68669o8033j23731n43252J103030
2077C909739M82909p36950p2568J53175O91258n5097p0086O39671l31560P89306
2067E399797J27491M24656K07199L08754l29655K33345k24692m45314J532314
2058G233895J055155J037617l0804P91630P82780J277026P13959M19960J003800
2049A4285018J602708K682289K282846L037368L997900O526543O813810Q062749
2041D9291231P486221P250024k319372j1862032j0156233q685213m733472m159482
2033B2111672k344365k585390o96264p72498q26096k024207o97768q37481m44970
2024A0882633j260718q37905n29840m93936k45442n76978l07236P395q53637L76235
$$ plain form
2087 4260043 3756212 3923788 2739886 3026955 3373056 3541725 3473692 3349961 2806709 3909739
2077 3909739 4392648 3655698 3583130 3736305 4427563 4372466 4302380 4942051 4610491 5399797
2067 5399797 5527288 5951944 6159143 6467897 6138242 6371587 6146895 5701581 7233895
2058 7233895 8289050 9326667 9295863 10087493 10870273 12147299 12861258 13281218 14285018
2049 14285018 15887726 18570015 20852861 23890229 27888129 34414672 41228482 49291231
2041 49291231 56777452 64027476 61708104 49846072 39689839 31004626 26271154 22111672
2033 22111672 19767307 17181917 16485653 15713155 14887059 12862852 12165084 11327603 10882633
2024 10882633 9621915 8784010 8254170 7760234 7514792 6937814 6630578 6637973 5784336 6160571
2014F160571J40675k35773j63685j26532m05610k36689O95158J1102j22314q76524
2004D840379l56292p57640K36860l13843J08475M44617n23837k55787R29793n88965
1994C763760j94461l2277k16064L85303j82895n34167M38133M95961m33049K90272
1984C780516o83887M48889m23417o67086Q6230l63729L83348J1512j132153N32468
1974A972691R41318l77338K87592l72989J56929j18184m05200k91425M06751L32565
1964B532710m42031N770L12244q611n8311n23474N10253p1380M21015l41347o93738
1953A643100O3658L24031n66214L38354l40010M70777J25594j52732N96208j54456
1943B348310j9739n20918k40607L1010J06413l4100K15233j19524j141110m81770
$$ plain form
2014 6160571 6301246 6065473 5901788 5775256 5369646 5132957 5828115 5839217 5716903 4840379
2004 4840379 4484087 3726447 3963307 3649464 3757939 4202556 3678719 3422932 4352725 3763760
1994 3763760 3569299 3537022 3320958 3706261 3523366 2989199 3427332 3923293 3490244 3780516
1984 3780516 3096629 3545518 3122101 2455015 2541245 2177516 2560864 2572376 1440223 1972691
1974 1972691 2914009 2536671 2824263 2451274 2608203 2490019 2084819 1793394 2200145 2532710
1964 2532710 2090679 2096449 2408693 2400082 2341771 1818297 2328550 2257170 2678185 2336838 1643100
1953 1643100 1706758 2030789 1464575 1802929 1462919 1933696 2059290 1906558 2502766 2348310
1943 2348310 2328571 1807653 1567046 1598056 1704469 1670369 1885602 1766078 624968 143198
1933A43198N84843N58311K36989K23304l07836J00143K07722N54633q07678r5494
1923A398135P63985m96209L24461j20453j81701P2142j78177l59778J81688J613
1913A405706K55923k28408L53600k06046l5135l82803j15224k82496P06588L37528
1903A809233j00020r9183R9663k74451m23899j36120M36203M59636K77665N53959
1893B602686k79488n97417l07298N4682K58351l218q5606K80926m32370k51056
1883A240192J32371K04717J04146m19339M58753l80001j04951k60364j36213M35134
1873A274445L26939M90753o82211l82586n2299p4915P96984q52882o1499L80943
1863A163672q75162P32735K71644n68324n96018M99791L99650r26035j65902P06167
$$ plain form
1933 143198 728041 1286352 1523341 1746645 1438809 1538952 1746674 2301307 1493629 1398135
1923 1398135 2162120 1665911 1990372 1869919 1688218 1760360 1582183 1222405 1404093 1405706
1913 1405706 1661629 1433221 1786821 1580775 1545640 1162837 1047613 765117 1471705 1809233
1903 1809233 1709213 1610030 1709693 1435242 1011343 875223 1311426 1771062 2048727 2602686
1893 2602686 2323198 1725781 1418483 1473165 1731516 1728298 1642692 1923618 1491248 1240192
1883 1240192 1372563 1577280 1681426 1262087 1720840 1340839 1235888 975524 839311 1274445
1873 1274445 1601384 2092137 1409926 1027340 975041 900126 1697110 844228 782729 1163672
1863 1163672 288510 1021245 1292889 724565 128547 628338 1027988 101953 -63949 642218
1853F42218m6846l75193P0778k13375N98406Q1150o49917j79876R59844R07385
1843A794574p41164Q6357k01023l24280k22037L04853j65294j76574L40443L15646
1833A011501Q3641l72742O44944P7080J53397O34862o89964J60235K17241o47759
1823A272436l48376N34498L60474k95740M61973J32239r72852l65551n29675J83275
1813D32701J320205n77612K78570K12590k4402M7071j92108m86311p58009O64248
1803I16943k0730O60090l87314n81138Q7453L64289O86898O5877l79647J77443
1793A590164p88858M73722N79210p78178l46755m32535L60916j91180J49574M98318
1783A114398l37930Q12621L70189M91601j020581N11299j75349r37631M67088
$$ plain form
1853 642218 595372 220179 290957 77582 675988 757138 107221 -72655 887189 1794574
1843 1794574 1053410 1139767 938744 614464 392427 697280 531986 355412 695855 1011501
1833 1011501 1095142 722400 1367344 1444424 1597821 2232683 1542719 1702954 1920195 1272436
1823 1272436 924060 1458558 1819032 1523292 1985265 2117504 1144652 779101 249426 432701
1813 432701 1752906 1175294 1453864 1666454 1642052 1689123 1497015 1010704 252695 916943
1803 916943 896213 1556303 1168989 587851 675304 1039593 1726491 1792368 1412721 1590164
1793 1590164 801306 1275028 1854238 1076060 729305 296770 657686 466506 616080 1114398
1783 1114398 776468 1589089 1959278 2450879 1430298 1941597 1766248 828617 1295705
1774A295705p7985K70885o93381O65194p4567k74194k47183k07008J028729n75061
1764A111134N35926L23081j14745l01843m51934J53739m49231M21529M47095o41913
1754A032838O9804n01650m49596N64037n05776k86406M59933M50679J47049L55435
1744A336347l50994J55062K42266j39962J87165j42869J64105M42183l09599l34916
$$ plain form
1774 1295705 1217720 1488605 795224 1460418 1385851 1111657 864474 657466 1686195 1111134
1764 1111134 1647060 1970141 1855396 1553553 1101619 1255358 806127 1227656 1674751 1032838
1754 1032838 1102642 600992 151396 715433 209657 -76749 383184 833863 980912 1336347
1744 1336347 985353 1140415 1382681 1242719 1429884 1287015 1451120 1893303 1583704 1248788
$$ [...]
##END NTUPLES=NMR SPECTRUM
##END=
