##TITLE=1H_CA-8872-1
 CDCl3, 8 sc, 
 7.06.2021
##JCAMPDX= 6.0         $$ Bruker NMR JCAMP-DX V2.0
##DATA TYPE= NMR SPECTRUM
##DATA CLASS= NTUPLES
##ORIGIN= UXNMR, Bruker Analytische Messtechnik GmbH
##OWNER= root
$$ XWIN-NMR		Version 3.5
$$ Mon Jun  7 11:20:15 2021 Russian Standard Time (UT+4h)  she@DPX200
##.OBSERVE FREQUENCY= 200.131506
##.OBSERVE NUCLEUS= ^1H
##.ACQUISITION MODE= SIMULTANEOUS
##.ACQUISITION SCHEME= undefined
##.AVERAGES= 8
##.DIGITISER RES= 18
##SPECTROMETER/DATA SYSTEM= spect
##.PULSE SEQUENCE= zg30
##.SOLVENT NAME= DMSO
##.SHIFT REFERENCE= (INTERNAL, DMSO, 0, 17.4995)
##AUDIT TRAIL= $$ (NUMBER, WHEN, WHO, WHERE, WHAT)
$$ ##TITLE= Audit trail, XWIN-NMR		Version 3.5
$$ ##JCAMPDX= 5.01
$$ ##ORIGIN= Bruker BioSpin GmbH
$$ ##OWNER= she
$$ F:/spectra/data/she/nmr/H-F/1/pdata/1/auditp.txt
$$ ##AUDIT TRAIL=  $$ (NUMBER, WHEN, WHO, WHERE, WHAT)
(   1,<2021-06-07 11:18:57.25 +0400>,<she>,<DPX200>,
      <created by zg, POWCHK disabled, PULCHK disabled
       configuration hash MD5:
       00 E9 B6 7A A2 85 ED C7 34 08 36 98 17 FE 4E 26
       data hash MD5: 16K
       B8 DE 99 83 07 78 C3 0D 38 B8 F4 9A 16 D4 15 33>)
(   2,<2021-06-07 11:19:00.01 +0400>,<she>,<DPX200>,
      <Start of raw data processing
       efp BC_mod = 2 LB = 0.24 FT_mod = 6 PKNL = 1 PHC0 = -11484.89 PHC1 = 13.20101 SI = 16K 
       data hash MD5: 16K
       D4 47 B3 B1 4C 65 C4 6B CF 03 79 4A F2 45 8E 4B>)
(   3,<2021-06-07 11:19:22.73 +0400>,<she>,<DPX200>,
      <pk PHC0 = -2.21532 PHC1 = 4.2 
       data hash MD5: 16K
       D3 53 56 63 E0 27 A5 E7 FA 43 E4 BB 15 74 8C 1A>)
(   4,<2021-06-07 11:19:26.32 +0400>,<she>,<DPX200>,
      <abs ABSG = 5 
       data hash MD5: 16K
       8C 68 EF B2 30 30 28 FA EA B5 DB 80 22 B8 26 C0>)
$$ ##END=
$$ 
$$ hash MD5
$$ 9F AB 1D E0 11 09 07 AD DB C1 5B AA CC F9 06 C7
##$RELAX= 
##$RELAX= 
##$RELAX= 
##$RELAX= 
##$RELAX= 
##$RELAX= 
$$ Bruker specific parameters
$$ --------------------------
##$DU= <F:/spectra>
##$EXPNO= 1
##$NAME= <H-F>
##$PROCNO= 1
##$TYPE= <nmr>
##$USER= <she>
##$AMP= (0..31)
100 100 100 100 100 100 100 100 100 100 100 100 100 100 100 100 100 100 
100 100 100 100 100 100 100 100 100 100 100 100 100 100 
##$AQSEQ= 0
##$AQ_mod= 1
##$AUNM= <au_zg>
##$AUTOPOS= <>
##$BF1= 200.13
##$BF2= 200.13
##$BF3= 200.13
##$BF4= 200.13
##$BF5= 200.13
##$BF6= 200.13
##$BF7= 200.13
##$BF8= 200.13
##$BYTORDA= 1
##$CFDGTYP= 0
##$CFRGTYP= 5
##$CHEMSTR= <none>
##$CNST= (0..31)
1 1 145 1 1 1 1 1 1 1 1 1 1 1 1 1 1 1 1 1 1 1 1 1 1 1 1 1 1 1 1 1 
##$CPDPRG= <>
##$CPDPRG1= <>
##$CPDPRG2= <>
##$CPDPRG3= <>
##$CPDPRG4= <mlev>
##$CPDPRG5= <mlev>
##$CPDPRG6= <mlev>
##$CPDPRG7= <mlev>
##$CPDPRG8= <mlev>
##$CPDPRGB= <>
##$CPDPRGT= <>
##$D= (0..31)
0 1.2 0 0 0 0 0 0 0 0.06 0 0.03 0 0 0 0 0.0002 0 0 0 0 0 0 0 0 0 0 0 0 
0 0 0 
##$DATE= 1623050336
##$DBL= (0..7)
120 120 120 120 120 120 120 120 
##$DBP= (0..7)
150 150 150 150 150 150 150 150 
##$DBP07= 0
##$DBPNAM0= <>
##$DBPNAM1= <>
##$DBPNAM2= <>
##$DBPNAM3= <>
##$DBPNAM4= <>
$$ [...]
##$SUBNAM3= <"">
##$SUBNAM4= <"">
##$SUBNAM5= <"">
##$SUBNAM6= <"">
##$SUBNAM7= <"">
##$SUBNAM8= <"">
##$SUBNAM9= <"">
##$SW= 20.0188882624521
##$SWIBOX= (0..15)
0 0 2 0 0 0 0 0 0 0 0 0 0 0 0 0 
##$SW_h= 4006.41025641026
##$TD= 16384
##$TD0= 1
##$TE= 0
##$TE2= 300
##$TE3= 300
##$TEG= 300
##$TL= (0..7)
0 120 120 120 120 120 120 120 
##$TP= (0..7)
150 150 150 150 150 150 150 150 
##$TP07= 0
##$TPNAME0= <>
##$TPNAME1= <>
##$TPNAME2= <>
##$TPNAME3= <>
##$TPNAME4= <>
##$TPNAME5= <>
##$TPNAME6= <>
##$TPNAME7= <>
##$TPOAL= (0..7)
0.5 0.5 0.5 0.5 0.5 0.5 0.5 0.5 
##$TPOFFS= (0..7)
0 0 0 0 0 0 0 0 
##$TUNHIN= 0
##$TUNHOUT= 0
##$TUNXOUT= 0
##$USERA1= <user>
##$USERA2= <user>
##$USERA3= <user>
##$USERA4= <user>
##$USERA5= <user>
##$V9= 5
##$VALIST= <valist>
##$VCLIST= <CCCCCCCCCCCCCCC>
##$VD= 0
##$VDLIST= <DDDDDDDDDDDDDDD>
##$VPLIST= <PPPPPPPPPPPPPPP>
##$VTLIST= <TTTTTTTTTTTTTTT>
##$WBST= 1024
##$WBSW= 4
##$XGAIN= (0..3)
0 0 0 0 
##$XL= 0
##$YL= 0
##$YMAX_a= 234113
##$YMIN_a= -110984
##$ZGOPTNS= <>
##$ZL1= 120
##$ZL2= 120
##$ZL3= 120
##$ZL4= 120
##$ABSF1= 17.48367
##$ABSF2= -2.535368
##$ABSG= 5
##$ABSL= 3
##$ALPHA= 0
##$AQORDER= 0
##$ASSFAC= 0
##$ASSFACI= 0
##$ASSFACX= 0
##$ASSWID= 0
##$AUNMP= <proc_1d>
##$AZFE= 0.1
##$AZFW= 0.1
##$BCFW= 0
##$BC_mod= 2
##$BYTORDP= 0
##$COROFFS= 0
##$CY= -3
##$DATMOD= 1
##$DC= 0
##$DFILT= <>
##$DTYPP= 0
##$F1P= 0
##$F2P= 0
##$FCOR= 1
##$FTSIZE= 16384
##$FT_mod= 6
##$GAMMA= 0
##$GB= 0
##$INTBC= 1
##$INTSCL= 1.334414e-10
##$ISEN= 128
##$LB= 0.24
##$LEV0= 0
##$LPBIN= 0
##$MAXI= 10000
##$MC2= 0
##$MEAN= 0
##$ME_mod= 0
##$MI= 1.114404
##$NCOEF= 0
##$NC_proc= -8
##$NLEV= 6
##$NOISF1= 3.799351
##$NOISF2= 2.8
##$NSP= 0
##$NTH_PI= 0
##$NZP= 0
##$OFFSET= 17.49955
##$PC= 1
##$PHC0= -11487.1
##$PHC1= 17.40101
##$PH_mod= 1
##$PKNL= yes
##$PPARMOD= 0
##$PSCAL= 0
##$PSIGN= 0
##$REVERSE= no
##$SF= 200.130007020393
##$SI= 16384
##$SIGF1= 3
##$SIGF2= 2
##$SINO= 5.538805
##$SIOLD= 16384
##$SREGLST= <1H.CDCl3>
##$SSB= 0
##$STSI= 16384
##$STSR= 0
##$SW_p= 4006.41025641026
##$SYMM= 0
##$S_DEV= 0
##$TDeff= 16384
##$TDoff= 0
##$TI= <>
##$TILT= no
##$TM1= 0
##$TM2= 0
##$TOPLEV= 0
##$USERP1= <user>
##$USERP2= <user>
##$USERP3= <user>
##$USERP4= <user>
##$USERP5= <user>
##$WDW= 1
##$XDIM= 16384
##$YMAX_p= 461992429
##$YMIN_p= -1202345
$$ End of Bruker specific parameters
$$ ---------------------------------
##NTUPLES= NMR SPECTRUM
##VAR_NAME=  FREQUENCY,     SPECTRUM/REAL,   SPECTRUM/IMAG
##SYMBOL=    X,             R,               I
##VAR_TYPE=  INDEPENDENT,   DEPENDENT,       DEPENDENT
##VAR_FORM=  AFFN,          ASDF,            ASDF
##VAR_DIM=   16384,         16384,           16384
##UNITS=     HZ,            ARBITRARY UNITS, ARBITRARY UNITS
##FACTOR=    0.24454680195387, 1,            1
##FIRST=     3502.18503748079, 0,            0
##LAST=      -504.225218929467, 0,           0
##MIN=       -504.225218929467, -1202345,    0
##MAX=       3502.18503748079, 461992429,    0
$$ Real data points
##PAGE= N=1
##DATA TABLE= (X++(R..R)), XYDATA
$$ [...]
6048C021071m65740P7614L38135J35500j51735j13089q1296J34337j83961j9578
6038B691258L35810l8303J78191k30755K03418m65099M56635k48625K18549j68473
6028B932606J50318O4922O9174K3009k8119l12775J77363l4704j57633Q1461J77924
6017C143546j25345o4462K67194L27599r8118J59544n11769l16357l2085L40452
6007C090199K09531m58793M39844k8970J84190m68907J28708Q9653K91930L23062
5997C800447K59896m06823o4868l52667l14616L58004K04561Q8484j77042l85583
5987C009793N47020k4983m9423J59125j30948J43879l54078j48222M9949j83633
5977C018479L36242j16188M60601J63498m1655k63477l01367K79850P8172J01461
$$ y = [3021071, 2555331, 2632945, 2971080, 3106580, 2954845, 2841756, 2760460, 2894797, 2710836, 2691258, 3027068, 2988765, 3166956, 2936201, 3139619, 2674520, 3131155, 2882530, 3101079, 2932606, 3082924, 3147846, 3217020, 3240029, 3211910, 2899135, 3076498, 3041794, 2884161, 2965622, 3143546, 3018201, 2953739, 3220933, 3548532, 3450414, 3609958, 3098189, 2781832, 2749747, 3090199, 3299730, 2840937, 3280781, 3251811, 3436001, 2967094, 3095802, 3185455, 3477385, 3800447, 4060343, 3653520, 3588652, 3235985, 2921369, 3279373, 3483934, 3572418, 3395376, 3009793, 3556813, 3531830, 3482407, 3641532, 3510584, 3654463, 3300385, 3152163, 3202112, 3018479, 3354721, 3238533, 3699134, 3862632, 3820977, 3557500, 3256133, 3535983, 3614155, 3715616]
5967C715616l2930l27059l81971K45319k69497J72961L57423k42374O11993K96110
5957D145591K05687m94011j41581j59178J31326P1396j73733j22246M40823j81235
5947C722839m03531q8012N79218j51286n5416M07957k98969Q4572J72557j80254
5937C789675j79427M92566L14517K61768l5708o47265M51466n30036l13192N5892
5927C660256L09357K21837l20124O68680j13288l79410j49334l1052J43358N1375
5917D061655o4322J95337l4378m39563N9462L74337L36044q8433l18436P2683
5907D154386L51220R9537n54488k27665j5576M36546m10038k2236r6798J81710
5897C896598K45681J0371M32441k14823m60714M04583K66984k7779j91105p1973
$$ y = [3715616, 3682686, 3355627, 2973656, 3218975, 2949478, 3122439, 3479862, 3237488, 3849481, 4145591, 4351278, 3857267, 3715686, 3556508, 3687834, 3759230, 3585497, 3463251, 3904074, 3722839, 3319308, 3231296, 3810514, 3659228, 3603812, 4011769, 3712800, 3797372, 3969929, 3789675, 3610248, 4102814, 4417331, 4679099, 4643391, 3996126, 4447592, 3917556, 3604364, 3660256, 3969613, 4191450, 3871326, 4540006, 4426718, 4047308, 3897974, 3866922, 4010280, 4061655, 3997333, 4192670, 4158292, 3718729, 3778191, 4152528, 4488572, 4400139, 4081703, 4154386, 4505606, 4605143, 4050655, 3822990, 3807414, 4243960, 3833922, 3811686, 3714888, 3896598, 4142279, 4152650, 4585091, 4370268, 3909554, 4314137, 4581121, 4553342, 4362237, 4290264]
5887D290264J3101L87479j02923j76105J26796m29137n1491k39818R601P70402
5877D598169l39090L13429j0796m1609M2486L04756k7344R0409N72112o70797
5867D831725O6711K90030Q3662k23275k10410O9637J33826k31715o0085N20828
5857E270934j40921L81662n84443o2686N41038j36956m187K90635j30993l8785
5847E385298j33664l68439L33815j60174j32054K83358K90794j07971m33039r567
5837D948357j15422J47779R5437K15218j51802K5153L25351l26205R5635O56832
5827E916333k29296r4350l26516k29515L90875k1024J6074L6997L50769J04900
5817E915247m13504J6487J33730j02575J01119K43002l7599L41610k3010l64934
$$ y = [4290264, 4303365, 4690844, 4587921, 4411816, 4538612, 4109475, 4057984, 3818166, 3827767, 4598169, 4259079, 4572508, 4561712, 4520103, 4562589, 4867345, 4840001, 4930410, 5502522, 4831725, 4898436, 5188466, 5272128, 5048853, 4838443, 4908080, 5041906, 4810191, 4750106, 5270934, 5130013, 5511675, 4927232, 4864546, 5405584, 5268628, 5264441, 5555076, 5424083, 5385298, 5251634, 4883195, 5217010, 5056836, 4924782, 5208140, 5498934, 5390963, 4957924, 4948357, 4832935, 4980714, 5076151, 5291369, 5139567, 5164720, 5490071, 5163866, 5259501, 5916333, 5687037, 5592687, 5266171, 5036656, 5427531, 5406507, 5422581, 5459578, 5810347, 5915247, 5501743, 5518230, 5651960, 5549385, 5650504, 5893506, 5855907, 6197517, 6174507, 5809573]
5807E809573K1960J33892K00178k86226K12474L7458K36902R0948k53046k19548
5797E984565k82488J63755M78841m93218J39498J46419L35590j6148l21758k21275
5787E913781M64795N06197J66956k65008J30109J50269j45671j9677P4027r9118
5777F876660J02396k37927L70003J77982k10641M80793K44273L2644J14836J58548
5767H109567n9940Q916J42246l05252p1512j11367M0076j80p6918k73468O7265
5756G469433K84604k32239m7772J68758o1291l28283J21954L24676N8417k44741
5746G513516M77357r9123n94003K74938J24283l18246K57139M75468L13884O2769
5736H487982J60790n08642l12039K1034R7704l1310r4333L9715M3468K25036l65931
$$ y = [5809573, 5831533, 5965425, 6165603, 5879377, 6091851, 6129309, 6366211, 6457159, 6204113, 5984565, 5702077, 5865832, 6344673, 5851455, 5990953, 6137372, 6472962, 6456814, 6135056, 5913781, 6378576, 6884773, 7051729, 6786721, 6916830, 7067099, 6921428, 6901751, 6975778, 6876660, 6979056, 6741129, 7111132, 7289114, 7078473, 7559266, 7803539, 7836183, 7951019, 8109567, 8049627, 8058543, 8200789, 7895537, 7824025, 7712658, 7752734, 7752554, 7675636, 7402168, 7469433, 7754037, 7521798, 7474026, 7642784, 7581493, 7253210, 7375164, 7699840, 7758257, 7513516, 7990873, 7891750, 7297747, 7572685, 7696968, 7378722, 7635861, 8111329, 8425213, 8487982, 8648772, 8140130, 7828091, 7849125, 7946829, 7915519, 7821186, 7860901, 7904369, 8129405, 7763474]
5725G763474k63299O81739J93812j40462R3703r2879r6286M62622o49842K57992
5715H210574N09067l61629N4536m27556K4239J73991r7970M29734n0673j01078
5705H363235j60705k29529L92007R0723M39873q4572J60587j52642j53557M9632
5695H715052k36359K69926o123J38741p6139J68123l04134k99656N09136K71166
5685I149733L4437m933l04520L54933r3658m9575K98040n4394o1076m10522J49359
5674I007824K10926L51654M05098L61069Q0782k03279j06240q9501J48712N60679
5664A0727724m457l06269l53246M3838O4943k72950L07730N13047J52839P2194
5654A0945393j30942o4341K13510Q1079k48414M57285q8777n28046l93701L31473
$$ y = [7763474, 7500175, 8181914, 8375726, 8235264, 8328967, 8236088, 8139802, 8602424, 7952582, 8210574, 8719641, 8358012, 8412548, 7984992, 8009231, 8183222, 8085252, 8514986, 8464313, 8363235, 8202530, 7973001, 8365008, 8455731, 8895604, 8811032, 8971619, 8818977, 8665420, 8715052, 8478693, 8748619, 8742496, 8881237, 8805098, 8973221, 8669087, 8369431, 8878567, 9149733, 9184170, 9179237, 8874717, 9229650, 9135992, 9086417, 9384457, 9330063, 9268987, 8858465, 9007824, 9218750, 9570404, 9975502, 10336571, 10417353, 10214074, 10107834, 10018333, 10167045, 10727724, 10723267, 10416998, 10063752, 10107590, 10172533, 9899583, 10207313, 10720360, 10873199, 10945393, 10814451, 10750110, 10963620, 11044699, 10796285, 11253570, 11164793, 10636747, 10243046, 10574519]
5644A0574519N6010K49265K20546j82130K17063r3148O7380L03933N77474o2219
5634A1928693k72454j22167J53163j06143K40012j0904j58917J29726K26202M16044
5624A2423255M01191n90106j36956j07545m5166l7180r0552N48568k3274m08634
5614A1933601m2604J59746M76307J64499K21136j54715M24018k42222k47818l56163
5604A2335785L4090O09802J24073j80935n48104L05833k31115o7989q7362J52637
5594A2446715J83518k36818L58748N16202l15781n17042M03639K83723m1094K41778
5584A3323588k8002j71008j42563J28695M83584j34131R3548j5182n63346l09383
5574A2665800j67058O58440J18229l9962N2050r0875j8111k4891L063M59528P1790
$$ y = [10574519, 10630529, 10879794, 11100340, 10918210, 11135273, 11042125, 11109505, 11413438, 11990912, 11928693, 11656239, 11534072, 11687235, 11581092, 11821104, 11810200, 11651283, 11781009, 12007211, 12423255, 12824446, 12234340, 12097384, 11989839, 11944673, 11907493, 11816941, 12365509, 12342235, 11933601, 11890997, 12050743, 12527050, 12691549, 12912685, 12757970, 13181988, 12939766, 12691948, 12335785, 12369875, 12979677, 13103750, 12922815, 12374711, 12680544, 12449429, 12381440, 12294078, 12446715, 12630233, 12393415, 12752163, 13268365, 12952584, 12435542, 12839181, 13122904, 13081810, 13323588, 13295586, 13124578, 12982015, 13110710, 13594294, 13460163, 13553711, 13538529, 12975183, 12665800, 12498742, 13157182, 13275411, 13235449, 13287499, 13196624, 13178513, 13153622, 13156685, 13616213, 13688003]
5563A3688003J0700K6591M6397J92780j79979N09838l84952J36369J82742j4694
5553A4213795n61656p5194M49577k95924l28826p4647M42395K10815K10627l28973
5543A3861989N12139J5710J22257K36720J39958l37066J9783k38984j71985J48095
5533A4308616M01835J91519l8350k14488J47544J89345L36479o6146J23919k01801
5523A5178472N6562R3673M46419q4677M118J26766r8468k3573m41937J26229j18369
5512A5265215K07803P2462j09772R3611K34706l93840L13795K16349J04225K77181
5502A6281735k902j69833j77230K0792K65182l1264j31929k6952K85230q1361
5492A6231468J22569P7394l52481K12384R0459J41712O0613K32672M74963o47124
$$ y = [13688003, 13698703, 13725294, 13771691, 13964471, 13784492, 14294330, 13909378, 14045747, 14228489, 14213795, 13652139, 13576945, 14026522, 13730598, 13401772, 13327125, 13769520, 13980335, 14190962, 13861989, 14374128, 14389838, 14512095, 14748815, 14888773, 14551707, 14571490, 14332506, 14160521, 14308616, 14710451, 14901970, 14863620, 14649132, 14796676, 14986021, 15322500, 15256354, 15380273, 15178472, 15235034, 15328707, 15775126, 15690449, 15694567, 15821333, 15722865, 15699292, 15257355, 15383584, 15265215, 15473018, 15545480, 15435708, 15529319, 15764025, 15370185, 15683980, 15900329, 16004554, 16281735, 16278833, 16109000, 15931770, 15952562, 16217744, 16186480, 16054551, 16027599, 16312829, 16231468, 16354037, 16431431, 16078950, 16291334, 16381793, 16523505, 16584118, 16816790, 17291753, 16644629]
5482A6644629J41577K75421j77646m51245O47979J1327m0016l2939M2442n3807
5472A7007722j99238O78003L78508l68008j01635J27982j43798M8813j33143K8652
5462A7323858k82989L6962J56040O7670N62850n67566p2813J86121L02445M62717
5452A8175295l0086O2866o55637P24373M56741m58036O23869m39393l72498J32256
5442A8219750m68433L80320j17141L2544J63796l2013K48267Q8438j36282l46892
5432A8032354L21873j36892L06403K48543J3210L62552J28873k02323o079P4575
5422A9143089Q3825K30487Q519M07342K0498R4568M61987K7669M20930L76785
5412B1275699j11036J70855K84387k33772m9897L40964N27214j49649Q7919O44168
$$ y = [16644629, 16786206, 17061627, 16883981, 16432736, 17080715, 17092042, 17052026, 17019087, 17061529, 17007722, 16808484, 17486487, 17864995, 17496987, 17395352, 17523334, 17379536, 17428349, 17295206, 17323858, 17040869, 17077831, 17233871, 17301541, 17864391, 17296825, 17224012, 17410133, 17712578, 18175295, 18145209, 18208075, 17552438, 18276811, 18733552, 18275516, 18899385, 18459992, 18087494, 18219750, 17751317, 18131637, 18014496, 18047040, 18210836, 18178823, 18427090, 18515528, 18379246, 18032354, 18354227, 18217335, 18523738, 18772281, 18785491, 19148043, 19276916, 19074593, 19068514, 19143089, 19226914, 19457401, 19465920, 19873262, 19893760, 19988328, 20450315, 20477984, 20898914, 21275699, 21164663, 21335518, 21619905, 21386133, 21336236, 21677200, 22204414, 22054765, 22142684, 22786852]
5402B2786852M47423K35852l6981O86303K66418O91113M88771J67936M67264N33822
5392B6734773j76425J82255o36016K77792Q67920M6395O93145M99792O28303L9129
5382B9157063l1514N81524K99082P91719P32812J121560Q65219Q70786J092734
5373C5480985R22776L50449P36949R18132K71836Q88264J409877J102680J442807
5364D3524755J334298K179224K340474K947907K518058L159900L854957L326883
5356F5186456M447239M191795L478289K850105J992196J327577J194744N58624
5348H5227025J306580Q88429J542800J391565M06175k27315k65696m3573J8714
5339I0244704N2673J521194J787828K808973L114695K452732K215346L53612J30299
$$ y = [22786852, 23234275, 23470127, 23433146, 24119449, 24385867, 25076980, 25565751, 25733687, 26200951, 26734773, 26558348, 26740603, 26104587, 26382379, 27250299, 27296694, 27989839, 28489631, 29117934, 29157063, 29125549, 29707073, 30006155, 30797874, 31530686, 32652246, 33517465, 34388251, 35480985, 36403761, 36754210, 37491159, 38409291, 38681127, 39569391, 40979268, 42081948, 43524755, 44859053, 47038277, 49378751, 52326658, 54844716, 58004616, 61859573, 65186456, 69633695, 73825490, 77303779, 80153884, 82146080, 83473657, 84668401, 85227025, 86533605, 87422034, 88964834, 90356399, 90762574, 90535259, 90269563, 90225990, 90244704, 90297377, 91818571, 93606399, 96415372, 99530067, 101982799, 104198145, 104551757, 104682056]
5330A04682056j259214j486629k274378k470321k951620m982697n022862n827476
5322G8406859n899354n211301m494976l423723l333294l556417k466128j946495
5314D8075171k201101j797191k105409j249783p08784j441189m50335j148609
5306C6972770k73527n99903n98528j247428j011029j252k89329p92182q99895
5297C1259697J07267m83382k64909K47468k79144n50320j35721m93624K63512
5288B9670844M43533J49541k93616p48640o17625k53427l86676p42437j70061
5279B7051436k85407n82948m49901J99218M1183N1708j53776K12759m87736q5634
5269B5510902j42121K00606N16990l53800N3986k00080M20170M42220Q31324Q25247
$$ y = [104682056, 103422842, 101936213, 99661835, 97191514, 94239894, 89257197, 84234335, 78406859, 72507505, 67296204, 62801228, 59377505, 56044211, 52487794, 50021666, 48075171, 45874070, 44076879, 41971470, 40721687, 40012903, 38571714, 38121379, 36972770, 36699243, 36099340, 35500812, 34253384, 33242355, 33241103, 32951774, 32159592, 31259697, 31366964, 30883582, 30618673, 30866141, 30586997, 30036677, 29900956, 29407332, 29670844, 30114377, 30263918, 29970302, 29221662, 28604037, 28350610, 27963934, 27221497, 27051436, 26766029, 26183081, 25733180, 25932398, 25973581, 26025289, 25871513, 26084272, 25596536, 25510902, 25368781, 25569387, 26086377, 25732577, 25786563, 25586483, 26006653, 26448873, 27280197, 28105444]
5259B8105444K35817L5782M03670Q30211L10103J393R36773Q31312j37385L46186
5249C1899306L97215N1733J78682K14935K60223Q7731N93402N47355P23686J093922
5239C6048190L92174O42087O38266K95647O58643J89692L45485l29702N51293
5230C9431775k01020k59707K80101N04916N53824l4340Q52723R55007J53884M70819
5220D2707982L17366O4594l15960o50099p05665k12309k67565l60776l36433q80330
5210C9360805N63116J29799j88977L46570M11163o3353k76102k89400l67991p35858
5200C8889772m06668j72802j113493j026686q01456o58292o30865p69728l06177
5191C3003605R7858n59032k35852j02374J43071k14745l58234k78954j115276
$$ y = [28105444, 28341261, 28377043, 28780713, 29610924, 29921027, 29922420, 30859193, 31690505, 31553120, 31899306, 32296521, 32348254, 32526936, 32741871, 33002094, 33089825, 33683227, 34230582, 34954268, 36048190, 36440364, 37082451, 37720717, 38016364, 38675007, 38864699, 39210184, 38880482, 39431775, 39230755, 38971048, 39251149, 39756065, 40309889, 40275549, 41128272, 42083279, 42237163, 42707982, 43025348, 43089942, 42773982, 42123883, 41418218, 41205909, 40938344, 40577568, 40241135, 39360805, 39923921, 40053720, 39864743, 40211313, 40622476, 40559123, 40283021, 39993621, 39625630, 38889772, 38483104, 38310302, 37196809, 36170123, 35368667, 34710375, 34079510, 33309782, 33003605, 33101463, 32542431, 32306579, 32204205, 32347276, 32132531, 31774297, 31495343, 30380067]
5182C0380067n97995q20060r18325o67689j182900r66380q47523j37571l62134
5173B3879490j126651n68435m87772o75694O064K350j94819p49439n12773n40828
5163A9031493m08910J54889l59183r85477n23783m94110j15013l03102p35859
5154A5260945l56277l05603K93519k93888j02440n17739k48428L47191k4188l54061
5144A3699031n79887j13235J61694J35798o183k50496k22970Q4711K21332n50635
5134A2579160k93665J62143L29907q6040j16354l32982M5719l6408K80622n81920
5124A1950182n11957K25207k88712m26507K90470j96062K71921P60434O676j98377
5114A1883275M4570j85332j4446J84538J3240m25655J27173K5989j53116M60078
$$ y = [30380067, 29782072, 28962012, 28043687, 27375998, 26193098, 25226718, 24379195, 24241624, 23879490, 22752839, 22184404, 21696632, 21020938, 21027002, 21029352, 20834533, 20085094, 19572321, 19031493, 18622583, 18777472, 18418289, 17432812, 16909029, 16414919, 16299906, 15996804, 15260945, 14904668, 14599065, 14892584, 14598696, 14496256, 13978517, 13730089, 14077280, 14053092, 13699031, 13119144, 13005909, 13167603, 13303401, 13297218, 13046722, 12823752, 12908463, 13129795, 12579160, 12285495, 12447638, 12777545, 12691505, 12575151, 12242169, 12287888, 12251480, 12532102, 11950182, 11438225, 11663432, 11374720, 10948213, 11238683, 11042621, 11314542, 12074976, 12081652, 11883275, 11927845, 11742513, 11728067, 11912605, 11925845, 11500190, 11627363, 11653352, 11500236, 11960314]
5104A1960314K61926k96406j90623M95259J67509k12224p4666r3871J51289j10953
5094A2057554k00313J2059J73032M32178j01050M4318l27358K99444Q4570q2157
5084A2392277J56125l77473J20708k21305l75600L96699M27474n41284M3750J16722
5074A2138093l3961M57210m33363L5208k23140L96308l81142j13831L6960P4240
5064A1952582m97177J56762k99253m28162M95413K15528J92459j46693K33591
5055A1875050l66179K64688L64540L54936q1926l62341K44605m3036m46187J26075
5045A1930225K55418m3875K4460K486J28292K32958Q5311k45358j69973J42073
5035A2342017Q7971l20431K52178M21957r6582L9816K38370M34656L05522L08771
$$ y = [11960314, 12222240, 11925834, 11735211, 12230470, 12397979, 12185755, 12111089, 12017218, 12168507, 12057554, 11857241, 11869300, 12042332, 12474510, 12373460, 12417778, 12090420, 12389864, 12474434, 12392277, 12548402, 12170929, 12291637, 12070332, 11694732, 12091431, 12518905, 11977621, 12021371, 12138093, 12104132, 12561342, 12127979, 12163187, 11940047, 12336355, 11955213, 11841382, 11878342, 11952582, 11455405, 11612167, 11312914, 10884752, 11380165, 11595693, 11788152, 11641459, 11875050, 11508871, 11773559, 12138099, 12493035, 12411109, 12048768, 12293373, 12250337, 11804150, 11930225, 12185643, 12141768, 12166228, 12168714, 12297006, 12529964, 12615275, 12369917, 12199944, 12342017, 12429988, 12109557, 12361735, 12783692, 12687110, 12726926, 12965296, 13399952, 13705474, 14014245]
5025A4014245O502r0687J12749R0888M06643n34130j57884k88308l96643L3944
5015A3197319K01138J37458M76555j38706K1909M56807j89025J43610p39407K10869
5005A3778527O96581j9260l45827M75869J71632l71300P9015J03496J72878q163
4995A4733448N03063J89260J27301O90432k2343l71795M11270J42196j22027R413
4985A6290218l52300N1639j41776M9400L19653L64001n33100j03012m1556L37494
4975A6240661O03636k03703Q2407m18800K16947K24503j84879j13583k44010j952
4965A6201227L91310Q9086M93012K94527P00525o62054K25380l6665J91916J83152
4955A8071416q47838j78916n19910J9879n16169l15529L25848L64421l84350l12203
$$ y = [14014245, 14020747, 13930060, 14042809, 14133697, 14540340, 14006210, 13848326, 13560018, 13163375, 13197319, 13398457, 13535915, 14012470, 13873764, 13895673, 14352480, 14163455, 14307065, 13567658, 13778527, 14475108, 14455848, 14110021, 14585890, 14757522, 14386222, 14465237, 14568733, 14741611, 14733448, 15236511, 15425771, 15553072, 16243504, 16221161, 15849366, 16260636, 16402832, 16280805, 16290218, 15937918, 15989557, 15847781, 15897181, 16216834, 16580835, 16047735, 15944723, 15903167, 16240661, 16844297, 16640594, 16723001, 16304201, 16521148, 16745651, 16560772, 16447189, 16203179, 16201227, 16592537, 16681623, 17174635, 17469162, 18169687, 17507633, 17733013, 17696348, 17888264, 18071416, 17223578, 17044662, 16524752, 16544631, 16028462, 15712933, 16038781, 16403202, 16018852, 15706649]
4945A5706649l20258j30147l24298M2607J44434m31667q0960M60595p9697K31445
4935A5218703n6333m6945m6274o3346j2664k16230Q5712m38250r4256J88988L9842
4924A4558947J69795J53666R4910j77632l0004K05134M4976J75861R8019n35100
4914A4758572j21980j93558J49404m700l07911q8601J8658j67022m95626k94690
4904A3252546j85309j31321k58480l24367J40355j24746k66213K56592k51246
4895A2107811m51000J7324n2458n21350N7844j28353L4804l8870q4151q2427p48819
4884A0110355r1508j96590l6526n26083k88024K80736K80845J38807k28665n30473
4874H912874n30537P2953l243L59488j89041k06091l06886J00041K56878k43084
$$ y = [15706649, 15386391, 15256244, 14931946, 14974553, 15118987, 14687320, 14606360, 15066955, 14987258, 15218703, 15162370, 15115425, 15069151, 15005805, 14993141, 14776911, 14862623, 14424373, 14330117, 14519105, 14558947, 14728742, 14882408, 14977318, 14799686, 14769682, 14974816, 15019792, 15195653, 15293672, 14758572, 14636592, 14443034, 14592438, 14587738, 14279827, 14191226, 14209884, 14042862, 13547236, 13252546, 13067237, 12935916, 12677436, 12353069, 12493424, 12368678, 12102465, 12359057, 12107811, 11656811, 11674135, 11621677, 11100327, 11158171, 11029818, 11064622, 11025752, 10941601, 10859174, 10110355, 10018847, 9822257, 9785731, 9259648, 8971624, 9252360, 9533205, 9672012, 9443347, 8912874, 8382337, 8455290, 8452047, 8811535, 8622494, 8416403, 8109517, 8209558, 8466436, 8223352]
4864H223352N72455k85829k11216k74689J33779M38767l17138j46169o1585k38141
4854G833586k067j81035M82496k03194j68128j12613j38562P9594l67536l02538
4844F920003k85619L14679l30300j55665L66896n4724m35422k05128q0026k21497
4834E833197p4654O2641n6570M13464j50666j21025k44328j43693J35219J31535
4824E785120j09300j73836J9831L3677K83698k08292j04387L55728l40352n81666
4814D960221J73768N70615l13660J68628L0393p5306N63292l47930l62270k00573
4804E167178j66237L15430P7793j58801l34744M95163J44322j25185K51739k64982
4794E401676j15975O8244k85015k2209O03371K43852n31067j77513m11107k4706
$$ y = [8223352, 8795807, 8509978, 8298762, 8024073, 8157852, 8596619, 8279481, 8133312, 8071727, 7833586, 7831519, 7650484, 8132980, 7929786, 7761658, 7649045, 7510483, 7590077, 7222541, 6920003, 6634384, 6949063, 6618763, 6463098, 6829994, 6775270, 6339848, 6134720, 6054694, 5833197, 5758543, 5821184, 5764614, 6178078, 6027412, 5906387, 5662059, 5518366, 5653585, 5785120, 5675820, 5501984, 5521815, 5555492, 5839190, 5630898, 5526511, 5882239, 5541887, 4960221, 5133989, 5704604, 5390944, 5559572, 5589965, 5514659, 6077951, 5730021, 5367751, 5167178, 5000941, 5316371, 5394164, 5235363, 4900619, 5395782, 5540104, 5414919, 5666658, 5401676, 5285701, 5353945, 5068930, 5046721, 5650092, 5893944, 5362877, 5185364, 4774257, 4749551]
4784D749551K05472R7182J18899j42397o3573j85390K55060P0555j39296M05400
4774E371463K46794q0826J03954j76754J18138K79939j16006N46108L36814l56391
4764F273233l02473l68204m48346m5207K60816Q8646o94883N3704J14226l32114
4754D599398m1338J0790Q3648o6934K57666R2567K02574n80865K49656J00640
4744D907802p65734p5053P7029q5465Q0456N3532J37072l85742o13870L88356
4734C718383j81528J20938M79235n56340m5239N64041k73129m6247L85062M31459
4724D596635j91797j08648j68453l00016K53646K43728p7647l56015K15227o9866
4714D036794r6563q9983j58559l01526j11345P52900J22466j69277m78818Q5753
$$ y = [4749551, 4955023, 5052205, 5171104, 5028707, 4965134, 4779744, 5034804, 5105359, 4966063, 5371463, 5618257, 5537431, 5641385, 5464631, 5582769, 5862708, 5746702, 6292810, 6629624, 6273233, 5970760, 5602556, 5154210, 5109003, 5369819, 5458465, 4763582, 4817286, 4931512, 4599398, 4558060, 4568850, 4652498, 4585564, 4843230, 4935797, 5138371, 4557506, 4807162, 4907802, 4142068, 4067015, 4144044, 4058579, 4139035, 4192567, 4329639, 3943897, 3330027, 3718383, 3536855, 3657793, 4137028, 3580688, 3535449, 4099490, 3826361, 3780114, 4165176, 4596635, 4404838, 4296190, 4127737, 3827721, 4081367, 4325095, 4247448, 3891433, 4106660, 4036794, 3940231, 3850248, 3691689, 3390163, 3278818, 4031718, 4154184, 3984907, 3506089, 3591842]
4704C591842J25429J08791p7918k70655Q5857L34629P5946k86170k40979K45445
4694C692217M33446M06399k00196k49412O98515m43101k30075q1274j29517K21985
4684D118987J72224j09320L40614k54755j50723r7027J34086j40459L37005J68091
4674D518723j49523l75637r1834R7513K90757j07885k87109L0069K45066m2318
4664D127822J15682J09654J62573l65035k62208K89595m771k50062O35628j02875
4654D456003q75646J79672j0516L72751K59482k80574J37784P9593k68133L48073
4644D398489o4300j45813K41685O2580l56451K08561j99527J25033M14831o9837
4634D615251n4082j15823R6364M55110L98353l52714J8679r235k83592L26167
$$ y = [3591842, 3717271, 3826062, 3748144, 3477489, 3563346, 3897975, 3973921, 3687751, 3446772, 3692217, 4125663, 4532062, 4331866, 4082454, 4780969, 4337868, 4107793, 4026519, 3897002, 4118987, 4291211, 4181891, 4522505, 4267750, 4117027, 4020000, 4154086, 4013627, 4350632, 4518723, 4369200, 3993563, 3901729, 3999242, 4289999, 4182114, 3895005, 3925074, 4170140, 4127822, 4243504, 4353158, 4515731, 4150696, 3888488, 4178083, 4173312, 3923250, 4558878, 4456003, 3580357, 3760029, 3749513, 4122264, 4381746, 4101172, 4238956, 4318549, 4050416, 4398489, 4334189, 4188376, 4430061, 4492641, 4136190, 4344751, 4145224, 4270257, 4685088, 4615251, 4561169, 4445346, 4541710, 4996820, 5395173, 5042459, 5061138, 5051903, 4768311, 5094478]
4624E094478K34853o1955K57257m3640j59205J32437J83774K0769K11158n8119
4614E811807J5280J87260l42030J5796o8035K27443m54188O56217m2621l5653
4604E971276M61018J58684m6287k7377Q62913p1636J74393N02638l05241q93187
4594F787194r47851J88056j57357K76571L04797p68277M36749m8408k74422m57109
4584E339943J0759Q4284k59708N25948J44935k67237j83582L96960k48276K02264
4574E746290k6418J70040J81341J10500M3411J51742L5290k59292j7122L03387
4564F439169R7340K09352L26616l43579J27114L85030j08146p8221p7658j98390
4554F778627j82147l91898n69625L98895l32560K60419O1134J85926N1008o5402
$$ y = [5094478, 5329331, 5267376, 5524633, 5480993, 5321788, 5454225, 5637999, 5658768, 5869926, 5811807, 5827087, 6014347, 5672317, 5688113, 5620078, 5847521, 5393333, 6049550, 6006929, 5971276, 6432294, 6590978, 6544691, 6517314, 7380227, 7308591, 7482984, 7985622, 7680381, 6787194, 5839343, 6027399, 5870042, 6146613, 6451410, 5683133, 6119882, 6071474, 5797052, 5339943, 5350702, 5434986, 5175278, 5701226, 5846161, 5578924, 5395342, 5792302, 5544026, 5746290, 5719872, 5889912, 6071253, 6181753, 6225164, 6376906, 6412196, 6152904, 6135782, 6439169, 6536509, 6745861, 7072477, 6728898, 6856012, 7241042, 7132896, 7054675, 6977017, 6778627, 6596480, 6204582, 5634957, 6033852, 5701292, 5961711, 6022845, 6208771, 6259779, 6194377]
4544F194377k06016m6425J40592o0826k73622j71754L51931o041k1256J39691
4534F040651o4119P4439N67698J48708m7961l91629k02556K40775l11805j00804
4524E953397L44090m94591J14716P5562L3149m22258J97135p401j92683L97202
4514E998318L63669k40392M90332N25283j87562k62531k9291L61878J06193J78989
4504G304886P6581Q0731L94070j47153N13605o5455j46652O6006M49604J35722
4494H661945N33080L12321J40107N84834O19407J74398L69549L64144K00834Q56639
4484A2817258K61401J512457J320843J182410J801360J641387J615201K545975
4476B4698292L035183L900296M354854N040983N123785L616894N39398l383311
$$ y = [6194377, 5988361, 5941936, 6082528, 6021702, 5748080, 5576326, 5928257, 5922216, 5900960, 6040651, 5976532, 6050971, 6618669, 6767377, 6719416, 6327787, 6125231, 6366006, 6054201, 5953397, 6297487, 5802896, 5917612, 5993174, 6026323, 5604065, 5801200, 5793799, 5601116, 5998318, 6361987, 6121595, 6611927, 7137210, 6949648, 6687117, 6657826, 7019704, 7125897, 7304886, 7381467, 7462198, 7856268, 7709115, 8222720, 8157265, 8010613, 8076619, 8526223, 8661945, 9195025, 9507346, 9647453, 10232287, 10851694, 11026092, 11395641, 11759785, 11960619, 12817258, 13078659, 14591116, 15911959, 17094369, 18895729, 20537116, 22152317, 24698292, 27733475, 31633771, 35988625, 41029608, 46153393, 49770287, 50309685, 46926374]
4468D6926374n910907o680015n591452m091387k851146k155077j231598j691150
4460A6723642p44273o24671m80664r68150k05027l21727l33374J18218n14448
4451A2649526r5797j82563K44899M59350k02308n5946k5365J96188M03270J44175
4441A3535429L18655j71416K21773O10508M79428Q38552k52341L8871m06880n872
4431A5206707J53267M49565O28246N38042Q58656J202589P24689R40235J496772
4422B2198768J497256J522661J803276K863306L395700L909473M229776N143693
4414D6563909L752454J522816j045571m111551n405104n722760m875007l560196
4406B7118990k288866j881082j399820p72466p91800p31592k91099O3889r59950
$$ y = [46926374, 41015467, 34335452, 28744000, 24652613, 21801467, 19646390, 18414792, 16723642, 15979369, 15354698, 14874034, 13905884, 13700857, 13379130, 13045756, 13163974, 12649526, 12553729, 12371166, 12616065, 13075415, 12873107, 12817161, 12791796, 12987984, 13391254, 13535429, 13854084, 13682668, 13904441, 14514949, 14994377, 15832929, 15580588, 15619459, 15212579, 15206707, 15359974, 15809539, 16437785, 16975827, 17834483, 19037072, 19761761, 20701996, 22198768, 23696024, 25218685, 27021961, 29885267, 33280967, 37190440, 41420216, 46563909, 50316363, 51839179, 50793608, 46682057, 41276953, 35554193, 30679186, 27118990, 24830124, 22949042, 21549222, 20776756, 19984956, 19253364, 18962265, 19026154, 18066204]
4397A8066204m13511q0340Q2250j08926L21576l91881K623L96412J74528j82110
4387A7866825L25961K67876J21659j1846N47594O1791J82882J037967M76279J28291
4377B1005279O06946M49394J036221J281727N86285O74907P55780O68l34793k2631
4367B6039783j92719r92327L27364R8565J55515K63078O75144O26349R35522K24280
4357B8160554R20294Q84519K64221j00098K97520o50739p80349o42712p70090
4348B7583120j287608j332918o66691J984Q3146m99901J29420P1765o0099k41871
4338B3780347O32854K78776R48476R87479R47140L98549P56739J864461J457201
4329C2052022J617194J697634J690733K167339K117489K247411J222515M77983
$$ y = [18066204, 17652693, 17572353, 17654603, 17545677, 17867253, 17475372, 17477995, 17874407, 18048935, 17866825, 18192786, 18460662, 18582321, 18570475, 19118069, 19179860, 19362742, 20400709, 20876988, 21005279, 21612225, 22061619, 23097840, 24379567, 24965852, 25640759, 26396539, 26397207, 26062414, 26039783, 25847064, 24854737, 25182101, 25280666, 25436181, 25699259, 26374403, 27000752, 27936274, 28160554, 29080848, 29965367, 30229588, 30129490, 30427010, 29776271, 28995922, 28353210, 27583120, 26295512, 24962594, 24295903, 24297887, 24381033, 23881132, 24010552, 24082317, 24022218, 23780347, 24413201, 24691977, 25640453, 26627932, 27575072, 27973621, 28730360, 30594821, 32052022, 33669216, 35366850, 37057583, 39224922, 41342411, 43589822, 44812337, 45290320]
4321D5290320K95803K45252q02315j698034j976899j289808q96341R3823l02800
4312C8959001L60095M47653N06179R52048K08184J38598N04708l75761j346303
4303D0354402k145323j969540j847338k029299j801912k219265j426963j211437
4295B5703325j114247p89638n76079q1677o87322j47698k81535q6102o21070K85911
4285B1603868L20890L7950J70106O00127j53393Q79703O30775O82798J127769
4276B5900593J072903J096181J859986J379753J367561J975159K178544J987734
4268C8818414J260915M34021J94078j377017j877822k182126k186474k004303
4260C1079686j710865j239862j552270j020779r84293k63553n97720M50985n4506
$$ y = [45290320, 45586123, 45831375, 45029060, 43331026, 41354127, 40064319, 39167978, 39261801, 38959001, 39319096, 39766749, 40272928, 41224976, 41433160, 41571758, 42076466, 41700705, 40354402, 38209079, 36239539, 34392201, 32362902, 30560990, 28341725, 26914762, 25703325, 24589078, 23799440, 23223361, 23141684, 22454362, 22306664, 22025129, 21939027, 21317957, 21603868, 21924758, 21962708, 22132814, 22732941, 22579548, 23459251, 24090026, 24772824, 25900593, 26973496, 28069677, 29929663, 31309416, 32676977, 34652136, 36830680, 38818414, 40079329, 40513350, 40707428, 39330411, 37452589, 35270463, 33083989, 31079686, 29368821, 28128959, 26576689, 25555910, 24571617, 24308064, 23710344, 24161329, 24106823]
4251B4106823n90505P8268O12518K707P48224O47236O28196N21275J335688J283348
4241B9373778J453557R36736J733272J604491J873441J754539R52261O13954k73973
4232D0022056j065472j734221j706478k068784j548701j129293j039046j238695
4224B8491366o75440l795R1578K08155M94598J84651j03641k26602p06970j103292
4214B6650608n82808q48304j081902r99814o87246n67323p42086p31818m88904
4205A9920403P6587k1884m03131k37129j61707j95789j2286J08378O71653M93492
4195B0238587M65417J97975J098488Q91280N46664L90574J055112O41409L62962
4186B5888468P45796K42572j30986l10389p04004l98413o87591j090193p37544
$$ y = [24106823, 23516318, 23594586, 24207104, 24209811, 24958035, 25605271, 26233467, 26754742, 28090430, 29373778, 30827335, 31764071, 33497343, 35101834, 36975275, 38729814, 39682075, 40296029, 40022056, 38956584, 37222363, 35515885, 33447101, 31898400, 30769107, 29730061, 28491366, 27815926, 27812131, 27903709, 28111864, 28606462, 28791113, 28687472, 28460870, 27753900, 26650608, 26067800, 25219496, 24137594, 23137780, 22450534, 21883211, 21141125, 20409307, 19920403, 19996990, 19975106, 19571975, 19334846, 19173139, 18977350, 18965064, 19073442, 19745095, 20238587, 20704004, 20901979, 22000467, 22891747, 23438411, 23828985, 24884097, 25525506, 25888468, 26634264, 26876836, 26745850, 26435461, 25731457, 25333044, 24645453, 23555260, 22817716]
4177B2817716l37496l72497n26981n41446k73224k16884k55594m8528p33294k4707
4167A9487065M0150m72020k31840j56893k25475o90465n72229o44398k81483J5552
4157A6267964l77693k97446J00949j25493k68771J1569k78042o708o9478K04234
4147A5161085k26350n11281l096k03301K15998J08986J93927o52026j76198j47923
4137A3759821k96623L38454j48997l2661m9429q5042J00728L57273K81574j86831
4127A4038267l20132J17795j75736J3258R7307N47806m5889l8324L06074P5413
4117A4615839r9082J71881m01705n46123q6447K1567L31751n70724J27720j00427
4107A3464250L67246q691J13299L83373k01839j18100l56949J46901J00260l33148
$$ y = [22817716, 22480220, 22107723, 21580742, 21039296, 20766072, 20549188, 20293594, 20245066, 19511772, 19487065, 19527215, 19055195, 18823355, 18666462, 18440987, 17750522, 17178293, 16533895, 16252412, 16267964, 15890271, 15592825, 15693774, 15568281, 15299510, 15311079, 15033037, 15026329, 14956851, 15161085, 14934735, 14423454, 14420358, 14217057, 14433055, 14542041, 14735968, 14083942, 13907744, 13759821, 13463198, 13801652, 13652655, 13619994, 13570565, 13485523, 13586251, 13943524, 14225098, 14038267, 13718135, 13835930, 13660194, 13673452, 13770759, 14318565, 14272676, 14234352, 14540426, 14615839, 14516757, 14688638, 14286933, 13740810, 13654363, 13675930, 14007681, 13436957, 13564677, 13464250, 13831496, 13822805, 13936104, 14319477, 14117638, 13999538, 13642589, 13789490, 13889750, 13556602]
4097A3556602J80985j43012K6089J84207J6836q0725j05472K31764p53928L30453
4087A3443799j26833k33910K56246M54648l82638K73571O15618O1826k20331q686
4077A4133310K11993J87961R170Q9002p6524J78161K06437K98383J11843k67033
4067A5082703l5937O32014K45684k03717n157M33114P43099k4040K82879J77433
4057A7328075N14337J56467r7864L05857k6904j9261N26024O08984m47790K48503
4047A9096428P82652l61211Q01845M46758K86774O8803O38142R02605K73770N86598
4037B3523164O5162O00821L17331R51913J05594P26699R97916J104633K65738
4028B8658971M74354J48164l22879N52270K92557P44863K81680P33242J197220
$$ y = [13556602, 13737587, 13594575, 13620664, 13804871, 13821707, 13740982, 13635510, 13867274, 13113346, 13443799, 13316966, 13083056, 13339302, 13793950, 13411312, 13684883, 14300501, 14362327, 14141996, 14133310, 14345303, 14533264, 14542434, 14631436, 14554912, 14733073, 14939510, 15237893, 15349736, 15082703, 15046766, 15678780, 15924464, 15720747, 15715590, 16148704, 16891803, 16867763, 17150642, 17328075, 17842412, 17998879, 17901015, 18206872, 18179968, 18160707, 18686731, 19295715, 18847925, 19096428, 19879080, 19517869, 20319714, 20766472, 21053246, 21122049, 21760191, 22662796, 22936566, 23523164, 23588326, 24189147, 24506478, 25458391, 25563985, 26290684, 27288600, 28393233, 28658971, 29133325, 29281489, 28958610, 29510880, 29803437, 30548300, 30829980, 31563222, 32760442]
4019C2760442J707727J693291K212843K625819L214940L525786L623287M844403
4011E6208538O032882O512675M571634J211888l788358p399560o775446o318007
4003E0256246m069400l584560k644670j275556j245796r48585p97912n01253m17799
3994C4770715l17792l01669n41847o03160l98223J99020l3977J47966p0023l20848
3984C2530162L77288M03456n64595r98613j8666k0179L2106k24342N03303J94466
3974C2214386j53114j55678J95786P0167Q73675N23881K18377P7078J70289R73979
3964C5008826O69400N97586P20371J133196J017591J346094N81956R98616J174049
3955D3247685J114438J007328J605851J367450K257401J578797J621938K715038
$$ y = [32760442, 34468169, 36161460, 38374303, 41000122, 44215062, 47740848, 51364135, 56208538, 62241420, 68754095, 73325729, 74537617, 70749259, 63349699, 56574253, 50256246, 46186846, 42602286, 39957616, 38682060, 37436264, 36487679, 35689767, 35188514, 34770715, 34452923, 34151254, 33609407, 33006247, 32608024, 32807044, 32773067, 32921033, 32851010, 32530162, 32907450, 33310906, 32746311, 31747698, 31729032, 31708853, 31740959, 31516617, 32019920, 32214386, 32061272, 31905594, 32101380, 32171547, 33045222, 33569103, 33787480, 33864558, 34034847, 35008826, 35678226, 36275812, 36996183, 38129379, 39146970, 40493064, 41075020, 42073636, 43247685, 44362123, 45369451, 46975302, 48342752, 50600153, 52178950, 53800888, 56515926]
3947E6515926K835138L561246L405912K104170K257024J669386J322918Q78266
3939G4549986P00669O76413R81697J384663K351703K995525L778038M104092M877601
3930I6400387N977963O439633P989127R294058J1061072J3034047J4550905J6530902
3922A81278094J7684599K0119844K2860970K7234399L1236724L1166510K4551741
3915C56132881P321359j5340217l3067092l9741135l6654785k9859459k3500512
3908A85291040j8679699j6160704j2965935j1146007q944826p570111o024113
3901A03799645n238916m589719m145330l792234l206527k384437l369660l386918
3893G3685904l270274k707432k311523k254775k084115j999921j792827r81136
$$ y = [56515926, 59351064, 62912310, 66318222, 68422392, 70679416, 72348802, 73671720, 74549986, 75250655, 75927068, 76908765, 78293428, 80645131, 83640656, 87418694, 91522786, 96400387, 102378350, 108817983, 116807110, 126101168, 137162240, 150196287, 164747192, 181278094, 198962693, 219082537, 241943507, 269177906, 300414630, 331581140, 356132881, 363454240, 348114023, 315046931, 275305796, 238651011, 208791552, 185291040, 166611341, 150450637, 137484702, 126338695, 117393869, 109823758, 103799645, 98560729, 93971010, 89825680, 86033446, 82826919, 80442482, 77072822, 73685904, 70415630, 67708198, 65396675, 63141900, 61057785, 59057864, 57265037, 56283901]
3885E6283901r73963j156613p70853r83571j082476n87915p56421q97747j61595
3876D8912747n36531l31554j53431m15633m39729l67797p30164k53276l14411
3867D5370221p35294O1212M04492m81223o0670k6136m61431P22350L26762n5894
3857D5064389K29980L72771N1515m08231K06112K26660n11018K99581M3548M75840
3847D6051147K88320O82479Q39591K30060J623160J585490J055718K164975K424300
3838E6945240K738942K984596L841160L326624L805369M272412L743771K225056
3830H3883170n97433l574172n314661n912640n621743m480727m180895k874573
3822E1326326k290614k110022j834772j503354j158336o05060j029638n08111
$$ y = [56283901, 55309938, 54153325, 53382472, 52398901, 51316425, 50728510, 49972089, 49074342, 48912747, 48376216, 48044662, 47891231, 47475598, 47035869, 46668072, 45937908, 45684632, 45370221, 44634927, 44696139, 45100631, 44619408, 44558738, 44532602, 44071171, 44793521, 45120283, 45064389, 45294369, 45667140, 45718655, 45310424, 45516536, 45743196, 45232178, 45531759, 45575307, 46051147, 46339467, 47021946, 47861537, 48091597, 49714757, 51300247, 52355965, 54520940, 56945240, 59684182, 62668778, 66509938, 69836562, 73641931, 77914343, 81658114, 83883170, 83285737, 79711565, 74396904, 68484264, 62862521, 58381794, 54200899, 51326326, 49035712, 46925690, 45090918, 43587564, 42429228, 41824168, 40794530, 40286419]
3814D0286419p89964r13682j61194j31409l18339k29676n13835J2022K86627r3997
3804C7432972m9012Q1067j96441J15835n3196N08147Q38242K06524K45379K58324
3794C9387841M43282M04154K37282K36124K35076K58389J31222L08217M19238
3785D2060825P27393Q84723M39891Q3712L63892Q13213N72761P18889O76403O91925
3775D8033627M27564J088016P58508J028857J305755P20603J554758J726472J749039
3766E8393199J148373J428357J442057J600252J704508K434943K359774K983705
3758G3495168L169511K690072K925795L800130M387935M369839M418161N211706
3750A04468317N746612O094511O589021P051742P243619Q030466Q967334R092153
$$ y = [40286419, 39496455, 38582773, 38421579, 38290170, 37971831, 37742155, 37228320, 37240342, 37526969, 37432972, 37383960, 37465027, 37268586, 37384421, 37331225, 37839372, 38677614, 38884138, 39129517, 39387841, 39831123, 40235277, 40472559, 40708683, 40943759, 41202148, 41333370, 41641587, 42060825, 42788218, 43672941, 44112832, 44196544, 44560436, 45373649, 45946410, 46665299, 47341702, 48033627, 48461191, 49549207, 50307715, 51336572, 52642327, 53362930, 54917688, 56644160, 58393199, 59541572, 60969929, 62411986, 64012238, 65716746, 68151689, 70511463, 73495168, 76664679, 79354751, 82280546, 86080676, 90468611, 94838450, 99256611, 104468317, 110214929, 116309440, 122898461, 129950203, 137193822, 145224288, 154191622, 163283775]
3742A63283775R219376Q779819Q004158P114209M177290J308670j298848l883900
3734A96704549l684366l184782k973641j902655j459940r12590o53745L55586
3726A82288416P25610L8940K98531J236934J266927O89651M8872j64550L32459
3717A86761790O3148p1338p68759j006101j046980r76361j355620j284215j333967
3708A78981597j361049k481653l178566l012278l805364l122241l630430l318179
3700A55071837l481542m265421l770522l917922m324870l750299l257156l827312
3692A24476793l796274m176667l512410l401568l375057l354580l661411l747666
3684I5451160k603296l050296k952295l249017k441178k358792k360740k195250
$$ y = [163283775, 172503151, 181282970, 189287128, 196401337, 200578627, 201887297, 200588449, 196704549, 193020183, 189835401, 186861760, 184959105, 183499165, 182586575, 181932830, 182288416, 183014026, 183052966, 183351497, 184588431, 185855358, 186545009, 186593881, 186429331, 186761790, 186824938, 186753600, 185984841, 184978740, 183931760, 182955399, 181599779, 180315564, 178981597, 177620548, 175138895, 171960329, 168948051, 165142687, 162020446, 158390016, 155071837, 151590295, 147324874, 143554352, 139636430, 135311560, 131561261, 128304105, 124476793, 120680519, 116503852, 112991442, 109589874, 106214817, 102860237, 99198826, 95451160, 92847864, 89797568, 86845273, 83596256, 81155078, 78796286, 76435546, 74240296]
3676G4240296k691809j666173j900665j763325j969231k079452j521848j609085
3668E9038708j191982r66537j230593j793939j339863q65310o97119j661393j665754
3659D7626218o10717l44809j081239r47374r32976q91390n57676j213282o06795
3650D0439960r74587o66937r28619l19201m50036o52386l81023n16115q71819
3641C4679237j304071r380k67400l2850k08585l4259l33627N25339J53257p33496
3631C2434165J80476O54772K40699l83855K54926l60967k47896n71055J36376
3622C2337641Q814m78609l06769l37381p3384K12461J55907k68480L60031K10795
3612C1821026m36307K45622k0821r37472n87588o72616p72425r26961q91789n06811
$$ y = [74240296, 71548487, 69882314, 67981649, 66218324, 64249093, 62169641, 60647793, 59038708, 57846726, 56880189, 55649596, 53855657, 52515794, 51650484, 50953365, 49291972, 47626218, 47015501, 46670692, 45589453, 44642079, 43709103, 42817713, 42260037, 41046755, 40439960, 39465373, 38798436, 37869817, 37550616, 37100580, 36448194, 36067171, 35551056, 34679237, 33375166, 33365786, 33098386, 33065536, 32856951, 32822692, 32489065, 33014404, 33167661, 32434165, 32614641, 33269413, 33510112, 33126257, 33381183, 33020216, 32772320, 32201265, 32337641, 32346455, 31867846, 31561077, 31223696, 31150312, 31362773, 31518680, 31250200, 31610231, 31821026, 31384719, 31630341, 31609520, 30672048, 30084460, 29411844, 28639419, 27712458, 26820669, 26313858]
3602B6313858r08802m91680j94870j84437o48118l44471m54444n81544j62963
3593B2342529j30335k05643J63552K89838n70260m09561J29772J0466P2392N0488
3583B1743238l47553O8947k82477p2039j57050L30892K55577j77676J64591k41427
3573B1285023O8745K5716j24776j05002K62953j40993l71164Q4726P8370N72930
3563B1636528j83997j78790l99374p06086n9872K0389K0570k87383L63717o05048
3553A9620654p93631K76225j4996o99253P0307k55030K30358J23536l44836j59319
3543A8054015J08804O670l0521j29367J8343J46540K41810M98057L96130N5439
3533A9365920J94609j9853M0987J80534p9940K23926J38397J8212M00193j4447
$$ y = [26313858, 25405056, 24913376, 24718506, 24534069, 23885951, 23541480, 23087036, 22505492, 22342529, 22212194, 22006551, 22170103, 22459941, 21889681, 21480120, 21609892, 21620358, 21692750, 21743238, 21395685, 21464632, 21182155, 21110116, 20953066, 21283958, 21539535, 21361859, 21526450, 21285023, 21353768, 21379484, 21254708, 21149706, 21412659, 21271666, 20900502, 20985228, 21063598, 21636528, 21452531, 21273741, 20874367, 20168281, 20108409, 20128798, 20149368, 19861985, 20225702, 19620654, 18827023, 19103248, 19088252, 18388999, 18459306, 18204276, 18434634, 18558170, 18213334, 18054015, 18162819, 18169489, 18138968, 18009601, 18027944, 18174484, 18416294, 18914351, 19310481, 19365920, 19560529, 19540676, 19581663, 19762197, 19682257, 19906183, 20044580, 20062792, 20462985, 20448538]
3523B0448538l79388L4348J65776j32578J1474k3686O2905k70990M46038J25754
3513B0488191k29487Q9588n7133j9565R3200Q69031J36163j47481o7043L17928
3503B1473392J63184N57095J67851J39167P1630K73916k30453M02836J008813
3494B4027431K48043K93188M58244l3017N08609O94571L75658P0001L7272L87208
3484B7067208J101632J03006P37908L76449L6853N14666M63286N33529Q10837
3475C1745374M04809L24948O57110P28862Q44999O2626L42715Q88490N97324L58707
3465C6955964P58362R72887R42045P83400J046780Q57297R63348O04750J100415
3456D4985248J575058J560639J450834J094796J103418J883950J792216K215432
$$ y = [20448538, 20069150, 20103498, 20269274, 20136696, 20148170, 20124484, 20187389, 19916399, 20362437, 20488191, 20258704, 20348292, 20291159, 20271594, 20364794, 21233825, 21369988, 21222507, 21155464, 21473392, 21636576, 22193671, 22361522, 22500689, 22572319, 22846235, 22615782, 23018618, 24027431, 24275474, 24568662, 25026906, 24993889, 25502498, 26197069, 26572727, 26642728, 26680000, 27067208, 28168840, 28271846, 29009754, 29386203, 29423056, 29937722, 30401008, 30934537, 31745374, 32150183, 32475131, 33132241, 33861103, 34706102, 34768728, 35111443, 35999933, 36597257, 36955964, 37714326, 38687213, 39629258, 40412658, 41459438, 42316735, 43280083, 43884833, 44985248, 46560306, 48120945, 49571779, 50666575, 51769993, 53653943, 55446159, 57661591]
3448E7661591J645946J952206K072868J885987K180596J892145K025868J835406
3440G3152613K426695K420633K060494K419229J850979K136291K184981J271294
3432H9923209K035861K191847J706824J221028J769719J091253J057444J017945
3424A02015130J041557P65093Q08707N98561L58444J289953O46562P26999N95619
3415A08846625R31672J74653J527003J166135K18362J470907J459489J095969
3407A16890815J385281K074100J730424J638085K945463L007940K580680L292112
3399A35544900L710718L870781L966579M964164M361840M461495M999584N092294
3391A70972355M535188N108297N134028M814662N037618N274246M594797M557230
$$ y = [57661591, 59307537, 61259743, 63332611, 65218598, 67399194, 69291339, 71317207, 73152613, 75579308, 77999941, 80060435, 82479664, 84330643, 86466934, 88651915, 89923209, 91959070, 94150917, 95857741, 97078769, 98848488, 99939741, 100997185, 102015130, 103056687, 103821780, 104630487, 105229048, 105587492, 106877445, 107524007, 108251006, 108846625, 109778297, 109952950, 111479953, 112646088, 112864450, 114335357, 115794846, 116890815, 118276096, 120350196, 122080620, 123718705, 126664168, 129672108, 132252788, 135544900, 139255618, 143126399, 147092978, 152057142, 156418982, 160880477, 165880061, 170972355, 175507543, 180615840, 185749868, 190564530, 195602148, 200876394, 205471191, 210028421]
3383B10028421M785272M339096M365811L957042L799325K681158L198772K691122
3375B39846019J955267J755389P83302P93375J029195O9861o07462l58693q14881
3366B44451372o26328r05326j099057j047242j557780j432819j461659j478563
3358B34842598j179391r76323r50690j050538n33016K2915N03827J249799R12085
3349B32841266J597552K299174K398387L325177M026633M109135N826258N938263
3341B62361845O458386O995249P861410Q433087R356312J0600079J0586317J1101766
3333C33754451J2131608J1895350J2381632J2437164J2558103J2406358J1186992
3326D18751658J0456829R320595Q077944O578449M806034K915745J085175k17349
$$ y = [210028421, 214813693, 219152789, 223518600, 227475642, 231274967, 233956125, 237154897, 239846019, 241801286, 243556675, 244339977, 245133352, 246162547, 246232408, 245624946, 245266253, 244451372, 243825044, 242919718, 241820661, 240773419, 239215639, 237782820, 236321161, 234842598, 233663207, 232686884, 231736194, 230685656, 230152640, 230175555, 230679382, 231929181, 232841266, 234438818, 236737992, 239136379, 242461556, 246488189, 250597324, 256423582, 262361845, 268820231, 275815480, 283676890, 292109977, 301466289, 312066368, 322652685, 333754451, 345886059, 357781409, 370163041, 382600205, 395158308, 407564666, 418751658, 429208487, 438529082, 446607026, 453185475, 457991509, 460907254, 461992429, 461775080]
3318D61775080k051933k817060m451184o232611p355876q154861r310613j1287511
3310D10113431j1798533j2873836j3657014j4074116j4413945j4606904j4293199
3303C14395884j4369529j2946419j2370615j1812066j0861510r633416r505773
3296B32896556q376555p233586o856408o308400n556997n208202m087084l692843
3288A85576481l427069k758649k969116k341358j951451k652017j620903j702401
3280A66153517j370357o29870j575402j890765j410635q04930j596413j623150
3272A55251995j273579k024335j703459j625203j551029k266816k220686j496887
3264A41090001j622605k165167k116611j665048k110046j773438j604224k282760
$$ y = [461775080, 459723147, 456906087, 452454903, 446222292, 438866416, 430711555, 421400942, 410113431, 398314898, 385441062, 371784048, 357709932, 343295987, 328689083, 314395884, 300026355, 287079936, 274709321, 262897255, 252035745, 242402329, 232896556, 224520001, 217286415, 210430007, 204121607, 198564610, 193356408, 189269324, 185576481, 182149412, 179390763, 176421647, 174080289, 172128838, 169476821, 167855918, 166153517, 164783160, 164153290, 162577888, 160687123, 159276488, 158471558, 156875145, 155251995, 153978416, 151954081, 150250622, 148625419, 147074390, 144807574, 142586888, 141090001, 139467396, 137302229, 135185618, 133520570, 131410524, 129637086, 128032862, 125750102]
3256A25750102j853285j600152j241858k095271k192118j482503j884695j693998
3248A11706222j717039j822928j846537j637981k191249j982808j948991j969807
3240I6588882j868202j735137j856868j896481j757238j946042k065901j341573
3232H2121440j693440j780449k091721j508456j760800k031310j360946j515469
3224F8378849j452051j585253p14679j328243j323570j353317j157707j426742
3216E8037287j440733j448129j348167o27616j088236j645805j544505o49976
3208D8244120q92855q13712j320530j068554q91253p25128r45802m16739r56637
3199D0212910o79376r51178q32301q97716r64982m98749l59360l84636j303239
$$ y = [125750102, 123896817, 122296665, 121054807, 118959536, 116767418, 115284915, 113400220, 111706222, 109989183, 108166255, 106319718, 104681737, 102490488, 100507680, 98558689, 96588882, 94720680, 92985543, 91128675, 89232194, 87474956, 85528914, 83463013, 82121440, 80428000, 78647551, 76555830, 75047374, 73286574, 71255264, 69894318, 68378849, 66926798, 65341545, 64626866, 63298623, 61975053, 60621736, 59464029, 58037287, 56596554, 55148425, 53800258, 53172642, 52084406, 50438601, 48894096, 48244120, 47351265, 46537553, 45217023, 44148469, 43257216, 42532088, 41586286, 41169547, 40212910, 39533534, 38582356, 37750055, 36852339, 35887357, 35388608, 35029248, 34644612, 33341373]
3190C3341373K86185k88433q80021k75380p61339o16577r83482n09987o35591
3181B8676748m73845m71573k13380k4730p60887l14134l47538k85104j59258k31871
3171B5394428p52284m63026m5665k2687Q8924m10338m55166j35524j98732l61411
3161B2638519o3144l68908j36896J19901n28096n02457Q8466k75743m0911k25629
3151B0705102k13784J49613r92478n76873Q6069k5033j42657J69907j57035k72234
3141A8730597m11858j1134j6792m87919K56989m0931o12587M6915k72386K7599
3131A7208493K33697l5541n57117o5912o251m1807K21684l7861o7102M3895J13710
3120A7009888J09883J07967n4707l2285K52967k47306K71865M41184n7022M05693
$$ y = [33341373, 33627558, 33339125, 32459104, 32183724, 31422385, 30805808, 29822326, 29312339, 28676748, 28202903, 27731330, 27517950, 27493220, 26732333, 26418199, 26070661, 25785557, 25626299, 25394428, 24642144, 24179118, 24133453, 24110766, 24199690, 23789352, 23334186, 23198662, 22999930, 22638519, 22575375, 22206467, 22069571, 22189472, 21661376, 21158919, 21247385, 20971642, 20930731, 20705102, 20491318, 20640931, 19648453, 19071580, 19157649, 19132616, 18989959, 19159866, 19002831, 18730597, 18318739, 18307605, 18290813, 17802894, 18059883, 18018952, 17406365, 17453280, 17180894, 17208493, 17442190, 17406649, 16849532, 16783620, 16777369, 16735562, 16957246, 16919385, 16852283, 16896178, 17009888, 17119771, 17227738, 17173031, 17140746, 17393713, 17146407, 17418272, 17859456, 17802434, 18208127]
3110A8208127p3847L67726L83214J6902j07208M08761M64634j87768K5727J86508
3100A9692776J77194P83966J98721O12622M58230M09076L05435L59788M95913
3091B3493721M33140M69915N05379r1723K1182J32462r66875j227374p70398q06268
3081B1193161r33715m00098o07048M2218r13480m72475j92750l86112m81942J40324
3071A6988083o15547K26066m08680q94794K5249L3605j13124L07085k00566j930
3061A5345447k93893m37759L83042j0255O5146m97998j35713J84410m75030j007178
3051A3120219j82194J24175k82091k79188l59769m20472n56173j69751M8279k04132
3041A0838903k09541l13021p9626o47782q19711N79727J88606n70342N3985j9359
$$ y = [18208127, 18134280, 18502006, 18885220, 18902122, 18794914, 19203675, 19668309, 19480541, 19506268, 19692776, 19869970, 20653936, 20852657, 21465279, 21923509, 22332585, 22638020, 22997808, 23493721, 23926861, 24396776, 24902155, 24810432, 24831614, 24964076, 23997201, 22769827, 21999429, 21193161, 20259446, 19859348, 19252300, 19294518, 18381038, 17908563, 17715813, 17329701, 16847759, 16988083, 16372536, 16598602, 16189922, 15295128, 15320377, 15353982, 15240858, 15547943, 15347377, 15345447, 15051554, 14613795, 14996837, 14986582, 15051728, 14553730, 14418017, 14602427, 14127397, 13120219, 12938025, 13062200, 12780109, 12500921, 12141152, 11720680, 11164507, 10994756, 11043035, 10838903, 10629362, 10316341, 10236715, 9588933, 8769222, 9348949, 9537555, 8967213, 9021198, 9001839]
3031I001839l8554k34318J5793r56465L89674o3918j65676L24790q0124k11692
3021G981349m34265n06121J58378j62176K41016j33152l267l06647M4109M11867
3011G291091m55766j84087j46076p2429J35837j84096p4096k8899j27775R5932
3001F249636j86923k8448m1533l1587m21115n7689K1909q2128j44759J65041n14563
2990D927841J08354L68953p7102Q3021J4915j43721K04468r0253k77240m82521
2980D636715M22498O4259L20053J60318l30526K19237o02695k08917K25214J74432
2970E080588j37924M25473L36641O272k63419K23943j41315l77838k6888N18308
2960E643841r6373m67124J63921M6109K16652j66817M13857o764p2936J91478
$$ y = [9001839, 8963285, 8728967, 8744760, 7788295, 8177969, 8114051, 7948375, 8273165, 8193041, 7981349, 7547084, 7040963, 7199341, 7037165, 7278181, 7145029, 7141762, 6835115, 6879224, 7291091, 6835325, 6651238, 6505162, 6432733, 6568570, 6384474, 6310378, 6281479, 6153704, 6249636, 6062713, 6034265, 5992732, 5961145, 5540030, 5482341, 5504250, 5422122, 5277363, 5442404, 4927841, 5036195, 5405148, 5328046, 5411067, 5425982, 5282261, 5486729, 5396476, 5119236, 4636715, 5059213, 5123472, 5443525, 5603843, 5273317, 5492554, 4889859, 4680942, 4906156, 5080588, 4942664, 5368137, 5704778, 5711050, 5447631, 5671574, 5530259, 5152421, 5125533, 5643841, 5547468, 5080344, 5244265, 5290374, 5507026, 5340209, 5754066, 5747302, 5674366, 5865844]
2950E865844j2590o6456R2472j89726j95663j22612L48921l73062p03245Q53220
2940E497103K26824K72384k24534K44917m51846o44181K0427o65258K9884l02526
2930D003194p2166M43045m1440O2944p4429l40110k61777q0425J75196L71862
2920D185894j06935j08813l86169R9927O8213K15906K90544j01584n27618J40629
2910C769994N3492n39120M44155J47321K47233l52418Q0432J67826j26292j99359
2900C693264J94385l39383P06754J1237n60668J3433N1831o6466l78804J59226
2890C484809k03648L41412p5914q0996Q2243l88756J08437J49297j36122j62239
2880C118523L02319J20463k23958k28449L27700K36371j03359J88871j31001k98800
$$ y = [5865844, 5853254, 5786798, 5879270, 5689544, 5493881, 5371269, 5720190, 5347128, 4643883, 5497103, 5723927, 5996311, 5771777, 6016694, 5564848, 4920667, 4941094, 4275836, 4305720, 4003194, 3931028, 4374073, 4332633, 4395577, 4321148, 3981038, 3719261, 3638836, 3814032, 4185894, 4078959, 3970146, 3583977, 3683904, 3752117, 3968023, 4258567, 4156983, 3629365, 3769994, 3823486, 3284366, 3728521, 3875842, 4123075, 3770657, 3851089, 4018915, 3892623, 3693264, 3887649, 3548266, 4255020, 4266257, 3705589, 3719022, 3770853, 3704387, 3325583, 3484809, 3281161, 3622573, 3546659, 3465663, 3547906, 3159150, 3267587, 3416884, 3280762, 3118523, 3420842, 3541305, 3317347, 3088898, 3416598, 3652969, 3549610, 3738481, 3607480, 3308680]
2870C308680P2301N7725l51637J51652M85349J5819j3330R0066l55328J00593
2860C561890q9251k67938L5849n18281J95105K51451j43174J45202q5661K14281
2850C299473J09269j35171k92721j14219P80150L80652M75889k66898M0984k67274
2840D010134K30439L09952o6317r3016j00245N05461o21247k8906q17733L53688
2830C682210M65315m53339o2107k93113N53309l20862k4759L24880l90148P24926
2820D206312j36805j24365n55000m57795M33383j32151K12136K58154l50612K17257
2810C570514j17192L13611N65914m10105k79370K7228J91430J86373j16033r5191
2800C837179J04886J09516k45253k24584l0930l01728L41552j57943o15893m1620
$$ y = [3308680, 3380981, 3438706, 3087069, 3238721, 3724070, 3739889, 3726559, 3816625, 3461297, 3561890, 3472639, 3204701, 3240550, 2722269, 2917374, 3168825, 3025651, 3170853, 3085192, 3299473, 3408742, 3273571, 2980850, 2866631, 3646781, 4027433, 4503322, 4236424, 4277408, 4010134, 4240573, 4550525, 4484208, 4391192, 4290947, 4796408, 4175161, 4146255, 3328522, 3682210, 4147525, 3694186, 3632079, 3338966, 3892275, 3571413, 3546654, 3871534, 3481386, 4206312, 4069507, 3945142, 3390142, 2932347, 3365730, 3233579, 3445715, 3703869, 3353257, 3570514, 3453322, 3766933, 4332847, 3922742, 3643372, 3670600, 3862030, 4048403, 3932370, 3837179, 3942065, 4051581, 3806328, 3581744, 3550814, 3249086, 3590638, 3432695, 2816802, 2775182]
2790B775182L89501n0309L97397L03229l6219j54689J85122l26463l41944N08134
2780C648941m72725j92982k03707N3821k4921k25182j77489j24589O72972l856
2770B950283M95132j17109j05742N45876p12738K75240R0805K8708J70091j14545
2760C506001m77984K11381L61707L6036k82680o47641J11114L76573l6604l89202
2750B768701K72431j28815q6105Q1782p74032q2344O13199j87002j75650J15703
2740B417868M86479p5429o5824j0897k32597m1651O1103L32323K36846J16750
2730C224971l49475L57926l32730J77126j00420L68135k61874j14186m1821Q8598
2720C016250K70674Q5095k1733j48674K97303M35538j57527m19163M53935J42046
$$ y = [2775182, 3164683, 3114374, 3511771, 3815000, 3778781, 3624092, 3809214, 3482751, 3140807, 3648941, 3176216, 2983234, 2779527, 2833348, 2808427, 2583245, 2405756, 2281167, 2954139, 2950283, 3445415, 3328306, 3222564, 3768440, 3055702, 3330942, 3421747, 3450455, 3620546, 3506001, 3028017, 3239398, 3601105, 3637141, 3354461, 2706820, 2817934, 3194507, 3157903, 2768701, 3041132, 2912317, 2826212, 2907994, 2133962, 2051618, 2664817, 2477815, 2302165, 2417868, 2904347, 2828918, 2763094, 2752197, 2519600, 2477949, 2539052, 2871375, 3108221, 3224971, 2875496, 3233422, 2900692, 3077818, 2977398, 3345533, 3083659, 2969473, 2927652, 3016250, 3286924, 3372019, 3350286, 3201612, 3498915, 3934453, 3776926, 3357763, 3811698, 3953744]
2710C953744k9552j88434J19440J42829R90801l5626L5290O60969P87681M77228
2700F914370q5995k17763M00585o74885r28280n60204m27584m02922m13688o61418
2690B942216K22911N7473J53464l98424j07973m19899l55228M27560n03896J82640
2680B200844K56736o0877j15482l48257K6552k1914j68925r1023j3158K43990
2670A908486k46409k149j6218P4675J55437q61591K12185o7556l42607P94514
2660A608767M7385K07137j46986k31608N35321l64574M7929l12088l62291L42810
2650A371802K71361n4196k29450r4704n8439j17085J59252J09980k99168M5937
2640A105290M23612l14417j97134O984k29960L28406k67537M8677m01055K28163
$$ y = [3953744, 3924192, 3735758, 3855198, 3998027, 4988828, 4953202, 4988492, 5649461, 6437142, 6914370, 6828375, 6610612, 7011197, 6336312, 5408032, 4847828, 4420244, 4017322, 3603634, 2942216, 3165127, 3222600, 3376064, 2977640, 2869667, 2449768, 2094540, 2522100, 2018204, 2200844, 2457580, 2396703, 2281221, 1932964, 1959516, 1937602, 1768677, 1677654, 1664496, 1908486, 1662077, 1659928, 1643710, 1718385, 1873822, 1012231, 1224416, 1156860, 814253, 1608767, 1656152, 1863289, 1716303, 1484695, 2020016, 1655442, 1703371, 1391283, 1028992, 1371802, 1643163, 1588967, 1359517, 1264813, 1206374, 1089289, 1248541, 1358521, 1059353, 1105290, 1528902, 1214485, 1017351, 1024335, 794375, 1122781, 855244, 903921, 502866, 731029]
2630G31029J92181j09717M63987k00959L52565k49721n53900J75963j44665K00749
2620H57512n16164L87553L18560j64544j25151K33636j9107L69439j77131R4215
2610A258818n3515k80294l34580j2500O09341j86872l05481l56018k39832L49625
2600D48692J41569R9227J32031j6628k6856R7319M3361j62986q2691L00471J98355
2589A171864l59841o3948n8179l99935o6997j8776K38958L44110M91703n0316
2579A228643m62856l24620N0051O80983j50361L6233l0897J98003m45838L79545
2569A158886K22626k55697l07855j64492K14058p2927j98388J27794k6408J28498
2559H26095K02901k12710J91824p2008k9275l45180r7909J15742L32678J24252
$$ y = [731029, 923210, 813493, 1277480, 1076521, 1429086, 1179365, 625465, 801428, 656763, 857512, 341348, 728901, 1047461, 882917, 757766, 991402, 972295, 1341734, 1164603, 1258818, 1205303, 925009, 590429, 577929, 1187270, 1000398, 694917, 338899, 99067, 448692, 590261, 689488, 821519, 804891, 778035, 875354, 918715, 755729, 673038, 973509, 1171864, 812023, 748075, 689896, 289961, 222964, 204188, 443146, 787256, 1278959, 1228643, 765787, 441167, 491218, 1172201, 1021840, 1058073, 1027176, 1225179, 779341, 1158886, 1381512, 1125815, 817960, 653468, 867526, 794599, 596211, 724005, 697597, 826095, 1028996, 816286, 1008110, 936102, 906827, 561647, 463738, 579480, 912158, 1036410]
2549A036410o0549k3170j56447K44126m90154J70530M32454L85317K86207o44542
2539A180182j2935l68501K51730J48880j34470k09877K35517M15300m21765k22945
2529H61116N44137o4758p5717J9173L5634M5193L8112p94079j22728O62070J58743
2518A306896j2140m43313L14780j9106m80474O5587M33117J85278R131K3486j45066
2507A238176j37307K70814m40410M5175J23012N42521J43518l05896j95062N0781
2497A335322j94126K91521L70065J84245q24591r7317K77898M41017k97828l92797
2487A093409L59908n63687k32342k17903L59416L28183m86640J2513J5928O19663
2477A288448p4867l97564J25098K12882l38252M11708K01113n47231O30620k3544
$$ y = [1036410, 975861, 952691, 796244, 1040370, 550216, 720746, 1153200, 1538517, 1824724, 1180182, 1167247, 798746, 1050476, 1199356, 1064886, 855009, 1090526, 1505826, 1084061, 861116, 1405253, 1340495, 1264778, 1283951, 1319585, 1364778, 1402890, 608811, 486083, 1148153, 1306896, 1294756, 851443, 1166223, 1147117, 666643, 732230, 1165347, 1350625, 1359756, 1383242, 1238176, 1100869, 1371683, 931273, 976448, 1099460, 1641981, 1785499, 1479603, 1284541, 1335322, 1141196, 1432717, 1802782, 1987027, 1162436, 1065119, 1343017, 1784034, 1486206, 1093409, 1453317, 889630, 657288, 439385, 798801, 1126984, 640344, 652857, 668785, 1288448, 1213581, 816017, 941115, 1153997, 815745, 1227453, 1428566, 881335, 1511955, 1488411]
2467A488411j69427j54324k41417j36053j29299K385k02042K02197K56872r1854
2457H25449r4468L08137n35333j62376K57631O6965M2881k10528K78360k63119
2447E13599K32562j03059p9899J76914O27572l99478m95579K24392l47300K34972
2437E84696L99588k89697L90919m44087J26823j23921n2697O4395O2952l99506
2427C19465K78527J84918m49872J60261j42248l45927j12046M15864K63958n45538
2417B7362L2282L34194l05616L0504M44273K30938n56887m9057M5885M6524M92800
2406G73202l78685P1040P6055n21881L11346n1272j28786o825K76900k81021J93115
2395C33188R1475j66183L23142P8292L0377m06411K20698L01865o81539K75906
$$ y = [1488411, 1318984, 1164660, 923243, 787190, 657891, 660276, 458234, 660431, 917303, 825449, 730981, 1039118, 503785, 341409, 599040, 666005, 708886, 498358, 776718, 513599, 746161, 643102, 563203, 740117, 1367689, 968211, 472632, 697024, 349724, 584696, 984284, 694587, 1085506, 641419, 768242, 644321, 591624, 656019, 718971, 319465, 597992, 782910, 333038, 493299, 351051, 5124, -106922, 308942, 572900, 27362, 59644, 393838, 88222, 118726, 562999, 793937, 237050, 187993, 233878, 280402, 773202, 394517, 465557, 541612, 19731, 331077, 279805, 151019, 144194, 421094, 140073, 333188, 424663, 258480, 581622, 659914, 690291, 283880, 504578, 806443, 124904, 400810]
2385D00810M56334j65516l13358J52248j63846l66584K59918j06169N6691J18214
2375C28742K688j23117l2946l0765R2843K64019K344N6115K7053k15544L6928
2364D08360J22671K11166m84739Q1956J27395J03349k57684L4474K76449J61979
2354G85376j49401m53524L0600k44510j99760L58741l11940J95434J74631M6797
2344B32444J85241k97094j83809n8387M20197o6660K58425m42349L74876l58016
2334F4868l91591J98460K04206j49550L6207N27174K01834m32063l72384j98606
2324c11445j1737L05637L58319M2951k06284N1245J79205L7482K26616P4480K1549
2313G68018K37666l50772r42j96247J8460M36341j18959J02491p836K05461q0802
$$ y = [400810, 857144, 691628, 378270, 530518, 366672, 88, 260006, 153837, 210528, 328742, 331430, 208313, 175367, 144602, 237445, 501464, 503808, 559923, 586976, 371432, 408360, 531031, 742197, 257458, 339414, 466809, 570158, 312474, 346948, 623397, 785376, 635975, 182451, 213051, -31459, -231219, 127522, -184418, 11016, 185647, 232444, 417685, 120591, -63218, -121605, 298592, 231932, 490357, 48008, 422884, 64868, -326723, -128263, 75943, -73607, -37400, 489774, 691608, 259545, -112839, -311445, -323182, -17545, 340774, 383725, 177441, 228686, 407891, 445373, 671989, 746469, 768018, 1005684, 654912, 653970, 457723, 476183, 912524, 793565, 896056, 888220, 1093681, 1012879]
2302A012879J58928J12161m43982P9076J95942k59247r5535k95726j65756R5111
2292C93851O95984m45410k43269L16363J41680l98727M2068R3183l62802L1177
2282B64098R1143Q7689m0292J27373l44754j0378j44697M92417n3044M25264Q282
2271I03101k39743j85634K03005k1830l88646O6277J11956l05295K12442l1595
2261C24038k45914M5546K97682j58950j92400K25953K74480p4566l13631Q9612
2251B71850J98524j1850J195n2571J77804K01246n16460O58071J98010l49063
2241G76756j10317K20972p8838N5723k61627n9257N26514q05785l7957M0763L7305
2230C04252P87549o24567k52666N1262p6523M22978P82413j95523m84740k13307
$$ y = [1012879, 1171807, 1283968, 839986, 919062, 1115004, 855757, 760222, 464496, 298740, 393851, 1089835, 644425, 401156, 717519, 859199, 460472, 502540, 595723, 232921, 264098, 355241, 442930, 402638, 530011, 185257, 174879, 30182, 522599, 469555, 894819, 903101, 663358, 477724, 680729, 658899, 270253, 336530, 448486, 143191, 355633, 324038, 78124, 123670, 421352, 262402, 70002, 295955, 570435, 495869, 182238, 271850, 470374, 458524, 459719, 407148, 584952, 786198, 269738, 927809, 1125819, 776756, 666439, 887411, 808573, 864296, 602669, 543412, 1069926, 264141, 226184, 266947, 304252, 1091801, 467234, 214568, 265830, 189307, 612285, 1394698, 1199175, 714435, 501128]
2220E01128r7218l5660K72494L02180j60043j7633n2867O2702l05220j05219J91141
2209E55785k52418M542K88927l17170J82585J44363K17500j35440r7990m85476
2199A05208M28051N04768m26459j14670K53623K00278k55063m94755N32612o9423
2189F64170k357L56726j37240k91316L0891J41848K9594J88337j96537J60358
2179I44474M23988m6713n4944m0602K3252j22868N9644k0637L55931Q08938K55673
2168B586136P8170n90141m03812q0046j11597j01054j29817o46573K45491J48291
2158I95048J04154M97107N0049n80873K68875O7132J86831M533m85122M29934
2148A537668N5150N8395l328K26209J90087k56327l22798K43342O6810m3343P20593
$$ y = [501128, 403910, 368250, 640744, 942924, 782881, 765248, 712381, 775083, 469863, 364644, 555785, 303367, 307909, 596836, 279666, 462251, 606614, 824114, 688674, 590684, 105208, 533259, 1038027, 611568, 496898, 750521, 950799, 695736, 200981, 733593, 664170, 661813, 1018539, 881299, 589983, 620874, 762722, 792316, 980653, 784116, 944474, 1368462, 1321749, 1266805, 1226203, 1249455, 1126587, 1186231, 1165594, 1521525, 2330463, 2586136, 2664306, 2074165, 1670353, 1590307, 1478710, 1377656, 1247839, 601266, 846757, 995048, 1099202, 1596309, 1646358, 1065485, 1334360, 1401492, 1588323, 1592856, 1107734, 1537668, 1592818, 1651213, 1647885, 1874094, 2064181, 1807854, 1485056, 1728398, 1795208, 1751865, 2472458]
2137B472458r926j79377K65252R795k31687L97847J50707K36539k4661L75068
2127C462015m7842j83048L23004j96192k18117M06720J81789j34127J11891K51721
2117C957814k13418k46010L42749J74648P4538k5687M03025M42729l35342l2604
2107D542442L39458L65174O68118J7852k94320P1382M05469L24147J47317M55176
2097G042215N40898M808O01528J25891J66873K34474J26006O33150N72137Q88570
2087A0936550M30511O78538J146491M06005R28386J694787J402015J950995J500305
2078B1074583K343616K400785K382020L069874K700173L165206M042815N143146
2070D6322218N991421P648376Q695176Q577871J1304214J5200466J9540332J9091782
$$ y = [2472458, 2462532, 2283155, 2548407, 2558202, 2326515, 2724362, 2875069, 3111608, 3086947, 3462015, 3414173, 3231125, 3554129, 3357937, 3139820, 3546540, 3728329, 3594202, 3706093, 3957814, 3744396, 3498386, 3841135, 4015783, 4090321, 4064634, 4467659, 4910388, 4575046, 4542442, 4881900, 5247074, 5915192, 5933044, 5638724, 5710106, 6115575, 6439722, 6587039, 7042215, 7583113, 7587921, 8189449, 8315340, 8482213, 8716687, 8842693, 9475843, 10047980, 10936550, 11367061, 12045599, 13192090, 13598095, 14526481, 16221268, 17623283, 19574278, 21074583, 23418199, 25818984, 28201004, 31270878, 33971051, 37136257, 41179072, 46322218, 52313639, 59962015, 68657191, 77235062, 88539276, 103739742, 123280074, 142371856]
2062A42371856J1167891o083054k4559056k7636134k0459722j3170781q894316
2055E2736684o752428n063042m170783l357842k277475k009555j535821j893603
2047B5676135k370388k092250j421576j771112j499482q47684o83801q14352m05932
2038A3769558q27948l67347m33095q65985n14545l88176o40072K14661n58576
2029I388475n22680j85015n68381n48667J82546M5910m47067n13771J38018K31083
2019G200451r36589k52153j54750L06385k78872m85965J07414L19283l57293l68701
2009E099210l51042n99314L96633k30546k56166O5625N03228j80028k42641n10750
1999C694209l45021L52223J47487j74236l79549M69515m73521l09162j3171q8675
$$ y = [142371856, 153539747, 147456693, 122897637, 95261503, 74801781, 61631000, 52736684, 45984256, 40921214, 36750431, 33392589, 31115114, 29105559, 27569738, 25676135, 23305747, 21213497, 19791921, 18020809, 16521327, 15673643, 14989842, 14175490, 13769558, 12941610, 12574263, 12141168, 11275183, 10760638, 10372462, 9732390, 9947051, 9388475, 8865795, 8680780, 8112399, 7563732, 7746278, 7792188, 7345121, 6831350, 6969368, 7200451, 6263862, 6011709, 5856959, 6163344, 5884472, 5398507, 5505921, 5825204, 5467911, 5099210, 4748168, 4148854, 4545487, 4314941, 4058775, 4124400, 4627628, 4447600, 4204959, 3694209, 3349188, 3701411, 3848898, 3674662, 3295113, 3764628, 3291107, 2981945, 2968774, 2880099]
1989B880099L5619k46982j6661J15253m20727M11668J70460j44932k74655O1731
1979B570873Q5791j96787K6776j58090N0891l26322r2148K74432l93261r0522
1969A751633K31985J8570m35280k23157L29565K5678p5884J67379K11348Q8768
1959B090605m32765J45331k32707L00030Q2079m05200k4346j80055K67724K49655
1949A860351p5303j58351j72897K21148o88786K0498l9566J2202J46206N0819
1939A176321K1683m36280k8198K81503J98329j51358K72456j328l43749k53836
1929G35543M72609J33252j16996j97213J10419L35026j43781M6026J03766k72330
1919A206321m0248k86082L56187j17294P3408l6229J3867K277M10868k56575n09641
$$ y = [2880099, 2915718, 2668736, 2652075, 2767328, 2346601, 2758269, 2928729, 2783797, 2509142, 2570873, 2656664, 2459877, 2486653, 2328563, 2379454, 2053132, 1960984, 2235416, 1842155, 1751633, 1983618, 2002188, 1566908, 1343751, 1673316, 1698994, 1623110, 1790489, 2001837, 2090605, 1657840, 1803171, 1570464, 1870494, 1952573, 1547373, 1523027, 1342972, 1610696, 1860351, 1785048, 1626697, 1453800, 1674948, 986162, 1006660, 967094, 979296, 1125502, 1176321, 1198004, 761724, 733526, 1015029, 1213358, 1062000, 1334456, 1333128, 989379, 735543, 1208152, 1341404, 1224408, 1027195, 1137614, 1472640, 1328859, 1374885, 1478651, 1206321, 1166073, 879991, 1236178, 1118884, 1192292, 1156063, 1169930, 1172207, 1583075, 1326500, 816859]
1908H16859J8628k07741j20466J51242l54721m19629M43156L17162M5460J97948
1898H87898k08552k25677o1009J16089K58611j27793j98472j89364L85333j7686
1888F19378k4525K03240q8888k80433k4614l3655K36166q1081R146l25489j60002
1877D9243r8313K42278J41835K65236M51924l70320j95787K790K23727J41105
1867H53718L35587n76905K43553J56726j82729n03811k41955M88232l34763L8048
1857B75701r2205M1009P6597j46024K81817j57534k93473j80236N31273N77770
1847I14695k25690m22490j55972k12346Q2376K35916J3951j51193k03288K70275
1837A46234o03852K30264N8813K74688L66048L24191N4653m93616m91541K19384
$$ y = [816859, 835487, 627746, 507280, 658522, 303801, -115828, 327328, 644490, 689950, 887898, 679346, 453669, 392660, 508749, 767360, 639567, 441095, 251731, 637064, 619378, 594853, 798093, 709205, 428772, 404158, 370503, 606669, 525588, 534734, 209245, 49243, -49070, 193208, 335043, 600279, 1052203, 681883, 486096, 488886, 712613, 853718, 1189305, 612400, 855953, 1012679, 829950, 326139, 84184, 572416, 237653, 275701, 183496, 224505, 301102, 155078, 436895, 279361, -14112, -194348, 336925, 914695, 689005, 266515, 110543, -101803, -19427, 216489, 230440, 79247, -124041, 146234, -457618, -227354, -168541, 106147, 472195, 796386, 851039, 357423, -134118, 85266]
1827H5266M94371J42284l15115k1651J4016J42716J79226j38393K94883j17878
1817G59725L21280J78946n56656j15657j14761j44973J41203J17355k75954l71060
1807f0552Q2201N43545L86317j27497m11433m31531J46809J93099M1555N1043
1797D13556l70377m80647N81022j24984O21851J07023J19594j50754l54818p34703
1787c73237J4482L11213O49561L61560m35947k20488k23779L39770K63787J0361
1777F97283j22673l48885j98876q3806L38076k28096n21344K50778M50792J5179
1767B48428k04874J38210k95879L95267k83571j88848O3011J37324Q555J54991
1757A72614J79803j94845J53373P0061j65779j8331k111n0300M6450L93225k76581
$$ y = [85266, 579637, 721921, 406806, 385155, 399171, 541887, 721113, 582720, 877603, 759725, 1081005, 1259951, 703295, 587638, 472877, 327904, 469107, 586462, 310508, -60552, 21649, 565194, 951511, 824014, 412581, -18950, 127859, 320958, 362513, 413556, 43179, -437468, 143554, 18570, 640421, 747444, 867038, 716284, 361466, -373237, -358755, -47542, 602019, 963579, 527632, 307144, 83365, 423135, 686922, 697283, 574610, 225725, 26849, -56957, 281119, 53023, -468321, -217543, 233249, 248428, 43554, 181764, -114115, 281152, -2419, -191267, -128256, 9068, 17623, 172614, 352417, 157572, 310945, 381006, 215227, 196896, 194785, 144485, 190935, 584160, 307579]
1746C07579j05609j32639J79906m36205L76295j73966K80950K23214k02779l10039
1736F707j09160J25875P59443l16779l22774J85150n8792J65387n34227Q8802
1726a0368l7239J18713O840j63824j99697j61155m9274N74802K10024k18533l46835
1715b76546N67919K91208m07185l1576j04548r2339N83064l6906k53148j32240
1705A07703M6000m6650o1027k2837K28510N3659k68007n29110P70215m8744j5466
1694B14246P4937K00329j64069m08618J32610K2091J21504l81458M99272k43899
1684F6945J09833L36130m84505Q0719L80702l9863k34752o0696J17449q1956K079
1673A92085J66858p3338J89341k95860m61217l15277M65166j13315p0926L15758
$$ y = [307579, 201970, 69331, 249237, -186968, 189327, 15361, 296311, 519525, 316746, 6707, -102453, 23422, 782865, 466086, 143312, 328462, 269670, 435057, -99170, -10368, -47607, 71106, 77946, -85878, -285575, -446730, -496004, 78798, 288822, 70289, -276546, 291373, 582581, 175396, 143820, 39272, -53067, 529997, 493091, 239943, 107703, 153703, 107053, 46026, 23189, 251699, 305358, 37351, -491759, 278456, 229712, 214246, 289183, 489512, 325443, -83175, 49435, 71526, 193030, -188428, 310844, 66945, 176778, 512908, 28403, 109122, 489824, 449961, 215209, 154513, 271962, 190006, 192085, 358943, 285605, 474946, 179086, -282131, -597408, -132242, -245557, -316483, -725]
1663g25j93692k2331J51903J58930Q1932K28597J68239q8961j71923l68571j16563
1652a73165M20587K12787l17021m51578K95484P0396k69037O756J43879L16917
1642B56005j31610m60254M23170l63102P4905J73745L1543J61815k71161J78882
1632G3938K95198m53716K89994K15461p71423k3086M19983M53027p6855j35825
1622B86696k40067j64660J27910L92234l94374j22894k20134j70547J52495K79243
1612g4098j7902O0019M70583k01336o9855M11751m00888m12586P11935m09134
1602F8489K26263j21217k202l9432j10229k01189j77148M44647j65471J82032
1592A04543M13615k22945n8302j95122k23214L26272N04379K978l18696m06017
$$ y = [-725, -194417, -216748, -64845, 94085, 176017, 404614, 572853, 483892, 311969, -56602, -173165, 247422, 460209, 143188, -308390, -12906, 57490, -211547, -204791, -60912, 256005, 124395, -335859, 87311, -275791, -200886, -27141, 4402, 166217, -104944, 73938, 369136, -84580, 205414, 420875, -350548, -373634, 46349, 499376, 422521, 286696, 46629, -118031, 9879, 402113, 7739, -115155, -335289, -505836, -353341, -74098, -92000, -31981, 438602, 237266, 167411, 579162, 178274, -234312, 477623, 68489, 294752, 173535, 171333, 131901, 21672, -179517, -356665, 87982, -77489, 104543, 518158, 295213, 236911, 41789, -181425, 144847, 649226, 652204, 333508, -72509]
1582g2509L84555j17219k2670k98259k03632N5132K87059p6696r0166j07376J12116
1571a49665k1171J08345K50117l40774J11619k61158P9178M13332J57561m1885
1561C05499l1254m35813O1749j4858j32399k08770M59268K1714j8014J06827l9264
1550G4685m32269J89267K36186J80378j5499J67413N6031m02676m38449j14010
1540d98943q9170J56613J85432L85704j98164N43971k21515l93264K11160K88196
1530C70020K01344k09694k47285l25266M68722k06226K7301q522Q1073M09318
1520E60785K36778l21496j81140N7589J0224J43488k40351o3305J98872j7254
1510C84190J72441j50347J03662l77840j55242m0206J90365l51019J44353k67260
$$ y = [-72509, 312046, 194827, 172157, -126102, -329734, -274602, 12457, -64239, -154405, -261781, -149665, -170836, -62491, 187626, -153148, -41529, -302687, -223509, 189823, 347384, 305499, 274245, -161568, -99819, -114677, -247076, -455846, 3422, 25136, 7122, 113949, 74685, -357584, -168317, 67869, 248247, 232748, 400161, 456192, 53516, -384933, -498943, -588113, -431500, -246068, 139636, -58528, 485443, 263928, -129336, 81824, 370020, 571364, 361670, 114385, -210881, 257841, 51615, 78916, 70394, 151467, 560785, 797563, 476067, 294927, 352516, 362740, 506228, 265877, 202572, 401444, 384190, 556631, 406284, 509946, 132106, -23136, -63342, 127023, -223996, -79643, -346903]
1500c46903P4713K15254J2475O4054q3129o7835m1524N13088j08393k76004K97398
1489B53194o1099l03554L71037L25826o34425K17439O02660q42117J79820L543
1479A12324l75531j33742N85949O5429l0713m02952J30000J88408J18701j42355
1469A15518j12282j09329j53509m7786K08510L10255j30273Q8132l63184o9332
1459b63280k88668M50585L73942j48176J21729m07701j12791N35502K73840m17676
1449A17306m5774K94184k90744j93256M11100k29623N0808M27691k62133k35615
1439D3944p4954N11841J27221l25192j93865J99853J4194m11518K10626k0651
1429H1499m02920J45231M16084M9545R7777Q9086k57267j21939k8280N22417k96199
$$ y = [-346903, -272190, -56936, -44461, 19593, -63536, -131371, -172895, 340193, 231800, -44204, 253194, 192095, -111459, 259578, 585404, -49021, 168418, 771078, -71039, 108781, 112324, -263207, -396949, 189000, 254429, 223716, -179236, -49236, 139172, 257873, 115518, 3236, -106093, -259602, -307388, -98878, 211377, 81104, 169236, -193948, -263280, -551948, -101363, 272579, 124403, 246132, -161569, -274360, 261142, 534982, 117306, 71532, 365716, 74972, -118284, 292816, 63193, 114001, 541692, 279559, 43944, -31010, 480831, 608052, 282860, 88995, 288848, 303042, -108476, 102150, 81499, -321421, -176190, 239894, 289439, 387216, 476302, 219035, 97096, 68816, 591233, 295034]
1418B95034j34585j51205K3956j28820K66148J67090j5932l07109L2517M37649
1408D84743l59611q6309j19929k84292L10670K20718m61080m39214L78444O03321
1398B47461n9021J25943J26017l8983K297k85044l94182l54687K32909N65785
1388A68495l0069p1227k67534M4029M30677J33766j7800j67094L8563M1677L8005
1377C41488j760J76171Q7793k27279K91847o52421j60288k47557K70962N3135
1367f7909m7649L71406N77967J37155o52085m44509K26563L97798l85164j20281
1357f708K53755J26906l98037j00068K2069k14426K53920l58084k67890M35663
1347b52900J91844p8241M2196J3842q910J39048N0569J0077J40665j90732j55916
$$ y = [295034, 160449, 9244, 33200, -95620, 170528, 337618, 321686, 14577, 47094, 484743, 125132, 38823, -81106, -365398, -54728, 165990, -295090, -734304, -355860, 247461, 188440, 314383, 440400, 401417, 403714, 118670, -275512, -630199, -397290, 168495, 138426, 67199, -200335, -156306, 274371, 408137, 390337, 223243, 261806, 303483, 341488, 339728, 515899, 603692, 376413, 668260, 15839, -144449, -392006, -121044, -67909, -115558, 255848, 833815, 970970, 318885, -125624, 100939, 498737, 113573, -6708, 247047, 373953, -24084, -124152, -102083, -316509, -62589, -420673, -688563, -252900, -61056, -139297, -97101, -83259, -92169, 46879, 97448, 107525, 248190, 57458, -98458]
1336i8458n8654O7807K83253n22322P3887K04925J83933K62559l62595m3327P5577
1325F6585O2062J39568k53920l047m11772J15003J45638l11177p2280O28434m2034
1314F3060j97764k18571P0604r6636R9132Q1082M35226R3161P4893k72613l89183
1303b57609K53481l38386M30632r0064J24337m46682N7257n7382j50350N26277
1293E1511J15734k7805o060r0860J47422j20906n0519J20599m0584k4151K43466
1282C17847k31943k98891N31832k17221k51427L34268J9205k12178k40579o92
1272b49779P5457J4402J40505j95534j59605L18692O3327k44941L62654M20836
1262E46014n51817j97231L02166j05906j06585Q4856J31166k72879L24887K36041
$$ y = [-98458, -157112, -89305, 193948, -328374, -254487, -49562, 134371, 396930, 34335, -8992, 66585, 128647, 268215, 14295, 11248, -400524, -285521, -139883, -451060, -523340, 105094, 63060, -134704, -353275, -282671, -379307, -280175, -199093, 236133, 329294, 404187, 131574, -257609, -4128, -342514, 88118, -1946, 122391, -324291, -267034, -324416, -474766, 51511, 167245, 139440, 133380, 42520, 189942, 69036, 18517, 139116, 98532, 74381, 317847, 85904, -212987, 318845, 101624, -149803, 184465, 203670, -8508, -249087, -249779, -174322, -159920, -19415, -214949, -374554, -55862, 7465, -237476, 125178, 546014, -5803, -203034, 99132, -6774, -113359, -28503, 102663, -170216, 154671, 390712]
1252C90712l30427j13879j28790J9050j27098M63057M0729j08681L19825m19551
1242D947K55748l41786q4652J96570n06775J69403l40694Q9354O9247J43390M64712
1231A19464j02402k64153K77740o6231m51294M26279j73186l8493K53544j63872
1221a82604J53947l99029J88235L08094K43709j46624l21530K92407K84916m28803
1211g282M330J26620J14460N9405n3658J8052j60113J98685j56278j15513j86881
1200a58173m58550M47569L12325m97744N8098M67967O2285l68365l2125J22038
1190d4675r7869K4538J01363l96160Q682K11380m01083M18361K5154P7135j09785
1179a82959L24257O03237j25122l61776j75463j94069P6187O7632l26428M20298
$$ y = [390712, 60285, -53594, -182384, -163334, -290432, 172625, 213354, 104673, 424498, 4947, 260695, -81091, -165743, 30827, -475948, -306545, -647239, -557885, -488638, -345248, 119464, 17062, -247091, 30649, -35582, -486876, -60597, -233783, -272276, -18732, -182604, -28657, -427686, -239451, 68643, 312352, 165728, -155802, 136605, 421521, -7282, -2952, 123668, 238128, 297533, 243875, 261927, 101814, 300499, 144221, 28708, -158173, -616723, -169154, 143171, -354573, -296475, 171492, 233777, -134588, -166713, -44675, -142544, -118006, -16643, -412803, -404121, -192741, -593824, -175463, -150309, -73174, -182959, 141298, 744535, 619413, 257637, 82174, -111895, -35708, 31924, -294504, 125794]
1169A25794l75384m93612J69552L22853j90869K79505M45J56360m44073L5160
1159d14269J5510J69700j3442L09859L25087m87258j14854R9048p4231q0598K39099
1148b6349L81295q700m89168k91578r0224l6672N68357j49660k28912R7978M42829
1137A69196M6329P8631l87196L32084q2143K53698r0342l04894L51721J9755n4298
1126C32541o67439P09219j1981R2046K5563q3853j74053l77460K20836j05249
1116c9830k47392j42333N67486J57724R7615R0188l44536l23267J96491N85801
1106E97947l14435j82681k21505J64537j62088l16482j49930j34575K22193M75217
1096b1802M7443J38031q730j8535k49360M89544k40864j83891J04621k11445L60368
$$ y = [125794, -249590, -743202, -573650, -250797, -441666, -162161, -161716, -5356, -449429, -414269, -398759, -229059, -242501, 67358, 392445, -94813, -209667, -110619, -184850, -265448, -26349, 354946, 346246, -142922, -434500, -524724, -561396, 6961, -142699, -371611, -273633, 169196, 215525, 294156, -93040, 239044, 156901, 410599, 320257, 15363, 367084, 386839, 332541, -334898, 374321, 362340, 454386, 479949, 396096, 222043, -155417, 65419, -39830, -287222, -429555, 137931, 295655, 393270, 483458, 138922, -184345, 12146, 597947, 283512, 100831, -120674, 43863, -118225, -434707, -584637, -719212, -497019, -21802, 25641, 163672, 154942, 136407, -112953, 376591, 135727, -48164, 56457, -154988, 205380]
1085B05380k59973j17789K00515m26380M18982J8234k41852j39262K38502m064
1075a07707r3301M3917K20991K89804L8056l59244n21734J77151K25205j21461
1065b08323n0545L76042K77562o71035J86607L00343K24181n65395j57638r0228
1055c78429L57478K28236Q672p5525l48283K99986O971M86013l12787l91376l12819
1044d31863M88024l28371K42445L00168l54885N17796q6388j77827O4329k43479
1034a0051R0862j46271J75429m44053L40732j22959k535K29272p43403o8083P1282
1023f29778J02438P3011M92561P348l22411K89398k17964k46958L05778J64081
1013A7504l74590J70018J86738k21349j62840L20683L73750O224k04702l86458
$$ y = [205380, -54593, -172382, 28133, -398247, 20735, 38969, -202883, -342145, -103643, -107707, -201008, -157091, 63900, 353704, 391760, 32516, -489218, -312067, -86862, -208323, -258868, 117174, 394736, -276299, -89692, 210651, 434832, -130563, -288201, -378429, -20951, 207285, 215957, 140432, -207851, 92135, 99106, 585119, 272332, -119044, -431863, 56161, -272210, -29765, 270403, -84482, 433314, 346926, 169099, 233428, -10051, 80811, -65460, 109969, -334084, 6648, -116311, -118846, 110426, -632977, -701060, -629778, -527340, -454329, 38232, 45580, -276831, 12567, -205397, -452355, -146577, 17504, -357086, -187068, -330, -221679, -384519, -63836, 309914, 316138, 111436, -275022]
1003b75022J24732K2542J96807l32911Q8069j38242K42944p1926P6718M1715J4237
992a0337K24002K16355k59621l48966L22189j34925j63278k60671J32384J3385
982b69483j06501L27675N12102n59532l50410K18572K43794k16792l6583O7368
972a69790R7983m80308L82527K6015J83130o8245q575P6233n8859r6853m32263
961e49005o196R8614M02342m26740J16305K83482K86747l44643l31666M32956
951c7804J32956j02482m86653k4089M6016j52571K4120N04251j73747k12092L46655
940a35440r4460n43484K63498J11648J07390K8122R3718j14827M01939j48239
930c0135m37255k08101M74176N72618J7932l87673O0728n8355j0027j51980k85063
$$ y = [-275022, -150290, -127748, 69059, -263852, -175783, -314025, -71081, -143007, -66289, -24574, -10337, 213665, 430020, 170399, -178567, 143622, 8697, -154581, -415252, -282868, -269483, -375984, -48309, 463793, -95739, -446149, -227577, 16217, -200575, -237158, -169790, -71807, -552115, -169588, -143573, 39557, -28688, -37263, 38970, -19889, -116742, -549005, -555201, -456587, -54245, -480985, -364680, -81198, 205549, -139094, -470760, -37804, 95152, -7330, -493983, -518072, -472056, -624627, -600507, -96256, -270003, -482095, -135440, -229900, -773384, -509886, -398238, -290848, -262726, -169008, -283835, 118104, -30135, -467390, -675491, -201315, 371303, 389235, 1562, 62290, 3935, -6092, -158072, -443135]
919d43135J32171L8018J39677j02403j09334J14237L70078k11227K92966J93807
909D14855m92714l7244J52666p6104l5249l4697L52845l01584q9713j18814M38204
898A72451l67392J52888K76915j7526m34285J4341l76284L20798N0969J27858
888g9267m74256k18329M59917K37480j80974O1078q1436M49106k89888j03820
878b20389N31800l73457k02005K93878J16447j17735k21127R4815L45653r804
868B38076K10956m68194K01372Q161J62554R648l40494j10208O0881J79339J5950
857A68041l58091j60994K27406K7820k198m35338N92688L23818p88145m6380L57734
846i3639J1917L70522k69271k24030k7711L58969M2103n31422J50026k08171N81828
$$ y = [-443135, -310964, -272946, -133269, -235672, -345006, -230769, 139309, -71918, 221048, 414855, -77859, -115103, 37563, -38541, -73790, -108487, 244358, -57226, -146939, -265753, 172451, -194941, -42053, 234862, 217336, -216949, -202608, -578892, -258094, -207125, -79267, -553523, -771852, -311935, -74455, -255429, -194351, -275787, 173319, -116569, -220389, 311411, -62046, -264051, 29827, 146274, 28539, -192588, -97773, 247880, 238076, 449032, -19162, 182210, 190371, 352925, 362573, 22079, -88129, -27248, 152091, 168041, -190050, -351044, -123638, -95818, -98016, -533354, 59334, 383152, -404993, -451373, -93639, -81722, 288800, 19529, -204501, -232212, 126757, 168860, -362562, -212536, -420707, 161121]
835A61121k41031r6489Q1125K77633o5224P1768j07369q9247J55110l08314k5189
824a86106J79128l23120J54994M88243o97785n52108L41718J41741j04453P2290
814d85458M43049j3202N51594m10387l08026O8725R4233L29572k4478l41755R7529
803A396K50170k80898q7661K59435r058k4461j89501L73018p983J77091L9917
792E01465j94595j56987n15617O1537K79367j00871j56790K30318k68717J5095
782c05795L10569n3949J60487o4401P5034M18645o03234k00904k69489N34955
772A918L49751l90511r8391J00824K65910k52778K83178M1680j00259j79607j29473
761a07758L117J09633o6042J35595N08153R808k95808m27209L88297k21028r7642
$$ y = [161121, -79910, -176399, -95274, 182359, 117135, 188903, 81534, -7713, 147397, -160917, -186106, -6978, -330098, -175104, 313139, -384646, -936754, -595036, -453295, -557748, -485458, -42409, -55611, 495983, 85596, -222430, -153705, -59472, 270100, 245622, -96133, 1396, 251566, -29332, -116993, 142442, 133384, 108923, -80578, 292440, 284457, 461548, 501465, 306870, 149883, -365734, -304197, -24830, -125701, -282491, -52173, -320890, -305795, 4774, -49175, 111312, 46911, 121945, 540590, -62644, -263548, -533037, 1918, 351669, -38842, -137233, -36409, 229501, -23277, 259901, 301581, 201322, 21715, -107758, -104641, 4992, -61050, 74545, 582698, 592506, 296698, -130511, 257786, 36758, -60884]
750f0884k6904k6012J38869k38612r2970o789J9100l6632j29978L88383j95952
739b68381K49609o1288j5274K10247m88093R4830J93302o5457J81932j17942j83882
728b70397N312J76219j5050J55652L58756N6840k78571n92697J23603K43460K21576
717A84703N482j24464r012k9611l84992q8789N97371J28974L19680k11542l3163
706C54637J36739o52869k87824m2112M9654M29905K85302p8870Q5304j5082l14059
695d9275K7077R5340n60227L01395R5400o4328j34049r9783j55514M0847L87205
684a15912R8460k12044m15947M41397L71118k88849J97164J08992M2955q7361
674A39973j09307n26407L1468L86062K22444K22774k56380n2329o73435n7092
$$ y = [-60884, -87788, -113800, 25069, -213543, -306513, -313302, -294202, -330834, -460812, -72429, -268381, -18772, -80060, -95334, 114913, -373180, -278350, -85048, -150505, 31427, -86515, -270397, -265085, -88866, -103916, 51736, 410492, 467332, 188761, -403936, -280333, -36873, 184703, 190185, 65721, 56709, 27098, -357894, -446683, 150688, 279662, 599342, 387800, 354637, 491376, -161493, -449317, -491429, -441775, -11870, 273432, 194562, 279866, 264784, -49275, -22198, 73142, -487085, -185690, -90290, -154618, -288667, -388450, -543964, -503117, -115912, -17452, -229496, -645443, -204046, 167072, -121777, 75387, 184379, 227334, 139973, 30666, -495741, -464273, -78211, 144233, 367007, 110627, 58298, -615137, -672229]
664f72229K49312K13725M8414J44815J52512q093j20902k62739j42952r620k10692
653f18449L72005N5628j37225J69203R6328L60038k23280k29805J2122L8166J64868
642E9599L4952r854K27901j88524m57611J17814l90141J64164L34761j51705k51468
631e10112Q0187L08756K11695J31310k53377n58765J51219j00717K12874L6081
621b90849n0919J70967K09530J42956l86791M27385k13827j68303n6867q9013
611c05731K59606L88415j40631j67917R4930J69127q2424r6925j82528K677N2777
600h624J35451K51231j6913K8215j8747l7011o3221P77M0923o71276k40474p2046
588f71715O08799M0202L45361k24331j43242K01249k22813J56440M78482l30175
$$ y = [-672229, -422917, -209192, -160778, -15963, 136549, 128456, 7554, -255185, -398137, -407757, -618449, -246444, -190816, -328041, -158838, -62510, 297528, 74248, -155557, -143435, -105269, 59599, 94551, 84697, 312598, 124074, -333537, -215723, -605864, -441700, -106939, -258644, -510112, -429925, -121169, 90526, 221836, -31541, -590306, -439087, -539804, -326930, -290849, -341768, -170801, 38729, 181685, -205106, 222279, 8452, -159851, -216718, -305731, -46125, 342290, 201659, 33742, 128672, 297799, 215375, 118450, -64078, -61401, -8624, 126827, 378058, 361145, 389360, 370613, 333602, 270381, 271158, 312081, -359195, -599669, -671715, -62916, -22714, 322647, 98316, -44926, 156323, -66490, 89950, 568432, 238257]
578B38257k77258l0291J8189K50813J07302j6431J32241m50884k89526K75834
568d1754J90959J92602j64022j21794J63370L66289o22376M90998J68022J8978
558F41272p55948k08202L9054M71658k32170L7606j87904m6095K27370K73223
548B59864K16759n51631O1835K00138j05123J72568j29520o0914p9883k48305
538b64212K8688N46K07769m63956K21463Q7567j89215K81714J47667j25744P28909
527F61196l4315l87599l68798l6796j652L9541O6836L0419k40181P7390j91843
516c85802j69150K21364K27623L35233l64392K16405Q4353k06352j39055O5539
506a14234n8503j32279j30616K66468P4099q5453K72303K51887l35071l50764
$$ y = [238257, -39001, -69292, -51103, 199710, 307012, 290581, 422822, -28062, -317588, -41754, 149205, 341807, 177785, 55991, 219361, 585650, -36726, 454272, 622294, 641272, -114676, -322878, -283824, 187834, -44336, -6730, -194634, -240729, -13359, 259864, 476623, -75008, -13173, 186965, 81842, 254410, 124890, 63976, -15907, -264212, -235524, -234978, -27209, -491165, -269702, -182135, -371350, -89636, 58031, -67713, 661196, 626881, 239282, -129516, -166312, -167964, -128423, -61587, -31168, -271349, -193959, -385802, -554952, -333588, -105965, 229268, -135124, 81281, 165634, -40718, -179773, -114234, -172737, -305016, -435632, -169164, -95065, -180518, 91785, 343672, 8601, -342163]
496c42163J70599j50017K95079J788l07279L87092K2767k56539o2987k95880M57360
485h0180J85311j6011L58637J68450j48101n64521q6778k2458L12771j96053j4100
474a03033l60376P0K44031j31265O52492j02612m68594j03999L38897J54845L94726
463E15182k89144Q0842n88687q6068J31444k37124R5653n19721N88594L90899
453H1870l36273P0895q1512L07851o8430M5352P01170p61338j23173q2280j47687
442c93555P0772k06355J75059J69433J77105J65401l0749O0487R1961k82644j11808
431a14893n7752n205K36906k48469L95717n21073Q263K81671k98000k24j66094
420d89153M80032O2011K9405o7727j82242l2899j35190J12787J57031j36110L11599
$$ y = [-342163, -171564, -321581, -26502, -24714, -331993, 55099, 77866, -178673, -241660, -537540, -80180, 105131, 89120, 447757, 616207, 468106, -96415, -183193, -205651, 107120, -88933, -103033, -463409, -463339, -219308, -350573, 301919, 199307, -269287, -373286, -34389, 120456, 515182, 226038, 306880, -281807, -367875, -236431, -473555, -377902, -897623, -309029, 81870, -254403, -183508, -265020, 42831, -25599, 19753, 720923, -40415, -163588, -245868, -393555, -322783, -529138, -354079, -184646, -7541, 157860, 127111, 187598, 279559, -3085, -114893, -172645, -177850, 59056, -189413, 206304, -314769, -306506, -24835, -322835, -323059, -489153, -9121, 52890, 82295, 14568, -167674, -200573, -335763, -222976, -65945, -202055, 109544]
409A09544l04813L5445J24605M37336j83654l11288K65281J85691j83669l39815
399a65337O8925l52531J20184L87018J7899N40179j01613q17774K1414j81561
$$ y = [109544, -195269, -159824, -35219, 402117, 218463, -92825, 172456, 358147, 174478, -165337, -96412, -448943, -328759, 58259, 76158, 616337, 514724, -303050, -281636, -463197]
$$ [...]
##END NTUPLES=NMR SPECTRUM
##END=
