##TITLE=1H_CA-8871
 CDCl3, 8 sc, 
 4.06.2021
##JCAMPDX= 6.0         $$ Bruker NMR JCAMP-DX V2.0
##DATA TYPE= NMR SPECTRUM
##DATA CLASS= NTUPLES
##ORIGIN= UXNMR, Bruker Analytische Messtechnik GmbH
##OWNER= root
$$ XWIN-NMR		Version 3.5
$$ Fri Jun  4 12:36:19 2021 Russian Standard Time (UT+4h)  she@DPX200
##.OBSERVE FREQUENCY= 200.131506
##.OBSERVE NUCLEUS= ^1H
##.ACQUISITION MODE= SIMULTANEOUS
##.ACQUISITION SCHEME= undefined
##.AVERAGES= 8
##.DIGITISER RES= 18
##SPECTROMETER/DATA SYSTEM= spect
##.PULSE SEQUENCE= zg30
##.SOLVENT NAME= CD3CN
##.SHIFT REFERENCE= (INTERNAL, CD3CN, 0, 17.5545)
##AUDIT TRAIL= $$ (NUMBER, WHEN, WHO, WHERE, WHAT)
$$ ##TITLE= Audit trail, XWIN-NMR		Version 3.5
$$ ##JCAMPDX= 5.01
$$ ##ORIGIN= Bruker BioSpin GmbH
$$ ##OWNER= she
$$ F:/spectra/data/she/nmr/H-F/1/pdata/1/auditp.txt
$$ ##AUDIT TRAIL=  $$ (NUMBER, WHEN, WHO, WHERE, WHAT)
(   1,<2021-06-04 12:35:13.54 +0400>,<she>,<DPX200>,
      <created by zg, POWCHK disabled, PULCHK disabled
       configuration hash MD5:
       00 E9 B6 7A A2 85 ED C7 34 08 36 98 17 FE 4E 26
       data hash MD5: 16K
       D8 B4 76 6D D8 F3 4C 79 40 CF F1 A1 C4 99 0E DF>)
(   2,<2021-06-04 12:35:17.18 +0400>,<she>,<DPX200>,
      <Start of raw data processing
       efp BC_mod = 2 LB = 0.24 FT_mod = 6 PKNL = 1 PHC0 = -11195.92 PHC1 = 4.801012 SI = 16K 
       data hash MD5: 16K
       0D D8 27 10 57 4A A5 6D 84 6F 29 03 70 DE B6 FB>)
(   3,<2021-06-04 12:35:33.04 +0400>,<she>,<DPX200>,
      <pk PHC0 = 74.13666 PHC1 = 7.6 
       data hash MD5: 16K
       32 36 08 8E 9D E2 F9 48 66 22 08 90 00 C3 7C 20>)
(   4,<2021-06-04 12:35:36.07 +0400>,<she>,<DPX200>,
      <abs ABSG = 5 
       data hash MD5: 16K
       D1 2B 1E A1 B8 DC 97 E4 A7 42 AD 2A FE DF 28 2B>)
$$ ##END=
$$ 
$$ hash MD5
$$ FF 32 36 A2 29 07 CA 78 B0 85 2C 7B E3 32 55 47
##$RELAX= 
##$RELAX= 
##$RELAX= 
##$RELAX= 
##$RELAX= 
##$RELAX= 
$$ Bruker specific parameters
$$ --------------------------
##$DU= <F:/spectra>
##$EXPNO= 1
##$NAME= <H-F>
##$PROCNO= 1
##$TYPE= <nmr>
##$USER= <she>
##$AMP= (0..31)
100 100 100 100 100 100 100 100 100 100 100 100 100 100 100 100 100 100 
100 100 100 100 100 100 100 100 100 100 100 100 100 100 
##$AQSEQ= 0
##$AQ_mod= 1
##$AUNM= <au_zg>
##$AUTOPOS= <>
##$BF1= 200.13
##$BF2= 200.13
##$BF3= 200.13
##$BF4= 200.13
##$BF5= 200.13
##$BF6= 200.13
##$BF7= 200.13
##$BF8= 200.13
##$BYTORDA= 1
##$CFDGTYP= 0
##$CFRGTYP= 5
##$CHEMSTR= <none>
##$CNST= (0..31)
1 1 145 1 1 1 1 1 1 1 1 1 1 1 1 1 1 1 1 1 1 1 1 1 1 1 1 1 1 1 1 1 
##$CPDPRG= <>
##$CPDPRG1= <>
##$CPDPRG2= <>
##$CPDPRG3= <>
##$CPDPRG4= <mlev>
##$CPDPRG5= <mlev>
##$CPDPRG6= <mlev>
##$CPDPRG7= <mlev>
##$CPDPRG8= <mlev>
##$CPDPRGB= <>
##$CPDPRGT= <>
##$D= (0..31)
0 1.2 0 0 0 0 0 0 0 0.06 0 0.03 0 0 0 0 0.0002 0 0 0 0 0 0 0 0 0 0 0 0 
0 0 0 
##$DATE= 1622795713
##$DBL= (0..7)
120 120 120 120 120 120 120 120 
##$DBP= (0..7)
150 150 150 150 150 150 150 150 
##$DBP07= 0
##$DBPNAM0= <>
##$DBPNAM1= <>
##$DBPNAM2= <>
##$DBPNAM3= <>
##$DBPNAM4= <>
$$ [...]
##$SUBNAM3= <"">
##$SUBNAM4= <"">
##$SUBNAM5= <"">
##$SUBNAM6= <"">
##$SUBNAM7= <"">
##$SUBNAM8= <"">
##$SUBNAM9= <"">
##$SW= 20.0188882624521
##$SWIBOX= (0..15)
0 0 2 0 0 0 0 0 0 0 0 0 0 0 0 0 
##$SW_h= 4006.41025641026
##$TD= 16384
##$TD0= 1
##$TE= 0
##$TE2= 300
##$TE3= 300
##$TEG= 300
##$TL= (0..7)
0 120 120 120 120 120 120 120 
##$TP= (0..7)
150 150 150 150 150 150 150 150 
##$TP07= 0
##$TPNAME0= <>
##$TPNAME1= <>
##$TPNAME2= <>
##$TPNAME3= <>
##$TPNAME4= <>
##$TPNAME5= <>
##$TPNAME6= <>
##$TPNAME7= <>
##$TPOAL= (0..7)
0.5 0.5 0.5 0.5 0.5 0.5 0.5 0.5 
##$TPOFFS= (0..7)
0 0 0 0 0 0 0 0 
##$TUNHIN= 0
##$TUNHOUT= 0
##$TUNXOUT= 0
##$USERA1= <user>
##$USERA2= <user>
##$USERA3= <user>
##$USERA4= <user>
##$USERA5= <user>
##$V9= 5
##$VALIST= <valist>
##$VCLIST= <CCCCCCCCCCCCCCC>
##$VD= 0
##$VDLIST= <DDDDDDDDDDDDDDD>
##$VPLIST= <PPPPPPPPPPPPPPP>
##$VTLIST= <TTTTTTTTTTTTTTT>
##$WBST= 1024
##$WBSW= 4
##$XGAIN= (0..3)
0 0 0 0 
##$XL= 0
##$YL= 0
##$YMAX_a= 371702
##$YMIN_a= -277928
##$ZGOPTNS= <>
##$ZL1= 120
##$ZL2= 120
##$ZL3= 120
##$ZL4= 120
##$ABSF1= 17.4299
##$ABSF2= -2.589138
##$ABSG= 5
##$ABSL= 3
##$ALPHA= 0
##$AQORDER= 0
##$ASSFAC= 0
##$ASSFACI= 0
##$ASSFACX= 0
##$ASSWID= 0
##$AUNMP= <proc_1d>
##$AZFE= 0.1
##$AZFW= 0.1
##$BCFW= 0
##$BC_mod= 2
##$BYTORDP= 0
##$COROFFS= 0
##$CY= -3
##$DATMOD= 1
##$DC= 0
##$DFILT= <>
##$DTYPP= 0
##$F1P= 0
##$F2P= 0
##$FCOR= 1
##$FTSIZE= 16384
##$FT_mod= 6
##$GAMMA= 0
##$GB= 0
##$INTBC= 1
##$INTSCL= 1.334414e-10
##$ISEN= 128
##$LB= 0.24
##$LEV0= 0
##$LPBIN= 0
##$MAXI= 10000
##$MC2= 0
##$MEAN= 0
##$ME_mod= 0
##$MI= 1.114404
##$NCOEF= 0
##$NC_proc= -5
##$NLEV= 6
##$NOISF1= 3.799351
##$NOISF2= 2.8
##$NSP= 0
##$NTH_PI= 0
##$NZP= 0
##$OFFSET= 17.55454
##$PC= 1
##$PHC0= -11121.78
##$PHC1= 12.40101
##$PH_mod= 1
##$PKNL= yes
##$PPARMOD= 0
##$PSCAL= 0
##$PSIGN= 0
##$REVERSE= no
##$SF= 200.129996014463
##$SI= 16384
##$SIGF1= 3
##$SIGF2= 2
##$SINO= 5.538805
##$SIOLD= 16384
##$SREGLST= <1H.CDCl3>
##$SSB= 0
##$STSI= 16384
##$STSR= 0
##$SW_p= 4006.41025641026
##$SYMM= 0
##$S_DEV= 0
##$TDeff= 16384
##$TDoff= 0
##$TI= <>
##$TILT= no
##$TM1= 0
##$TM2= 0
##$TOPLEV= 0
##$USERP1= <user>
##$USERP2= <user>
##$USERP3= <user>
##$USERP4= <user>
##$USERP5= <user>
##$WDW= 1
##$XDIM= 16384
##$YMAX_p= 394570138
##$YMIN_p= -171115
$$ End of Bruker specific parameters
$$ ---------------------------------
##NTUPLES= NMR SPECTRUM
##VAR_NAME=  FREQUENCY,     SPECTRUM/REAL,   SPECTRUM/IMAG
##SYMBOL=    X,             R,               I
##VAR_TYPE=  INDEPENDENT,   DEPENDENT,       DEPENDENT
##VAR_FORM=  AFFN,          ASDF,            ASDF
##VAR_DIM=   16384,         16384,           16384
##UNITS=     HZ,            ARBITRARY UNITS, ARBITRARY UNITS
##FACTOR=    0.24454680195387, 1,            1
##FIRST=     3513.19014714922, 0,            0
##LAST=      -493.220109261037, 0,           0
##MIN=       -493.220109261037, -171115,     0
##MAX=       3513.19014714922, 394570138,    0
$$ Real data points
##PAGE= N=1
##DATA TABLE= (X++(R..R)), XYDATA
$$ [...]
7755B55498K8623l3496l3851K4181K0807m7193K3551J4384k7144O8065l6146j0672
7743B46607j6470l1794l9125J4807j6887q478P769o8975R937J8202L7431O4235
7731B17259l5705o6596J6975Q44j6615J4004n5229O978M6381J5524m4604p998
7719I1218K915L1235m8317m2218J2176N3567l0128L7149l8790o5424L8294O0031
7707A01708m2821L0322m8067L7545M4064p4489L3230M216m4525O3324o6024O782
7695D5265N7167n9301K2232k5029r1084L0823M6633L9021L0259q9923M6036m6974
7683E125o7008Q6686K5431m7395r19O8928j4200j272l207K0628K7998r1600K2412
7670C1607N4998n3085j6368r368l326P6042k5364j2195n7360r275O5331q459k0278
$$ plain form
7755 255498 284121 250625 216774 240955 261762 214569 238120 252504 225360 293425 257279 246607
7743 246607 230137 198343 159218 174025 157138 148660 156429 87454 97391 115593 153024 217259
7731 217259 181554 114958 131933 132777 116162 130166 74937 81915 128296 143820 99216 91218
7719 91218 94133 125368 77051 34833 47009 100576 70448 107597 68807 3383 41677 101708
7707 101708 58887 89209 41142 78687 122751 48262 81492 85708 41183 104507 38483 45265
7695 45265 102432 43131 65363 40334 -50750 -19927 26706 65727 95986 6063 52099 5125
7683 5125 -61883 24803 50234 2839 1920 70848 56648 55376 52169 72797 100795 9195 31607
7670 31607 86605 33520 17152 7784 4458 80500 55136 42941 -14419 -23694 41637 33178 12900
7657A2900M5477J0423P969J2902o8104J4292M1985l4966j6325l9045L1124O2445
7645H1077Q358J0670l1660k0657k8965K9489k9216o9346l51N0556K4707k8191
7633c529L857L6641o466n055m663q6214O0450n7956J9442p321J2180M9971Q717
7620B0054n1382J878L0088J289r5906O1841L0454k949j7433q875J5715j2835K6180
7607a881J0686Q53j9581l4272k3796J5636P4267L696m8008P0178n3668l5036R665
7594c1261M9260M864l0352N355j4231n9545N1847j763L9892l3025N40K9314P187
7581A8082m1942l3039j3082M6925M2959k717o4409j6074N6839l8213K6674M0020
7569B2023p9688Q364R2334m3922M1581p1233N6347j4027n5879J1281J7587L1321
$$ plain form
7657 12900 58377 68800 76769 89671 21567 35859 77844 42878 26553 -12492 18632 81077
7645 81077 89435 100105 68445 47788 18823 48312 19096 -50250 -50601 -45 24662 -3529
7633 -3529 328 36969 30503 25448 20785 -65429 -4979 -62935 -43493 -50814 -38634 11337 20054
7620 20054 -31328 -29450 638 1927 -93979 -32138 -1684 -4633 -22066 -30941 -15226 -28061 -1881
7607 -1881 8805 9658 -9923 -44195 -67991 -52355 21912 25608 -22400 47778 -5890 -40926 -31261
7594 -31261 17999 22863 -7489 -2134 -16365 -75910 -24063 -25826 14066 -18959 -18419 10895 18082
7581 18082 -23860 -56899 -69981 -23056 19903 17186 -47223 -63297 -6458 -44671 -17997 22023
7569 22023 -57665 -49301 43033 -889 40692 -30541 25806 11779 -44100 -32819 -15232 16089
7557A6089k6871J0566m4626J7406L251j5135M6837m9735o0917J9905O291J8151
7545e8788O875j8531k2221M6368k4978M1588R827j5621l8936o1344O702J05004
7533b4055l5847k2051N7373m0684M3122K0348j0865L386k5670j0914k4663n1232
7521a21752O0177M482n5758O2816k3746j2997K9159M1893l1299O0497l7089j5420
7509c9037j1416N338J4350j2024n0434K8983L0834l8641M9792j5316n826L4737
7497h660J2355j1233m8286M364J6113j5702L816L193j6646M3385j9418k4647M2112
7484a9254j7399l8771K3333K8018k2026o409J4690J7073J6933n154n0772K5737
7472c4001K5301q676n5792n4821j7382R3019n7341L9095J990M3215l945K2494
$$ plain form
7557 16089 -10782 -216 -44842 -27436 -24185 -39320 7517 -42218 -103135 -83230 -76939 -58788
7545 -58788 -51913 -70444 -92665 -46297 -71275 -29687 -19860 -35481 -74417 -135761 -129059 -24055
7533 -24055 -59902 -81953 -24580 -65264 -22142 -1794 -12659 -9273 -34943 -45857 -70520 -121752
7521 -121752 -61575 -57093 -112851 -50035 -73781 -86778 -57619 -15726 -47025 13472 -23617 -39037
7509 -39037 -50453 -45115 -30765 -42789 -93223 -64240 -33406 -72047 -22255 -37571 -43397 -8660
7497 -8660 3695 -7538 -55824 -51460 -35347 -51049 -47233 -44040 -60686 -17301 -36719 -61366 -19254
7484 -19254 -36653 -75424 -52091 -24073 -46099 -52508 -37818 -20745 -3812 -8966 -59738 -34001
7472 -34001 -8700 -17376 -73168 -127989 -145371 -52352 -109693 -70598 -68608 -25393 -29338 -6844
7460f844k4307J2177l7712P584M1964n1226j9317L7663l947n5670k5684N2671
7448g2648K9810l9793o1647L4569J1555J9436L9555l747l878Q219n6562J8378
7436g6753Q528L530L4989k1642O692j1982j8609l110N4904k2735J1303o371q0139
7423a21395Q1476p397o6013M2625l3986N794P7319q158j2206k3409L0090M8388
7411A3128l9705o1617P8938l4021m1139N9338q1733j895P9108o2483J5645L113
7399g3323o0097N4307j9705L7964K634j1097k6214O1534K9702k6560k4510l1375
7387h6740k2511o447J4969Q5413l0422O6768J1768O100m1688o9533l164J8969
7375e6518L3230j7631n8201L4929O084K2188l2191J1927j0803l1054L2019q414
$$ plain form
7460 -6844 -31151 -18974 -56686 -49102 -7138 -58364 -77681 -40018 -43965 -99635 -125319 -72648
7448 -72648 -42838 -82631 -144278 -109709 -98154 -78718 -39163 -42910 -46788 -38569 -95131 -76753
7436 -76753 -68225 -64695 -29706 -51348 -44656 -56638 -75247 -78357 -23453 -46188 -34885 -41256 -121395
7423 -121395 -39919 -47316 -113329 -70704 -104690 -98896 -21577 -29735 -41941 -65350 -35260 13128
7411 13128 -26577 -88194 -9256 -43277 -84416 -25078 -106811 -108706 -29598 -92081 -76436 -73323
7399 -73323 -133420 -79113 -98818 -60854 -58220 -69317 -95531 -33997 -4295 -30855 -55365 -86740
7387 -86740 -109251 -115698 -100729 -15316 -45738 21030 32798 38898 -2790 -72323 -75487 -56518
7375 -56518 -23288 -40919 -99120 -64191 -58107 -35919 -68110 -56183 -66986 -98040 -66021 -74435
7363g4435J0627J12821o5234m9899O676r014J1356O8622k2833p6458n19K0826
7351f7464L4496M8802n592k9343J0925J7150n9180m2217J1956N0546l5150l7297
7339a02368L1008P800L5013M6298K9567p9978K9645j3729o5317L3490j6256J0935
7327e3892L4535j4111k8292r36J5957p384j7113J3649K6257m2957l5294K3028
7315h6553L477n6794K7711P654J03646K786j3366K652k2365k8559j601l963O6793
7302A518r400l8285o104o1n4463l671Q597O0012J2145l9363M192j1127N1444J7194
7288g372m8870J4173n134n1008K8803k523Q406j2431l4083N7184r770k0254q337
7275i1216J6970k5382L6697j468j0254J8019O3868k082l2665J3071j5221k834
$$ plain form
7363 -74435 -63808 49013 -16221 -66120 -59444 -68458 -57102 11520 -11313 -87771 -88290 -67464
7351 -67464 -32968 15834 10242 -19101 -8176 8974 -50206 -92423 -80467 -29921 -65071 -102368
7339 -102368 -71360 -63560 -28547 17751 47318 -32660 -3015 -16744 -82061 -48571 -64827 -53892
7327 -53892 -19357 -33468 -61760 -62696 -46739 -54123 -71236 -57587 -31330 -74287 -109581 -86553
7315 -86553 -83076 -139870 -112159 -104505 -859 1927 -11439 -8787 -31152 -59711 -61312 -65275 1518
7302 1518 -7882 -46167 -52271 -52332 -106795 -110466 -101869 -41857 -29712 -69075 -64883 -76010 -24566 -7372
7288 -7372 -56242 -42069 -47203 -98211 -69408 -71931 -63525 -75956 -110039 -52855 -62625 -82879 -91216
7275 -91216 -74246 -99628 -62931 -64399 -74653 -56634 7234 5152 -27513 -14442 -29663 -32497
7263c2497M737m0281j1215p0360O4166J6204l4268K4301K2456M9833l8735J7219
7251b8440M7912p0473m7319M3647j7977r922K9967m712j1641K6597m2793N6129
7239b9025m3978n3646O3466q217O040K5464L7760N637m9468m523J5385q506l2483
7226g6094l513j7872P4074q769j3156q38P066n1690k942J14613m1287j4660j0215
7213d5283n7706L61K0798k01Q168J504O4361J717l6609j058N24L6198k0817N7381
7199B9338n6204j0392Q104L052N3940n4978p4560O3764q550l9551J6670P067L610
7186e8690k3463n9439L2905M4896j2767L6783L3230m4398J5091q4374N3187J8140
7174d8899l244j7896K1123k1450K3730O1023k9592k6955J949k4150j8581j4093
$$ plain form
7263 -32497 -27760 -68041 -79256 -149616 -85450 -69246 -103514 -79213 -56757 -6924 -45659 -28440
7251 -28440 19472 -51001 -98320 -54673 -72650 -82572 -52605 -57317 -68958 -42361 -85154 -29025
7239 -29025 -73003 -126649 -63183 -71400 -65360 -39896 -2136 3501 -45967 -50490 -35105 -43611 -76094
7226 -76094 -79607 -97479 -23405 -32174 -45330 -46168 -39102 -90792 -93734 20879 -20408 -35068 -45283
7213 -45283 -102989 -102628 -81830 -82031 -73863 -72359 -7998 -6281 -42890 -43948 -43424 -7226 -28043 29338
7199 29338 -26866 -37258 -29154 -26102 27838 -27140 -101700 -37936 -46486 -86037 -69367 -62300 -58690
7186 -58690 -82153 -141592 -108687 -63791 -76558 -39775 -6545 -50943 -35852 -120226 -67039 -48899
7174 -48899 -52143 -70039 -48916 -70366 -46636 14387 -15205 -42160 -40211 -64361 -82942 -97035
7162i7035L6307M7595p0692J3299P663K5834L4429m2477o1372R0603J6350r224
7150h720m5683l5295J1232J8784N4930k955j5569M2k1061J4076j9411L7780P03
7137a1147Q61n0743q219j6781L7385Q899O8392k2092l8037J2651o125p1637L2445
7124f4148K0201k1124Q5827j584l1130M3197p2157J4274N8161j9511l674q9082
7112h0750k8282K1226n1473l749R9186k4242K0073n845M3097m3217m7933k345
7100a04254N5589P5517k4788P131k2763l4893K1763J6011K4444l2410m1917j9143
7088g9713J608M9110l4742L6887l2856L0403M1348p2002L1256K6667m6817P695
7076d1156k4201k950R4740m8201p033o6768P3294L5205m9382k2995j6047R7436
$$ plain form
7162 -97035 -60728 -13133 -83825 -70526 -62863 -37029 -2600 -45077 -106449 -15846 504 -8720
7150 -8720 -54403 -89698 -78466 -59682 -4752 -7707 -23276 -23234 -44295 -30219 -49630 -11850 -11147
7137 -11147 -10286 -61029 -69248 -86029 -48644 -39745 28647 6555 -31482 -18831 -24956 -96593 -64148
7124 -64148 -43947 -65071 20756 19172 -11958 31239 -40918 -26644 31517 12006 8332 -80750
7112 -80750 -109032 -87806 -139279 -143028 -43842 -68084 -48011 -53856 -10759 -53976 -101909 -104254
7100 -104254 -48665 26852 2064 9195 -13568 -48461 -26698 -10687 13757 -18653 -60570 -79713
7088 -79713 -78105 -28995 -63737 -26850 -59706 -29303 12045 -59957 -28701 -2034 -48851 -41156
7076 -41156 -65357 -68307 26433 -21768 -28801 -95569 -22275 12930 -36452 -59447 -75494 21942
7064B1942L0046k0821l9913j6869j1062J7762m9476n3665L5670O3491j6521N0328
7052A0912o2326j5223O3363m0769J8855j9325r983M4569o4985J980N3027l1696
7040e1601N2820n0l7798p088m464O4960N731o3449M5593J4325q0236j1735K9512
7027d3480K0126J2241R466j3545Q788J7312m4422M2880p152m3495J887K8996m1154
7014e1552N9348k7648J6665N9570j8151m5115n933J3923L1304j3968n1852P2114
7002C8705k8140J1106k9392j2845P6830n3960o3462M7002l0674j9226O2851k7580
6990b8785M4555k7946r0131O3246J978k4273O8084J0922k5763O3536n8813n336
6978h726l0892J7309k751J3160L0338n2745K1288M4502J2703r1215L9686M2954
$$ plain form
7064 21942 51988 31167 -8746 -25615 -36677 -18915 -68391 -122056 -86386 -22895 -39416 10912
7052 10912 -51414 -66637 -3274 -44043 -25188 -44513 -54496 -9927 -74912 -72932 -19905 -51601
7040 -51601 1219 1169 -36629 -43717 -48181 16779 22510 -40939 4654 18979 -61257 -72992 -43480
7027 -43480 -23354 -11113 -1647 -15192 -6404 10908 -33514 9366 2214 -41281 -39394 -10398 -51552
7014 -51552 7796 -19852 -3187 56383 38232 -6883 -12816 1107 32411 18443 -33409 38705
7002 38705 10565 21671 -7721 -20566 56264 2304 -61158 -14156 -44830 -64056 -1205 -28785
6990 -28785 15770 -12176 -102307 -39061 -37083 -61356 6728 17650 -8113 55423 -3390 -8726
6978 -8726 -39618 -22309 -25060 -11900 18438 -34307 -13019 31483 44186 -47029 -7343 35611
6966C5611l9051L0833K3462j5992n6857J4212Q265N2356P811j6460J0666r5612
6954d0756K7653N7663j0335l547k0169j6613P4882l7426k5302N3413o433M3966
6942I6996q3278Q925P747m3476M0652M7398o5909k1106L5442o7425M5642L7280
6930C8888l0541M4106m5567P110O113o0761j2599q377K9212M9291r676M2599q383
6917D1415m6979m043k5976N7125N2200j8329J7487J9564o6282j3507l158l8747
6905b9230k411L2967p202M015l957K0090j626l9822n4080M0668n257J2773K1094
6892a1978K0802J7880K8429k1654o609j6666m2636J0682k8675O4956m704q2374
6880g2547l471M6146K0581j3845k6088j1371J01944r3439j4685P2926k7912k6783
$$ plain form
6966 35611 -3440 27393 50855 34863 -21994 -7782 483 52839 60650 44190 54856 -40756
6954 -40756 -13103 44560 34225 30678 10509 -6104 68778 31352 6050 59463 53030 96996
6942 96996 13718 22643 30390 -13086 27566 74964 9055 -12051 23391 -44034 1608 38888
6930 38888 8347 52453 6886 13996 20109 -40652 -53251 -61628 -32416 16875 7199 49798 41415
6917 41415 -5564 -9607 -35583 21542 73742 55413 72900 92464 26182 12675 9517 -29230
6905 -29230 -31641 1326 -5876 -1861 -5818 14272 12646 -27176 -81256 -40588 -45845 -33072 -11978
6892 -11978 8824 26704 55133 33479 26870 10204 -32432 -21750 -50425 14531 9827 -72547
6880 -72547 -76018 -29872 -9291 -23136 -49224 -60595 41349 -52090 -66775 6151 -21761 -48544
6868d8544K1249n438N7372m4751k8098O0058L994k0161K8773m2123M3491l5140
6856i318p2027N2213J905j0948m9035J2599K1477Q994J2738O4427k2848J9452
6844B9629K9918j2216q596K2805n6242J7261J050K8045j3409m5615K4775L3407
6832E0812k7017l6123J305k0284K6889L0493O650J3636r166J649n480L6019k9406
6819C9977K3819n5566K4703l7469j6084O5839K19k9945n506j064j5008P0093j3522
6806E0486Q457j4759o1868N1758m7219p920Q5431j2607m1969J3544j7960K0131
6794B5505J7545q3839P0899M3124o2862N0899j1640m5651N3300m6953p051L1673
6782C4949j14585M2797K4626j6154J00596m0040l0553N2692r1199o30K8892k0647
$$ plain form
6868 -48544 -27295 -32733 24639 -20112 -48210 11848 15842 -4319 24454 -17669 25822 -9318
6856 -9318 -81345 -29132 -27227 -38175 -87210 -74611 -53134 -44140 -31402 33025 10177 29629
6844 29629 59547 47331 38735 61540 5298 22559 23609 51654 38245 -7370 17405 50812
6832 50812 23795 -12328 -11023 -31307 -4418 26075 32725 46361 37195 38844 33364 69383 39977
6819 39977 63796 8230 32933 -4536 -20620 45219 45438 15493 9987 8923 -6085 64008 50486
6806 50486 58943 44184 -17684 34074 -13145 -21065 64366 51759 9790 23334 5374 25505
6794 25505 43050 -40789 30110 73234 10372 61271 49631 3980 57280 10327 3276 34949
6782 34949 -79636 -36839 -12213 -28367 72229 32189 1636 54328 -36871 -37501 -8609 -29256
6770b9256M4832Q258l2132J8542K7900k7862P6559q504l7231n0098J5688L7986
6758D4682N203r0554j4244L9150o5757N0812K2000J6178N9101o1595m4267J1394
6746b7897K8785j7260K8392k5815M2775M8l1844M2577r9297K0697N3140m9962
6734c5661O4061N4945l2242p328r8738K4769M0508o5663O474K1792J8890J5381
6722G188J4101l4379J8861l6541R344M0323L0859m1464J4814n995M8004k209n3671
6709I235L9013m0867L345L0626j9875m330j0345P329j7046n838K5425L095l2819
6696a3052K2733j548M386o5249m1740N937J9143K9160R165k3826r917J3552P2444
6683B1188R8275j7285l5213J6791K1406j1522J153o2303l0588r435j6727R012
$$ plain form
6770 -29256 15576 23834 -8298 10244 38144 10282 86841 78337 41106 -8992 6696 44682
6758 44682 49885 -40669 -54913 -15763 -81520 -30708 -8708 7470 66571 4976 -39291 -27897
6746 -27897 888 -16372 12020 -13795 28980 29028 -2816 39761 -59536 -38839 14301 -35661
6734 -35661 28400 83345 51103 43775 -54963 -30194 10314 -55349 -48875 -27083 -8193 7188
6722 7188 21289 -13090 5771 -30770 -21426 18897 49756 8292 23106 17111 65115 62906 9235
6709 9235 48248 7381 10726 41352 21477 17147 6802 14131 -2915 -8753 16672 19767 -13052
6696 -13052 9681 8133 12519 -52730 -94470 -88533 -69390 -40230 -31065 -54891 -64808 -51256 21188
6683 21188 119463 102178 66965 83756 105162 93640 94793 32490 1902 -7533 -24260 -15248
6671a5248j4942j6930K5032J8456j4783n260N2913k8025r3575p8753J06339Q7818
6659B3042j4304M64j6757j2198P6960j3022K8555m7710j445K3266M1690l6711
6647E1830m9917K4110L282K6163k780J2137J253o8170N6526m4229n9043M8548
6635b90l6427m5125P7702L3821r14N9039n9387L5567M951k1908Q0896p0254j4181
6622D3490j7010k2454K8671k7843n393L5554j2946j0832J01549p1590k4043K2762
6610C9915p7605K1633m933J0168O4126K0568L137O7424K301K4508J9911p7681
6598A13472l6393O030l2128l4644M7926J2278k0958P472J4755n3017l6333M7714
6586C6174o454N9546l2391k0908j7644q892J5586j835O6261J0708R3395m6373
$$ plain form
6671 -15248 -30190 -47120 -22088 -3632 -18415 -23675 29238 1213 -92362 -171115 -64776 23042
6659 23042 8738 9202 -7555 -19753 57207 44185 72740 25030 23585 46851 88541 51830
6647 51830 1913 26023 29305 55468 52688 64825 66078 -2092 54434 10205 -48838 -290
6635 -290 -36717 -81842 -4140 29681 28767 87806 28419 63986 68937 47029 127925 57671 43490
6622 43490 26480 4026 32697 4854 -539 35015 22069 11237 112786 41196 17153 39915
6610 39915 -37690 -16057 -20990 -10822 53304 73872 77009 144433 146734 171242 191153 113472
6598 113472 77079 83109 50981 16337 64263 76541 55583 63055 77810 24793 -11540 36174
6586 36174 29720 89266 56875 35967 18323 9431 25017 23182 89443 100151 193546 147173
6574A47173P755K4294L7019j1381J7810N179K1406O4141K6555M0256R1104K9471
6562E00782M4800Q961q0154k2082p7386o4788l8081q1551L6880N6324l9118J3143
6550B57730q328n6658O3150o4374k1833p040M928N889J5227l1842L25L829l6997
6537A24006r223m5457K4317P968K1525L5181l8329N7858l8513n6970M5822m0096
6525H8089L7737j2009n3579M5279J639l6550K2339M425j7484K8150l6481j9052
6513E2503O1383o3610N3335q734J3081J3971n2212M1736J3468o9708l7458K8059
6501D5814K3799R110m1672q130j2613O9746L5313k0829p718l8702J1237K2452
6489H7807K284K6438j7997k3211L1167k7532j9251L7630k094n5630M5533k7000
$$ plain form
6574 147173 154928 179222 216241 204860 222670 227849 249255 313396 339951 380207 471311 500782
6562 500782 545582 554543 474389 452307 374921 310133 272052 190501 227381 283705 244587 257730
6550 257730 249402 192744 255894 191520 169687 162647 167575 173464 188691 156849 157174 161003 124006
6537 124006 114783 69326 93643 101611 123136 158317 119988 177846 139333 82363 128185 88089
6525 88089 125826 113817 60238 105517 107156 70606 92945 97370 79886 108036 71555 52503
6513 52503 113886 50276 103611 94877 107958 121929 69717 111453 124921 55213 17755 45814
6501 45814 69613 78723 37051 28921 16308 86054 121367 100538 92820 54118 65355 87807
6489 87807 90091 116529 98532 75321 106488 78956 59705 97335 95241 39611 85144 58144
6477E8144P314L3958o381k8024J7162j4526j1589n0745M4979J7911J4059o872
6465G5390o2028K7179J9054k4687l760J4347j0386n238O968O353K5127P071j7902
6452E7488L2435k4455N2293L0048p6724J7315N5404l4601m480M0092p1493m0693
6440C2629k2634J6085Q5028j8536j6147j283K3549L018l9408J0129K7883Q863
6428A09176l39k30m7698N2137L8150R012n1705k0238K731j6039j9796O531M2762
6415A04454M2547p6113N445L5003L8794L2991m042j9687l5749L068J6853K121
6403A45685k1237M0241O6886k1498n0308O0154j21325L510M4600M7739N1919p3252
6391A73114M4102L3473j5149M4013l6512k873L1754o8307L6116M8388j46303P5841
$$ plain form
6477 58144 65458 99416 93035 65011 82173 67647 56058 5313 50292 68203 82262 75390
6465 75390 13362 40541 59595 34908 31148 45495 35109 29871 36839 43192 68319 75390 57488
6452 57488 89923 65468 117761 147809 71085 88400 143804 109203 104723 144815 73322 32629
6440 32629 9995 26080 111108 92572 76425 75142 98691 101709 62301 72430 100313 109176
6428 109176 108837 108607 60909 113046 151196 160208 108503 88265 90996 74957 55161 61692 104454
6415 104454 147001 70888 76333 111336 150130 183121 179079 159392 123643 126711 143564 145685
6403 145685 124448 164689 231575 210077 159769 219923 98598 102108 146708 194447 246366 173114
6391 173114 217216 250689 235540 279553 243041 240168 271922 203615 239731 288119 141816 217657
6379B17657K4914o5199k5407o8700J2524O4660m3055p818l213l2524N110j0882
6367F8067m8644K5269L0536L9053m5326K0779O6428l9779n0655P7154j7648O993
6355A32227K2032k0429j2015o334Q1461n0942q6959K7443l4948M5571k9045R034
6343G7096K9594r007J0271l270l1701J9485L6069j6314J9701m039O09k1153N940
6330A13281K1602n2763k4678j0291K4218M7029m8421R026j0029l3017k9527O4992
6318G1422j0799L1166j5717j6817k2311q802J2474O6027m5918P2134O3699j10765
6306H5793k5445L8752J3385k2786j9690k2094L7271j7304j2304M6837n7600N0713
6294I5528K8732j4417k5739n1575N658L8775j707J1939j5514J2461j8916j3562
$$ plain form
6379 217657 242571 177372 151965 83265 95789 160449 117394 109576 106363 73839 78949 68067
6367 68067 19423 44692 75228 114281 68955 89734 156162 116383 65728 142882 125234 132227
6355 132227 154259 133830 121815 115481 196942 146000 59041 86484 51536 97107 68062 77096
6343 77096 106690 97683 107954 104684 72983 92468 128537 112223 131924 127885 128494 107341 113281
6330 113281 134883 82120 57442 47151 71369 118398 69977 79003 68974 35957 6430 71422
6318 71422 60623 91789 76072 59255 36944 28142 40616 106643 60725 132859 196558 85793
6306 85793 60348 99100 112485 89699 70009 47915 85186 67882 55578 102415 44815 95528
6294 95528 124260 109843 84104 32529 38187 76962 75255 87194 71680 84141 65225 51663
6282E1663L5659J2733o6567j7481M5364O1952o7020k7838P5970n1522k1082J2525
6270D4356l9807M330R668l608N2315N7094m6366p1549N7357L2454j7677K728K1998
6257A03293K4352L517l6913l8556K3419k0089q997N016o487K3741O086N675K1951
6244A06008l437p9348J1250R015j3751N650K9093N114J8519Q070o3154J0530K6224
6231F9783k9031N1436n318n9299j8417M9828j2113j5175M4177k0155j6804J0251
6219D9163J6061J328l2400k379n416L9593P5543m6752k511Q3838p3414j9796J283
6206H4141m1315J0968n170N4431J8750k2572m2697K3944o915J5169N06l2067p135
6193E0038K5282O8647k6638l8948m2831M2965l2965M9940K2757K849p902m4190
$$ plain form
6282 51663 87322 100055 33488 16007 61371 123323 56303 28465 104435 52913 31831 44356
6270 44356 4549 8879 18547 14939 67254 124348 77982 6433 63790 96244 78567 81295 103293
6257 103293 127645 131162 94249 55693 79112 59023 50026 55042 48555 72296 78382 84057 106008
6244 106008 102571 23223 34473 43488 29737 35387 64480 69594 88113 96183 33029 43559 69783
6231 69783 40752 92188 86870 27571 9154 58982 46869 31694 75871 55716 38912 49163
6219 49163 65224 66552 34152 31773 26357 65950 141493 94741 92230 176068 102654 82858 84141
6206 84141 42826 53794 48624 103055 121805 99233 56536 80480 73565 88734 89240 57173 50038
6193 50038 75320 143967 117329 78381 35550 78515 45550 95490 118247 121096 113194 69004
6181F9004K2559l1856m2150N0534N5656m180l9460l3927J9313k8092J7635M2795
6169I7831r491P5885o6826J6237q1819O5769K3147n3842K3079j9008o2360N1883
6157F0485K2225l1183P9524J0854L780j8832m438k2310k2671k7078O0372Q788
6145A19516J4086k4057K4761k4577k357m5659J9428k7342J2190N912m4922L5242
6133F2221Q1080p5328r0712P0622O6543j1335M1625m9380M910P8152n5837M7677
6121A70238q6303L6363J1435l7399M391J604n101K9332o57m7644K1072J1828m9221
6108E9938j75K1227j6826L9020J0568K247j2696j7921j2656L0104J7949M4216
6096A64995r1709k123K4081m4585Q157Q5943l5626p6992N552N2717N5618o5144
$$ plain form
6181 69004 91563 59707 17557 68091 123747 119567 80107 46180 65493 37401 55036 97831
6169 97831 88340 164225 97399 113636 31817 97586 120733 66891 89970 70962 8602 60485
6157 60485 82710 51527 131051 141905 145685 126853 122415 100105 77434 50356 110728 119516
6145 119516 133602 109545 134306 109729 107372 61713 81141 53799 65989 71901 26979 62221
6133 62221 143301 67973 -22739 47883 114426 103091 144716 95336 100246 178398 122561 170238
6121 170238 83935 120298 131733 94334 98725 100329 95228 124560 123903 76259 97331 109159 59938
6108 59938 59763 80990 64164 103184 113752 115999 103303 85382 72726 102830 120779 164995
6096 164995 73286 71163 95244 50659 58816 144759 109133 32141 37693 90410 146028 80884
6084H0884r343O3439l0577L110J9116p7697P1039p730l2480Q9202L2052j0798
6072A90217M1300j6110n7290l9361j2707K1351k3175l9391J13647j016m5992R6390
6060B27863o7909p725M4396n0537j3073L174j7836R6196L6879o9340K1862k7989
6048A75961j6192L9181l2377O5309j9378p307K3436M49j3105k1603r00m965n1557
6035A36952j5332N2409j4139K8238K0289j868K9702k2180M0020k2634o2322L8839
6023B07974K5024K7705L8791n5120N170J9321k6384L0552o2252L5789P4685p5743
6011B45512O5682l5519m4691Q2342k5443k4225p13o8418K8207Q8727K0942J8476
5999C50879K9167l6489m2014k2278J0119R5142l2164N51K0233j4785o9387L60
$$ plain form
6084 80884 71541 134980 104403 107513 126629 48932 119971 112241 79761 168963 201015 190217
6072 190217 231517 215407 158117 118756 106049 127400 104225 64834 178481 177465 131473 227863
6060 227863 159954 152229 196625 146088 133015 136189 118353 214549 251428 182088 203950 175961
6048 175961 159769 198950 166573 231882 212504 205197 228633 229082 215977 194374 193474 188509 136952
6035 136952 121620 174029 159890 188128 208417 206549 236251 214071 254091 231457 169135 207974
6023 207974 232998 260703 299494 244374 249544 268865 242481 273033 210781 246570 321255 245512
6011 245512 311194 275675 230984 313326 287883 263658 262945 194527 222734 311461 332403 350879
5999 350879 380046 343557 301543 279265 289384 384526 352362 352913 373146 358361 288974 289334
5987B89334M99p183K373L1608k1353J9498P86K4225N7316j8555p41R08j65J10723
5973D89273j12408m6833P5179j4083L1080Q7496p8978m992K1551l2396M9588n2050
5961D12427M72M8552l0897L2227l3849r4109K2247J6317n0617J42771J7110q2393
5949D00258l236r961J08484K4806p4168J3805L3262o4670O2604o2714m9790M7862
5937D26542m8341P2685j227o8448Q6207k163m115L5477j08814R076K8617k1014
5925D04482L3241q255j5657q604M3322k5604M4676m4303j4578o7417k0168N0112
5913C71247P4322r2033Q174M9140n1556P5737m0746n2150K1334L407k9110M8961
5901C86727n2587j2080l9912l7683N6031M6222n2473k317L5663K0230J0616n1518
$$ plain form
5987 289334 289833 282650 285023 316631 295278 314776 315562 339787 397103 378548 377807 378715 378550 489273
5973 489273 376865 330032 405211 391128 422208 509704 430726 425734 447285 414889 464477 412427
5961 412427 412899 461451 430554 462781 428932 334823 357070 373387 322770 465541 482651 400258
5949 400258 397022 387061 495545 520351 446183 459988 493250 428580 491184 428470 378680 426542
5937 426542 378201 450886 449659 381211 467418 465255 461140 496617 387803 396879 425496 404482
5925 404482 437723 429468 413811 405207 448529 422925 467601 423298 408720 341303 321135 371247
5913 371247 445569 353536 361710 410850 359294 435031 394285 342135 363469 366876 337766 386727
5901 386727 334140 322060 282148 244465 300496 346718 294245 291928 327591 347821 358437 306919
5889C06919r875j5733n5452L6378M2967p048L3602j9452q8637N8527J928k3516
5877B60608N8267m6981N437o7243M017L5973L6509k9772k099N7544J6034j2771
5865C15523r5950n8525O3297o8386R3311J5108q0522R3593l1087m912Q6750r2336
5853B35864L6677M2878l3177l0479l8093L0882L8119k6328l2998J3077o2315o112
5841A67995l12m110K2431l2606P2377K6476p5829l205Q934J2950J4383n8425J922
5828A52981J9755m332J3021k4942J8410K3422O333j6910L7360k6327r364J2123
5816B01530M8016o3135J4784k0620k5288r840J5802L0277m4931j454L8257k2191
5804A61207j979j0289p036P3254j3232m4263M6635K7039l6094K5105j1478m5012
$$ plain form
5889 306919 297044 281311 225859 262237 305204 298156 331758 312306 223669 282196 284124 260608
5877 260608 318875 271894 277331 210088 214105 250078 286587 256815 254716 312260 328294 315523
5865 315523 219573 161048 224345 155959 249270 264378 183856 277449 246362 241450 328200 235864
5853 235864 272541 315419 282242 251763 213670 244552 282671 256343 223345 236422 174107 167995
5841 167995 167683 163573 186004 153398 225775 252251 176422 173217 182151 195101 209484 151059 152981
5828 152981 172736 168404 181425 156483 174893 198315 204648 187738 225098 198771 189407 201530
5816 201530 249546 186411 201195 180575 155287 145447 161249 191526 146595 145141 183398 161207
5804 161207 159228 148939 141903 215157 201925 157662 204297 231336 195242 220347 208869 163857
5792A63857j8037k4722M9710L1998n3200k03M1143M0428k4610j9371k5653J8430
5780A79770L8306j5837o6177r430P3664m5163o565j0015J1247j8736K0128J4884
5768A66076M76l0963M198m1126j8764L3713K8044N2123n8033m4367M763L2708
5756A28848j2417K9156Q026O289N5758K5472j2125n0100o6524P824l0915J4179
5744A03471N7860l5977L3118l465p5198o692L987K9257m793m7652M9571O1379
5732A64866n85M91K4307n3842k23J9880n4194M5591m0885k7263O8498J8901k1891
5719A43651l224J0237N690J6354k9433k918Q650j3820J5652m1976K3619p156p8529
5706D6797P8533K3378k8901k3740l2802k732K9757N4034j7415N9799q7841P883
$$ plain form
5792 163857 145820 121098 170808 202806 149606 149403 190546 230974 206364 186993 161340 179770
5780 179770 218076 202239 136062 126632 200296 155133 148568 138553 149800 131064 151192 166076
5768 166076 166552 135589 139787 98661 79897 113610 141654 193777 135744 91377 96140 128848
5756 128848 116431 145587 153613 159902 215660 241132 229007 178907 112383 120207 89292 103471
5744 103471 161331 125354 158472 155007 79809 73117 77104 106361 101568 53916 103487 164866
5732 164866 164281 164772 189079 135237 135014 154894 100700 146291 105406 78143 146641 165542 143651
5719 143651 140427 150664 156354 172708 143275 140357 149007 135187 150839 108863 132482 125326 46797
5706 46797 125330 148708 119807 96067 63265 60533 90290 144324 126909 186708 98867 106750
5694A06750J14160q4867o6885J0470O1179J3412j2145L7348j2309n1599j7213
5683I8301O409m8398L8176J8669l5282K6413K3579L4880j3400m3768j6116L7660
5671A27123k1969L3126R132k2776P3577o4092K8419P4120o5129k5330J7696l2793
5659A31104M7744l3836p6725N1540M781m353l59L2787j6861j5964k5444m685M7471
5646A37200J3697j3824L7552r655L0j2592j1892j7118O588L709K1165L9380L9982
5633B34222j8958k490L2369J4564j14517n2521K2712M0911P3217r8839J9049Q082
5621A57801Q718m9150P321j28K6788P0228k3986M4303r600n5898N3873L0916l7520
5608B23666q5335K1270M6146l6168R326J5219n3907L2082J2066o4159K1128N4127
$$ plain form
5694 106750 220910 136043 69158 79628 140807 154219 142074 179422 167113 115514 98301
5683 98301 104710 56312 94488 113157 77875 104288 127867 162747 149347 105579 89463 127123
5671 127123 105154 138280 147412 124636 198213 134121 162540 236660 171531 146201 163897 131104
5659 131104 178848 145012 68287 119827 124608 120255 119896 152683 135822 119858 94414 89729 137200
5646 137200 150897 137073 174625 164970 165000 152408 140516 123398 129986 133695 154860 194240 234222
5633 234222 215264 212774 245143 259707 145190 92669 115381 156292 229509 130670 149719 157801
5621 157801 166519 117369 124690 124562 151350 221578 197592 241895 232295 176397 230270 261186 223666
5608 223666 138331 159601 205747 169579 178905 194124 140217 172299 184365 120206 141334 195461
5596A95461k8664k1091l829K9868J5955N2424k2624M490K7805J97K2678L5032
5584C07702j128q2366j5538R37J1653r264P6346l0582m7353o048K066j2923j0791
5571A82711k1699O5295L3844j6212l323m8212n544L6856o6546O658K4686J212
5559A89726P2945J5079m067K0603j5226k3847o2689l3324K2351m4585j5015N7381
5547A79332m080L5739P5040p0608r639j7930l6118L0804n3724J9088O8013J3886
5535B29803P806p363O1780k8390N836l1324l8859N4597N287k7398J6619o250l1675
5522B10469J4987m6627l9662L0504r236L7013J7549l8533J0382k5935K9950N2009
5510B42870j8751m920L3174k9693N9846j6384J2828L8866n1376M223M133m8762
$$ plain form
5596 195461 166797 145706 141877 171745 187700 240124 217500 221990 249795 249992 272670 307702
5584 307702 306574 224208 208670 209607 221260 211996 288342 257760 210407 204359 206425 193502 182711
5571 182711 161012 226307 260151 243939 240616 192404 186860 223716 157170 163828 188514 189726
5559 189726 262671 277750 273683 294286 279060 255213 192524 159200 181551 136966 121951 179332
5547 179332 175252 210991 286031 215423 205784 187854 151736 182540 128816 147904 215917 229803
5535 229803 237609 230246 292026 263636 269472 238148 199289 253886 259173 231775 248394 242144 210469
5522 210469 225456 178829 139167 169671 160435 197448 214997 176464 186846 160911 190861 242870
5510 242870 224119 219199 252373 222680 282526 266142 278970 317836 266460 270683 274816 226054
5498B26054M2889m06p7910m7174j860M8028L7625Q718q896l691K619K4240J7932
5485B68168k1894l1408J5022K9254j8696k5011L0864K9922J9241r6780K5968r977
5473B14673l7702K3898K0334K6011j1919j4743L795l2578k2958q109M0644J3150
5461B14496J8484K4115K2413K390j2076M7803m2816L9850N4860m5146j0132J3650
5449C27891j371L3302l1471p4960L2002m2709Q321M4005m0624j2369r072R276
5437B42221J5547J8358Q2308L4777r1546M1975o688l7328M8612J4739k1732O6863
5425D08106m2993J0896o03J5623M5314k5474J5276k0320l7464K7552o2330m3151
5413B90432P4339k5106J7665k4847k9702l460J5331O9062L5471J0918M5430m7497
$$ plain form
5498 226054 268943 268537 190627 143453 141593 189621 227246 235964 227068 223377 225996 250236 268168
5485 268168 246274 214866 229888 259142 240446 215435 246299 276221 295462 198682 224650 214673
5473 214673 176971 200869 221203 247214 235295 220552 224347 191769 168811 160702 201346 214496
5461 214496 232980 257095 279508 281898 269822 317625 274809 314659 369519 324373 314241 327891
5449 327891 326520 359822 328351 253391 285393 242684 251005 295010 254386 242017 232945 242221
5437 242221 257768 276126 358434 393211 301665 343640 336952 299624 348236 362975 341243 408106
5425 408106 365113 376009 375406 391029 436343 410869 426145 405825 368361 395913 333583 290432
5413 290432 364771 339665 357330 332483 302781 299321 314652 383714 419185 430103 475533 428036
5401D28036L1903N6560j7391n3477K7507o042j7984L5626l5961k1337O580L0469
5389D64489m0910L349L12o1065O803J7172j844J0861p6679K3447O1713N830N141
5376D18619k0345L2767L2303r122m9488J9589m8528N1579j431n6671O7913l6647
5364D00538J1191L6925q3963N7405O0444p3088K3339k6443n286L6469K5372m4489
5352D18414P596m476M9589P604o2900K2383O718j7381r138j9575j5704N9568k4753
5339D17945J3948q5408K5897Q5132K4488m8334O2135r349n5491Q0264L9563m5292
5327E05498j7879L7932O6336K5332j330o0633j4223o2202J4450P1366n9980j4062
5315D90605M7761j3707l0221P9706J6762j7307k1767K1256m006J1320k2544L203
$$ plain form
5401 428036 459939 516499 499108 445631 473138 467096 449112 484738 448777 427440 434020 464489
5389 464489 423579 426928 427240 366175 372978 390150 388306 399167 322488 345935 407648 413478 418619
5376 418619 398274 431041 463344 454222 404734 424323 375795 427374 425943 369272 437185 400538
5364 400538 411729 448654 364691 422096 482540 409452 432791 406348 401062 437531 462903 418414
5352 418414 426010 421534 471123 478727 415827 438210 444928 427547 418409 398834 383130 442698 417945
5339 417945 431893 346485 372382 457514 482002 433668 495803 486454 430963 511227 550790 505498
5327 505498 487619 525551 591887 617219 615889 555256 541033 478831 493281 564647 504667 490605
5315 490605 538366 524659 494438 574144 590906 573599 551832 573088 569082 580402 557858 561061
5303E61061Q8863K0314J0911N5425j4186N708k7378L9787j3989l7366L2640j3710
5291G08080m4064m595J1702K1919m0694l8485p138j0270j12463j0364l0164Q6264
5279E29728J6669j1302L1317P578l8629Q7827k4506n1045K2556l6309N9970j4007
5267E79847k5432l7116p037k8711N591n2129j9155J380k3920p627j2232m540P2938
5254D41857N6314q4768j4889N2341L848K2089L394m5970K1338M9869J9566k5008
5242D99981k290N297j2956m7898l4169J9405R860J5680k7303k0683j9362R2775
5230D78337m2115l2655K7777M7918n0960J9952l7726M8819J5227J6622J01327
5219E92523m2904p0330K8684K7553k6314J1677q2945O5272o408j8497M1048j9861
$$ plain form
5303 561061 649924 670238 681149 736574 722388 728096 700718 740505 726516 689150 721790 708080
5291 708080 664016 659421 671123 693042 652348 613863 606725 596455 483992 473628 443464 529728
5279 529728 546397 535095 566412 573990 535361 623188 598682 547637 570193 533884 593854 579847
5267 579847 554415 517299 510262 481551 487142 435013 415858 417238 393318 385691 373459 368919 441857
5254 441857 498171 413403 398514 450855 454703 476792 480186 434216 455554 505423 524989 499981
5242 499981 497691 502988 490032 442134 407965 427370 437230 452910 425607 404924 385562 478337
5230 478337 436222 403567 431344 479262 428302 448254 410528 459347 474574 491196 592523
5219 592523 549619 479289 507973 535526 509212 520889 437944 503216 496808 478311 519359 499498
5207D99498R670O9402k5613K1506N6593K6318N8298J3629K4217J44096j0618k477
5195H84519J14546L1675P4920J28419R696Q4864K01850O1076J39401J51986J71670
5184B054622K64089K10645K80745L08219K9897J118j85294k60745k21554k80777
5174B200965k59520k05917k38335j62470o8511j07502k2990j01186r3799J2213
5164I52948o4360j04995M3741p4981r1065M6920p1263r105L5445k589p010p4493
5152E79193q8469K6059K1605m0515L7643o57J6165K882n0575l3055N5025l3058
5140D92243J0608k2801j6444K9987o5523K1343J3410j7515J9747k2554p3388L0918
5128D00031l6973L182j0959n454L8947K3291k8841M8097o899L2646j0874k3738
$$ plain form
5207 499498 509168 578570 552957 574463 631056 657374 715672 729301 753518 897614 886996 884519
5195 884519 999065 1030740 1105660 1234079 1243775 1328639 1530489 1591565 1730966 1882952 2054622
5184 2054622 2318711 2529356 2810101 3118320 3148217 3149335 2964041 2703296 2481742 2200965
5174 2200965 1941445 1735528 1497193 1334723 1266212 1158710 1135720 1034534 940735 952948
5164 952948 888588 783593 827334 752353 661288 708208 636945 627840 663285 660696 653686 579193
5152 579193 490724 516783 538388 497873 535516 534859 551024 553906 503331 470276 525301 492243
5140 492243 502851 480050 463606 493593 428070 449413 462823 445308 465055 442501 369113 400031
5128 400031 363058 366240 355281 349827 388774 412065 383224 431321 424422 457068 446194 422456
5116D22456r756j8041R3018k76j9586q378j4320m5840j7918j0338Q1783q3060
5104C69744j664L6844l6700L2986j5688J453O4365o3457k6153M5879k0609l294
5092C83706m2627K9425R460m6760m4169N4990L0736m9512M9108l707n0176o725
5080C13749m1103M4909J1499k4488L7309K0559k0088J5295o162K2112Q5781q0970
5068C78402M6852j3711n7697M4312J2581r2080L5875L3346l1589Q953K248r631
5056C57861p651K130K5406K7305q4773M8952Q5764p950k7476r232J2277N4084
5044D76697l3816j2620l4460j5114R3995K751j7115j8780l068j9751p1037L8250
5032C85932J09114M33q9767N2154J1246o2642O6206K5322j8222n08j4083K0873
$$ plain form
5116 422456 412700 394659 487677 487401 467815 459437 445117 399277 381359 371021 452804 369744
5104 369744 368080 404924 368224 401210 385522 386975 451340 387883 361730 407609 387000 383706
5092 383706 341079 370504 379964 333204 289035 344025 374761 325249 374357 370650 320474 313749
5080 313749 272646 317555 329054 304566 341875 362434 342346 357641 351479 373591 459372 378402
5068 378402 425254 411543 353846 398158 410739 318659 354534 387880 356291 365244 367492 357861
5056 357861 350210 352340 377746 405051 320278 369230 454994 447044 419568 410336 422613 476697
5044 476697 442881 430261 395801 380687 474682 477433 460318 441538 438470 418719 347682 385932
5032 385932 495046 495479 405712 457866 469112 406470 472676 497998 479776 479268 465185 486058
5020D86058j6453o2631N4637R210O236N9415M2172Q984n7509n6450R0368J1533
5008E75570r1977K5228j8697m8310Q6384l1149L1399J2o3166N1801q042k1134
4996D87919k8135P5561k5617k2550k6156L8447J02316n0391N0293O841k3839k1534
4984E63155m7174j8073M8375l6023J7114N0767l8623L5952k884Q379M255p3548
4972E11672N1641M8178j07357p371L0101K1307O0692m0248j2280K8578p2193L8415
4960E51135K4084P0540r915K4098m4941M1276M5664n3446J4185K6705m5426M1648
4948F85607N2968N389m383n52R103q903M7293Q066n5131O6N9985K188M1670k8021
4934H15345l7396L4373j5821m0511L0819j1513O46K8686O730P9085K1799L6156
$$ plain form
5020 486058 469605 406974 461611 470821 477057 536472 578644 587628 530119 473669 564037 575570
5008 575570 483593 508821 490124 441814 528198 497049 528448 528460 465294 517095 509053 487919
4996 487919 459784 535345 509728 487178 461022 499469 601785 551394 601687 608528 584689 563155
4984 563155 515981 497908 546283 510260 527374 578141 539518 575470 572586 580965 585220 511672
4972 511672 563313 611491 504134 496763 526864 548171 608863 568615 556335 584913 512720 551135
4960 551135 575219 645759 635844 659942 615001 656277 701941 648495 662680 689385 643959 685607
4948 685607 738575 743964 739581 739029 748132 739229 786522 794588 739457 739523 799508 801696 843366 815345
4934 815345 777949 812322 796501 755990 786809 775296 775942 804628 811358 890443 912242 948398
4922I48398L5196n9379M2972M0180p0565m8793M546k6287O023j1945K8177m0494
4910H48029Q2705k1645r8514N7966J1925M4553K022q848l4188L3547j7844J167
4898I00875M2511n6931O5957P8328n0890N0149k5781N1811M799n1926O3415l10
4886A072007K2240P8705k3087K8798K5922o4785M7257K6385p3404K7747L3013
4875A200798l9931P200j13989N2350L3372k1292P0277M6013j0841P3652n2925
4864A244684M153P8887R6374O8496j9112N8771J21881P3222J27205J47616J05038
4853B107215J43373K11038J84799K45050K58181K83908L55082M38605N07456N45590
4843E280297N62313N61946N49850M02305J21472n760k93122n40861o08690o54566
$$ plain form
4922 948398 983594 924215 967187 1007367 936802 888009 892555 866268 872291 860346 888523 848029
4910 848029 930734 909089 810575 868541 880466 925019 927041 918193 884005 917552 899708 900875
4898 900875 943386 886455 952412 1030740 979850 1029999 1004218 1056029 1060828 1008902 1072317 1072007
4886 1072007 1094247 1172952 1149865 1178663 1204585 1139800 1187057 1213442 1140038 1167785 1200798
4875 1200798 1160867 1168067 1054078 1106428 1139800 1118508 1188785 1234798 1223957 1297609 1244684
4864 1244684 1248837 1327724 1424098 1492594 1473482 1532253 1654134 1727356 1854561 2002177 2107215
4853 2107215 2250588 2461626 2646425 2891475 3149656 3433564 3788646 4227251 4734707 5280297
4843 5280297 5842610 6404556 6954406 7356711 7478183 7472423 7179301 6638440 6029750 5375184
4833E375184o83955n54830m90755m89886k64165k28527j43210k32530j46023q9013
4823B052290r1181n8826p8353j66942l6655o098n8443j7886k6921j12577k6414
4812A371994n1900J8055m7043n2532m0265o0875m5757M0451L8272o966o4616l0238
4800A068580p400l1397J25l9272l57J5871k3676J400M2608k3055l9963k2656Q1157
4787A021965n497l5708M8453k5729k0441Q2618j1700k6090J290J1347M3983J8466
4775A102957n9939O4774L4851L7614r944j3868j2398K0120L6978R17M7972L4623
4763A284657J8319m5768j0098K2272L5081P5116K884K1172R2213L8412J9988L8731
4751A592979N6151O5959R7152P6320R3661J18565J10441J72120J74934K22042
$$ plain form
4833 5375184 4691229 4136399 3645644 3155758 2891593 2663066 2519856 2287326 2141303 2052290
4823 2052290 1961109 1902283 1823930 1656988 1620333 1614235 1555792 1537906 1510985 1398408 1371994
4812 1371994 1320094 1338149 1291106 1238574 1198309 1137434 1091677 1132128 1170400 1163434 1098818 1068580
4800 1068580 1061180 1029783 1029908 990636 990279 1006150 982474 983874 1026482 1003427 963464 940808 1021965
4787 1021965 1016468 980760 1029213 1003484 983043 1065661 1053961 1027871 1029161 1040508 1084491 1102957
4775 1102957 1043018 1107792 1142643 1180257 1170313 1156445 1144047 1164167 1201145 1202062 1250034 1284657
4763 1284657 1302976 1257208 1247110 1269382 1304463 1379579 1382463 1403635 1495848 1534260 1554248 1592979
4751 1592979 1649130 1715089 1812241 1888561 1982222 2100787 2211228 2383348 2558282 2780324
4741B780324K20143K53158L17454L14305K94156L64800L34896R0208k6825k13226
4731D729393k95400k43109j76979L3536l8633O2656R4143K4494Q6247j5398j6113
4720D244837q9251p1708M1932P576L8486q4404k74870l98871l81281l09411j89886
4709B533149j16023k35385r6330q5725j13917K82p0741o2932r6423j00533L6154
4698A591576m5963p925J3242n6751k3640K1387K9449l2314o2798j3434L184k8793
4686A387220N0062j1706J801J567o3477J6877Q1829j9489R830L3585n2771L741
4674A439069M53O7725K0731J8986P3740L4426K0247J32476K2349N4515J90479
4663B075196J1569P8189J18891M6200J31199O8556R5387J69184J91311K26786
$$ plain form
4741 2780324 3000467 3253625 3571079 3885384 4179540 4544340 4879236 4969444 4942619 4729393
4731 4729393 4433993 4190884 4013905 4047441 4008808 4071464 4165607 4190101 4276348 4260950 4244837
4720 4244837 4155586 4083878 4125810 4133386 4171872 4087468 3812598 3413727 3032446 2723035 2533149
4709 2533149 2417126 2181741 2085411 1999686 1885769 1886051 1815310 1752378 1655955 1555422 1591576
4698 1591576 1545613 1537688 1550930 1494179 1470539 1491926 1521375 1489061 1426263 1412829 1416013 1387220
4686 1387220 1437282 1425576 1427377 1428944 1365467 1382344 1464173 1444684 1454514 1488099 1435328 1439069
4674 1439069 1439522 1507247 1527978 1546964 1620704 1655130 1675377 1807853 1830202 1884717 2075196
4663 2075196 2086765 2164954 2283845 2330045 2461244 2529800 2625187 2794371 2985682 3212468
4653C212468J31048m6237j11835j96538j79078k83430j68856k12038q7264r5021
4643A963219o0296k7970n4690O3969j1100k9808K8829M0563l8408L964K1201k9510
4631A869963o1331J2907J8464m2083M3865m8480l6504k3083n3251P2462o9324
4620A683605N01O7772o6398R493J5003k1275O5583j884J1276Q5108K771J2843
4608A864398O1814K9164O5028R870k6592J7996J3552o2266o258l5619R324l9479
4596A900932P8782Q6885L1997K488K2884j081N5330M8698L8274N0453L7083Q3039
4584B435764P8791K7020M6896O9624J11424j501K8226K8611j4934J3364j5069
4573B808216N0635J1119J14865O3346j6114P7796M3382N1674M654P5346N5095
$$ plain form
4653 3212468 3343516 3297279 3185444 2988906 2809828 2526398 2357542 2145504 2058240 1963219
4643 1963219 1902923 1874953 1820263 1884232 1873132 1843324 1872153 1912716 1874308 1878272 1899473 1869963
4631 1869963 1808632 1821539 1840003 1797920 1841785 1793305 1756801 1733718 1680467 1752929 1683605
4620 1683605 1684106 1751878 1685480 1694973 1709976 1688701 1754284 1752400 1763676 1848784 1851555 1864398
4608 1864398 1926212 1955376 2020404 2030274 2003682 2021678 2035230 1972964 1966706 1931087 1940411 1900932
4596 1900932 1979714 2066599 2098596 2101084 2123968 2122887 2178217 2226915 2265189 2315642 2352725 2435764
4584 2435764 2514555 2541575 2588471 2658095 2769519 2768018 2796244 2824855 2809921 2823285 2808216
4573 2808216 2858851 2869970 2984835 3048181 3032067 3109863 3153245 3204919 3209573 3284919 3340014
4562C340014l8461J29186N4031J3882Q5049Q1739O3210Q5237j3909P7020j0499
4551C866499j5427R6034R310Q5234Q3230J13129O8545J7553K5577J06423O9527
4540D525634P2789l9488l3702K2504L570j1648P214N9582P5763J79732J40637
4529E002587J59605J56535J93077J70929J23075M2349J04823P9726P6419J33704
4519F242829J39931K33467J70974K20289K70155K54775K46306L02951K57659K40318
4509H579654K32675K41361K92109L39990K61672K76316L29039L03366K41704K99497
4499A1397383L06642L33377L86660L29054L71361L09365L62706L87551L35634
4490A4519733L50635L41434K16056L18780K83780K55856L35758L67411M54885
$$ plain form
4562 3340014 3301553 3430739 3484770 3498652 3583701 3665440 3728650 3813887 3799978 3876998 3866499
4551 3866499 3851072 3947106 3956416 4041650 4124880 4238009 4306554 4324107 4349684 4456107 4525634
4540 4525634 4598423 4558935 4525233 4547737 4551307 4539659 4546873 4606455 4682218 4861950 5002587
4529 5002587 5162192 5318727 5511804 5682733 5805808 5848157 5952980 6032706 6109125 6242829
4519 6242829 6382760 6616227 6787201 7007490 7277645 7532420 7778726 8081677 8339336 8579654
4509 8579654 8812329 9053690 9345799 9685789 9947461 10223777 10552816 10856182 11097886 11397383
4499 11397383 11704025 12037402 12424062 12753116 13124477 13433842 13796548 14184099 14519733
4490 14519733 14870368 15211802 15427858 15746638 16030418 16286274 16622032 16989443 17444328
4481A7444328N39450N48567N23579O46100O37513O38556P01619P07631P35373
4472B3122716O94389P94877P68207Q75801J017291J027470J091453J243888J326453
4463C1962545J514986J713005J983408K167280K351265K475045K611919K903416
4455D9682869L389601L735799M217286M730698N316021O418997P703075R272320
4447I4466666J1294124J3225945J5461096J7187669J9431434K2495363K6977672
4440B20539969L3191976M1975094M7029014L6810588J5023497j5084215m3366251
4433C36119672n3824852n1390863m1635984k9428730k1260354j6361959j3103578
4426A09113352j0690452q796877p108761n809584m671399m077447l630206l236673
$$ plain form
4481 17444328 17983778 18532345 19055924 19702024 20339537 20978093 21679712 22387343 23122716
4472 23122716 23817105 24611982 25380189 26255990 27273281 28300751 29392204 30636092 31962545
4463 31962545 33477531 35190536 37173944 39341224 41692489 44167534 46779453 49682869
4455 49682869 53072470 56808269 61025555 65756253 71072274 77491271 85194346 94466666
4447 94466666 105760790 118986735 134447831 151635500 171066934 193562297 220539969
4440 220539969 253731945 295707039 342736053 379546641 394570138 379485923 336119672
4433 336119672 282294820 230903957 189267973 159839243 138578889 122216930 109113352
4426 109113352 98422900 89626023 82517262 76707678 72036279 67958832 64328626 61091953
4418F1091953k819548k374925j941152j662949j366033j120577r23591q65662
4410D8017516p02617p13993o06344n26130m32220l08659j18446K3821J22124K33239
4400D4988291M69328M70635O64719J004382J176875J424514J615334J774914K075083
4391E5664075K306953K640191L017029L436289L989443M768200N756394P111041
4383H8689615Q726900J0625772J2799590J4829099J6604348J9614271K3211608
4376A95101203K7668978L4025303M2327706M0342307K3613802P911111j4143138
4369C56847272l8791385m7297476m7112807m0842345k9845882k1656271j6737245
4362A14563861j3318622j0813501q930345p077035n782836m894956m327717l794050
$$ plain form
4418 61091953 58272405 55897480 53956328 52293379 50927346 49806769 48883178 48017516
4410 48017516 47314899 46600906 45994562 45468432 45036212 44727553 44609107 44632928 44755052 44988291
4400 44988291 45457619 45928254 46592973 47597355 48774230 50198744 51814078 53588992 55664075
4391 55664075 57971028 60611219 63628248 67064537 71053980 75822180 81578574 88689615
4383 88689615 97416515 108042287 120841877 135670976 152275324 171889595 195101203
4376 195101203 222770181 256795484 299123190 339465497 363079299 370990410 356847272
4369 356847272 318055887 270758411 223645604 182803259 152957377 131301106 114563861
4362 114563861 101245239 90431738 81501393 74424358 68641522 63746566 59418849 55624799
4354E5624799l463043l076298k752962k480250k158213j974719j780544j537480
4346C6401290j552472j414123j396867j346956j203840j193350j152733r60043
4338B6180906j029778q81267q00262p94672p96087p64816p79799o40926o37874
4329A9055425o42911n61124n13637m75278m79426m46610m16161n49773n20896
4320A4449609m68253m26285l80307l44310l69755k65692k59156k98098j65328
4311A1472425k51017j36393j87366k26158k18616k08895k63779j46810k68781
4302I564610j91302j35177j48810j33541j74354j02877j10363j96569j03906j32544
4292H135167j88025j93045j57504j22528j16361j25858j05992j39546k07061j64970
$$ plain form
4354 55624799 52161756 49085458 46332496 43852246 41694033 39719314 37938770 36401290
4346 36401290 34848818 33434695 32037828 30690872 29487032 28293682 27140949 26180906
4338 26180906 25151128 24269861 23469599 22674927 21878840 21114024 20334225 19693299 19055425
4329 19055425 18412514 17851390 17337753 16862475 16383049 15936439 15520278 14970505 14449609
4320 14449609 13981356 13555071 13174764 12830454 12460699 12195007 11935851 11637753 11472425
4311 11472425 11221408 11085015 10897649 10671491 10452875 10243980 9980201 9833391 9564610
4302 9564610 9373308 9238131 9089321 8955780 8781426 8678549 8568186 8371617 8267711 8135167
4292 8135167 7947142 7754097 7596593 7474065 7357704 7231846 7125854 6986308 6779247 6614277
4282F614277j06979p7716p7297j07264o0905o0076J394m4885j62023j75814j84027
4271E558685k19192j18711k08595j52973j52589j12665k2713n2543m6488n9134
4261D413082m996o776n1065l6799O7465r6580q2079q1765j0237m9292j04356m5133
4249C911469n9334j02455j47903n3718m9303k3206N526n8962m3347j01783l3051
4238C243933m9843M5893Q1129M0927K4107m040o8668m5759r44Q1285m4825K2246
4226C325441J6241L5667j0560o102L000m5583J12525j1560m8042j024q0474l3830
4214C255699j1255j01462l8800K3309K7675K9943o1924j2179m6628j09745p933
4203B946700k7745n0789N4989k4099k4511k6983q8607O5732k2258n3630N0235
$$ plain form
4282 6614277 6507298 6429582 6352285 6245021 6184116 6124040 6125434 6080549 5918526 5742712 5558685
4271 5558685 5339493 5220782 5012187 4859214 4706625 4593960 4571247 4518704 4472216 4413082
4261 4413082 4408086 4401310 4350245 4313446 4380911 4284331 4202252 4120487 4110250 4060958 3956602 3911469
4249 3911469 3852135 3749680 3601777 3548059 3498756 3475550 3481076 3422114 3378767 3276984 3243933
4238 3243933 3194090 3239983 3321112 3362039 3386146 3382106 3313438 3267679 3266735 3348020 3303195 3325441
4226 3325441 3341682 3377349 3366789 3360687 3363687 3318104 3430629 3419069 3371027 3370003 3289529 3255699
4214 3255699 3244444 3142982 3104182 3127491 3155166 3185109 3123185 3111006 3064378 2954633 2946700
4203 2946700 2918955 2868166 2923155 2899056 2874545 2847562 2758955 2824687 2802429 2748799 2799034
4192B799034K1896L722M5320J4958o6001j4123n1601J5767L4839J4365K605m1795
4180B778986P3207P4670l4325k4470K935K8873J6823M0070J2741J12296O2439
4169C144245j5534P750L2297Q8875J38189N4354J60305K42721J37883K80353K41649
4158D513087K58819K24307J23693J13416J19352k7673j87353k75025l06056l86878
4148D169689k35779k64749j62999r6640n6939j13373o0570j0473J5585j05707
4138C078045M6795K6111k3814k7083n0950l059M9042Q822M582K6447m4215M6568
4126C137291J8810j8221L3364m0737K8115L2116k2801j2235P6343m9099J5893
4115C198839O1427N8023N8400m9040J9669Q1964O383p524j8041M9396P7772l62
$$ plain form
4192 2799034 2820930 2824652 2869972 2884930 2818929 2804806 2753205 2768972 2803811 2818176 2820781 2778986
4180 2778986 2852193 2926863 2892538 2868068 2871003 2899876 2916699 2956769 2969510 3081806 3144245
4169 3144245 3128711 3136461 3168758 3257633 3395822 3450176 3610481 3853202 3991085 4271438 4513087
4158 4513087 4771906 4996213 5119906 5233322 5352674 5325001 5137648 4862623 4556567 4169689
4148 4169689 3933910 3669161 3506162 3409522 3352583 3239210 3178640 3168167 3183752 3078045
4138 3078045 3124840 3150951 3127137 3100054 3049104 3046045 3095087 3103909 3108491 3134938 3090723 3137291
4126 3137291 3156101 3137880 3171244 3130507 3158622 3190738 3167937 3155702 3232045 3182946 3198839
4115 3198839 3260266 3318289 3376689 3327649 3347318 3429282 3435665 3428141 3410100 3459496 3537268 3536906
4103C536906J847R4624M3065L6065O5603J31353J06945P6254J50589P8554J95415
4092D517220J21395J58232L23219K74615K10753J98645p921n4797k25590k59820
4082E255951j71974j60011j72113o7261j15419P009j3518m6889j5938L884P8201
4071D581922N076r0312J42124J12326m3284k1398O038Q222M7019j2707L9886k891
4059D772021j901M3930L0100K4118J10443L8763M5876K0419j9558K7384P1099
4048E162694K7133P1550N812k6711Q0694O3544N1839Q7713M8116K8425O3858N9955
4036E724622M9669N6488O8876R3638Q1423k712L9832R2483J08258O7207O0619
4025F440403P5718J18766N3265J45472O3246M0139R7467Q1057J31317J11582M6483
$$ plain form
4103 3536906 3538753 3633377 3676442 3712507 3778110 3909463 4016408 4092662 4243251 4321805 4517220
4092 4517220 4638615 4796847 5120066 5394681 5605434 5804079 5796158 5741361 5515771 5255951
4082 5255951 5083977 4923966 4751853 4684592 4569173 4576182 4562664 4515775 4499837 4503721 4581922
4071 4581922 4586998 4496686 4638810 4751136 4707852 4686454 4692492 4700714 4747733 4735026 4774912 4772021
4059 4772021 4770120 4814050 4844150 4868268 4978711 5017474 5063350 5083769 5064211 5091595 5162694
4048 5162694 5189827 5261377 5267189 5240478 5321172 5384716 5436555 5524268 5572384 5600809 5664667 5724622
4036 5724622 5774291 5830779 5899655 5993293 6074716 6072004 6111836 6204319 6312577 6379784 6440403
4025 6440403 6516121 6634887 6688152 6833624 6896870 6937009 7034476 7115533 7246850 7358432 7404915
4014G404915R2740J71639P1192J20475Q6826O9695Q2804P0661L1004J29025K10
4003H331186R4000J92234J11518J98290J76126J69973K17367J16290Q2982Q6891
3993I776857o9444l8617k8685M3045N8251J24388P2193J47281Q0060K32512K23662
3982A0621503J63939L31205L25366K87705L95735L37422N09492N10905N74236
3973A4057508P00162P66199Q99522J030228J185501J418495J700211K018936K371278
3964B6148040K656767L092789L601729M360001N324193O290566O423264L473907
3956F1371256j711493n693822p705848p564101n932463m370356l279096k633919
3948B2480158k151509j687719j358180j115306q33585p35748o96125n86912o37688
$$ plain form
4014 7404915 7497655 7669294 7740486 7860961 7947787 8017482 8100286 8170947 8201951 8330976 8331186
4003 8331186 8425186 8617420 8728938 8927228 9103354 9273327 9490694 9606984 9689966 9776857
3993 9776857 9707413 9668796 9640111 9683156 9741407 9865795 9937988 10085269 10165329 10397841 10621503
3982 10621503 10785442 11116647 11442013 11729718 12125453 12462875 12972367 13483272 14057508
3973 14057508 14757670 15523869 16423391 17453619 18639120 20057615 21757826 23776762 26148040
3964 26148040 28804807 31897596 35499325 39859326 45183519 51474085 57897349 61371256
3956 61371256 59659763 53965941 46260093 38695992 32763529 28393173 25114077 22480158
3948 22480158 20328649 18640930 17282750 16167444 15333859 14598111 13901986 13315074 12677386
3939A2677386n27849m98866m36218l42657k93303l15300k66485k20771k19100
3930I556837j75166k37771k03816k03648j03837j12508j62007j53151j36783n3294
3920H014856k9369q9996r1042n7415p9496n5675m6537m7545o7660p8625n5626
3909G315870r9806m1883k1327J0692n2696M1752M4232m5895O8428J25174M1192
3898G385733R8414K20714J47766K37983K84052L77666L61542L90519N13015M80435
3888A0497839M88017O50548O18261N00529K76305j64243n14266o97416p58091
3879A0897483m98778l60805l28017j90301l21291l56914m49442m44277k31214
3870G716444j87133k06948j50530j41018j61177k3377r1802J3413j1303M736J07835
$$ plain form
3939 12677386 12149537 11650671 11214453 10871796 10578493 10263193 9996708 9775937 9556837
3930 9556837 9381671 9143900 8940084 8736436 8632599 8520091 8358084 8204933 8068150 8014856
3920 8014856 7985487 7895491 7804449 7747034 7667538 7611863 7565326 7517781 7450121 7371496 7315870
3909 7315870 7216064 7174181 7152854 7163546 7110850 7152602 7196834 7150939 7219367 7344541 7385733
3898 7385733 7484147 7704861 7852627 8090610 8374662 8752328 9113870 9504389 10017404 10497839
3888 10497839 10985856 11636404 12254665 12755194 13031499 12867256 12352990 11655574 10897483
3879 10897483 10398705 10037900 9709883 9519582 9198291 8841377 8391935 7947658 7716444
3870 7716444 7529311 7322363 7171833 7030815 6869638 6846261 6754459 6767872 6756569 6761305 6869140
3859F869140R9700J09262K26403J28464K26248L77461L70403N11491M74927Q0624
3849I474123k32483m59822n65145l38427k73929j65578q9722p1850L8850J4990
3839G331007J07729J25382N9392J87221J91033J53019J84923J32598J84301K37285
3829H893890J74781K39759K86509K52639L71997N39986N80046O88782P87871Q80099
3819A3696359R77323Q60218O97822L92463k80460n96796q91037j092379j064761
3810A2698752r05430p30731m66613m36735k14228j24521k61368m36193n64761
3801H558172m90095m97416m48316m01377l61609k84345k20829k03890k15038j83072
3791E252185j42042j67113p5488r2403m2759j69554j18899j7871j15012j84093
$$ plain form
3859 6869140 6968840 7078102 7304505 7432969 7659217 8036678 8407081 8918572 9393499 9474123
3849 9474123 9241640 8781818 8216673 7878246 7604317 7438739 7349017 7277167 7316017 7331007
3839 7331007 7438736 7564118 7623510 7810731 8001764 8154783 8339706 8472304 8656605 8893890
3829 8893890 9068671 9308430 9594939 9847578 10219575 10759561 11339607 12028389 12816260 13696359
3819 13696359 14673682 15533900 16231722 16624185 16343725 15746929 14855892 13763513 12698752
3810 12698752 11793322 11062591 10595978 10159243 9945015 9820494 9559126 9122933 8558172
3801 8558172 8068077 7570661 7122345 6720968 6359359 6075014 5854185 5650295 5435257 5252185
3791 5252185 5110143 4943030 4867542 4775139 4732380 4562826 4443927 4426056 4311044 4126951
3781D126951m6696m0837j60283l7323j29379j03823k6827r0642o6895j06808m0375
3770C277063L453r3987l0194L2452l5374J5012l8108q6667j0173l1902l4633j0802
3758B956140r4954K7745K0902o0758k3881l6263l5948j2839m060p0832K3498n3349
3746B635401L6388M6283k4484p886o7928J6506R2589j2386j084k0538n2118n096
3734B635647N370k8910k3529J7845m2911P9534J1552l4567j5892O8140J652o4721
3722B609210q7497k4266l256n2939O9191o7023K5194K5047m8966N9100r8290p176
3710B398329n3697n2856M4293j248r7941K7206n871P788L0634j2592L7576O883
3698B328504L989m479j2808n5207O4302m105j798O581p5955q3547n8810k0751
$$ plain form
3781 4126951 4080255 4039418 3879135 3841812 3712433 3608610 3581783 3491141 3424246 3317438 3277063
3770 3277063 3280516 3186529 3156335 3188787 3153413 3168425 3130317 3043650 3033477 3001575 2966942 2956140
3758 2956140 2861186 2888931 2909833 2849075 2825194 2788931 2752983 2740144 2736084 2665252 2688750 2635401
3746 2635401 2671789 2718072 2693588 2685702 2617774 2634280 2726869 2714483 2713399 2692861 2640743 2635647
3734 2635647 2641017 2612107 2588578 2606423 2563512 2643046 2654598 2620031 2604139 2672279 2673931 2609210
3722 2609210 2521713 2497447 2494191 2441252 2510443 2443420 2468614 2493661 2444695 2503795 2405505 2398329
3710 2398329 2344632 2291776 2336069 2334821 2236880 2264086 2258215 2266003 2296637 2284045 2321621 2328504
3698 2328504 2332493 2328014 2315206 2259999 2324301 2320196 2318398 2324979 2249024 2165477 2106667 2085916
3686B085916K0070m6045l4031j8414k2864j816k1736m8687L5059m9713m0753K2097
3674A879083k9679N1295l7049m3357J3870J3128j2294k3056j277p3670O276M2251
3662A785521n5577n189J7611k8097P107n30K6721L6374k3898m4710n2996j8484
3650A643853N1594K4782r903M3080K1697J2531K396M6448M445p0117M1779L3860
3638A846445J4637l4898k4195n0026M1015n8743l9763l4532m103N2711M4967l0120
3626A723395N8665n7238m160L4761K164J16402K4556l9376M7855M8060l787P5399
3614B026696J1508P0560J696n306R7465P1385P930R5482L6403L1418M1686M2876
3602B529799J53918R1275P2920J69815J35906Q2645J57087P6229Q1045J80730
$$ plain form
3686 2085916 2105986 2059941 2025910 2007496 1984632 1982816 1961080 1912393 1947452 1897739 1856986 1879083
3674 1879083 1849404 1900699 1863650 1820293 1834163 1847291 1834997 1811941 1810664 1736994 1743270 1785521
3662 1785521 1729944 1724755 1742366 1714269 1721376 1720846 1747567 1783941 1760043 1715333 1662337 1643853
3650 1643853 1695447 1720229 1710326 1753406 1775103 1787634 1790030 1836478 1840923 1770806 1812585 1846445
3638 1846445 1861082 1826184 1801989 1751963 1792978 1734235 1694472 1659940 1655837 1708548 1753515 1723395
3626 1723395 1782060 1724822 1720662 1755423 1757587 1873989 1898545 1859169 1907024 1955084 1951297 2026696
3614 2026696 2038204 2108764 2110460 2105154 2202619 2274004 2281934 2377416 2413819 2445237 2486923 2529799
3602 2529799 2683717 2774992 2847912 3017727 3153633 3236278 3393365 3469594 3550639 3731369
3592C731369J72796K21707K53633K28963K30069K77180J80560J57536R9753R9320
3582E652886J1167o9334q3594j13840r8692m3070m9768p6839j0499q9055p6491
3571D952871r7721k31520j80335k24325k84082k30399k48753k19400j50013j88662
3561B897661j92335l4547r9605o1699p0913r7728P503q2415J6375j0251l6286
3550B235760l2899M077l1734L1595r862m5934q086K8586P7456J2554q0403R5902
3538B277012K6255O330j5795N182n73K7306m4659N2154K5785k4233L5526k7262
3526B343028L0857O6061k3962k3508L4625n9847M610J5580K269j9958p9466k6760
3514B263529J0716k801K0492M2563j3980L8142J3158j8236j7882m7094K7451O3565
$$ plain form
3592 3731369 3904165 4125872 4379505 4608468 4838537 5115717 5296277 5453813 5553566 5652886
3582 5652886 5664053 5594719 5511125 5397285 5298593 5255523 5205755 5128916 5118417 5029362 4952871
3571 4952871 4855150 4623630 4443295 4218970 3934888 3704489 3455736 3236336 3086323 2897661
3561 2897661 2705326 2670779 2571174 2509475 2438562 2340834 2348337 2265922 2282297 2272046 2235760
3550 2235760 2202861 2206938 2175204 2206799 2196937 2151003 2142917 2171503 2248959 2261513 2181110 2277012
3538 2277012 2303267 2309597 2293802 2298984 2298411 2325717 2281058 2333212 2358997 2334764 2370290 2343028
3526 2343028 2373885 2439946 2415984 2392476 2427101 2367254 2371864 2387444 2389713 2369755 2290289 2263529
3514 2263529 2274245 2271444 2291936 2334499 2320519 2358661 2371819 2353583 2335701 2288607 2316058 2379623
3502B379623n3254n1602n302K3723N6935L477J1749K0256J6201j03073K1199K1742
3490B341674o713j2525r8836l8785J2325L8306p458j3621O6113p2901l9581j0157
3478B157841P950m2370k8960l6402j8951K7133N928l4404J01238q034K2638N9724
3466B213331Q5157J8534K4185K6357p221J10738N8707L0248J11212L903J5294
3455B690445N8041Q6594P0158N7945K7376L4997P2972K1714R0076P7843M2545
3444C330706J9981j2419N3327O1302J6098O689J1181o2097N4147K263K3489J9219
3432C523886k8589N5899L5947l7299m5160K2271K361K5207M2329q562Q1063P1639
3420C740992o668M5673o211L560L2584r008j2878K5635m1785O4882L1033j43421
$$ plain form
3502 2379623 2326369 2274767 2269465 2293188 2350123 2353600 2365349 2385605 2401806 2298733 2319932 2341674
3490 2341674 2334961 2322436 2223600 2184815 2197140 2235446 2227988 2214367 2280480 2207579 2167998 2157841
3478 2157841 2165791 2123421 2094461 2058059 2039108 2066241 2072169 2037765 2139003 2130969 2153607 2213331
3466 2213331 2298488 2317022 2341207 2367564 2360343 2471081 2529788 2560036 2671248 2675151 2690445
3455 2690445 2748486 2835080 2905238 2963183 2990559 3025556 3098528 3120242 3210318 3288161 3330706
3444 3330706 3350687 3338268 3391595 3452897 3468995 3475684 3486865 3424768 3478915 3481178 3504667 3523886
3432 3523886 3495297 3551196 3587143 3549844 3504684 3526955 3529316 3554523 3596852 3588290 3669353 3740992
3420 3740992 3734324 3779997 3773786 3777346 3809930 3800922 3788044 3813679 3771894 3836776 3867809 3724388
3408C724388K5356L3254n3570j7993K3100k3430m3574l7707r574m4540j03078
3397C472632M1694n387k2589o2162r1215m78O098l3093p71l8366l8319j9271n0981
3384C157792o5505K077n9516q390K4269m8992l833k5980l6900J5689q2816L3722
3372B901617J5207L1571J0923m3691l7967J1437J3532o5848M0722J1604l7619
3361B851488L497K3472k1759j7216j267k8250K8134n3911j821J6263J9035J4517
3349B832182m7400j16592L1164j6970n3293n799o3736k4151L1824o5525k4034
3338B477670j8788q4581J6076r0441J2187j8851j63578j0605n11l5976j792p0234
3326B010576m3569J6127r8690K8276k6805p9717O510m254o3545m2393q3692q476
$$ plain form
3408 3724388 3749744 3782998 3729428 3711435 3734535 3711105 3667531 3629824 3620250 3575710 3472632
3397 3472632 3514326 3508939 3486350 3424188 3332973 3332495 3338593 3305500 3304729 3266363 3228044 3208773 3157792
3384 3157792 3092287 3094364 3034848 3026458 3050727 3001735 2997902 2971922 2935022 2950711 2867895 2901617
3372 2901617 2916824 2948395 2959318 2915627 2877660 2889097 2902629 2836781 2877503 2889107 2851488
3361 2851488 2854985 2878457 2856698 2839482 2838215 2809965 2838099 2784188 2782367 2798630 2817665 2832182
3349 2832182 2784782 2668190 2699354 2682384 2629091 2623292 2559556 2535405 2567229 2501704 2477670
3338 2477670 2458882 2374301 2390377 2299936 2312123 2293272 2129694 2119089 2118578 2082602 2080810 2010576
3326 2010576 1967007 1983134 1884444 1912720 1885915 1806198 1812708 1808454 1744909 1702516 1618824 1610348
3314A610348N6828l6806q0230Q2792P806j1102o0960l912n3347p4128O3010k5568
3302A474731K0664K6807L0172j7557r559n2644j31M8162q3228j2862P8334l5142
3290A467747J3582j8941P0874M3638M3311k0658J438J9709k820J1310l9340k322
3278A587528P6836m088j7018o7981j6445L787k2817N8034n6190k1495L692r0673
3266A433170O658M82j7132m8518J6392l8456o0009n2129o6754R211M0914m6821
3254A177008n0437m9974q1894O3698J8401p1290J8029n3999j0433l5362Q166N4055
3242I85968p976j8751L1105m667M2947k4756p428k7223j9863m8883k2226L7584
3230I15831k4393o794Q618N5545k6865k6351O8211m80L4454p5733j11750L4013
$$ plain form
3314 1610348 1667176 1630370 1550140 1632932 1640738 1629636 1568676 1564764 1511417 1437289 1500299 1474731
3302 1474731 1495395 1522202 1552374 1534817 1525258 1472614 1472483 1520645 1437417 1424555 1502889 1467747
3290 1467747 1481329 1462388 1533262 1576900 1620211 1599553 1600991 1620700 1617880 1629190 1589850 1587528
3278 1587528 1664364 1660276 1643258 1575277 1558832 1562619 1539802 1597836 1541646 1520151 1523843 1433170
3266 1433170 1439828 1440310 1423178 1374660 1391052 1352596 1292587 1240458 1173704 1182915 1223829 1177008
3254 1177008 1126571 1076597 994703 1058401 1076802 1005512 1023541 969542 959109 923747 931913 985968
3242 985968 977992 959241 990346 985679 1028626 1003870 996442 969219 949356 900473 878247 915831
3230 915831 891438 884644 893262 948807 921942 895591 963802 963322 997776 922043 810293 844306
3218H44306Q7603j0708l698m7508L0195n725m0890K6302l9083K6555m8401l3800
3206G85148k1670L1664o1605l0271l6020K8988k2312k2672J3888r857K573M731
3194F62585k3951M1955l7920K3098K7904m3109m025L0723k395j8230L2556r2507
3182E96684j8738q524L1830P6606o7286k2923o600l2327K2276o226k4672O610
3170E46710j3543j1844O3949R588l2536M9056q560n8804L7687N142j2685m6414
3158E27746k0133L8495N829j3668M3550l8669o1247J9950p9351J9296L9867n4632
3146D27033K9840O1703J4420k1602n7375k7870M0562L0026l8645O9306n9870n474
3134D62054K6547J1269L0513l3974l711k6058l4931M2875J5595k0161J5515L1561
$$ plain form
3218 844306 931909 921201 917503 869995 900190 894465 853575 879877 840794 867349 818948 785148
3206 785148 763478 795142 733537 703266 667246 696234 673922 651250 665138 655281 657854 662585
3194 662585 638634 680589 642669 665767 693671 650562 646537 677260 674865 656635 689191 596684
3182 596684 577946 569422 601252 677858 610572 587649 581049 548722 570998 564772 540100 546710
3170 546710 533167 521323 585272 594860 562324 611380 602820 544016 581703 586845 574160 527746
3158 527746 507613 546108 551937 538269 581819 543150 481903 501853 422502 441798 481665 427033
3146 427033 456873 518576 532996 511394 454019 426149 466711 496737 458092 527398 467528 462054
3134 462054 488601 499870 530383 496409 492698 466640 431709 474584 490179 470018 485533 517094
3122E17094p5298j9395O0450j0672M5220k4180o3728L2540O1395N1801M5666m4887
3110E76006j4592j5149l9602M5493m6215P4352K2193n7763r216L6023L3249J0780
3098F15559Q662n2599q156J55l5559K9913N5226K945k9541j6010p147P0152j2788
3085F20812K4305J5286q028J9142q4m2663M8207o2918o182M5879J3077L6147l470
3072F99510k0775L0234k989j0389K8354P952o180N8783N9643O2020O6429n2251
3060I20341N3386N4173N8299K3304O32N9265J21031R341N4366R1250K3316R8663
3048A567367J29357m8401Q9916R6055K8410L3515r1776j13409j1954j96113j54258
3037A328709l9409n8685p3400j04295q2120J6941j7246q8053o1576o2072J0879
$$ plain form
3122 517094 441796 422401 482851 472179 517399 493219 429491 462031 523426 575227 620893 576006
3110 576006 561414 546265 506663 552156 505941 580293 602486 544723 535507 571530 604779 615559
3098 615559 624221 571622 563466 563621 528062 557975 613201 616146 586605 570595 563448 633600 620812
3085 620812 645117 660403 652375 671517 671433 628770 676977 614059 607877 653756 666833 702980 699510
3072 699510 678735 708969 705980 695591 723945 731897 725717 784500 844143 906163 972592 920341
3060 920341 973727 1027900 1086199 1109503 1110135 1169400 1290431 1299772 1354138 1445388 1468704 1567367
3048 1567367 1696724 1648323 1738239 1834294 1862704 1896219 1804443 1691034 1679080 1482967 1328709
3037 1328709 1289300 1230615 1157215 1052920 970800 987741 970495 882442 820866 758794 769673
3026G69673j2178j10898K8064j1593o2839N3006k4631n9476N9531r6053l5603
3015D97003L5518l3833K9106M1316n3470O6273m4002k8010J4287k7898K556J6981
3003E15827q1511J3212p282n3227J20029o6568j64013Q3814M33J078P4679j3068
2991D23403q2251K3194k3178r838L5614l7481J2418m570j0253P981l1257R1851
2979C95633l0992m5605M5992n7547m1392J0626n701K9371l782J6819L5885l7676
2967C11631j6159K3114L6797m2564k3247m6397K2536L574L1951j0918J5875J3482
2955C19675r212R919k1208n3042m168J1333k0563j1318l732K3406L6597p5753
2943B01934J9597m4779M6999Q9257k7941j5370K0548n9073P3449k7016J1819K1371
$$ plain form
3026 769673 757495 646597 674661 663068 600229 653235 628604 569128 628659 532606 497003
3015 497003 532521 498688 527794 569110 515640 581913 537911 509901 524188 496290 498846 515827
3003 515827 434316 447528 440246 387019 507048 440480 276467 360281 360714 361792 436471 423403
2991 423403 341152 364346 341168 331330 366944 329463 341881 337311 327058 335039 303782 395633
2979 395633 364641 319036 365028 307481 266089 276715 271014 300385 296603 313422 349307 311631
2967 311631 295472 318586 355383 312819 289572 243175 265711 269285 301236 290318 306193 319675
2955 319675 310463 320382 299174 246132 241964 253297 232734 221416 217684 241090 277687 201934
2943 201934 221531 176752 223751 313008 285067 269697 290245 231172 304621 277605 289424 310795
2931C10795p7804k1150J7754k2312O9092j8779l8860L8142J446m6124K5982o476
2919B31706O9449K3083j27667J4090M9738p0156K9714j5191M34J6147k2507N4395
2907B53235Q113o7738j1804n02N8579M0615m0517k3447K0497j034j0707n8465
2895A66825j0357K3069j8495L7309O1370k1353n444l2803j949N4924J5156n4535
2883B13717j1314k1883k0023L1868r643J456j562O182j0168J9504k9454L1146
2871A99826L4576q0814k8831J0706K2130N2810n18j6284K3071j5388l5802L5756
2859B01238k5948M6535m0390N379K6205M7837m2031n2719k1768J01197l5106o054
2847B04375L7553k8732N661N8334L0933j4639o0152J0420M3952k4188l9415J7631
$$ plain form
2931 310795 232991 211841 229595 207283 276375 257596 218736 256878 258324 212200 238182 231706
2919 231706 301155 324238 196571 210661 260399 190243 219957 204766 205200 221347 198840 253235
2907 253235 261348 193610 181806 181304 239883 280498 239981 216534 237031 235997 225290 166825
2895 166825 156468 179537 161042 198351 259721 238368 232924 200121 198172 253096 268252 213717
2883 213717 202403 180520 160497 192365 182722 184178 182616 188798 178630 198134 168680 199826
2871 199826 234402 153588 124757 135463 157593 210403 209885 193601 216672 201284 165482 201238
2859 201238 175290 221825 181435 186814 213019 260856 218825 166106 144338 245535 210429 204375
2847 204375 241928 213196 218857 277191 308124 293485 233333 243753 287705 263517 224102 241733
2835B41733M1932J6622J9421N1172k610L6020j0781n3783J1192K1804J13185k1468
2823D64439m5163J1948m6326m8453M5681J753m51o34l5211k5674J2154O864L8667
2810C79594k0870P915O1458K1411N2563l8304M4527L7065m1017L0590L3578L2607
2798F01117Q5848J250r192j7989J2509j364k9011n2568K7215n9608k2261o3376
2786D72570M2050J3780o0354J5402j7937n8068j1623r000J9344K7808P037m3237
2774C97772L6212O5936J5697L5391O42M5312K8663m9238N7133j1360L8907K4339
2762F85406m9546j3468r9977J1277Q461k5137l5072q032K1246k6499j2171k4763
2750D31725K3482j94l1683J21765p4908l1658N4196m3539K0471N9548k5915K2157
$$ plain form
2835 241733 283665 300287 319708 370880 368270 404290 393509 339726 350918 372722 485907 464439
2823 464439 419276 431224 384898 336445 382126 383879 383428 382794 347583 321909 334063 340927 379594
2810 379594 358724 366639 428097 449508 502071 463767 508294 545359 504342 534932 568510 601117
2798 601117 686965 688215 679023 661034 673543 672179 643168 590600 617815 558207 535946 472570
2786 472570 514620 528400 468046 483448 465511 407443 395820 386820 406164 433972 441009 397772
2774 397772 433984 499920 515617 551008 551650 596962 625625 576387 633520 622160 661067 685406
2762 685406 635860 622392 522415 533692 542153 517016 481944 473912 495158 468659 456488 431725
2750 431725 455207 455013 423330 545095 470187 438529 492725 449186 469657 529205 503290 525447
2738E25447k1368M3459N097L1562j0781r6136k7339n6110j3666n734j6667N9993
2726D17757m6545j7463Q0218j2659j7446k469m4511M0255m5136K1248M009k6760
2714C50498k2775O8093j7335j1356J5397j8385n677j2821m5284N2994l0593k9636
2702B93120L883j1537j1975K9731o1611L0937K7142m3936L1097M1052j8996m1085
2690B67822J275K6779K0644q1669J7340j6121m4565L7822k9666n8338M7198j5830
2678A72691m4183m055K1847j075r9K9025M306J913J306R736n4360R3917j7227
2665B13742j15570N1529K6562m3503L505j764k5698N9402l6952J297R187l5748
2653A05989L095j0612j6411K5492n1573K9234N5148n5026O4946M6105m1341l8249
$$ plain form
2738 525447 504079 547538 552635 584197 573416 477280 449941 393831 380165 374431 357764 417757
2726 417757 371212 353749 433967 421308 403862 401393 356882 397137 352001 373249 377258 350498
2714 350498 327723 395816 378481 367125 382522 364137 358460 345639 300355 353349 322756 293120
2702 293120 297003 285466 273491 303222 241611 272548 299690 255754 286851 327903 308907 267822
2690 267822 269097 295876 316520 234851 252191 236070 191505 229327 199661 141323 188521 172691
2678 172691 128508 124453 146300 145225 145126 174151 178457 180370 181676 191412 137052 230969 213742
2665 213742 98172 149701 176263 132760 136265 134501 108803 168205 131253 132550 141737 105989
2653 105989 109084 98472 82061 107553 55980 85214 140362 85336 150282 196387 155046 116797
2641A16797n6782M1150J3108k6188K4636L3516k5413k7650l7149L1984J2314k6893
2629G3430j4994N1358m793N2446j04335n450K6078n5327L9232L7072l6023j8465
2617D0229K6237r513J9041k7035j0771M3227o245k13Q941p5476j1276K6967J8677
2604D2790J0877r062K9006R215j4596R950N6720j8471k1742m1694k8808R1259
2592A15444L1596n5908m3229j2036N9840N6130m740K12n4948j1779J5529k8749
2580F7362N720n016K8524J9162j7374o7447j1460m4497N7135M0697l9229K8426
2568F2003k243o4621J4542J6349m9640O5257N5054o5296L1909q7768Q2424J6808
2556G4778j02366Q2291n7547L46J19816n7824J8954j2495l6120N4948m5038j4449
$$ plain form
2641 116797 60015 101165 114273 88085 112721 146237 120824 93174 56025 88009 100323 73430
2629 73430 58436 109794 105001 157447 53112 47662 73740 18413 57645 94717 58694 40229
2617 40229 66466 56953 75994 48959 38188 81415 75170 74957 83898 8422 -2854 24113 42790
2604 42790 53667 44605 73611 82826 68230 78180 134900 116429 94687 52993 24185 115444
2592 115444 147040 91132 47903 35867 95707 151837 147097 147309 92361 80582 96111 67362
2580 67362 73082 68066 96590 115752 98378 30931 19471 -25026 32109 72806 33577 62003
2568 62003 59760 -4861 9681 26030 -23610 41647 96701 31405 63314 -24454 57970 74778
2556 74778 -27588 54703 -2844 -2498 117318 59494 78448 65953 29833 84781 39743 25294
2544B5294O8443k1959n8213O0015l7820N9511j8892m1588M8671l1449l8820P1368
2532H4561n6616j6138m7624k2815J25698k860k1094K1191j5551p9436N8868O961
2520C5145n215P9494k9509Q46L0688L3984J8720n6755q9480L026K0186L6673K473
2507H0276Q979j653J4148K2620j07351J3694N3644p383R757m5381J8084J4905
2495G4339L8146M1437k5475n972K9420n1952O9304K5428M070J2490j1780k7114
2483A72341J5507J6664L7987o8155k389N6872j09118n3540J4192J0103p894Q219
2471I0789O2554m8148K6087M638K6555M3557Q6101o0889k5331O437k1582k3907
2459A66861N7817J8737j2553L0484n236P504p4484j5525K6873Q631L5765k8089
$$ plain form
2544 25294 93737 71778 13565 73580 35760 95271 76379 34791 83462 52013 13193 84561
2532 84561 27945 11807 -35817 -58632 67066 64206 43112 64303 48752 -30684 28184 35145
2520 35145 29930 109424 79915 80761 111449 145433 164153 107398 17918 20944 41130 77803 80276
2507 80276 89255 87602 101750 124370 17019 30713 84357 76974 86731 41350 59434 74339
2495 74339 112485 153922 128447 122475 151895 99943 169247 194675 198745 211235 199455 172341
2483 172341 187848 204512 242499 174344 171955 228827 119709 66169 80361 90464 82570 90789
2471 90789 153343 105195 131282 135920 162475 206032 292133 231244 205913 212350 190768 166861
2459 166861 224678 243415 230862 261346 256110 263614 189130 173605 200478 209109 244874 216785
2447B16785n8460J0706L7657p532k1142l4092K8524K2898j4032N2535J8420r788
2435B42479l9368J6032K7332o818m1898n0800n5818M7542M0706j3065o8851j1227
2423H6246Q631K9814j3433N8653R498p5332k9825M5791p0952M6041J2469k4693
2411H2908K0815j4010O155K2481J4710k6366J5014o3079L0076K2717j4438o238
2399I0745q2769j3767P1806N5687p6919N6330K2933m5165n08l4985Q797O2990
2387A15175o8541k7669J2885L0982j0248K0247L9849k5730m2829q1846m51J02719
2375F4543l124M213k6274L758r127L35L7061j43j6425L2186K0610J4003l4330
2362H7286q6278m1505k425L0150M7113J4952j4420L552O161j8148j3827k2577
$$ plain form
2447 216785 158325 169031 206688 199156 178014 143922 172446 195344 181312 233847 252267 242479
2435 242479 203111 219143 246475 239657 197759 146959 91141 138683 179389 166324 97473 86246
2423 86246 94877 124691 111258 169911 179409 104077 74252 120043 49091 95132 107601 82908
2411 82908 103723 89713 95868 118349 133059 106693 121707 58628 88704 111421 96983 90745
2399 90745 7976 -5791 66015 121702 44783 101113 124046 78881 78373 43388 52185 115175
2387 115175 46634 18965 31850 62832 52584 72831 112680 86950 44121 -37725 -38176 64543
2375 64543 61419 65632 39358 43116 33989 34324 71385 71242 54817 87003 107613 121616 87286
2362 87286 1008 -40497 -42922 -12772 34341 49293 34873 38425 44586 26438 12611 -9966
2350i966l8604M0894Q68j7050K0080L9026m896K223K9389j6193L9847m2703j6064
2337B6851r500k2881J9904j5326L06Q5475p1110K7822l0445j48270R4371N6259
2325A3456k5893M895n804j6382K2708j6542M4290n651j7778L7677l8189j911J35602
2312A30478k1973m1536o2405m1372K5649L3587n6551J1617O261K6399J2933l6760
2300a3673o1121N9364L499K9364j6059m335l359J891Q016L4566m8924j9636O2818
2287C2411q0860O0152J9139n4931L075N439L3927K5174l0068N4780k0620m1429
2275F189P2188l5937p2065k0041L6060n3625N3605P5188L837j1253q425j2952
2263C2769L7408l7131O757O8189n5499M301L1813n9927j5965J8843j9300k3952
$$ plain form
2350 -9966 -48570 -7676 -6808 -23858 -3778 35248 30352 32575 61964 45771 85618 42915 26851
2337 26851 17351 -5530 14374 -952 -646 84829 13719 41541 11096 -137174 -42803 13456
2325 13456 -12437 -7542 -13346 -29728 -7020 -23562 20728 15077 -2701 34976 -3213 -5124 130478
2312 130478 108505 66969 4564 -36808 -11159 22428 -34123 -22506 -16245 10154 23087 -13673
2300 -13673 -74794 -15430 -11931 17433 1374 -2961 -6320 -4429 3587 38153 -10771 -30407 32411
2287 32411 -48449 11703 30842 -24089 -21014 -15575 18352 43526 13458 68238 47618 6189
2275 6189 78377 42440 -29625 -49666 -13606 -67231 -13626 61562 65399 54146 45721 32769
2263 32769 70177 33046 39803 107992 52493 56794 88607 28680 12715 31558 12258 -11694
2251a1694K0113j4053L4819K7251n2302J9697Q650J5429j9180j5747N2835L122
2239F8940n5345K0053j6822J80o162k5496M5147P0604l6484l5559j6792Q837n464
2226A5637j6874N554Q212M4616j2771l8499N622N9162L4391k3333j1606j3285
2214E6826j0724l8581j2582k7934R7587o247m1145k3182m1530P3131M2282l8955
2202B8946l401P398q5404J9059K0070j6695J03570%l379L901p5745M0415L7622
2189G6357l3456Q878j3972m523K1811k520O365o4045j856j0324M4529N5517l6663
2176D6098k3494J2318m6279k4228K9206J2368N7006O593L7231q188K4986p6243
2164D7374K1009l9521l4318N6481Q449K1709m4648k2623K7963o2k083J459j9640
$$ plain form
2251 -11694 8419 -5634 29185 56436 4134 23831 32481 47910 28730 12983 65818 68940
2239 68940 13595 33648 16826 17006 10844 -14652 30495 101099 64615 29056 12264 21101 15637
2226 15637 -1237 4317 12529 57145 44374 5875 11497 70659 105050 81717 70111 56826
2214 56826 46102 7521 -5061 -32995 64592 58345 17200 -5982 -47512 25619 67901 28946
2202 28946 25545 32943 -52461 -33402 -13332 -30027 73543 73543 70164 74065 -1680 38735 76357
2189 76357 42901 51779 37807 33284 55095 52575 58940 -5105 -6961 -17285 27244 82761 46098
2176 46098 22604 34922 -11357 -35585 -6379 5989 62995 69588 106819 98631 123617 47374
2164 47374 68383 28862 -5456 51025 59474 81183 36535 13912 41875 41813 39730 41189 21549
2151B1549l202l0819m3369M8680j8044K6590P8642l9684O2931L959n4158R0490
2139A43565O886l7893J5032J2076k4829J6618M511K941p591m5416O1153J7133
2127A64186k9137N3505j364l2640J0981l7620L1681k207K0921n16L6818q6754
2115A27854p273K8265j8393M1188p5581q4L5595j9242k2579Q8558n9449N3697
2103A72556M2788p1931J3694N417M237M3830l6300k3653L7403m786P7123q797
2091B51581p3694M5750J8116k2213R7792k6162N3855N8923l2755p156k8035J2264
2079C48266j3185m5780K9171N3027p7537J05458N3689k5317L5438L1736j5141
2068D79825l0310k640L0284L4505J324O6369N459M2906k090j9604J01022O2962
$$ plain form
2151 21549 18347 -12472 -55841 -7161 -25205 1385 80027 40343 103274 107233 53075 143565
2139 143565 150451 112558 127590 139666 114837 131455 135966 138907 131316 85900 147053 164186
2127 164186 135049 188554 187190 154550 165531 127911 159592 157385 178306 177790 214608 127854
2115 127854 120581 148846 130453 171641 96060 95976 131571 112329 89750 178308 118859 172556
2103 172556 215344 143413 157107 162524 166761 210591 174291 150638 188041 183255 260378 251581
2091 251581 177887 223637 241753 219540 317332 291170 345025 403948 371193 364037 336002 348266
2079 348266 335081 289301 318472 371499 293962 399420 453109 427792 463230 494966 479825
2068 479825 449515 446875 477159 511664 512988 579357 584816 627722 625632 606028 707050 770012
2056G70012l340O9236k2044q210P1271K8009J6677n825K3150O7019K3853K1498
2044A051306J49686Q1742P0348R3157M752R8892J47930R9510J34964K09455J31052
2033B272794K42395K54605J93555K92328L40301K97708M37067M37158O36069O92541
2023F096521P96032J066875J237657J489619J897195K504690J581965o40752j883823
2014A4145979k589261k445296j834750j188309q35356o77925m93929m11920l88257
2005C280976k18681j62424j67583j48298k47802j60721j87112j47868m9600j37123
1995A653764j75680j08040k7426m2968p7102q5758k6718l5856j05660l3033j1749
1984I23774j2233n6988k1305j4036k5586n9834L651n0474m0559n0273o598Q326
$$ plain form
2056 770012 766672 835908 813864 805654 876925 904934 921611 915786 938936 1005955 1029808 1051306
2044 1051306 1200992 1282734 1353082 1446239 1450991 1549883 1697813 1797323 1932287 2141742 2272794
2033 2272794 2515189 2769794 2963349 3255677 3595978 3893686 4330753 4767911 5403980 6096521
2023 6096521 6892553 7959428 9197085 10686704 12583899 15088589 16670554 16029802 14145979
2014 14145979 11556718 9111422 7276672 6088363 5253007 4575082 4081153 3669233 3280976
2005 3280976 3062295 2899871 2732288 2583990 2336188 2175467 1988355 1840487 1790887 1653764
1995 1653764 1478084 1370044 1342618 1299650 1222548 1136790 1110072 1074216 968556 935523 923774
1984 923774 911541 854553 833248 819212 793626 733792 737443 686969 646410 596137 589539 597865
1972E97865l0189m9485q521l362K8525k6329m0146j7399P93o2495L3054R27M4422
1959D67660R145j05570p2402M9676r302J6363j7419p472l5305l2594j655M1657
1947C02782l4258k9749j8557K7835Q932k0820m103j4105K9597j0904k3783j453
1935B11414k160K8194L550o3033J8319j7227M810j6005q3149J9034j8221k6366
1923E9160P9690l5616r770P8500k7783m7520q767L0022K6952j2063M910K2058
1911A59773m8106J538L2182l5614R020k0814J5797k2897J8798q167L4152m6349
1899H9313l6207M5276M686n8490l7346k0873N017K1667J16577m745j12886L1778
1887D3767m1190K7049J16189k8069k7402k514m1318k8617K9985k69K911k8777
$$ plain form
1972 597865 567676 518191 509670 506308 534833 508504 468358 450959 451752 389257 422311 423238 467660
1959 467660 476805 371235 298833 348509 339207 355570 338151 330679 295374 262780 261125 302782
1947 302782 268524 238775 220218 248053 256985 236165 232062 217957 247554 236650 212867 211414
1935 211414 209254 237448 240998 177965 196284 179057 183867 167862 84713 103747 85526 59160
1923 59160 138850 103234 93464 171964 144181 96661 87894 117916 144868 132805 137715 159773
1911 159773 111667 113205 145387 109773 118793 97979 113776 90879 109677 101510 135662 89313
1899 89313 53106 98382 103068 44578 7232 -13641 -8624 13043 129620 124875 11989 43767
1887 43767 2577 29626 145815 117746 90344 87830 46512 17895 47880 47611 50522 21745
1875B1745N4612N6k0354k7067k4826k8573M0599J9325m701k3952j8687Q4135j6892
1862E5420n014P3402L1624o7948m8917j9910J9955J5934L8311l0543j8670M123
1850D7767K9452n7505l2984n580j3521l5209L0113j8241N8526L9725o0326Q701
1838i082L9767r865N1430j9097n9581P8725m2861k4222J7375K3281N1442l1840
1826F5472o6745M5891k9300J2246K2004p2280k2058N273k9968k8616P0738l4994
1814f2337N1394J1265o1142K2700L3583J6746L3602m191L7642n181m6614N8661
1802H6128M223l1565r748k5837j4224l5660k9216M5924q2416M0744P184J8846
1790b5617P031L3224k4159N5594p6261j7143J18313P944l5957n6634K6696P8891
$$ plain form
1875 21745 76357 76413 56059 28992 4166 -24407 16192 35517 30816 6864 -11823 72312 55420
1862 55420 50406 123808 155432 87484 38567 18657 38612 54546 92857 62314 43644 47767
1850 47767 77219 19714 -13270 -18850 -32371 -67580 -37467 -55708 2818 42543 -17783 -9082
1838 -9082 30685 20820 72250 53153 -6428 72297 29436 5214 22589 45870 97312 65472
1826 65472 -1273 44618 15318 27564 49568 -22712 -44770 -39497 -69465 -98081 -27343 -62337
1814 -62337 -10943 322 -60820 -38120 -4537 12209 45811 41620 79262 74081 27467 86128
1802 86128 90351 58786 49038 23201 8977 -26683 -55899 -9975 -92391 -51647 -44463 -25617
1790 -25617 -18586 14638 -9521 46073 -30188 -47331 70982 78926 42969 -13665 13031 91922
1778I1922L4243L5547o8230m4642j7583P1230k7860P891j6586m6771N0455n7436
1766A2180q570o148M170n094L2146p3680N4361J440J5749J7293J2071k468o2438
1753h988j5230N91l8198M9150k3555K8P0936p1383M1140q4118j8210J1225L940
1740h2672K3384M1529k3674K8432J1114J2584K4261l1263k0266N8712p0854j0671
1728c9384M1261m4298J5018l0065K2316M0003q065j4507L869k5Q687q2579K5346
1715f2423J2488k1672N7564K6202n3384l9654N3016L7574k02j6445p4259O6381
1703a4814M3291j092r4913M6113J9184l1798L078k5760l2625O6169j76O4861n5036
1690a3518j364M0064q264N900L8281q0731N4168j3567k1658J5482k4546M3268
$$ plain form
1778 91922 126165 161712 93482 48840 31257 102487 74627 82518 65932 19161 69616 12180
1766 12180 3610 -2538 1632 -3462 28684 -44996 9365 10805 26554 43847 55918 53450 -8988
1753 -8988 -24218 -23627 -61825 -12675 -36230 -36202 34734 -36649 4491 -79627 -97837 -86612 -82672
1740 -82672 -59288 -17759 -41433 -13001 -1887 10697 34958 3695 -16571 42141 -28713 -39384
1728 -39384 1877 -42421 -27403 -57468 -35152 4851 -3214 -17721 -13852 -13877 -5190 -87769 -62423
1715 -62423 -49935 -71607 -14043 12159 -41225 -80879 -27863 9711 9509 -6936 -81195 -14814
1703 -14814 28477 27385 -67528 -21415 -2231 -34029 -30951 -56711 -89336 -23167 -23343 41518 -13518
1690 -13518 -14882 25182 16918 22818 61099 -19632 34536 20969 -689 14793 -9753 33515
1678C3515J6480j00222n01j0206k5462J16273m0106K836O8909n7428N820r883
1666B5o1289L7678j2018K1573P442q7424M6663M2458o1064J7577J1587l7851O8855
1653e788l3336K8134K0745o5378P8641k6866m680K9215m8265m1870J5037m0381
1641i4792M4735K2068n0836J6791L0445O916Q300K2662K1509k3501r293l1272
1629c6268O9523k2226K3636k0953l1586j2865M3633J5321j6250R605N6816R960
1617H8346l8957q9574J6383k8973o436N1642j4054k3478m9639K0953J17914p5790
1605c1663l8585M1963J2891N6625o6016k8403R1530k7672K208K2242k5493J4208
1593B3835K5116o3587M269o2416m574N2874k0877l5877J26523j05994k8170O1939
$$ plain form
1678 33515 49995 -50227 -50728 -60934 -86396 29877 -10229 -7393 61516 4088 9908 25
1666 25 -61264 -23586 -35604 -14031 -6589 -94013 -47350 -4892 -65956 -48379 -36792 -74643 -5788
1653 -5788 -39124 -10990 9755 -55623 23018 -3848 -8528 20687 -27578 -69448 -54411 -94792
1641 -94792 -50057 -27989 -78825 -62034 -31589 -24673 -16373 6289 27798 4297 -4996 -36268
1629 -36268 33255 11029 34665 13712 -17874 -30739 12894 28215 11965 21570 78386 88346
1617 88346 49389 -40185 -23802 -52775 -59211 -7569 -21623 -45101 -94740 -73787 44127 -31663
1605 -31663 -70248 -28285 -15394 41231 -24785 -53188 38342 10670 12878 35120 9627 23835
1593 23835 48951 -14636 -10367 -72783 -77357 -24483 -45360 -81237 45286 -60708 -88878 -26939
1581b6939m0496M3280K4221m5626Q6317j6545k1248K0792m3080L1574M7028k4978
1569C4300Q36k5631p7380J7439j2557k036M4239o6652m3699J0587L0395Q7244
1557b915q127p315P866M3502k7834L4769n9501K9993M4048k2572k2796p272L001
1544D847K964k5864k3418J5308m0641j0393l858j4104M1170j6555K2660K71K4722
1531b2891k7995K5686j5292L637J9917N4769J1196J4261o8053N8864J8668m4843
1519B7924o9181J0160l68r829L7659K2815L0362m6219o3339O0484p6534K6411
1507d9655Q5167j08744K832L8000o3255P9542K8067l8712L2342J2623l9153K9072
1495H126l0059o262L0747l0182O4630L0526o0655K3683J7123n1633o4150L301
$$ plain form
1581 -26939 -67435 -24155 66 -45560 40757 24212 2964 23756 -19324 12250 59278 34300
1569 34300 35136 9505 -67875 -50436 -62993 -65029 -20790 -87442 -131141 -120554 -90159 -2915
1557 -2915 -11042 -18357 -10491 33011 5177 39946 -19555 10438 54486 31914 9118 1846 4847
1544 4847 7811 -18053 -41471 -26163 -66804 -77197 -81055 -95159 -53989 -70544 -47884 -47613 -22891
1531 -22891 -50886 -25200 -40492 -36855 -16938 37831 49027 63288 -4765 54099 72767 27924
1519 27924 -41257 -31097 -31465 -41294 -3635 19180 49542 3323 -60016 468 -76066 -49655
1507 -49655 35512 -73232 -70400 -32400 -95655 -16113 11954 -26758 5584 18207 -20946 8126
1495 8126 -21933 -28195 2552 -27630 37000 67526 6871 30554 47677 -3956 -68106 -64805
1483f4805l8776L8324M5189k8718M3020k970M4868K5442k3002K3656j9997l1779
1471A0452J9835o6181N582Q2423j5107j2863J0154n3714K9321P252m312n723m6793
1458c9674N110R367r753j7099k8327M905J5339R2985l4246p914J6588k7839K8430
1445G872l2052l5256N2810k2374J18658N4356r7249j9226r1973M67P5086p9990
1433f8871o221j6949J7316J2567K7127n5447Q6435r984l1583p057J4326N6646
1421A8305p099J428k3746l6083J8011M8117q3472o245K3567K6271L8631k3560
1409e875k8332J4406N735n974k603k0566k4613K766M8920K134J0908k9991J5744
1396a7341l2834o861o264R5650N1215k2123n537j09006J3466k7560j0123J8912
$$ plain form
1483 -64805 -103581 -65257 -20068 -48786 -5766 -8736 36132 61574 38572 62228 42231 10452
1471 10452 30287 -35894 -30312 52111 37004 24141 34295 -19419 9902 17154 12842 7119 -39674
1458 -39674 -34564 -25197 -34950 -52049 -80376 -75471 -60132 32853 -1393 -9307 7281 -20558 7872
1445 7872 -24180 -59436 -6626 -29000 89658 144014 46765 27539 -64434 -63967 11119 -68871
1433 -68871 -75092 -92041 -74725 -62158 -35031 -90478 -4043 -14027 -45610 -52667 -38341 18305
1421 18305 11206 12634 -11112 -47195 -29184 18933 -64539 -70784 -47217 -20946 17685 -5875
1409 -5875 -34207 -19801 -14066 -20040 -22643 -43209 -67822 -65056 -16136 -14002 -3094 -33085 -17341
1396 -17341 -50175 -57036 -63300 32350 83565 61442 55905 -53101 -39635 -67195 -77318 -58406
1384e8406J2497N8395j885p2837r93L6644j5585K2958K5684n179L5014J0095m8917
1371b515J6230m9841J4908R377J2574K5203K0458L411N790q0845j9570R6542p2644
1358b0922m5602K4926l3938N5225K2688J8781j5773M468N8751n0869r564j1001
1346b830L510k4099M6517j5440r732l048N737l7103k1716o870M7842M1760l7036
1333a2508k8706L743N51K0740Q080M7857m7049j9628M167N262k7643J7907N3891
1320B6664J4790m7745L863j381J45l4078j2224j719N6416K8643j9682j8840K3676
1307A8528l5153J1296j2717o3924L0382Q748k2244K4687J3055j6812O3883o262
1295A3467m5495J6850K0417l5755k4283L9195L2736j8498k7177P3729j0436k8108
$$ plain form
1384 -58406 -45909 12486 10601 -62236 -63229 -26585 -42170 -19212 6472 1293 36307 46402 -2515
1371 -2515 13715 -36126 -21218 -11841 733 25936 46394 49805 55595 -25250 -44820 51722 -20922
1358 -20922 -66524 -41598 -75536 -20311 2377 21158 5385 9853 68604 17735 8171 -2830
1346 -2830 680 -23419 23098 7658 -2074 -5122 615 -36488 -58204 -65074 -17232 24528 -12508
1333 -12508 -41214 -37471 -36920 -16180 -8100 39757 -7292 -26920 -22753 -17491 -45134 -27227 26664
1320 26664 41454 -6291 -2428 -3809 -3664 -37742 -49966 -51685 4731 33374 13692 -5148 18528
1307 18528 -16625 -5329 -18046 -81970 -51588 -42840 -65084 -40397 -27342 -44154 19729 13467
1295 13467 -32028 -15178 5239 -30516 -54799 -15604 17132 -1366 -28543 45186 34750 6642
1283F642M0568l8680L7647k077k0934m3350K094J2368k7730j8532M1494k1527
1271c2017n6862N0278J6340j5441p367k518P693j16L6049P6841j5047j18786M258
1258e6695J8393Q1216J7573o4488l0984L9401o9623k6841K0444O6364n1346m0914
1246i7500M4402K1140m0293J008P8069p0540k6350N3556O5039j6577j01765O4484
1234b5327P1391m4081N5459m8353P56n142J43J4878l2454p8117Q2386n0246l1895
1221i0602J8998l4198N3658N9680M1042m1468K0974m5782k4297M4375N8509N8282
1209A19171n8266k3098N342m8948Q986k971N100M4611J4452o2299K2121m106q3314
1196f3219P4542J6249K7295J8744p2582R281R96k2750M8643k3929o4691K3910
$$ plain form
1283 6642 47210 8530 46177 44100 23166 -20184 -18090 -5722 -33452 -51984 -10490 -32017
1271 -32017 -88879 -38601 -22261 -37702 -45069 -47587 -39894 -40010 -3961 72880 57833 -60953 -56695
1258 -56695 -38302 42914 60487 -4001 -34985 4416 -65207 -92048 -71604 -5240 -56586 -97500
1246 -97500 -53098 -31958 -72251 -71243 6826 -63714 -90064 -36508 28531 11954 -89811 -25327
1234 -25327 46064 1983 57442 9089 9845 4703 4846 19724 -12730 -90847 -8461 -58707 -90602
1221 -90602 -71604 -105802 -52144 7536 48578 7110 28084 -17698 -41995 2380 60889 119171
1209 119171 60905 37807 43149 -5799 3187 216 5316 49927 64379 2080 24201 20095 -63219
1196 -63219 11323 27572 54867 73611 1029 10310 11306 -11444 37199 13270 -51421 -27511
1184b7511k9072N6662j9261o3403Q2492L8784m6447k0457j2929J7569j8642j6457
1172e8672M9193L688K9561O1474j12872j3296L806o9859R0299J1806o1918M6906
1160a9884K2082J0556N7437m3151p3255L9932m3608K9187R272l7309J6655M920
1148b7166m1281J0243k4901M5318L3396l1603L7354J2383q629n288P467j6758
1136i465K539L3579r3167q212J1513K9851O5046n1464m3566N4972K3356L9740
1124E4722J2192o5209l3476r493N8819J4349p0345R288O4985k8338M694K8354
1112D0542J4129l1281j1825l0628j5869J6573Q1192q789m1246J9626o7252m9702
1100h4530K0084Q8580K5457o7305j5876l093R009M6486m8070n8674L5204N4466
$$ plain form
1184 -27511 -56583 79 -19182 -82585 -93 38691 -7756 -28213 -41142 -23573 -42215 -58672
1172 -58672 -9479 -5791 23770 85244 -27628 -40924 -37118 -106977 -16678 -4872 -66790 -19884
1160 -19884 2198 12754 70191 27040 -46215 -6283 -49891 -20704 -11432 -48741 -32086 -27166
1148 -27166 -68447 -58204 -83105 -37787 -4391 -35994 1360 13743 5114 -174 7293 -9465
1136 -9465 -6926 26653 -66514 -74726 -63213 -33362 31684 -19780 -63346 -8374 14982 54722
1124 54722 66914 1705 -31771 -41264 17555 31904 -38441 -29153 35832 7494 12188 40542
1112 40542 54671 23390 11565 -19063 -34932 -18359 62833 54044 12798 32424 -34828 -84530
1100 -84530 -64446 24134 49591 -17714 -33590 -36683 -27674 18812 -29258 -87932 -52728 1738
1088A738L3602R940m317l4316P94k3102L2876l5205N5425k0875q607N0478l1382
1075B7049o8801L4552K321r184m1661M1704L8069k8226m426r235R408R718n2195
1062e0907Q030o614L9384L3148j248m7947M189L3237l4896K6232q7525p266Q6550
1049e633P646j2220l9558n0452J98K6293O2802J9434o8776m7054J1778N8809N3805
1036A7072l6466k287L3389o2856J7506J4254M117K4822r0680K9506M7442J2285
1024H104J949n3425j261q921m59O4187j6145N289M5104o9174N5598k137l7054
$$ plain form
1088 1738 35340 45280 40963 6647 7441 -15661 17215 -17990 37435 16560 7953 58431 27049
1075 27049 -41752 -7200 -4879 -14063 -55724 -14020 24049 -4177 -8603 -17838 -8430 1288 -50907
1062 -50907 -42877 -49491 -10107 23041 21793 -26154 -21965 11272 -23624 2608 -84917 -92183 -5633
1049 -5633 2013 -10207 -49765 -100217 -100019 -73726 -10924 8510 -60266 -107320 -95542 -36733 17072
1036 17072 -19394 -21681 11708 -51148 -33642 -19388 -15271 9551 -81129 -51623 -4181 8104
1024 8104 10053 -43372 -44633 -53554 -54013 10174 -5971 -682 44422 -24752 30846 28709 -8345
$$ [...]
##END NTUPLES=NMR SPECTRUM
##END=
