##TITLE=1H_CA-8870-1
 CDCl3, 8 sc, 
 4.06.2021
##JCAMPDX= 6.0         $$ Bruker NMR JCAMP-DX V2.0
##DATA TYPE= NMR SPECTRUM
##DATA CLASS= NTUPLES
##ORIGIN= UXNMR, Bruker Analytische Messtechnik GmbH
##OWNER= root
$$ XWIN-NMR		Version 3.5
$$ Fri Jun  4 12:50:13 2021 Russian Standard Time (UT+4h)  she@DPX200
##.OBSERVE FREQUENCY= 200.131506
##.OBSERVE NUCLEUS= ^1H
##.ACQUISITION MODE= SIMULTANEOUS
##.ACQUISITION SCHEME= undefined
##.AVERAGES= 8
##.DIGITISER RES= 18
##SPECTROMETER/DATA SYSTEM= spect
##.PULSE SEQUENCE= zg30
##.SOLVENT NAME= CD3CN
##.SHIFT REFERENCE= (INTERNAL, CD3CN, 0, 17.4861)
##AUDIT TRAIL= $$ (NUMBER, WHEN, WHO, WHERE, WHAT)
$$ ##TITLE= Audit trail, XWIN-NMR		Version 3.5
$$ ##JCAMPDX= 5.01
$$ ##ORIGIN= Bruker BioSpin GmbH
$$ ##OWNER= she
$$ F:/spectra/data/she/nmr/H-F/1/pdata/1/auditp.txt
$$ ##AUDIT TRAIL=  $$ (NUMBER, WHEN, WHO, WHERE, WHAT)
(   1,<2021-06-04 12:49:08.06 +0400>,<she>,<DPX200>,
      <created by zg, POWCHK disabled, PULCHK disabled
       configuration hash MD5:
       00 E9 B6 7A A2 85 ED C7 34 08 36 98 17 FE 4E 26
       data hash MD5: 16K
       52 66 30 32 13 D5 55 41 CA 20 AC 92 E0 EE C6 CC>)
(   2,<2021-06-04 12:49:11.73 +0400>,<she>,<DPX200>,
      <Start of raw data processing
       efp BC_mod = 2 LB = 0.24 FT_mod = 6 PKNL = 1 PHC0 = -11125.65 PHC1 = 18.80101 SI = 16K 
       data hash MD5: 16K
       7B 16 1A B7 3F CB 8A 37 B8 B2 40 89 A2 18 2A 0E>)
(   3,<2021-06-04 12:49:25.70 +0400>,<she>,<DPX200>,
      <pk PHC0 = 4.780939 PHC1 = -5.6 
       data hash MD5: 16K
       60 6D AA AD F4 19 D4 27 EF 7C A5 03 58 43 75 3C>)
(   4,<2021-06-04 12:49:29.06 +0400>,<she>,<DPX200>,
      <abs ABSG = 5 
       data hash MD5: 16K
       6B F6 D7 EF 48 0C 0D 0F 3F B7 80 54 C5 64 CA 30>)
$$ ##END=
$$ 
$$ hash MD5
$$ F8 18 57 E8 55 52 EB 79 4F FC 69 34 44 19 FB 09
##$RELAX= 
##$RELAX= 
##$RELAX= 
##$RELAX= 
##$RELAX= 
##$RELAX= 
$$ Bruker specific parameters
$$ --------------------------
##$DU= <F:/spectra>
##$EXPNO= 1
##$NAME= <H-F>
##$PROCNO= 1
##$TYPE= <nmr>
##$USER= <she>
##$AMP= (0..31)
100 100 100 100 100 100 100 100 100 100 100 100 100 100 100 100 100 100 
100 100 100 100 100 100 100 100 100 100 100 100 100 100 
##$AQSEQ= 0
##$AQ_mod= 1
##$AUNM= <au_zg>
##$AUTOPOS= <>
##$BF1= 200.13
##$BF2= 200.13
##$BF3= 200.13
##$BF4= 200.13
##$BF5= 200.13
##$BF6= 200.13
##$BF7= 200.13
##$BF8= 200.13
##$BYTORDA= 1
##$CFDGTYP= 0
##$CFRGTYP= 5
##$CHEMSTR= <none>
##$CNST= (0..31)
1 1 145 1 1 1 1 1 1 1 1 1 1 1 1 1 1 1 1 1 1 1 1 1 1 1 1 1 1 1 1 1 
##$CPDPRG= <>
##$CPDPRG1= <>
##$CPDPRG2= <>
##$CPDPRG3= <>
##$CPDPRG4= <mlev>
##$CPDPRG5= <mlev>
##$CPDPRG6= <mlev>
##$CPDPRG7= <mlev>
##$CPDPRG8= <mlev>
##$CPDPRGB= <>
##$CPDPRGT= <>
##$D= (0..31)
0 1.2 0 0 0 0 0 0 0 0.06 0 0.03 0 0 0 0 0.0002 0 0 0 0 0 0 0 0 0 0 0 0 
0 0 0 
##$DATE= 1622796547
##$DBL= (0..7)
120 120 120 120 120 120 120 120 
##$DBP= (0..7)
150 150 150 150 150 150 150 150 
##$DBP07= 0
##$DBPNAM0= <>
##$DBPNAM1= <>
##$DBPNAM2= <>
##$DBPNAM3= <>
##$DBPNAM4= <>
$$ [...]
##$SUBNAM3= <"">
##$SUBNAM4= <"">
##$SUBNAM5= <"">
##$SUBNAM6= <"">
##$SUBNAM7= <"">
##$SUBNAM8= <"">
##$SUBNAM9= <"">
##$SW= 20.0188882624521
##$SWIBOX= (0..15)
0 0 2 0 0 0 0 0 0 0 0 0 0 0 0 0 
##$SW_h= 4006.41025641026
##$TD= 16384
##$TD0= 1
##$TE= 0
##$TE2= 300
##$TE3= 300
##$TEG= 300
##$TL= (0..7)
0 120 120 120 120 120 120 120 
##$TP= (0..7)
150 150 150 150 150 150 150 150 
##$TP07= 0
##$TPNAME0= <>
##$TPNAME1= <>
##$TPNAME2= <>
##$TPNAME3= <>
##$TPNAME4= <>
##$TPNAME5= <>
##$TPNAME6= <>
##$TPNAME7= <>
##$TPOAL= (0..7)
0.5 0.5 0.5 0.5 0.5 0.5 0.5 0.5 
##$TPOFFS= (0..7)
0 0 0 0 0 0 0 0 
##$TUNHIN= 0
##$TUNHOUT= 0
##$TUNXOUT= 0
##$USERA1= <user>
##$USERA2= <user>
##$USERA3= <user>
##$USERA4= <user>
##$USERA5= <user>
##$V9= 5
##$VALIST= <valist>
##$VCLIST= <CCCCCCCCCCCCCCC>
##$VD= 0
##$VDLIST= <DDDDDDDDDDDDDDD>
##$VPLIST= <PPPPPPPPPPPPPPP>
##$VTLIST= <TTTTTTTTTTTTTTT>
##$WBST= 1024
##$WBSW= 4
##$XGAIN= (0..3)
0 0 0 0 
##$XL= 0
##$YL= 0
##$YMAX_a= 202515
##$YMIN_a= -101044
##$ZGOPTNS= <>
##$ZL1= 120
##$ZL2= 120
##$ZL3= 120
##$ZL4= 120
##$ABSF1= 17.50811
##$ABSF2= -2.510929
##$ABSG= 5
##$ABSL= 3
##$ALPHA= 0
##$AQORDER= 0
##$ASSFAC= 0
##$ASSFACI= 0
##$ASSFACX= 0
##$ASSWID= 0
##$AUNMP= <proc_1d>
##$AZFE= 0.1
##$AZFW= 0.1
##$BCFW= 0
##$BC_mod= 2
##$BYTORDP= 0
##$COROFFS= 0
##$CY= -3
##$DATMOD= 1
##$DC= 0
##$DFILT= <>
##$DTYPP= 0
##$F1P= 0
##$F2P= 0
##$FCOR= 1
##$FTSIZE= 16384
##$FT_mod= 6
##$GAMMA= 0
##$GB= 0
##$INTBC= 1
##$INTSCL= 1.334414e-10
##$ISEN= 128
##$LB= 0.24
##$LEV0= 0
##$LPBIN= 0
##$MAXI= 10000
##$MC2= 0
##$MEAN= 0
##$ME_mod= 0
##$MI= 1.114404
##$NCOEF= 0
##$NC_proc= -8
##$NLEV= 6
##$NOISF1= 3.799351
##$NOISF2= 2.8
##$NSP= 0
##$NTH_PI= 0
##$NZP= 0
##$OFFSET= 17.48611
##$PC= 1
##$PHC0= -11120.87
##$PHC1= 13.20101
##$PH_mod= 1
##$PKNL= yes
##$PPARMOD= 0
##$PSCAL= 0
##$PSIGN= 0
##$REVERSE= no
##$SF= 200.130009709309
##$SI= 16384
##$SIGF1= 3
##$SIGF2= 2
##$SINO= 5.538805
##$SIOLD= 16384
##$SREGLST= <1H.CDCl3>
##$SSB= 0
##$STSI= 16384
##$STSR= 0
##$SW_p= 4006.41025641026
##$SYMM= 0
##$S_DEV= 0
##$TDeff= 16384
##$TDoff= 0
##$TI= <>
##$TILT= no
##$TM1= 0
##$TM2= 0
##$TOPLEV= 0
##$USERP1= <user>
##$USERP2= <user>
##$USERP3= <user>
##$USERP4= <user>
##$USERP5= <user>
##$WDW= 1
##$XDIM= 16384
##$YMAX_p= 305200001
##$YMIN_p= -1088793
$$ End of Bruker specific parameters
$$ ---------------------------------
##NTUPLES= NMR SPECTRUM
##VAR_NAME=  FREQUENCY,     SPECTRUM/REAL,   SPECTRUM/IMAG
##SYMBOL=    X,             R,               I
##VAR_TYPE=  INDEPENDENT,   DEPENDENT,       DEPENDENT
##VAR_FORM=  AFFN,          ASDF,            ASDF
##VAR_DIM=   16384,         16384,           16384
##UNITS=     HZ,            ARBITRARY UNITS, ARBITRARY UNITS
##FACTOR=    0.24454680195387, 1,            1
##FIRST=     3499.49550161857, 0,            0
##LAST=      -506.914754791693, 0,           0
##MIN=       -506.914754791693, -1088793,    0
##MAX=       3499.49550161857, 305200001,    0
$$ Real data points
##PAGE= N=1
##DATA TABLE= (X++(R..R)), XYDATA
$$ [...]
7273c28054L65654l1131L44691K79991l76279J58455m04392Q68140k01234n69084
$$ -328054 37600 6469 351160 631151 254872 413327 8935 877075 675841 106757
7263A06757K80367k76869K45159j15165k60860N67198l55615J88208k25172L06751
$$ 106757 387124 110255 355414 240249 -20611 546587 190972 379180 154008 460759
7253D60759k40927j88279k04085k55617M93220m36832K47822O55664j47655k42989
$$ 460759 219832 31553 -172532 -428149 65071 -371761 -123939 531725 384070 141081
7243A41081k18003N28628l1344R6715K39447k56135r3800K16129L38313m62651
$$ 141081 -76922 451706 420362 517077 756524 500389 406589 622718 961031 498380
7233D98380n8725q3785l03765J55479M94487l06224k84643k36637L58744j92012
$$ 498380 439655 355870 52105 207584 702071 395847 111204 -125433 233311 41299
7223D1299j09729k62193N06744m51565N79460K47892J5552L8708o00893J57516
$$ 41299 -68430 -330623 176121 -275444 304016 551908 567460 606168 5275 162791
7213A62791m75690J05526J07368L05837Q2882L8828J87177j33219L64997n29243
$$ 162791 -312899 -207373 -100005 205832 288714 327542 514719 381500 746497 217254
7203B17254n78768M0537k07993L25163J3629M7535M53260o8130p8886J58430K6702
$$ 217254 -361514 -320977 -528970 -203807 -190178 -142643 310617 242487 163601 322031 348733
7192C48733J93456l52575J91062J12915k03226J36547j53361k9025K14576J55090
$$ 348733 542189 189614 380676 493591 290365 426912 273551 244526 459102 614192
7182F14192M5693k32240j29549k83564k35877M91363j27026K62429m03125k5091
$$ 614192 659885 427645 298096 14532 -221345 270018 142992 405421 2296 -22795
7172b2795j42559m0838K45817J13041P7087J1084K45178j19464k21356J24577
$$ -22795 -165354 -206192 39625 152666 229753 240837 486015 366551 145195 269772
7162B69772J10464K3336R464o5525L12825k24868q4827N02332k10493R811p8278
$$ 269772 380236 403572 413036 347511 660336 435468 350641 852973 642480 652291 574013
7151E74013l43384L2413N31093n68292j39272Q58132n63149M59384j01378k96662
$$ 574013 230629 263042 794135 225843 86571 944703 381554 840938 739560 442898
7141D42898J4784r4961M03616J86465q8281j15725j98467N94184n70176j54761
$$ 442898 457682 362721 766337 952802 864521 748796 550329 1144513 574337 419576
7131D19576N9668k41755L83500J6495L0422J82684m12370m24709K91741N1894
$$ 419576 479244 237489 620989 637484 667906 850590 438220 13511 305252 357146
7121C57146k04442K51836p02797J34352M42519o3385J46580M9646m45706j7193
$$ 357146 152704 404540 -298257 -163905 278614 215229 361809 411455 -34251 -51444
7111e1444j2292j84503L27874Q589R8854K17579r7397j4046J64126M61770k387
$$ -51444 -63736 -248239 79635 88224 187078 404657 307260 293214 457340 919110 916723
7100I16723j13814k76467l73927J68144k76517K67187j37490m47196k4982J91369
$$ 916723 802909 526442 152515 320659 44142 311329 173839 -273357 -298339 -106970
7090a06970N03902q2813m6983k4136l2872k9125n23478J18605K65765m10433N68354
$$ -106970 396932 314119 267136 243000 210128 181003 -342475 -223870 41895 -368538 199816
7079A99816j4067j12825N04028o35028r7975j63521L35903P8467O3823J50959
$$ 199816 185749 72924 576952 -58076 -156051 -319572 16331 94798 158621 309580
7069C09580K79961n38711l94636K5286j29954L59339L44619k04919j63650L27545
$$ 309580 589541 50830 -343806 -318520 -448474 -89135 255484 50565 -113085 214460
7059B14460n7502M396n35468l03629L88323M45758j40350J62183K45776m33511
$$ 214460 156958 161354 -374114 -677743 -289420 156338 15988 178171 423947 -9564
7049i564J87581j21281J99374r6987r302K09532K52676O8098o05391l01068L81
$$ -9564 178017 56736 256110 159123 149821 359353 612029 680127 74736 -226332 -225951
7038b25951J89197J79050k10031J18841l8974M53476J82130j77727l54145p51986
$$ -225951 -36754 142296 -67735 51106 12132 465608 647738 470011 115866 -636120
7028f36120M51052l1898j48611J74814N15272K85172m60509m80766M0041k07467
$$ -636120 -185068 -216966 -365577 -190763 324509 609681 149172 -331594 -291553 -499020
7018d99020K57209K58358L22041J82615J88854m99699m67116r0450J79012J57823
$$ -499020 -241811 16547 338588 521203 710057 210358 -256758 -347208 -168196 -10373
7008a0373m25382N50304o5091L64613J4634j16328m2801j01526m2036L87p1142
$$ -10373 -435755 114549 49458 414071 428705 312377 269576 168050 126014 126401 55259
6997E5259l09732O1160M99048o02599M76594L74371Q267k98122k65413O33219
$$ 55259 -254473 -193313 305735 -296864 179730 554101 562368 264246 -1167 632052
6987F32052M22582l2803o49730k05333M0088O1878j65695J0285m37349J72410
$$ 632052 1054634 1021831 372101 166768 206856 268734 103039 113324 -324025 -151615
6977a51615N61775J14499k61626m80678k55630L82185j25J7385K18863l7713n05175
$$ -151615 410160 524659 263033 -217645 -473275 -91090 -91215 -73830 145033 107320 -397855
6966c97855N51013K81785o03857K41010K52116K45924J56676n59570K5998j14411
$$ -397855 153158 434943 -168914 72096 324212 570136 726812 167242 193240 78829
6956G8829l35517J84730r5418m09765R3698K94978o4359k2530Q9680M03571N16554
$$ 78829 -256688 -71958 -167376 -577141 -483443 -188465 -252824 -275354 -185674 217897 734451
6945G34451k75309j86720j45263L31049j2641l25687j26462M75813j66258n0257
$$ 734451 459142 272422 127159 458208 445567 119880 -6582 469231 302973 252716
6935B52716m34106L4472K90481q5999J93168j5382j08924M2396o6529o2759l84185
$$ 252716 -181390 -146918 143563 57564 250732 235350 126426 168822 102293 39534 -344651
6924c44651j60891J9288j7889l1807P61608K36174k38120N5646J05738J05485
$$ -344651 -505542 -486254 -504143 -535950 225658 461832 223712 279358 385096 490581
6914D90581l11940k49949l78942N09670k05299K87024k74061j01176M17462N75886
$$ 490581 178641 -71308 -450250 59420 -145879 141145 -132916 -234092 183370 759256
6904G59256n8324n24929l94543P8785l4516K89783l53085q6912m81638Q99033
$$ 759256 700932 176003 -218540 -139755 -174271 115512 -237573 -324485 -806123 92910
6894I2910J60128k14768O3401k81701M9422M27640J73845n16887J22547J04055
$$ 92910 253038 38270 101671 -180030 -130608 297032 470877 -46010 76537 180592
6884A80592l32718K92473k04354j61852L75050j22151j77916M17180j52304j40743
$$ 180592 -152126 140347 -64007 -225859 149191 27040 -150876 266304 114000 -26743
6874b6743L54612m33974J28365n184K2952J58408j75216p8736k10766K58068o9029
$$ -26743 327869 -106105 22260 17076 40028 198436 23220 -55516 -266282 -8214 -77243
6863g7243J58200J34471q31665K34142O1647P0655j11941O98636J09168j033672
$$ -77243 80957 215428 -616237 -382095 -320448 -249793 -361734 336902 446070 -587602
6853e87602J09592L81417K26371L29449q1748J57913m46459K80316k81407r1966
$$ -587602 -478010 -96593 129778 459227 377479 535392 88933 369249 87842 -4124
6843d124k96534R7460L97960R9158j13126q2297K14254l70793M687k37607j44941
$$ -4124 -300658 -203198 194762 293920 180794 98497 312751 -58042 -53355 -290962 -435903
6832d35903K24248R0475N1527K82262J48886n88835O823K59965Q6878K57303J30719
$$ -435903 -211655 -121180 -69653 212609 361495 -227340 -220517 39448 126326 383629 514348
6821E14348p635Q9826k03848p689l55351k74401Q4026K27905l05667j89472M09229
$$ 514348 506713 596539 392691 385002 29651 -244750 -160724 67181 -238486 -427958 -18729
6810a8729M19720j56538m05643L67301J06951j76805L21024J67262m21637J62932
$$ -18729 400991 244453 -161190 206111 313062 136257 457281 624543 202906 365838
6800C65838j39616K90173l16693p3904k3620l36205O54921m0305J94003m99125
$$ 365838 226222 516395 199702 125798 102178 -234027 420894 380589 574592 75467
6790G5467n6993O901K09944K75438l69429l16228J91332N55415m58440J82948
$$ 75467 18474 25375 235319 510757 141328 -174900 16432 571847 113407 296355
6780B96355l34293j77934n84351M06098M24428j1136j0189J70964P2086J47954
$$ 296355 -37938 -215872 -800223 -394125 30303 19167 8978 179942 252028 399982
6770C99982L53569j02661o96708M3901L53503K1399k54160J50532K92604o18426
$$ 399982 753551 650890 -45818 -1917 351586 372985 118825 269357 561961 -56465
6760e6465m9746j25584M59057j95666k0925R4750j1183j13496j8400K76559r3801
$$ -56465 -106211 -231795 227262 31596 10671 105421 94238 -19258 -37658 238901 145100
6749A45100k70689O0938j49164J33426O2972J73827M17991j66053L7239j10129
$$ 145100 -125589 -64651 -213815 -80389 -17417 156410 574401 408348 445587 335458
6739C35458j56805l89985J11573K66778j56674l0085L83924l23237M5381j63460
$$ 335458 178653 -211332 -99759 167019 10345 -19740 364184 40947 86328 -77132
6729g7132K15637j29397J03825M36354p7626j45322k42565M22329r3488j50755
$$ -77132 138505 9108 112933 549287 471661 326339 83774 506103 412615 261860
6719B61860K49229P9898n93748R9655j60835K71218P6676O267L02040j17645O40743
$$ 261860 511089 590987 -2761 96894 -63941 207277 283953 290220 592260 474615 1115358
6708A115358J01379m72286k75978M63959k95118l05244L31640J50842J59842k08692
$$ 1115358 1216737 744451 468473 932432 637314 332070 663710 814552 974394 765702
6698G65702m18303L87454P5454K02525q6676j30406L08319l23274L65887j50841
$$ 765702 347399 734853 810307 1012832 926156 795750 1104069 780795 1146682 995841
6688I95841j41171J9060o01777O097J72034k7144j7768J09475M12567m26470j35076
$$ 995841 854670 873730 271953 278050 450084 422940 405172 514647 927214 500744 365668
6677C65668O02246l38124J28397R04054k64896M88754l04984o63177N4558J0842
$$ 365668 967914 629790 758187 1662241 1397345 1886099 1581115 917938 972496 983338
6667I83338q9927l83697M48782K68527L07610K93510m51746M14048m9089j09379
$$ 983338 893411 509714 958496 1227023 1534633 1828143 1376397 1790445 1741356 1631977
6657A631977j25857L6285k86416q6382N52580k30737J37234n18477Q4416P73950
$$ 1631977 1506120 1542405 1255989 1169607 1722187 1491450 1628684 1110207 1194623 1968573
6647A968573m8943k95473L35767k71292l79576L22261M81088Q1943o62854j11369
$$ 1968573 1919630 1624157 1959924 1688632 1309056 1631317 2112405 2194348 1531494 1420125
6637A420125L24909K24662j59037J72224J81293J72623j73306j0477Q5489J20248
$$ 1420125 1745034 1969696 1810659 1982883 2164176 2336799 2163493 2153016 2238505 2358753
6627B358753O4389L9971L31526r4211J42771k10199k4726O85645L15800K79601
$$ 2358753 2423142 2463113 2794639 2700428 2843199 2633000 2608274 3293919 3609719 3889320
6617C889320K07923J96706K61611L1008J31913l23206K72696k67679J27840M73043
$$ 3889320 4097243 4293949 4555560 4586568 4718481 4395275 4667971 4400292 4528132 5001175
6607E001175N27773P48628L39635L22M57751M00440P61303N90485N44800J33895
$$ 5001175 5528948 6277576 6617211 6617533 7075284 7475724 8237027 8827512 9372312 9506207
6597I506207L58330K67390J09670L41215k15333K43394n86368m37104l53844r49797
$$ 9506207 9864537 10131927 10241597 10582812 10367479 10610873 10024505 9587401 9233557 8283760
6587H283760n97222o55991l91889p5330m24292l66269m50526k11970P0335m9785
$$ 8283760 7686538 7030547 6638658 6563328 6139036 5772767 5322241 5110271 5180606 5130821
6577E130821j89956J76236j50164l93926K56584m05575p4341M02831J76022n6933
$$ 5130821 4940865 5117101 4966937 4573011 4829595 4424020 4349679 4752510 4928532 4871599
6567D871599m01331M3878m71728L07376l3328j18372n19558r3954j65412J17022
$$ 4871599 4470268 4514146 4042418 4349794 4316466 4198094 3678536 3584582 3419170 3536192
6557C536192K00760r7295l7963K07959k15097j2601K57255K18209k4287j01514
$$ 3536192 3736952 3639657 3601694 3809653 3594556 3581955 3839210 4057419 4033132 3931618
6547C931618k30065k07377L48330M22705P7411L22711O31806o91446P4633L66909
$$ 3931618 3701553 3494176 3842506 4265211 4342622 4665333 5297139 4605693 4680326 5047235
6537E047235K37259M33178J4307K20989O07651L87472P01716j14141P200K53564
$$ 5047235 5284494 5717672 5731979 5952968 6560619 6948091 7649807 7535666 7542866 7796430
6527G796430L81050L17566O90327K07505P81976o6832n96731L70945r08356k23481
$$ 7796430 8177480 8495046 9185373 9392878 10174854 10108022 9511291 9882236 8973880 8750399
6517H750399m00712n60687p51274m45001j24210o64477k0330q18711l02434Q1420
$$ 8750399 8349687 7789000 7037726 6592725 6468515 5804038 5783708 4964997 4662563 4743983
6507D743983j2419j62601l75889K57632l74116L909P7384m41370o8767j80602
$$ 4743983 4731564 4568963 4193074 4450706 4076590 4080499 4157883 3716513 3647746 3467144
6497C467144K27590k26967r6311J39437j77517O1710r0876K5803j40759K55206
$$ 3467144 3694734 3467767 3371456 3510893 3333376 3395086 3304210 3330013 3189254 3444460
6487C444460k47513j56506j92054m18236M95984l65591N4139l39053k02589r3836
$$ 3444460 3196947 3040441 2848387 2430151 2926135 2560544 2614683 2275630 2073041 1979205
6477A979205l86799r4109r7240P16122J29529l96862k58729K7751M10888j25181
$$ 1979205 1592406 1498297 1401057 2117179 2246708 1849846 1591117 1618868 2029756 1904575
6467A904575n1305l59752L38887K76526k32007J3216k64468K47638m65680O57828
$$ 1904575 1853270 1493518 1832405 2108931 1876924 1890140 1625672 1873310 1407630 2065458
6457B065458n9621j11887O7579m88K82152l10720j47307P5752J75630k58497L1641
$$ 2065458 2005837 1893950 1961529 1961041 2243193 1932473 1785166 1860918 2036548 1778051 1809692
6446A809692K25856p5173J18309L14705l38640P6001J79947o0806j14690K15030
$$ 1809692 2035548 1960375 2078684 2393389 2054749 2130750 2310697 2249891 2135201 2350231
6436B350231P0480r88347K33565J19760p3776J30062j96330J23923P2321l16934
$$ 2350231 2420711 1432364 1665929 1785689 1711913 1841975 1645645 1769568 1841889 1524955
6426A524955L51458M97285k40126K4556m38559K60604o64417J34170K67549K1488
$$ 1524955 1876413 2373698 2133572 2158128 1719569 1980173 1315756 1449926 1717475 1738963
6416A738963K36541N73P31056p86515j31766P57865K80873k45013k36805O22846
$$ 1738963 1975504 1976077 2707133 1920618 1788852 2546717 2827590 2582577 2345772 2968618
6406B968618J63679o13313P379K25667m47978K72318J38824K66280K95488k06319
$$ 2968618 3132297 2518984 2526363 2752030 2304052 2576370 2715194 2981474 3276962 3070643
6396C070643J69119M71611M88088K1210l89446M2765J85763l6601m2654j82402
$$ 3070643 3239762 3711373 4199461 4220671 3831225 3873990 4059753 4023152 3980498 3798096
6386C798096L84949l62232N31313l63450K24449K72192k989O46021P6306N98338
$$ 3798096 4183045 3820813 4352126 3988676 4213125 4485317 4482328 5128349 5204655 5802993
6376E802993O44312J98573N31762L15316M82372L71511K33453Q23394R33010Q99772
$$ 5802993 6447305 6645878 7177640 7492956 7975328 8346839 8580292 9403686 10336696 11236468
6366A1236468O19468N80736n7418k37318o29970o75208l05779p96754p76831K93606
$$ 11236468 11855936 12436672 12379254 12141936 11511966 10836758 10530979 9734225 8957394 9251000
6356I251000j102671M3135o99945p88731L30615l14325j67134j02546J15946j40645
$$ 9251000 8148329 8191464 7491519 6702788 7033403 6719078 6551944 6449398 6565344 6424699
6346F424699J59200n2214R3395j12663m56360l71611J63678n22052n0982J80327
$$ 6424699 6583899 6531685 6625080 6512417 6056057 5684446 5848124 5326072 5275090 5455417
6336E455417K11328N5434r7227j5625M65579L27042J26848P38112M6179K05555
$$ 5455417 5666745 5722179 5624952 5609327 6074906 6401948 6528796 7266908 7313087 7518642
6326G518642N86536P49307K7094R4845Q30554q1465P31491R65111O34773k2320
$$ 7518642 8105178 8854485 8881579 8976424 9806978 9725513 10457004 11422115 12056888 12034568
6316A2034568o08280o16199j285539m61834j275061n02878n23432n96129K69944
$$ 12034568 11426288 10810089 9524550 9062716 7787655 7284777 6761345 6165216 6435160
6307F435160o85558j63289L50611l56937k43384m98680K75336l52342M2086m02320
$$ 6435160 5749602 5586313 5936924 5579987 5336603 4837923 5113259 4760917 4803003 4400683
6297D400683Q5575K5626j74771l67263r33084j9860k14186K10547K89579J01826
$$ 4400683 4486258 4511884 4337113 3969850 3036766 3016906 2802720 3013267 3302846 3404672
6287C404672k32989l59141m18469j46262K0571k89475O1171L04948m63493K00949
$$ 3404672 3171683 2812542 2394073 2247811 2268382 1978907 2040078 2345026 1881533 2082482
6277B082482J06903L80214l63723k13734K84409j01284o31013k42661N87443L00999
$$ 2082482 2189385 2569599 2205876 1992142 2276551 2175267 1544254 1301593 1889036 2190035
6267B190035j37069K86968n40348l2168K85860m13733J98750k6136l34472L21514
$$ 2190035 2052966 2339934 1799586 1767418 2053278 1639545 1838295 1812159 1477687 1799201
6257A799201r4419L45952r9101k12049M5716l4328P3118P976O95446o38828J01127
$$ 1799201 1704782 2050734 1951633 1739584 1785300 1750972 1824090 1832066 2527512 1888684 1989811
6246A989811N652n29243Q6230P6664l97345l07318j25054P23262r9438Q2399J30250
$$ 1989811 1995463 1466220 1552450 1629114 1231769 924451 799397 1522659 1423221 1505620 1635870
6235A635870l20937M04664m92920l82241L49849K46541R6405k27957O0048O73960
$$ 1635870 1314933 1719597 1226677 844436 1194285 1440826 1537231 1309274 1369322 2043282
6225B043282j89638l42064k94240m9900n9837k89033O74515K69313K89424k18912
$$ 2043282 1853644 1511580 1217340 1167440 1107603 818570 1493085 1762398 2051822 1832910
6215A832910j35427j47227j28986J22275n65711K81801L50159N08098L57039k76861
$$ 1832910 1697483 1550256 1421270 1543545 977834 1259635 1609794 2117892 2474931 2198070
6205B198070k60284k3253M8962p52236L85637M86681j02741J48203L42288P0481
$$ 2198070 1937786 1914533 1963495 1211259 1596896 2083577 1980836 2129039 2471327 2541808
6195B541808l58709l14926m23177J97841K03626p684R5284N4837J99671L40978
$$ 2541808 2183099 1868173 1444996 1642837 1846463 1838779 1934063 1988900 2188571 2529549
6185B529549n45017o38596J77073J27519l9062L87570l60644L96616N3833n51000
$$ 2529549 1984532 1345936 1523009 1650528 1611466 1999036 1638392 2035008 2088841 1537841
6175A537841L41950j33360L08580l74116l10457j96757l71268L20970j32186M14291
$$ 1537841 1879791 1746431 2055011 1680895 1370438 1173681 802413 1123383 991197 1405488
6165A405488l31630K61134L15538k13305N3833q6433L1618R7684J35607m78633
$$ 1405488 1073858 1334992 1650530 1437225 1491058 1404625 1436243 1533927 1669534 1190901
6155A190901m20200K69338j75326M12179J72506l21316O9417K23219M17470M00235
$$ 1190901 770701 1040039 864713 1276892 1449398 1128082 1197499 1420718 1838188 2238423
6145B238423k74631k85955K66122l19593K76056R9371o89565M63872m74579q1739
$$ 2238423 1963792 1677837 1943959 1624366 1900422 1999793 1310228 1774100 1299521 1217782
6135A217782j9042N6969L83916k47729n50128l7887N66976N05853L33520k08818
$$ 1217782 1198740 1255709 1639625 1391896 841768 803881 1370857 1876710 2210230 2001412
6125B001412p12442L13288N51239m98763N24507k60470K14224k14874K98290K34489
$$ 2001412 1288970 1602258 2153497 1654734 2179241 1918771 2132995 1918121 2216411 2450900
6115B450900m83050m48556N9665J26098K34693p4478N3816r1131J15940R0048
$$ 2450900 1967850 1519294 1578959 1705057 1939750 1865272 1919088 1827957 1943897 2033945
6105B033945n70343K73310K57303K35941L19217p11548O97756j88715J74660k48389
$$ 2033945 1463602 1736912 1994215 2230156 2549373 1837825 2535581 2346866 2521526 2273137
6095B273137j96713N36187j11319N88466o00053K08470K20274M80112K16423l22417
$$ 2273137 2076424 2612611 2501292 3089758 2489705 2698175 2918449 3398561 3614984 3292567
6085C292567J59526m49478q8237L04312J87466O66896L8289N90893k19956j68016
$$ 3292567 3452093 3002615 2914378 3218690 3406156 4073052 4111341 4702234 4482278 4314262
6075D314262p0508l71005M9879L72148J5607M7588J96358l09824k09201k24922
$$ 4314262 4243754 3872749 3922628 4294776 4310383 4357971 4554329 4244505 4035304 3810382
6065C810382k61500k59608m23931L80164j22424L60653R2151R2658k25421p72631
$$ 3810382 3548882 3289274 2865343 3245507 3123083 3483736 3575887 3668545 3443124 2670493
6055B670493k99511L34585L77598l5862M41499k89655l84593o519R6841m10835
$$ 2670493 2370982 2705567 3083165 3047303 3488802 3199147 2814554 2808035 2904876 2494041
6045B494041L2702O09787m88575K49391P63548o9608j34293l36873k58712k16706
$$ 2494041 2526743 3136530 2647955 2897346 3660894 3591286 3456993 3120120 2861408 2644702
6035B644702N55558k24353p9940R4569q5337J79504J61763l35613j4615k4188
$$ 2644702 3200260 2975907 2895967 2990536 2905199 3084703 3246466 2910853 2896238 2872050
6025B872050K42104J57393J61832l20724R1585k25022j71462J78315J65406N1839
$$ 2872050 3114154 3271547 3433379 3112655 3204240 2979218 2807756 2986071 3151477 3203316
6015C203316k04883L9154k92737j02540L18310J55059l2461l36595O0453K90205
$$ 3203316 2998433 3037587 2744850 2642310 2960620 3115679 3083218 2746623 2807076 3097281
6005C097281O5489j53650l74595N28388k61032j80894M93004j53581k71563J59009
$$ 3097281 3162770 3009120 2634525 3162913 2901881 2720987 3213991 3060410 2788847 2947856
5995B947856J77075m7478J44857j96015j09582N36030O6484k89537j59048N1072
$$ 2947856 3124931 3077453 3222310 3026295 2916713 3452743 3519227 3229690 3070642 3121714
5985C121714j89681K33563M58208n98464O0719k38111P32043R0486k65901L77455
$$ 3121714 2932033 3165596 3623804 3025340 3086059 2847948 3579991 3670477 3404576 3782031
5975C782031k61118L73809j10038L43967k74987N50003L18624l93692q9819L36432
$$ 3782031 3520913 3894722 3784684 4128651 3853664 4403667 4722291 4328599 4238780 4575212
5965D575212p9508P41271r2320K88746N65931k8000l41194k23502O48N18298m3292
$$ 4575212 4495704 5236975 5144655 5433401 5999332 5971332 5630138 5406636 5407284 5925582 5882290
5954E882290j56493K05333o9859N15429l16870N69349j2478J94504O50691l21628
$$ 5882290 5725797 5931130 5861271 6376700 6059830 6629179 6616701 6811205 7461896 7140268
5944G140268P14805l30336M41418P75300j63596O11148j10636k13195K73291N33885
$$ 7140268 7855073 7524737 7966155 8741455 8577859 9189007 9078371 8865176 9138467 9672352
5934I672352L28349J23688J037177j59337o5858O45582o55020P87598O93649L43909
$$ 9672352 10000701 10124389 11161566 11002229 10936371 11581953 10926933 11714531 12408180 12752089
5924A2752089J223951M69640K74250J166664O52703N05224N04190J089301P78134
$$ 12752089 13976040 14445680 14719930 15886594 16539297 17044521 17548711 18638012 19416146
5915A9416146P65946J990362J624402J738739J629199K097607K239187J710798
$$ 19416146 20182092 22172454 23796856 25535595 27164794 29262401 31501588 33212386
5907C3212386L141224L349121L716077M450592M479226N257563N265557N726255
$$ 33212386 36353610 39702731 43418808 47869400 52348626 57606189 62871746 68598001
5899F8598001O285229N712296N255955K866023J400852j253508l311528m677864
$$ 68598001 74883230 80595526 85851481 88717504 90118356 88864848 85553320 80875456
5891H0875456n601885n161630n535299m624420m274825m683722l678193l512104
$$ 80875456 75273571 70111941 64576642 59952222 55677397 50993675 47315482 43803378
5883D3803378m117985k872956k736719k672661k416382j982621j977849j312767
$$ 43803378 39685393 36812437 34075718 31403057 28986675 27004054 25026205 23713438
5875B3713438r46332j387783j403510q55550r46207r42448p72722n67021k37027
$$ 23713438 22767106 21379323 19975813 19120263 18174056 17231608 16458886 15891865 15654838
5866A5654838n28999o14579m82327m31821j007859j88023n2398p75748k85666
$$ 15654838 15125839 14511260 14028933 13597112 12589253 12401230 12348832 11573084 11287418
5857A1287418k33485j35998K22288p50211P0682k94908l34101n22212k82751Q8249
$$ 11287418 11053933 10917935 11140223 10390012 10460694 10165786 9831685 9309473 9026722 9114971
5847I114971m38787l02305l43400M86757N86247q17836j08766k96499o50147j92761
$$ 9114971 8676184 8373879 8030479 8517236 9103483 8285647 8176881 7880382 7230235 7037474
5837G037474k40905K79105P7725m15650L6534m62349j2972Q3748m32554J63740
$$ 7037474 6796569 7075674 7153399 6737749 6774283 6311934 6298962 6382710 5950156 6113896
5827F113896J7931L14995n32305K0955L07337r53607M8354l46052M3632K43259
$$ 6113896 6131827 6446822 5914517 5935472 6242809 5289202 5337556 4991504 5035136 5278395
5817E278395l48115K92259l35032K8989q7862j47197l50646J2190J38104k05378
$$ 5278395 4930280 5222539 4887507 4916496 4828634 4681437 4330791 4342981 4481085 4275707
5807D275707M75668m22676k79518M92945p58142M10394K20663p47522L20594L72622
$$ 4275707 4751375 4328699 4049181 4542126 3783984 4194378 4415041 3667519 3988113 4360735
5797D360735j21442L69684K06426m78828q0586P3600l42129n49365M67987Q3899
$$ 4360735 4239293 4608977 4815403 4336575 4255989 4329589 3987460 3438095 3906082 3989981
5787C989981K58790J78037l95566J04023m84527O5508J66732l07163J97011J69588
$$ 3989981 4248771 4426808 4031242 4135265 3650738 3716246 3882978 3575815 3772826 3942414
5777C942414K61180L31138j52703l59780n26673N84063j88824K03022l30502m11866
$$ 3942414 4203594 4534732 4382029 4022249 3495576 4079639 3890815 4093837 3763335 3351469
5767C351469K78711K67195O18789j60257J3660p60318m25950P6096L31694K84228
$$ 3351469 3630180 3897375 4516164 4355907 4369567 3609249 3183299 3259395 3591089 3875317
5757C875317j25511M80238l32979l22791Q5682k5671m71151p545P1018K5167K11759
$$ 3875317 3749806 4230044 3897065 3574274 3659956 3634285 3163134 3155589 3226607 3251774 3463533
5746C463533O77967j97630k39675K57333j11825p58959K07715j53527J21227M55654
$$ 3463533 4141500 3943870 3704195 3961528 3849703 3090744 3298459 3144932 3266159 3721813
5736C721813k99871L3830l30910N60013l08851k71700L0766k79157O26989o1801
$$ 3721813 3421942 3455772 3124862 3684875 3376024 3104324 3135090 2855933 3482922 3421121
5726C421121L74231P9166k42283p8754p15374l1871P2113L2374O04761j12201
$$ 3421121 3795352 3874518 3632235 3553481 2838107 2806236 2878349 2910723 3515484 3403283
5716C403283l52786K72233r435K47268j4691k79492J03530j54298j3165K40411
$$ 3403283 3050497 3322730 3313295 3560563 3545872 3266380 3369910 3215612 3202447 3442858
5706C442858L33007j52648l24984J05103l03310R0506k54275L55714J97782m44040
$$ 3442858 3775865 3623217 3298233 3403336 3100026 3190532 2936257 3291971 3489753 3045713
5696C045713j11673n6725Q7321L40204K9113O25908o21097L06642l59273l49843
$$ 3045713 2934040 2877315 2964636 3304840 3333953 3959861 3338764 3645406 3286133 2936290
5686B936290K99589m20056O36689J05280m19281M64752j61556q3644K55414J54184
$$ 2936290 3235879 2815823 3452512 3557792 3138511 3603263 3441707 3358063 3613477 3767661
5676C767661n12128k63439j8840K09149M82749n5441j91089L10264j81043l05400
$$ 3767661 3255533 2992094 2973254 3182403 3665152 3609711 3418622 3728886 3547843 3242443
5666C242443K85054k85415M05223L65664j17075m1594n97521L39500m2510j50310
$$ 3242443 3527497 3242082 3647305 4012969 3895894 3854300 3256779 3596279 3553769 3403459
5656C403459M37071k59976N03453n10408o9552K49642m3748L63495o51373q7106
$$ 3403459 3840530 3580554 4084007 3573599 3504047 3753689 3709941 4073436 3422063 3334957
5646C334957M87326j17828j88426J6871N57567r6414o5612j8755N0125K97727
$$ 3334957 3822283 3704455 3516029 3532900 4090467 3994053 3928441 3909686 3959811 4257538
5636D257538o79094O4322n93k26858N08789J60842k85909M72934J52542J32972
$$ 4257538 3578444 3642766 3642173 3415315 3924104 4084946 3799037 4271971 4424513 4557485
5626D557485K00906J40529l46193m0451J56853o5825j7391r7407N97941L31526
$$ 4557485 4758391 4898920 4552727 4512276 4669129 4603304 4585913 4488506 5086447 5417973
5616E417973n86411N7293k6258p86026N3001k18468N82085J76173O150j08997
$$ 5417973 4831562 4888855 4862597 4076571 4129572 3911104 4493189 4669362 4675512 4566515
5606D566515k33938j9510L58134M75003m2735j52237N31029j73136O93073K65845
$$ 4566515 4332577 4313067 4671201 5146204 5103469 4951232 5482261 5309125 6002198 6268043
5596F268043m18988N77714l5239m55448Q7376P6294Q7610J82336N76951n36243
$$ 6268043 5849055 6426769 6391530 5936082 6023458 6099752 6187362 6369698 6946649 6410406
5586F410406m40633J51278j82041l14849L94981j83420L35418l4901O63768M62740
$$ 6410406 5969773 6121051 5939010 5624161 6019142 5835722 6171140 6136239 6800007 7262747
5576G262747l96079M58466n63280k66086M16404N12187j59462j7244K4049n83605
$$ 7262747 6866668 7325134 6761854 6495768 6912172 7424359 7264897 7247653 7271702 6688097
5566F688097K42211k02235m12394j52262Q3249Q2462Q5944M13495l87478N76201
$$ 6688097 6930308 6728073 6315679 6163417 6246666 6329128 6415072 6828567 6441089 7017290
5556G017290j82986m6350J67361j27337K8270N19603J75609L91823P9084k74674
$$ 7017290 6834304 6787954 6955315 6827978 6856248 7375851 7551460 7943283 8022367 7747693
5546G747693q5156M53585N56433j55502M45257j65691J059590N8801Q3617Q21464
$$ 7747693 7662537 8116122 8672555 8517053 8962310 8796619 9856209 9915010 9998627 10820091
5536A0820091O6335N4725M75429K99994L71387P14065P6843R90263M15539K89518
$$ 10820091 10886426 10941151 11416580 11716574 12087961 12802026 12878869 13869132 14284671 14574189
5526A4574189J249749Q43814N34781J791875J001917J238328J302850J396822
$$ 14574189 15823938 16667752 17202533 18994408 19996325 21234653 22537503 23934325
5518B3934325J652944K036613K192350J842355K889561K415863K668741L082362
$$ 23934325 25587269 27623882 29816232 31658587 34548148 36964011 39632752 42715114
5510D2715114J407838J462075l03966j305138k462958k773555l005066k947672
$$ 42715114 44122952 45585027 45281061 43975923 41512965 38739410 35734344 32786672
5502C2786672k854978k446563j281424r79328j488342j337634j123447o29581
$$ 32786672 29931694 27485131 26203707 25224379 23736037 22398403 21274956 20645375
5494B0645375j273057j258111k97663q65535k79228q63242j71653o26091k71059
$$ 20645375 19372318 18114207 17816544 16951009 16671781 15808539 15636886 15010795 14739736
5485A4739736k57901m45124Q807J79471J97609K60745J31448m27026j47952J41026
$$ 14739736 14481835 14036711 14045518 14224989 14422598 14683343 14814791 14387765 14239813 14380839
5475A4380839j22101j15767K82574Q33196r8077o7972O07132K7818M09972L88935
$$ 14380839 14258738 14142971 14425545 15258741 15160664 15092692 15699824 15727642 16137614 16526549
5465A6526549P54082j25365Q10012J247982N38405P18521J44429P98531J281732
$$ 16526549 17280631 17155266 17965278 19213260 19751665 20470186 20614615 21413146 22694878
5456B2694878R52330P71002O00780R07236P38210J802539J414629J114353K466983
$$ 22694878 23647208 24418210 25018990 25926226 26664436 28466975 29881604 30995957 33462940
5447C3462940J543468J400188K069155J313347J630889K184367J383984R22715
$$ 33462940 35006408 36406596 38475751 39789098 41419987 43604354 44988338 45911053
5439D5911053j2969J46254j74781J11698m26560o40645m36169j156627k69976
$$ 45911053 45898084 46044338 45869557 45981255 45554695 44914050 44477881 43321254 43051278
5430D3051278n93500j063896m53707q39443j375770j172932j876799k033393j689262
$$ 43051278 42457778 41393882 40940175 40100732 38724962 37552030 35675231 33641838 31952576
5421C1952576k354074j760443j653515j293697j847238j205978j290698p11895
$$ 31952576 29598502 27838059 26184544 24890847 23043609 21837631 20546933 19835038
5413A9835038j329315p79350m18036j195240p30641m47259n72521j05490k22331
$$ 19835038 18505723 17726373 17308337 16113097 15382456 14935197 14362676 14257186 14034855
5404A4034855l79150p19460p77034k1222j76300M8515j70012L34891l24823m27107
$$ 14034855 13655705 12936245 12159211 12137989 11961689 12010204 11840192 12175083 11850260 11423153
5394A1423153n15186l50209k61173K5062m01784L96341n397n48394n839k79371
$$ 11423153 10907967 10557758 10296585 10321647 9919863 10316204 10310807 9762413 9756574 9477203
5384I477203j44274n37241J37173k37127j69757M65827j94449K78554r5915J40310
$$ 9477203 9332929 8795688 8932861 8695734 8525977 8991804 8797355 9075909 8979994 9120304
5374I120304o08422k77183M14754k46170j71205K58768M22742m40383k34509l09634
$$ 9120304 8511882 8234699 8649453 8403283 8232078 8490846 8913588 8473205 8238696 7929062
5364G929062Q8846n837J6386M2416l74051L75728j14634L36228p1837n62305K4633
$$ 7929062 8017908 8012071 8028457 8070873 7696822 8072550 7957916 8294144 8222307 7660002 7684635
5353G684635K24945L09665L5086O8795l831l27123j18156L21936k66357P3715
$$ 7684635 7909580 8219245 8254331 8323126 8319295 7992172 7874016 8195952 7929595 8003310
5343H003310L50663L08875j86373m1656Q813N73183n29902k53887L58075k23408
$$ 8003310 8353973 8662848 8476475 8434819 8443632 9016815 8486913 8233026 8591101 8367693
5333H367693L75787N6095r2196L15375k74280n8819l7597r3008l2283J85570L24535
$$ 8367693 8743480 8799575 8707379 9022754 8748474 8689655 8652058 8559050 8526767 8712337 9036872
5322I036872J05439K72950K51769o3845j12121j00221m33785K53727R02987j91321
$$ 9036872 9142311 9415261 9667030 9603185 9491064 9390843 8957058 9210785 10113772 9922451
5312I922451m05574J34339j37517J82568m32848O32314l66871K01855O39070r2368
$$ 9922451 9516877 9651216 9513699 9696267 9263419 9895733 9528862 9730717 10369787 10277419
5302A0277419K44690j88050k28576q5249p67421M76883K41947L66554Q3871j15678
$$ 10277419 10522109 10334059 10105483 10020234 9252813 9729696 9971643 10338197 10422068 10306390
5292A0306390k56965l0721K17380j73307K54356n52223m22315J05197N81692J0704
$$ 10306390 10049425 10018704 10236084 10062777 10317133 9764910 9342595 9447792 10029484 10040188
5282A0040188m09072j80553Q65M78276l5212P686K92742j26831M02674j63983
$$ 10040188 9631116 9450563 9451428 9929704 9894492 9902178 10194920 10068089 10470763 10306780
5272A0306780l62324n39633L27113M99530j58451j52480l31958N06906J35967
$$ 10306780 9944456 9404823 9731936 10231466 10073015 9920535 9588577 10095483 10231450
5263A0231450p2814J6761J34795k98047m11K98534o96152J59141j49619O4906
$$ 10231450 10158636 10175397 10310192 10012145 10011734 10310268 9614116 9773257 9623638 9688544
5253I688544K57540p6435n9058Q9969q9995L90680o9920p38690K68445Q67000
$$ 9688544 9946084 9869649 9810591 9900560 9810565 10201245 10131325 9392635 9661080 10528080
5243A0528080k5128k79284Q5774p61443o2384L42679L0378R5683K03600K16442
$$ 10528080 10502952 10223668 10309442 9547999 9485615 9828294 9858672 9954355 10157955 10374397
5233A0374397j56710N62131J00582o22788L43376K8829m05963l02619J28674P8246
$$ 10374397 10217687 10779818 10880400 10257612 10600988 10629817 10223854 9921235 10049909 10128155
5223A0128155K02881P85839K55920n52364J2007J24630k17738j51392j03907L12956
$$ 10128155 10331036 11116875 11372795 10820431 10832438 10957068 10739330 10587938 10484031 10796987
5213A0796987M39091K01750o43009Q6094k26481j75292K43613k6883Q3879M22375
$$ 10796987 11236078 11437828 10794819 10880913 10654432 10479140 10722753 10695870 10779749 11202124
5203A1202124Q6185L74614K17907o57059L9543o1786k02127O4508M96662O79450
$$ 11202124 11288309 11662923 11880830 11223771 11263314 11201528 10999401 11063909 11560571 12240021
5193A2240021k58372j16897R5342N885m16740J34031M65605j27542k81355J65323
$$ 12240021 11981649 11864752 11960094 11965979 11549239 11683270 12148875 12021333 11739978 11905301
5183A1905301k90796M37228j50517n86818J40631k22863O7077o4934J65768l31934
$$ 11905301 11614505 12051733 11901216 11314398 11455029 11232166 11299243 11234309 11400077 11068143
5173A1068143J90043L9241j61983J51099o84849j12648N82448k78990Q0895m06619
$$ 11068143 11258186 11297427 11135444 11286543 10601694 10489046 11071494 10792504 10873399 10466780
5163A0466780R0698J08715j74566k00339L54536Q8767r24959N49075J76119k76381
$$ 10466780 10557478 10666193 10491627 10291288 10645824 10734591 9809632 10358707 10534826 10258445
5153A0258445K01095m17658j92295Q7581j44262r521k58179M14544q6971l53103
$$ 10258445 10459540 10041882 9849587 9937168 9792906 9783385 9525206 9939750 9852779 9499676
5143I499676J09511M9405j88765M7438J95378k14952J19970j28722R708J42976
$$ 9499676 9609187 9658592 9469827 9517265 9712643 9497691 9617661 9488939 9498647 9641623
5133I641623M4170m64298M10315l04791l43551L56741k56995k23055L30687q4742
$$ 9641623 9685793 9221495 9631810 9327019 8983468 9340209 9083214 8860159 9190846 9106104
5123I106104M14644o8718l57207R4078m65098J62381q458L11030l62541R7186
$$ 9106104 9520748 9452030 9094823 9188901 8723803 8886184 8877726 9188756 8826215 8923401
5113H923401K60941m38846M44891J76751K07164o41154m7475J57148m3102M35558
$$ 8923401 9184342 8745496 9190387 9367138 9574302 8933148 8885673 9042821 8999719 9435277
5103I435277n00483M61795l45637m27050N61917K69479K18276j66169Q7350j22103
$$ 9435277 8934794 9396589 9050952 8623902 9185819 9455298 9673574 9507405 9594755 9472652
5093I472652J4917K94038j27855N21420n55606j17068M1932o82575O17116k80724
$$ 9472652 9487569 9781607 9653752 10175172 9619566 9502498 9544430 8861855 9478971 9198247
5083I198247J34225M74424p6705l26781K6014r0052J63703Q46245l98908j8792
$$ 9198247 9332472 9806896 9730191 9403410 9429424 9339372 9503075 10349320 9950412 9931620
5073I931620Q4481R497R8970l35297m13086k41985o8025M06209J76148M45307
$$ 9931620 10016101 10025598 10124568 9789271 9376185 9134200 9066175 9472384 9648532 10093839
5063A0093839p4546j03076l098m0679j72248l73813k61200l3668N43227M66331
$$ 10093839 10019293 9916217 9913119 9872440 9700192 9326379 9065179 9031511 9574738 10041069
5053A0041069J30369l49277L9159R702k63112L22150r9092l016N15851J52164
$$ 10041069 10171438 9822161 9861320 9871022 9607910 9930060 9830968 9827952 10343803 10495967
5043A0495967j52170l57724k41906L8876n6580k615l4192p1079j21911o6662o3844
$$ 10495967 10343797 9986073 9744167 9783043 9726463 9723848 9689656 9618577 9496666 9430004 9366160
5032I366160l3280J40218K8770m45372L67212P6206j84781J47681O166L72604
$$ 9366160 9332880 9473098 9501868 9056496 9423708 9499914 9315133 9462814 9468980 9841584
5022I841584L41372l18749m08757L69421k65601K88099J30874n34922R5361j70894
$$ 9841584 10182956 9864207 9455450 9824871 9559270 9847369 9978243 9443321 9538682 9367788
5012I367788R5195q494l68504L02005L59643M39798r28412K50291L15638n09009
$$ 9367788 9462983 9454489 9085985 9387990 9747633 10187431 9259019 9509310 9824948 9315939
5002I315939J05006r9867l5632J42044L02466k09017j46416K29879j3756k53526
$$ 9315939 9420945 9321078 9285446 9427490 9729956 9520939 9374523 9604402 9590646 9337120
4992I337120n93105N97346J67730q2053K16453L7664m41896p8701J7162O18827
$$ 9337120 8744015 9341361 9509091 9427038 9643491 9681155 9239259 9160558 9177720 9796547
4982I796547K386K0601L0103J42705m56547J9218K43296m10453L04336k71961
$$ 9796547 9798933 9819534 9849637 9992342 9535795 9555013 9798309 9387856 9692192 9420231
4972I420231J87846o0302J64542j55712j51680K435j04396K87296M85074J18099
$$ 9420231 9608077 9547775 9712317 9556605 9404925 9407360 9302964 9590260 10075334 10193433
4962A0193433j77339K89291K07502j47054j87839k95863O15276K53878R3258J16228
$$ 10193433 10016094 10305385 10512887 10365833 10177994 9882131 10497407 10751285 10844543 10960771
4952A0960771m24595r4673o120m59034J44079M82937k96882L32147K6543m75499
$$ 10960771 10536176 10441503 10435383 9976349 10120428 10603365 10306483 10638630 10665173 10189674
4942A0189674L17921o15219m03053k01251J57803l41283n762O87008L03847L13838
$$ 10189674 10507595 9892376 9489323 9288072 9445875 9104592 9098830 9785838 10089685 10403523
4932A0403523l10020l16033K28434p46391M19375j01251M12545L56989m98182
$$ 10403523 10093503 9777470 10005904 9259513 9678888 9577637 9990182 10347171 9848989
4923I848989J89726m25506M35734k24595j02113Q1822P5004P23769p49295M10666
$$ 9848989 10038715 9613209 10048943 9824348 9722235 9804057 9879061 10602830 9853535 10264201
4913A0264201J3293n13981L83481Q2226o58454P21478L97831k10291J2699k74448
$$ 10264201 10277494 9763513 10146994 10229220 9570766 10292244 10690075 10479784 10492483 10218035
4903A0218035l26518r1697R1773R1392M22758K81857R4093L19964o9766K21019
$$ 10218035 9891517 9799820 9891593 9982985 10405743 10687600 10781693 11101657 11031891 11252910
4893A1252910m7357m14541M20382K77670K5309M00353j43714k1117j47524j78399
$$ 11252910 11205553 10791012 11211394 11489064 11514373 11914726 11771012 11749895 11602371 11423972
4883A1423972K21623l10034N81422p17097M53902O6738o06087M62811m64484K26516
$$ 11423972 11645595 11335561 11916983 11199886 11653788 11720526 11114439 11577250 11112766 11339282
4873A1339282K5721q1397N8339l365P25014L37744L17313l7528K0754O6882q8516
$$ 11339282 11365003 11283606 11341945 11338580 12063594 12401338 12718651 12681123 12701877 12768759 12680243
4862A2680243J40100K87784p48056N00126m7790j90969K15846k49359j86564m7221
$$ 12680243 12820343 13108127 12360071 12860197 12812407 12621438 12837284 12587925 12401361 12354140
4852A2354140k96418j77564p1100k25609n36343N06005k84297K08781L91419l78670
$$ 12354140 12057722 11880158 11809058 11583449 11047106 11553111 11268814 11477595 11869014 11490344
4842A1490344J83834n069o76024K68130J94074k64115n7586r3203K57612J36310
$$ 11490344 11674178 11669109 10993085 11261215 11455289 11191174 11133588 11040385 11297997 11434307
4832A1434307m25011L49527j0119m40302o1865J47011j93756R768o4372k76581
$$ 11434307 11009296 11358823 11348704 10908402 10846537 10993548 10799792 10809560 10745188 10468607
4822A0468607O38542k43520o32888M74183o90L23676l62922K96416j08496l25242
$$ 10468607 11107149 10863629 10230741 10704924 10704234 11027910 10664988 10961404 10852908 10527666
4812A0527666K9109l60907K72309l56280P2646L79940L69358J80915k19847M20867
$$ 10527666 10556775 10195868 10468177 10111897 10184543 10564483 10933841 11114756 10894909 11315776
4802A1315776M05102j31918l4974J12603J648m60538O41999J39866M85393n7133
$$ 11315776 11720878 11588960 11553986 11666589 11668237 11207699 11849698 11989564 12474957 12417824
4792A2417824o2563J4094N88018j72324P36953J42398l57757J06832K32495k6462
$$ 12417824 12355261 12369355 12957373 12785049 13522002 13664400 13306643 13413475 13645970 13619508
4782A3619508m04850m17884K15055l4993R3954J15285P4847q3136p06824l59891
$$ 13619508 13214658 12796774 13011829 12976836 13070790 13186075 13260922 13177786 12470962 12111071
4772A2111071L47833K23431m300q27181K5146k29364K58261k50944K49868J51541
$$ 12111071 12458904 12682335 12678035 11850854 11876000 11646636 11904897 11653953 11903821 12055362
4762A2055362J08655L62082m62524R1722N2230j07679k4440o05062k48533O7105
$$ 12055362 12164017 12526099 12063575 12155297 12207527 12099848 12075408 11470346 11221813 11288918
4752A1288918n46867J29445n2587N9284n02190k09J72631k19539R1862o4436K163
$$ 11288918 10742051 10871496 10818909 10878193 10376003 10375794 10548425 10328886 10420748 10356312 10358475
4741A0358475K5389j88327K47794L01479o6158J41137j00685J62913J22625m58696
$$ 10358475 10383864 10195537 10443331 10744810 10678652 10819789 10719104 10882017 11004642 10545946
4731A0545946K54102J95212L30054J53282k1235k03534K79953k2676j03147k75595
$$ 10545946 10800048 10995260 11325314 11478596 11457361 11253827 11533780 11511104 11407957 11132362
4721A1132362K07331j16562J55574r9492m34969k03947K42766K43861J30841J46560
$$ 11132362 11339693 11223131 11378705 11279213 10844244 10640297 10883063 11126924 11257765 11404325
4711A1404325m16791K27877L57166q7021k35853n49695j96412P95331q8349j53292
$$ 11404325 10987534 11215411 11572577 11485556 11249703 10700008 10503596 11298927 11210578 11057286
4701A1057286q11352m07623j09233k92343Q40847l68400M3831l1388l90361k34051
$$ 11057286 10245934 9838311 9729078 9436735 10277582 9909182 9953013 9921625 9531264 9297213
4691I297213j4701K58131K14023O299j12580l52195J75271k18957M78415n26639
$$ 9297213 9282512 9540643 9754666 9760965 9648385 9296190 9471461 9252504 9730919 9204280
4681I204280K01220N45126p95463j92319k92697O19627j24669K18556J10114m43252
$$ 9204280 9405500 9950626 9155163 8962844 8670147 9289774 9165105 9383661 9493775 9050523
4671I050523O79715j13708j74641M28085J24946k93707o5360L66450n48014L06758
$$ 9050523 9730238 9616530 9441889 9869974 9994920 9701213 9635853 10002303 9454289 9761047
4661I761047j13490k28543L43755q4681J94023q6760L73092n49863J00514q6669
$$ 9761047 9647557 9419014 9762769 9678088 9872111 9785351 10158443 9608580 9709094 9622425
4651I622425j5397N09240k28891N12655K13427j35222l1483j54787O2324m964
$$ 9622425 9607028 10116268 9887377 10400032 10613459 10478237 10446754 10291967 10354291 10349327
4641A0349327L86680J94671p7908O9119k61348O94443o0790j87609j14127m05102
$$ 10349327 10736007 10930678 10852770 10921889 10660541 11354984 11294194 11106585 10992458 10587356
4631A0587356j9617M65857L32575k07670N71320m40120m08804J63817k8574K13337
$$ 10587356 10567739 11033596 11366171 11158501 11729821 11289701 10880897 11044714 11016140 11229477
4621A1229477M8498J59421j49006k0498K15032r450j71959K67538O00812k53564
$$ 11229477 11277975 11437396 11288390 11267892 11482924 11473474 11301515 11569053 12169865 11916301
4611A1916301n65360L56544J38005L64939j10463r6684j87655J98247K29580o5259
$$ 11916301 11350941 11707485 11845490 12210429 12099966 12003282 11815627 12013874 12243454 12178195
4601A2178195K82209k90637K2728K43142k5049J33922K97334N42737j13429p151
$$ 12178195 12460404 12169767 12192495 12435637 12410588 12544510 12841844 13384581 13271152 13264001
4591A3264001J66191l69797J35864J48272O39497k31237k23204M22186K31159
$$ 13264001 13430192 13060395 13196259 13344531 13984028 13752791 13529587 13951773 14182932
4582A4182932O41119M1791j11012j11760N9063L6896L26013k05504k09824J63033
$$ 14182932 14824051 14865842 14754830 14643070 14702133 14739029 15065042 14859538 14649714 14812747
4572A4812747j604p43N00330O32437j28513J88205K9984r53139O87637L06895
$$ 14812747 14811143 14810400 15310730 15943167 15814654 16002859 16032843 15079704 15767341 16074236
4562A6074236p33119j02295N22921J033687k74470K31627O11878J37087K50107
$$ 16074236 15341117 15238822 15761743 16795430 16520960 16752587 17364465 17501552 17751659
4553A7751659j88006j45263L29356K84732O69558J02528o1799O18862M83061j8083
$$ 17751659 17563653 17418390 17747746 18032478 18702036 18804564 18742765 19361627 19844688 19826605
4543A9826605k10860L98363M45314J73697n0707J23668O14861O25077l32193M92239
$$ 19826605 19615745 20014108 20459422 20633119 20582412 20706080 21320941 21946018 21613825 22106064
4533B2106064R06537r7263K31245O34162J29103J60086Q2660k67088P63393P39646
$$ 22106064 23012601 22915338 23146583 23780745 23909848 24069934 24152594 23885506 24648899 25388545
4523B5388545Q05220O76290M63831Q24069L65122K06984M80822Q80319R31773
$$ 25388545 26193765 26870055 27333886 28157955 28523077 28730061 29210883 30091202 31022975
4514C1022975R37277J295391J644521J450417J095615J218019J209542L73019
$$ 31022975 31960252 33255643 34900164 36350581 37446196 38664215 39873757 40246776
4506D0246776O92362R18748J398713J315580R60290J457255J762199K066594J771354
$$ 40246776 40939138 41857886 43256599 44572179 45532469 46989724 48751923 50818517 52589871
4497E2589871K129619K501052L077005L116754L843149M893751M874479O402860
$$ 52589871 54719490 57220542 60297547 63414301 67257450 72151201 77025680 83428540
4489H3428540P900798R245241J0378051J1536926J3529300J6593031K0448778
$$ 83428540 91329338 100574579 110952630 122489556 136018856 152611887 173060665
4482A73060665K3637670K6947268K6155043K0153714O650753j0405785k2561822
$$ 173060665 196698335 223645603 249800646 269954360 276605113 266199328 243637506
4475B43637506k9141749k8930730k5394508k1111513j6058599j2356836q755524
$$ 243637506 214495757 185565027 160170519 139059006 123000407 110643571 101888047
4468A01888047o855026n712721m744994l639258k986613k319921j987753k282722
$$ 101888047 95033021 89320300 84575306 80936048 77949435 75629514 73641761 71359039
4460G1359039q37725p10083q29873m22312M7240K25414M03542N26515Q56482J000251
$$ 71359039 70521314 69811231 68981358 68559046 68606286 68831700 69235242 69761757 70618239 71618490
4450G1618490O04507R42806J628857J833649J625026K522036K696928K743656
$$ 71618490 72222997 73165803 74794660 76628309 78253335 80775371 83472299 86215955
4442H6215955L020472L696822M588627N306394O017281P973567Q860519J0179843
$$ 86215955 89236427 92933249 97521876 102828270 108845551 116819118 125679637 135859480
4434A35859480J2240197J4528740J6674856J9159009K2615799K6550156K6279705
$$ 135859480 148099677 162628417 179303273 198462282 221078081 247628237 273907942
4427B73907942J9822193J1469866j914980j4706660k2355138k7532939k5250055
$$ 273907942 293730135 305200001 303285021 288578361 266223223 238690284 213440229
4420B13440229k1666924j7809236j3668105j0339175p632168n822516m050036
$$ 213440229 191773305 173964069 160295964 149956789 142324621 136502105 132452069
4413A32452069k904421l051776j958080j475771j597632j054137j716328j249486
$$ 132452069 129547648 126495872 124537792 123062021 121464389 120410252 118693924 117444438
4405A17444438j549677m91763j370962j585957j318859j674618j598539k367696
$$ 117444438 115894761 115402998 114032036 112446079 111127220 109452602 107854063 105486367
4397A05486367k394177j845577j724399j322615j181423o46878m58473j048205
$$ 105486367 103092190 101246613 99522214 98199599 97018176 96371298 95912825 94864620
4389I4864620k8086j86968k99479K2217q9071n33073o23784o64373j294377j294533
$$ 94864620 94836534 94649566 94350087 94372304 94283233 93750160 93126376 92462003 91167626 89873093
4379H9873093j598056j414508j894115r89781o85775n33338n98231j91742Q2504
$$ 89873093 88275037 86860529 84966414 83976633 83290858 82757520 82159289 81967547 82050051
4370H2050051N2196N54799K29935j5762L36038q21338k82731j116591j562035
$$ 82050051 82102247 82657046 82886981 82871219 83207257 82385919 82103188 80986597 79424562
4361G9424562j358252k102859j384759j210175j283156r21350r08227q28464j96877
$$ 79424562 78066310 75963451 74578692 73368517 72085361 71164011 70255784 69427320 69230443
4352F9230443j91015p75868n69938n39936k96458m86908p68297o29498j507522
$$ 69230443 69039428 68263560 67693622 67153686 66857228 66370320 65602023 64972525 63465003
4343F3465003q33317j009131j354398j040622j361121r22487j571278m24646q50335
$$ 63465003 62631686 61622555 60268157 59227535 57866414 56943927 55372649 54948003 54097668
4334E4097668r66460q34385r00946o02292q54640K23666j177416q79205k9773
$$ 54097668 53131208 52296823 51395877 50793585 49938945 50162611 48985195 48105990 48076217
4325D8076217o55303q61925q83627r68165j00850p38609m72097m61399n71719
$$ 48076217 47420914 46558989 45675362 44707197 44606347 43867738 43395641 42934242 42362523
4316D2362523r58653r14182k94879k79377p88316K6942o48918j131711j57036
$$ 42362523 41403870 40489688 40194809 39915432 39127116 39154058 38505140 37373429 37216393
4307C7216393m86472l92272l31943k30108l32035k83759n00840p31792l44140
$$ 37216393 36729921 36337649 36005706 35775598 35443563 35159804 34658964 33927172 33583032
4298C3583032m94487O9988m26616m10080K91206r16982L92813m30143N4594k37075
$$ 33583032 33088545 33158533 32731917 32321837 32613043 31696061 32088874 31658731 31713325 31476250
4288C1476250o95039L70940m30794K80723o52401k55770M42211p2884J98807k12182
$$ 31476250 30781211 31152151 30721357 31002080 30349679 30093909 30536120 30463236 30662043 30449861
4278C0449861J23633j88873l42314n5401j30865M09810k28745m95367J67653k22229
$$ 30449861 30573494 30384621 30042307 29986906 29856041 30265851 30037106 29541739 29709392 29487163
4268B9487163K16349J00813N8709N3803o987L14569L68312J18610p6817L48667
$$ 29487163 29703512 29804325 29863034 29916837 29909850 30224419 30592731 30711341 30634524 30983191
4258C0983191L62555J59919j63366N26904l39430R133k12854k3251J91305j77756
$$ 30983191 31345746 31505665 31342299 31869203 31529773 31538906 31326052 31302801 31494106 31316350
4248C1316350P0114l91119K30318n3399j43310M5966m36063J82198l3775N7051
$$ 31316350 31386464 30995345 31225663 31172264 31028954 31074920 30638857 30821055 30787280 30844331
4238C0844331R9430K86658M22437j85211L36213O4975l16976N88498j10283l73322
$$ 30844331 30943761 31230419 31652856 31467645 31803858 31868833 31551857 32140355 32030072 31656750
4228C1656750J25547K55754L07113l18397l24371J97377p46457J66264P2834L25140
$$ 31656750 31782297 32038051 32345164 32026767 31702396 31899773 31153316 31319580 31392414 31717554
4218C1717554q8719j61491R64916L3757J80079J20346m10576N38638q3937O16498
$$ 31717554 31628835 31467344 32432260 32466017 32646096 32766442 32355866 32894504 32810567 33427065
4208C3427065L20523l86509J093510j58088L52959O4730J09296J84916j69219
$$ 33427065 33747588 33361079 34454589 34296501 34649460 34714190 34823486 35008402 34839183
4199C4839183O17504L37781j63022k4010L79382K79872k1805N25533J02123J97224
$$ 34839183 35456687 35794468 35631446 35607436 35986818 36266690 36244885 36770418 36872541 37069765
4189C7069765l00300N5211L30969O22451J33287M52069o9018M17444Q76336Q69842
$$ 37069765 36769465 36824676 37155645 37778096 37911383 38363452 38294434 38711878 39588214 40458056
4179D0458056Q09553N11892J047657Q94845Q35316O84221J95967P4871p90473
$$ 40458056 41267609 41779501 42827158 43722003 44557319 45241540 45437507 45512378 44721905
4170D4721905J17548M50136k70907O19194l41407N20716J49822N00754Q57803
$$ 44721905 44839453 45289589 45018682 45637876 45296469 45817185 45967007 46467761 47325564
4161D7325564l0942Q08422L5538O93476P59084O37448J441594R38079Q54194J520812
$$ 47325564 47294622 48103044 48138582 48832058 49591142 50228590 51670184 52608263 53462457 54983269
4151E4983269K043200K255176K541135K821340L028580L112222M087507M142733
$$ 54983269 57026469 59281645 61822780 64644120 67672700 70784922 74872429 79015162
4143G9015162M919453N363654O108127P159467P314115O212976M689868K307195
$$ 79015162 83934615 89298269 95406396 102565863 109879978 116092954 120782822 123090017
4135A23090017J228901l90153n37097J178641K227284L988382M051561N032645
$$ 123090017 124318918 123928765 123391668 124570309 126797593 130785975 134837536 139870181
4127A39870181L919513L89708l172777o973030q785175r737887r564919q727111
$$ 139870181 143789694 144179402 141006625 134033595 125248420 115510533 105945614 97218503
4119I7218503q122808o346098m873579m701110m345563k758501k955460k658464
$$ 97218503 89095695 82749597 77876018 73174908 68829345 66070844 63115384 60456920
4111F0456920k579742j759634j940927j727181j310931j558895j070257j536577
$$ 60456920 57877178 56117544 54176617 52449436 51138505 49579610 48509353 46972776
4103D6972776m28720m13883q79353j196540m25775j14124p16405m05084p20586
$$ 46972776 46544056 46130173 45250820 44054280 43628505 43514381 42797976 42392892 41672306
4094D1672306q13868j26875o04697J35965K2824m43209k57596j54664j80574m21974
$$ 41672306 40858438 40731563 40126866 40262831 40285655 39842446 39584850 39430186 39249612 38827638
4084C8827638m67598j008792m77376p68443J07512p20842l67305k64682n68446
$$ 38827638 38360040 37351248 36873872 36105429 36212941 35492099 35124794 34860112 34291666
4075C4291666j22885o01811j01658p36981l76012k49859m53815j95679j3907K04602
$$ 34291666 34168781 33566970 33465312 32728331 32352319 32102460 31648645 31452966 31439059 31643661
4065C1643661n56255K2182j9308o08647L96850j65961k90664k00846k75604J59894
$$ 31643661 31087406 31109588 31090280 30481633 30878483 30712522 30421858 30221012 29945408 30105302
4055C0105302k08196n42150k44498M06282n17091m65076K68618o11242M9050o72105
$$ 30105302 29897106 29354956 29110458 29516740 28999649 28534573 28803191 28191949 28240999 27568894
4045B7568894r3838P0643l51595q0501M20398k48704k75715m5005k13210j3479
$$ 27568894 27475056 27545699 27194104 27113603 27534001 27285297 27009582 26964577 26751367 26737888
4035B6737888L63105m10744l99867M17230Q9288k58309L64761J16254l17975M92235
$$ 26737888 27100993 26690249 26290382 26707612 26796900 26538591 26903352 27019606 26701631 27193866
4025B7193866k35154L3500J83636K27974K67017M70075K13805M57873M51799L7456
$$ 27193866 26958712 26992212 27175848 27403822 27670839 28140914 28354719 28812592 29264391 29301847
4015B9301847P15987p4189Q7436N22409k62973J037743n5158R63077j25483M2887
$$ 29301847 30017834 29943645 30031081 30553490 30290517 31328260 31273102 32236179 32110696 32153583
4005C2153583J41946n61111P41613M18538P22239K36143Q25169M12752L61485
$$ 32153583 32295529 31734418 32476031 32894569 33616808 33852951 34678120 35090872 35452357
3996C5452357J448818K35107L22303M74271K42260L55173l41397P25983R480J188266
$$ 35452357 36901175 37136282 37458585 37932856 38175116 38530289 38188892 38914875 38924355 40112621
3986D0112621R05478P04527J064278J376099J192516J186370J006448O52541J410927
$$ 40112621 41018099 41722626 42786904 44163003 45355519 46541889 47548337 48200878 49611805
3977D9611805J334746R55663J254349P18705J042480J165379J469837R73957J325930
$$ 49611805 50946551 51902214 53156563 53875268 54917748 56083127 57552964 58526921 59852851
3968E9852851J345502J039748O51681k90760j456409k140274k433374k171720
$$ 59852851 61198353 62238101 62889782 62599022 61142613 59002339 56568965 54397245
3960E4397245k432117k482030j321082j520550r49597q45138r25196q98654m62140
$$ 54397245 51965128 49483098 48162016 46641466 45691869 44846731 43921535 43022881 42560741
3951D2560741n44385m7162j95795n32244o60014N8226l49706M46245n4809P51657
$$ 42560741 42016356 41969194 41773399 41241155 40581141 40639367 40289661 40735906 40681097 41432754
3941D1432754M17489R51443L59091N19485N02968L80117N98192O62883J011400
$$ 41432754 41850243 42801686 43160777 43680262 44183230 44563347 45161539 45824422 46835822
3932D6835822Q66015Q63512J516838J069951J449480J292573R69538P71755M40627
$$ 46835822 47701837 48565349 50082187 51152138 52601618 53894191 54863729 55635484 56076111
3923E6076111L24122n15809q35835j151692j916640j754159j671520j577032j025318
$$ 56076111 56400233 55884424 55048589 53896897 51980257 50226098 48554578 46977546 45952228
3914D5952228j644994m28026j260461k98781o04521m84442o9305m86691K32233
$$ 45952228 44307234 43879208 42618747 42319966 41715445 41231003 41161698 40675007 40907240
3905D0907240o21183l51512m7437J03993M09720K5540O76625l0688J37190o63812
$$ 40907240 40286057 39934545 39887108 39991101 40400821 40426361 41102986 41072298 41209488 40545676
3895D0545676j40540k34851j51229m2664r533j63359r5898n25989j78647L148
$$ 40545676 40405136 40170285 40019056 39976392 39966859 39803500 39707602 39181613 39002966 39006114
3885C9006114q38565o61429m27441q63332k86001j032890p57311J7198n72481
$$ 39006114 38167549 37506120 37078679 36215347 35929346 34896456 34139145 34156343 33583862
3876C3583862K47720m4530m554l76753k6731l8254M15955M17610J0328K33284
$$ 33583862 33831582 33787052 33782498 33405745 33379014 33340760 33756715 34174325 34184653 34417937
3866C4417937O68847K74813L76686Q7910R18081N33310M37361R87806L33086N15224
$$ 34417937 35086784 35361597 35738283 35826193 36744274 37277584 37714945 38702751 39035837 39551061
3856C9551061M05084O36195M43905P07466J032671J016606J371152J363821J162753
$$ 39551061 39956145 40592340 41036245 41743711 42776382 43792988 45164140 46527961 47690714
3847D7690714J431938J338825J277838R72356R25453J597563J537926K544503
$$ 47690714 49122652 50461477 51739315 52711671 53637124 55234687 56772613 59317116
3839E9317116J468376J507911K74943Q35626P25346r06090m01105p54778n44797
$$ 59317116 60785492 62293403 62568346 63403972 64129318 63223228 62822123 62067345 61522548
3830F1522548j176044o37908r61127p58997m74818j051936r27387p72607q44392
$$ 61522548 60346504 59708596 58747469 57988472 57513654 56461718 55534331 54761724 53917332
3821E3917332o38280p55303l68368j003617m97217q19046n18269o82346j152825
$$ 53917332 53279052 52523749 52155381 51151764 50654547 49835501 49317232 48634886 47482061
3812D7482061l42140m52657M39944n5391k89985k37981o78114l86053j99894M35019
$$ 47482061 47139921 46687264 47127208 47071817 46781832 46543851 45865737 45479684 45279790 45714809
3802D5714809k59792n39564l7885j69079K18268J12030K88288m1197K0465P70785
$$ 45714809 45455017 44915453 44877568 44708489 44926757 45038787 45327075 45285878 45306343 46077128
3792D6077128l70270K34446R71792L43786m6438N09849J30386K06348L85032L09153
$$ 46077128 45706858 45941304 46913096 47256882 47210444 47720293 47850679 48057027 48442059 48751212
3782D8751212N41818N65671Q34852N56439L73546L45497J96878Q69921M57829
$$ 48751212 49293030 49858701 50693553 51249992 51623538 51969035 52165913 53035834 53493663
3773E3493663L88673M10202M96242J207140q5879J76313L42155K19143j51021
$$ 53493663 53882336 54292538 54788780 55995920 55910041 56086354 56428509 56647652 56496631
3764E6496631P40041P97103J42860O45557m4411J49138k83490J6086l32133K00778
$$ 56496631 57236672 58033775 58176635 58822192 58777781 58926919 58643429 58659515 58327382 58528160
3754E8528160R7767l19740O08549K639l26036m69548K3566J24401j9803k35725
$$ 58528160 58625927 58306187 58914736 58917375 58591339 58121791 58145357 58269758 58249955 58014230
3744E8014230n20284n58183k68668k03888m08731Q769p3054j102719l52656q8573
$$ 58014230 57493946 56935763 56667095 56463207 56054476 56063245 55990191 54887472 54534816 54446243
3734E4446243k98458j036939p73563k50557q64178q56166j302387q10147o82552
$$ 54446243 54147785 53110846 52337283 52086726 51222548 50366382 49063995 48253848 47571296
3725D7571296r70316n81879r85887j293721r24168o93951p46895o50460j176781
$$ 47571296 46600980 46019101 45033214 43739493 42815325 42121374 41374479 40724019 39547238
3716C9547238r80596n32017j191798m71189q23369j342704m73313o14314m71873
$$ 39547238 38566642 38034625 36842827 36371638 35548269 34205565 33732252 33117938 32646065
3707C2646065l29631n1313j007379n00079j019392N7880m73567l51170l89662
$$ 32646065 32316434 32265121 31257742 30757663 29738271 29796151 29322584 28971414 28581752
3698B8581752k17260k85899n54488r1490o09972m0773P91307m40866n85382L53762
$$ 28581752 28364492 28078593 27524105 27432615 26822643 26781870 27573177 27132311 26546929 26900691
3688B6900691O5019J6838m00296l4894K35785N65323L11845O1551J45778K61278
$$ 26900691 26965710 26982548 26582252 26547358 26783143 27348466 27660311 27721862 27867640 28128918
3678B8128918L74796J16734L83116J25050M7484J36283L47103J336309J75665
$$ 28128918 28503714 28620448 29003564 29128614 29176098 29312381 29659484 30995793 31171458
3669C1171458k08697N83083M96709M23964n0419L60177L37929l89097M63837M25469
$$ 31171458 30962761 31545844 32042553 32466517 32416098 32776275 33114204 32725107 33188944 33614413
3659C3614413K0008K65315o9548n6675M63383n75055K1010o0625L17234L81031
$$ 33614413 33634421 33899736 33830188 33773513 34236896 33661841 33682851 33622226 33939460 34320491
3649C4320491j09215j10821n4808K99165p31321n91260K98619n79705M84166j98892
$$ 34320491 34211276 34100455 34045647 34344812 33613491 33022231 33320850 32741145 33225311 33026419
3639C3026419l27695m6656R732M03336K76526m02402P9269m34900L26833K69871
$$ 33026419 32698724 32652068 32661800 33065136 33341662 32939260 33018529 32583629 32910462 33180333
3629C3180333M47051r2848K15324L65681J61775j61902J96443M14573K14338N57023
$$ 33180333 33627384 33534536 33749860 34115541 34277316 34115414 34311857 34726430 34940768 35497791
3619C5497791N06995R0400P0476Q24802L41111K82106J06181J8705R7874N97843
$$ 35497791 36004786 36095186 36165662 36990464 37331575 37613681 37719862 37738567 37836441 38434284
3609C8434284J45705l81837M50962L60269m30828N4043J01546m19625L91505j52398
$$ 38434284 38579989 38198152 38649114 39009383 38578555 38632598 38734144 38314519 38706024 38553626
3599C8553626L9445O95544k91689L8182J62218k06747o26022M41308j69473l5677
$$ 38553626 38593071 39288615 38996926 39035108 39197326 38990579 38364557 38805865 38636392 38600715
3589C8600715J4504l68781L29628q0707l76915r679r49710R7073l13296j37597
$$ 38600715 38615219 38246438 38576066 38495359 38118444 38108765 37159055 37256128 36942832 36805235
3579C6805235k29584k99191k9292n78350p12885l87061k60960l92790n82562n73773
$$ 36805235 36575651 36276460 36247168 35668818 34955933 34568872 34307912 33915122 33332560 32758787
3569C2758787r22189k56511k85903k90002o94268o57526k10644o86043m21216
$$ 32758787 31836598 31580087 31294184 31004182 30309914 29652388 29441744 28755701 28334485
3560B8334485j35318n06554k81502l3957n99713j91077o3280o77455R09509n68782
$$ 28334485 28199167 27692613 27411111 27377154 26777441 26586364 26523084 25845629 26755138 26186356
3550B6186356O2854L6931l32547K94535l46344L29484R831n2390K97969k34610
$$ 26186356 26249210 26286141 25953594 26248129 25901785 26231269 26241100 26188710 26486679 26252069
3540B6252069M58547k307j17214J34819O8150K59005m67675Q87211L22600k4597
$$ 26252069 26710616 26708309 26591095 26725914 26794064 27053069 26585394 27472605 27795205 27770608
3530B7770608K7299N99584M4329j38947J90222j5056L6950N93498L98676O21380
$$ 27770608 27797907 28397491 28441820 28302873 28493095 28478039 28514989 29108487 29507163 30128543
3520C0128543L5052R5551K34343J071680M60444m8595M39305M73555J05403L84953
$$ 30128543 30163595 30259146 30493489 31565169 32025613 31977018 32416323 32889878 32995281 33380234
3510C3380234J53115N82462Q48036L08030R98896J37175L21808P50539Q69126
$$ 33380234 33533349 34115811 34963847 35271877 36270773 36407948 36729756 37480295 38349421
3501C8349421R24411N10543L57630J75202J334619P45371K18324J190557M72223
$$ 38349421 39273832 39784375 40142005 40317207 41651826 42397197 42615521 43806078 44278301
3492D4278301N91548O92079M27352Q63051O82940K57056P86759Q05190R84225
$$ 44278301 44869849 45561928 45989280 46852331 47535271 47792327 48579086 49384276 50368501
3483E0368501J119424P35339M09544J181639J087130Q41246R28525J712398J156544
$$ 50368501 51487925 52223264 52632808 53814447 54901577 55742823 56671348 58383746 59540290
3474E9540290P83469J615634Q78911J770821J223230K052278J216024J772213
$$ 59540290 60323759 61939393 62818304 64589125 65812355 67864633 69080657 70852870
3466G0852870J550138J453981K399672J691394L051136K191485J855249J778047
$$ 70852870 72403008 73856989 76256661 77948055 80999191 83190676 85045925 86823972
3458H6823972K079445K934403K400488K515085K212246K168903K607246K317247
$$ 86823972 88903417 91837820 94238308 96753393 98965639 101134542 103741788 106059035
3450A06059035K382058K123411K460007K757975K601305K381081J858439K101930
$$ 106059035 108441093 110564504 113024511 115782486 118383791 120764872 122623311 124725241
3442A24725241J811352J666738K313284J719289O70498R58994J161996J490924
$$ 124725241 126536593 128203331 130516615 132235904 132906402 133865396 135027392 136518316
3434A36518316Q84129N92706O250O3270O58243L34667k84762m46800k6635J08327
$$ 136518316 137402445 137995151 138001401 138064671 138722914 139057581 138772819 138326019 138299384 138407711
3424A38407711o7412j11461n09666q92009m08071p23847M25420j88513m25475
$$ 138407711 138340299 138228838 137719172 136827163 136419092 135695245 136120665 135932152 135506677
3415A35506677j78970N3849k82316O6886K96888n49843J65681Q56940L33534L99931
$$ 135506677 135327707 135381556 135099240 135166126 135463014 134913171 135078852 135935792 136269326 136669257
3405A36669257K19277M08909N82442j22197O7420j71337l41095m8194m72425q3545
$$ 136669257 136888534 137297443 137879885 137757688 137825108 137653771 137312676 137264482 136792057 136708512
3395A36708512L0654l17709r63685q91451j123595r83120p75059j058135j034082
$$ 136708512 136739166 136421457 135457772 134566321 133442726 132459606 131684547 130626412 129592330
3386A29592330j032458j598080r76328j959840k306519j730037j823902j904791
$$ 129592330 128559872 126961792 125985464 124025624 121719105 119989068 118165166 116260375
3378A16260375j595094j873278j086025k165708j585074k020517k081111j126248
$$ 116260375 114665281 112792003 111705978 109540270 107955196 105934679 103853568 102727320
3370A02727320k129854j146356j247831j048250j368310j638643j970774j200173
$$ 102727320 100597466 99451110 98203279 97155029 95786719 94148076 92177302 90977129
3362I0977129j090651j574276j617043j423012r01716j034468j133789j030863
$$ 90977129 89886478 88312202 86695159 85272147 84370431 83335963 82202174 81171311
3354H1171311j595284j451771j682134j416147j337545p10578j512815j518076
$$ 81171311 79576027 78124256 76442122 75025975 73688430 72977852 71465037 69946961
3346F9946961j322389p17908j369433j586628j581027j640108j678919r09944
$$ 69946961 68624572 67906664 66537231 64950603 63369576 61729468 60050549 59140605
3338E9140605j455962j042090j273694q16805j556614j651336j573788r50981
$$ 59140605 57684643 56642553 55368859 54552054 52995440 51344104 49770316 48819335
3330D8819335r32072j465993j099925n84037p48225j151496q86370r09267j375179
$$ 48819335 47887263 46421270 45321345 44737308 43989083 42837587 41951217 41041950 39666771
3321C9666771n98825p62482j154753l10173m76592r9534n24562l24782j133449
$$ 39666771 39067946 38305464 37150711 36840538 36363946 36264412 35739850 35415068 34281619
3312C4281619m91174q11738q85086n87422K27824j55739j050027o70446r7523
$$ 34281619 33790445 32978707 32093621 31506199 31734023 31578284 30528257 29857811 29760288
3303B9760288q31210l63437o48575q91647j9733n36773l72630p15602k88932n52550
$$ 29760288 28929078 28565641 27917066 27025419 27005686 26468913 26096283 25380681 25091749 24539199
3293B4539199o58708l72483o64182n17002l40695q964K0454k44572p19287n73756
$$ 24539199 23880491 23508008 22843826 22326824 21986129 21977165 21997619 21753047 21033760 20460004
3283B0460004j161873o40253l97851j22986j96065o33354J83074o2139p36211
$$ 20460004 19298131 18657878 18260027 18137041 17940976 17307622 17490696 17428557 16692346
3274A6692346N1980n24308k88588o94194k68110j40349K28980J32239m54892m78057
$$ 16692346 16744326 16220018 15931430 15237236 14969126 14828777 15057757 15189996 14735104 14257047
3264A4257047r14240m68093p646M35726L51518m28008j30726o799j1086j22788
$$ 14257047 13342807 12874714 12867068 13302794 13654312 13226304 13095578 13088779 13077693 12954905
3254A2954905l57961j29932p2618q48692J07472j64796n1748J79431l26903l55740
$$ 12954905 12596944 12467012 12394394 11545702 11653174 11488378 11436630 11616061 11289158 10933418
3244A0933418J2k73963l81346l10337K03219P0146R9711k36310r0268j12207o06432
$$ 10933418 10933430 10659467 10278121 9967784 10171003 10241149 10340860 10104550 10014282 9902075 9295643
3233I295643M38665l13233P1176k42967R3382M65552j74557k47628k62833K2422
$$ 9295643 9734308 9421075 9492251 9249284 9342666 9808218 9633661 9386033 9123200 9145622
3223I145622m01206l88855M6235J27786L38282J45180o06799o93739J10775N42337
$$ 9145622 8744416 8355561 8401796 8529582 8867864 9013044 8406245 7712506 7823281 8365618
3213H365618l23523l68493L98973M94109l49797l32713k29974k89598N81984n59767
$$ 8365618 8042095 7673602 8072575 8566684 8216887 7884174 7654200 7364602 7946586 7386819
3203G386819k624o37853N53589J08301J89298J40242k83374J42408j54466M90990
$$ 7386819 7384195 6746342 7299931 7408232 7597530 7737772 7454398 7596806 7442340 7933330
3193G933330k75085r32697M61943L62335K78040k98732Q0464J44560P2437k22972
$$ 7933330 7658245 6725548 7187491 7549826 7827866 7529134 7609598 7754158 7826595 7603623
3183G603623l02599k31435K43270R139m1071J09026J39275K53878n19845j04938
$$ 7603623 7301024 7069589 7312859 7321998 7280927 7389953 7529228 7783106 7263261 7158323
3173G158323R9555j52966M04854J49251j47170J50406J93626R2341k08403J11508
$$ 7158323 7257878 7104912 7509766 7659017 7511847 7662253 7855879 7948220 7739817 7851325
3163G851325j41267p53707J35938J56596L75754K53756N5636m20982l67852J2906
$$ 7851325 7710058 6956351 7092289 7248885 7624639 7878395 7934031 7513049 7145197 7158103
3153G158103J14149J7075n4609O86540K814M63187l62000J10058k85825j91220
$$ 7158103 7272252 7289327 7234718 7921258 7924072 8387259 8025259 8135317 7849492 7658272
3143G658272k07523K70183J90460k27838N38492k21612K41453L60637j96930J86997
$$ 7658272 7450749 7720932 7911392 7683554 8222046 8000434 8241887 8602524 8405594 8592591
3133H592591l36825k18061O66089P1647J21472j42674N42184L63962j66651P3200
$$ 8592591 8255766 8037705 8703794 8775441 8896913 8754239 9296423 9660385 9493734 9566934
3123I566934p0132k23340L70977L75418J05097J88601R94550K82508j91870L31234
$$ 9566934 9496802 9273462 9644439 10019857 10124954 10313555 11308105 11590613 11398743 11729977
3113A1729977j07523M98594M41448P09978N66974M56047N37075M5028R66840R86259
$$ 11729977 11622454 12121048 12562496 13272474 13839448 14295495 14832570 14877598 15844438 16830697
3103A6830697j37249J061781O28326P06902K97645j11534n43107q53049j169559
$$ 16830697 16693448 17755229 18383555 19090457 19388102 19276568 18733461 17880412 16710853
3094A6710853r07239p79503q86217p14426N2461q21858k40041j087594j4058j03048
$$ 16710853 15803614 15024111 14137894 13423468 13475929 12654071 12414030 11326436 11312378 11209330
3084A1209330o52836l90503j02751J78676m49146n03766k56283l16469M06876
$$ 11209330 10556494 10165991 10063240 10241916 9792770 9289004 9032721 8716252 9123128
3075I123128n17806K4617j87082j46012l24731n76757L69221m79621J52123m34612
$$ 9123128 8605322 8629939 8442857 8296845 7972114 7395357 7764578 7284957 7437080 7002468
3065G002468n6485l84187q6619K56742l00291n21917K4496n3180k30204R4192
$$ 7002468 6945983 6561796 6475177 6731919 6431628 5909711 5934207 5881027 5650823 5745015
3055E745015L44425o38608K87486Q991l9750m16999o05095q5488l15529R2775
$$ 5745015 6089440 5450832 5738318 5747309 5707559 5290560 4685465 4599977 4284448 4377223
3045D377223N88970K77858l85184l03807j39039l70688L57291l40000n3558j119
$$ 4377223 4966193 5244051 4858867 4555060 4416021 4045333 4402624 4062624 4009066 4007947
3035D007947K51721l5042k01085L69647m66704J4354K91665N0988j41432l11650
$$ 4007947 4259668 4224626 4023541 4393188 3926484 3940838 4232503 4283491 4142059 3830409
3025C830409k39968j64880r7111m8783L11228j33051k01832K30456k74117K94723
$$ 3830409 3590441 3425561 3328450 3279667 3590895 3457844 3256012 3486468 3212351 3507074
3015C507074k51612K0299p092L29496J66216l10553L17774o39318L21292J6870
$$ 3507074 3255462 3275761 3268669 3598165 3764381 3453828 3771602 3132284 3453576 3470446
3005C470446n7640k3367j8430J64644q9044r1129R5322m88751j03199J43781K30348
$$ 3470446 3412806 3389439 3371009 3535653 3446609 3355480 3450802 2962051 2858852 3002633 3232981
2994C232981l67645j67184J50728K29809P5520k24381L8048o25305k5382L17267
$$ 3232981 2865336 2698152 2848880 3078689 3154209 2929828 2967876 2342571 2317189 2634456
2984B634456K88294K03130P3853K3177l39001k15822K40691o70364J66139J069705
$$ 2634456 2922750 3125880 3199733 3222910 2883909 2668087 2908778 2238414 2404553 3474258
2974C474258m43791j0k22555N475Q3928p24194j89027Q8187J00456O53707L33151
$$ 3474258 3030467 3030457 2807902 2813377 2897305 2173111 1984084 2072271 2172727 2826434 3159585
2963C159585Q6497R5098l27942m17304j34747n62702p5686L27872L49549J20887
$$ 3159585 3246082 3341180 3013238 2595934 2461187 1898485 1822799 2150671 2500220 2621107
2953B621107j83171P3345j50088k54528j01445m80539K89986M46796L27092j11119
$$ 2621107 2437936 2511281 2361193 2106665 2005220 1524681 1814667 2261463 2588555 2477436
2943B477436k3530K44794l33853k15944n59101M73758j75037L39525l9220m5488
$$ 2477436 2453906 2698700 2364847 2148903 1589802 2063560 1888523 2228048 2188828 2143340
2933B143340J34279k12792L2365r1191k41651k724J82582R0667L1125J26626m39286
$$ 2143340 2277619 2064827 2097192 2006001 1764350 1761626 1944208 2034875 2066000 2192626 1753340
2922A753340p1930k62369L48325K95672l03028k18153M18540M41442k15531j32128
$$ 1753340 1681410 1419041 1767366 2063038 1760010 1541857 1960397 2401839 2186308 2054180
2912B054180j25218Q8686K98008m96560k3661O5979M07879O9047j74104L3511
$$ 2054180 1928962 2017648 2315656 1819096 1795435 1861414 2269293 2338340 2164236 2197747
2902B197747k02465n6006r7433J9316K38300K52393k6222L12949p94207j21289
$$ 2197747 1995282 1939276 1841843 1861159 2099459 2351852 2325630 2638579 1844372 1723083
2892A723083J43165n76114O03777M87109m92903l97988K98608J83351j11342K48097
$$ 1723083 1866248 1290134 1893911 2381020 1888117 1490129 1788737 1972088 1860746 2108843
2882B108843J39587k12993j33027L36119k14276O227L22625K07857j91995k25898
$$ 2108843 2248430 2035437 1902410 2238529 2024253 2030480 2353105 2560962 2368967 2143069
2872B143069M38433k15051K65136l81027k22725J92694j27103J51930l4131J69325
$$ 2143069 2581502 2366451 2631587 2250560 2027835 2220529 2093426 2245356 2211225 2380550
2862B380550j15863k9271R8257k7462O903q4669J92198J08254R9209K55542K2923
$$ 2380550 2264687 2235416 2333673 2306211 2313114 2228445 2420643 2528897 2628106 2883648 2906571
2851B906571J30355l31494K7241K06440K27893L76900m07680L82862m852m53218
$$ 2906571 3036926 2705432 2732673 2939113 3167006 3543906 3136226 3519088 3514236 3061018
2841C061018M604j92463l34243K37699M268k41600J76609l34857K18363K6150
$$ 3061018 3065622 2873159 2538916 2776615 2780883 2539283 2715892 2381035 2599398 2625548
2831B625548R5025k389n72191J41014L94017R7984K94787m4108M3846k11212k4316
$$ 2625548 2720573 2718184 2145993 2287007 2681024 2779008 3073795 3029687 3073533 2862321 2838005
2820B838005o34655J70697R90666l9701K61470l34527N3444q3634R9494k55854
$$ 2838005 2203350 2374047 3364713 3325012 3586482 3251955 3305399 3221765 3321259 3065405
2810C065405j15353L77018P1511J58803L13008p7120l21926P7481k45465P7268
$$ 3065405 2950052 3327070 3398581 3557384 3870392 3793272 3471346 3548827 3303362 3380630
2800C380630j68661m2840L52626L16441m42962N86555l20805n4540k63477J38886
$$ 3380630 3211969 3169129 3521755 3838196 3395234 3981789 3660984 3606444 3342967 3481853
2790C481853r7108K39554J31586K50286K873m35229m25715k00J9980K1610k25697
$$ 3481853 3384745 3624299 3755885 4006171 4009044 3573815 3148100 3147900 3167880 3189490 2963793
2779B963793k62272J65303L94659O20278L57024n25384l83960o8219K3700J51659
$$ 2963793 2701521 2866824 3261483 3881761 4238785 3713401 3329441 3261222 3284922 3436581
2769C436581J75214M57706j77595M52263o20614j11888P7494q9477k5225k00238
$$ 3436581 3611795 4069501 3891906 4344169 3723555 3611667 3689161 3599684 3574459 3374221
2759C374221J52645N3705J61361K00926k30316n72492m78795L69266k82225J53097
$$ 3374221 3526866 3580571 3741932 3942858 3712542 3140050 2661255 3030521 2748296 2901393
2749B901393r5484k09244j78914K41614j91245p7261J42912O6177l95040j17915
$$ 2901393 2805909 2596665 2417751 2659365 2468120 2390859 2533771 2599948 2204908 2086993
2739B086993k07466j56163k213M77291j8906m01185N4169L4381K99200m36665
$$ 2086993 1879527 1723364 1721151 2198442 2179536 1778351 1832520 1866901 2166101 1729436
2729A729436J82166k86448n2913l3953L42337j27979m08904J91803n72795N46424
$$ 1729436 1911602 1625154 1572241 1538288 1880625 1752646 1343742 1535545 962750 1509174
2719A509174j63962r6758M30189k60521K93840n28974J66896L8766j85980O78893
$$ 1509174 1345212 1248454 1678643 1418122 1711962 1182988 1349884 1388650 1202670 1881563
2709A881563l70798n8144j57042L12509l55507k35539Q71265n24963K36817p16236
$$ 1881563 1510765 1452621 1295579 1608088 1252581 1017042 1888307 1363344 1600161 883925
2699H83925j39712R6155l33160M49935l60941L47339l47199K89839j8890K87172
$$ 883925 744213 840368 507208 957143 596202 943541 596342 886181 867291 1154463
2689A154463L1284k42968L17753M1712k58701l60451J93938L7980k27426J81910
$$ 1154463 1185747 942779 1260532 1302244 1043543 683092 877030 915010 687584 869494
2679H69494m27712M26388K24112m50175J92971K05555o6530n28525L47833J67765
$$ 869494 441782 868170 1092282 642107 835078 1040633 974103 445578 793411 961176
2669I61176j5832n72800k59565N46088j34629K57882L82912n01982K0475O7384
$$ 961176 945344 372544 112979 659067 524438 782320 1165232 663250 683725 751109
2659G51109L18135n58418o8485J73102n38551N2820P68115l0111l51009P9656
$$ 751109 1069244 510826 442341 615443 76892 129712 897827 867716 516707 596363
2649E96363r4661j54869J74461o25560j00731L42084J89239J38889k53845r4242
$$ 596363 501702 346833 521294 -104266 -204997 137087 326326 465215 211370 117128
2639A17128n61580O95117J31487J52524j88582L92394L7889k84025J07200j33217
$$ 117128 -444452 250665 382152 534676 346094 738488 776377 492352 599552 466335
2629D66335K01652q7288k25831l01409m334j0631L46553J40775O289K4119J67191
$$ 466335 667987 580699 354868 53459 49125 38494 385047 525822 532111 556230 723421
2618G23421k67852J16685j59785n5316l76423J51726J34581J19929L59263N048
$$ 723421 455569 572254 412469 357153 -19270 132456 267037 386966 746229 751277
2608G51277j54919k29306j34995J34104K58814l43844J03118Q8080L17081k03853
$$ 751277 596358 367052 232057 366161 624975 281131 384249 472329 789410 585557
2598E85557j34132K8247o04377J37750J63497K13535J22312k11107k45359M19419
$$ 585557 451425 479672 -124705 13045 176542 390077 512389 301282 55923 475342
2588D75342n73425r9514M02525k59899K85971O4662J00128L15895k92137l28925
$$ 475342 -98083 -197597 204928 -54971 231000 295662 395790 711685 419548 90623
2578I0623j22343j1592M1683k2612O3537k05308K75636L08384m6392K62888J6425
$$ 90623 -31720 -43312 -1629 -24241 39296 -166012 109624 418008 371616 634504 650929
2567F50929O3987k95029m2529L18803K49902q9475k63049O30674l1197j58854
$$ 650929 714916 419887 377358 696161 946063 856588 593539 1224213 1193016 1034162
2557A034162n95641l76913L10727j01860k7696L43P0913L14472j30567m33373
$$ 1034162 438521 61608 372335 270475 242779 243122 314035 628507 497940 64567
2547F4567m15549M07172O3062j35980L37332K91670k00639j7411K21799m08981
$$ 64567 -350982 56190 119252 -16728 320604 612274 411635 394224 616023 207042
2537B07042J75380L26632O7138N9959l39906j30755L22220k7410m87509K52921
$$ 207042 382422 709054 776192 836151 496245 365490 687710 660300 172791 425712
2527D25712J03252Q9524J08586j83784M0121K0428K2473j36081J8978J55481Q8473
$$ 425712 528964 618488 727074 543290 583411 603839 626312 490231 509209 664690 753163
2516G53163J64889j89525L18107j80842k24259L80270J9667l50693l31925J88974
$$ 753163 918052 728527 1046634 865792 641533 1021803 1041470 690777 358852 547826
2506E47826p2013J52314L7914M47668l71345j06757n0444l16740L73908n2088
$$ 547826 475813 628127 666041 1113709 742364 635607 585163 268423 642331 590243
2496E90243P4197k58907M84995k30742L24339Q0137n3740J15571o13638p3253
$$ 590243 664440 405533 890528 659786 984125 1064262 1010522 1126093 512455 439202
2486D39202M6998K93928k98259j19299K38093m5950M3028J65537L02013l76139
$$ 439202 486200 780128 481869 362570 600663 554713 597741 763278 1065291 689152
2476F89152o01858P5692j07456M39588p7415L96594l6048J1771k1259p99185K57504
$$ 689152 87294 162986 55530 495118 417703 814297 778249 790020 768761 -30424 227080
2465B27080J10084L08867k44388J78085R016J4222l1935o31677O7285K28454k87775
$$ 227080 337164 646031 401643 579728 588744 602966 571031 -60646 6639 235093 -52682
2454e2682K94177k24121J5350J62442l28114K83846p3583K65536Q0962N8747l70214
$$ -52682 241495 17374 32724 195166 -132948 150898 77315 342851 423813 482560 112346
2443A12346R1058N77848n70973L29371m16843m71314p4254J64700R1040L55953
$$ 112346 203404 781252 210279 539650 122807 -348507 -422761 -258061 -167021 188932
2433A88932K05911j57842K60343m56143j7119j25498K79625M88810o1841o6241
$$ 188932 394843 237001 497344 41201 24082 -101416 178209 667019 605178 538937
2423E38937j55813k06183j69933j22165N291k26951Q15255Q1227r1277n94554
$$ 538937 383124 176941 7008 -115157 -109866 -336817 478438 559665 468388 -126166
2413a26166j38548J35522O7307m225P9605L12363k87795P7821N7466p29671M09248
$$ -126166 -264714 -129192 -61885 -66110 13495 325858 38063 115884 173350 -556321 -147073
2402a47073j73004L52901N05702n29133M63526O0176o56509k72680K72965K00632
$$ -147073 -320077 32824 538526 9393 472919 533095 -123414 -396094 -123129 77503
2392G7503m10212j27996j95016J58298O49432l39591P7042L47736k31452L27297
$$ 77503 -332709 -460705 -655721 -497423 152009 -187582 -110540 237196 5744 333041
2382C33041k50096J20287L77929K59923K78277n48263k72698q4123N48365K48536
$$ 333041 82945 203232 581161 841084 1119361 571098 298400 214277 762642 1011178
2372A011178l21371K344o36773J8169Q9356n65629o6287J03262Q59565l46088
$$ 1011178 689807 692151 55378 73547 162903 -402726 -469013 -365751 493814 147726
2362A47726j96663J01971P28055l99132l47842r6521K03782j95407l46644M79682
$$ 147726 -48937 53034 781089 381957 34115 -62406 141376 -54031 -400675 79007
2352G9007J07252r8901q6753j24399J90921l05661l6585j06033K1261J68016J38968
$$ 79007 186259 87358 605 -123794 67127 -238534 -275119 -381152 -359891 -191875 -52907
2341e2907K57280k94478L43830k10361k57927M28255L66055L5873o42126K47910
$$ -52907 204373 -90105 253725 43364 -214563 213692 579747 615620 -26506 221404
2331B21404n17016J00984R2086j51579L96979k45469K68527j98636L99904J41441
$$ 221404 -295612 -194628 -102542 -254121 142858 -102611 165916 -32720 367184 508625
2321E08625m10929Q0667j51465l6719J33339P63688j79785K79986K84664j034905
$$ 508625 97696 178363 26898 -9821 123518 887206 707421 987407 1272071 237166
2311B37166L84018l83561n2130L4184M36062l71090l7444K31097l38416J38207
$$ 237166 621184 237623 185493 219677 655739 284649 247205 478302 139886 278093
2301B78093L03946n59609M02283j89927r8288q0277K76651j45476j73310k12867
$$ 278093 582039 22430 424713 234786 136498 56221 332872 187396 14086 -198781
2291a98781k24140J26187J64895N736K75543K68062l04788k2417m21145K88131
$$ -198781 -422921 -296734 -131839 -126103 149440 417502 112714 90297 -330848 -42717
2281d2717j49369L53528L52783j40530j76560L89477p09282K65944j61260J7047
$$ -42717 -192086 161442 514225 373695 197135 586612 -122670 143274 -17986 -939
2271i39J61805j68847K94637o15334M78896J94878k48391J09859o696l9442J91403
$$ -939 160866 -7981 286656 -328678 150218 345096 96705 206564 199868 160426 351829
2260C51829M52j4373l07146l26167M8900L12893j47509l67292N61320k3556O14506
$$ 351829 352281 337908 30762 -295405 -246505 66388 -81121 -448413 112907 89351 703857
2249G03857m84953J27141M75921o70031j71565j6452j9292L10416j92839O4632
$$ 703857 218904 346045 821966 151935 -19630 -36082 -55374 255042 62203 126835
2239A26835k3325M9087L67415m32528L9887L55292j1471L1651l94817L48813N30646
$$ 126835 103510 152597 520012 87484 127371 482663 471192 502843 108026 456839 987485
2228I87485q4441q33823k95368L89008j965n9574r0984K82578M01705j63189K37085
$$ 987485 903044 69221 -226147 162861 160896 101322 10338 292916 694621 531432 768517
2217G68517J5977m40956L13104l39317L42502K1342n10159K34602l88749M76681
$$ 768517 784494 343538 656642 317325 659827 681169 171010 405612 16863 493544
2207D93544J2720j49537Q4249o7696J57591l54158M74923k04802L34664L11695
$$ 493544 506264 356727 440976 373280 530871 176713 651636 446834 781498 1093193
2197A093193j03892P196R649M6765J9808p8850M93850j38247j09957l1971j29366
$$ 1093193 989301 996497 1006146 1052911 1072719 993869 1487719 1349472 1239515 1207544 1078178
2186A078178k09447J13602J94308j62508o8265K54116l5529K56165O0022k61401
$$ 1078178 868731 982333 1176641 1014133 945868 1199984 1164455 1420620 1480642 1219241
2176A219241J6740N1312k04397L27023n05562j33581L61694R8829J3177p9620
$$ 1219241 1235981 1287293 1082896 1409919 904357 770776 1132470 1231299 1244476 1164856
2166A164856j56203m34990M68972J03967k59782J49149j07481K41474R5054O36671
$$ 1164856 1008653 573663 1042635 1146602 886820 1035969 928488 1169962 1265016 1901687
2156A901687n14217K4550M41159k03757j25874m10749Q17423J34908j81461r9887
$$ 1901687 1387470 1412020 1853179 1649422 1523548 1112799 1930222 2065130 1883669 1783782
2146A783782J29477r0719J1192J36400K10842q9235K19307l37567K96598J88857
$$ 1783782 1913259 1822540 1833732 1970132 2180974 2091739 2311046 1973479 2270077 2458934
2136B458934K36629K1063k17844J66733K28204m44757L20025L20460M85307J26882
$$ 2458934 2695563 2716626 2498782 2665515 2893719 2448962 2768987 3089447 3574754 3701636
2126C701636j075525K02796P89725j75366j1964J96675K4148K44103N68629P4908
$$ 3701636 2626111 2828907 3618632 3443266 3431302 3627977 3652125 3896228 4464857 4539765
2116D539765m7303K03853L52285L02437j75050j06718N47458k93493K87329N11448
$$ 4539765 4492462 4696315 5048600 5351037 5175987 5069269 5616727 5323234 5610563 6122011
2106F122011O72589P26372J0546M43867M09818j9010L09625J52539R14424R60432
$$ 6122011 6794600 7520972 7531518 7975385 8385203 8366193 8675818 8828357 9742781 10703213
2096A0703213K68749R60857J071374Q63219J211722J323340J159090J623918J632328
$$ 10703213 10971962 11932819 13004193 13867412 15079134 16402474 17561564 19185482 20817810
2087B0817810J827968J887931K384113L042243K480547M158520M324464M358139
$$ 20817810 22645778 24533709 26917822 29960065 32440612 36599132 40923596 45281735
2079D5281735O316982P957258R220963J0759406J1882016J5336317J2507642J821266
$$ 45281735 51598717 59555975 68776938 79536344 91418360 106754677 119262319 121083585
2071A21083585p493683j5506383j4446878j4281473j2048282r534396o865944
$$ 121083585 113589902 98083519 83636641 69355168 57306886 47772490 40906546
2064D0906546m930205l308214l544615k412445j935901j929225j189304j572389
$$ 40906546 35976341 32668127 29123512 26711067 24775166 22845941 21656637 20084248
2056B0084248j006510j256009j408773j705185j119506r53791q40123n81477p44955
$$ 20084248 19077738 17821729 16412956 14707771 13588265 12634474 11794351 11212874 10467919
2047A0467919j05152j33557o81317m26233r15260j06407n81516L3768L00966o84252
$$ 10467919 10362767 10229210 9547893 9121660 8206400 8099993 7518477 7552245 7853211 7168959
2037G168959q6477j34621o41929K9318j23337k43819n84246K96768K37514r24382
$$ 7168959 7082482 6947861 6305932 6335250 6211913 5968094 5383848 5680616 5918130 4993748
2027D993748K33218l30287j56812p42518M92484k30933m06583N0537n25354K20060
$$ 4993748 5226966 4896679 4739867 3997349 4489833 4258900 3852317 3902854 3377500 3597560
2017C597560o9474R2613K62535r84884n32003M68488K28714j67104j82394M02770
$$ 3597560 3528086 3620699 3883234 2898350 2366347 2834835 3063549 2896445 2714051 3116821
2007C116821m31540J32175J47062n77701l55085J80201l3097K229k16615R6954
$$ 3116821 2685281 2817456 2964518 2386817 2031732 2211933 2178836 2181065 1964450 2061404
1997B061404N2325l88105m91265N29283L18951k79636l13799o0670J26848O87490
$$ 2061404 2113729 1725624 1234359 1763642 2082593 1802957 1489158 1428488 1555336 2242826
1987B242826J3140q6803O4547q12773M83457l68641m43698L30032j92903l2968
$$ 2242826 2255966 2169163 2233710 1420937 1904394 1535753 1092055 1422087 1229184 1196216
1977A196216j74274K52605j78596K34498K32411k28340L07053J53682l99612r040
$$ 1196216 1021942 1274547 1095951 1330449 1562860 1334520 1641573 1795255 1395643 1386603
1967A386603m00664N70372o24500J5422l5464O5575l51290j97455M94926j13108
$$ 1386603 985939 1556311 931811 947233 911769 977344 626054 428599 923525 810417
1957H10417j46775M13567L8608L02623l42009k66200L39134k98433n4880R2792
$$ 810417 663642 1077209 1115817 1418440 1076431 810231 1149365 850932 796052 888844
1947H88844P27k86514k92162O2407J39023n7262L21342k47136O8445qn8577q9420
$$ 888844 889571 603057 310895 373302 512325 455063 776405 529269 597714 597706 539129 449709
1935D49709j80659J09270L85243k30723l4506k68269J38402J54033K00844k57377
$$ 449709 269050 378320 763563 532840 498334 230065 368467 522500 723344 465967
1925D65967M36426Q2062o87832k03771O82929m71216L49711k83381m44124L24322
$$ 465967 902393 984455 296623 92852 775781 304565 654276 370895 -73229 251093
1915B51093N5639J7634L79717l9242K92237P2942m40907m004m8801L59667l13167
$$ 251093 306732 324366 704083 664841 957078 1030020 589113 585109 536308 895975 582808
1904E82808M3875n2260K01092j53957p99608J17376M80507J60453L67685j74144
$$ 582808 626683 574423 775515 621558 -178050 -60674 419833 580286 947971 773827
1894G73827j28256J94833k53330J9762k75624K9453O045j2734j80166j84644P5097
$$ 773827 645571 840404 587074 606836 331212 360665 366710 353976 173810 -10834 64263
1883F4263n41922O44873r1915j3746k8283J20140L49085N288L50263m47956k81205
$$ 64263 -477659 167214 75299 61553 33270 153410 502495 507783 858046 410090 128885
1872A28885M2031n28627K46634J62253J74853L94245K2894J01151l00474k20389
$$ 128885 170916 -357711 -111077 51176 226029 620274 643168 744319 443845 223456
1862B23456j68708p7244M16109k38616l89685K00746q2650L4177J78376J45858
$$ 223456 54748 -22496 393613 154997 -234688 -33942 -116592 -82415 95961 241819
1852B41819J58312K30052N7604q1110n77423q0070k01805O66761l76933m03680
$$ 241819 400131 630183 687787 606677 29254 -50816 -252621 414140 37207 -366473
1842c66473M38129m9012j08407L70426j68170M72545l4073R0623k37349K71918
$$ -366473 71656 22644 -85763 284663 116493 589038 554965 645588 408239 680157
1832F80157K76611o04374N02073R3355l52293p7868L11454m08571j73198M7132
$$ 680157 956768 352394 854467 947822 595529 517661 829115 420544 247346 294478
1822B94478k41875n7745P37258k82338r0810m31868j00685j50569k74294M58702
$$ 294478 52603 -5142 732116 449778 358968 -72900 -173585 -324154 -598448 -139746
1812a39746K27013J21053K2224J61341m2354k73435K52729j79015J99701o72041
$$ -139746 87267 208320 230544 391885 349531 76096 328825 149810 349511 -322530
1802c22530J28882k09698N07558j36318j99042N40882l99139k7928r0763J79697
$$ -322530 -193648 -403346 104212 -32106 -231148 309734 -89405 -117333 -208096 -28399
1792b8399j89483j61842L19153l83798N35845r2527j76286j73136J88133M46888
$$ -28399 -217882 -379724 -60571 -444369 91476 -1051 -177337 -350473 -162340 284548
1782B84548o04595J08471K19734k11540M11186J33193j11957M2588j14083J03201
$$ 284548 -320047 -211576 8158 -203382 207804 340997 229040 271628 157545 260746
1772B60746m40998L72920p5664K18484J63724K97882k25461k36696j83562j67828
$$ 260746 -180252 192668 117004 335488 499212 797094 571633 334937 151375 -16453
1762a6453M6814k39514J53284Q4143J07467M9353j61225r4815l72347J22522m89063
$$ -16453 30361 -209153 -55869 28274 135741 185094 23869 -70946 -443293 -320771 -809834
1751h09834R7118P80149J77613k45914k18079K01095j62586k13482L30721N5507
$$ -809834 -712716 67433 245046 -868 -218947 -17852 -180438 -393920 -63199 -7692
1741g692J90481J84273l87494J4390N9529M53732o42227k61721K07490L29663
$$ -7692 182789 367062 -20432 -6042 53487 507219 -135008 -396729 -189239 140424
1731A40424K40304l30986L48733l68281J51220k94309l40777N68316k01028Q7099
$$ 140424 380728 49742 398475 30194 181414 -112895 -453672 114644 -86384 715
1721G15K33052l28698j9499l94155K42146N338k92290K21593l57041K1606O89785
$$ 715 233767 -94931 -114430 -508585 -266439 -261101 -553391 -331798 -688839 -667233 22552
1710B2552K14545K91177m55479K11274j9351n014n1107J95855n887m92960o5153
$$ 22552 237097 528274 72795 284069 264718 259704 208597 404452 398565 -94395 -159548
1699a59548R8339n6398j48750L72879k93691K91822N6470l75648J47306j91031
$$ -159548 -61209 -117607 -266357 106522 -187169 104653 161123 -214525 -67219 -258250
1689b58250j57835K07692l60633L12072R5206n39982K58102N87610m19637n8479
$$ -258250 -416085 -208393 -569026 -256954 -161748 -701730 -443628 143982 -275655 -334134
1679c34134J01245j6332N7858k29156N51505M5836K40996L5345m96681K35860
$$ -334134 -232889 -249221 -191363 -420519 130986 176822 417818 453163 -43518 192342
1669A92342k51055L55660k71465k55047N75793l34324J06232m64334k67072K72462
$$ 192342 -58713 296947 25482 -229565 346228 11904 118136 -346198 -613270 -340808
1659c40808K8573O35605o14796J8574l36294K46263R3645l2364K78198L0440k92788
$$ -340808 -312235 323370 -291426 -272852 -609146 -362883 -269238 -301602 -23404 7036 -285752
1648b85752j53123j34725N96638K51429j8051l5694K11619l483m47603J26664
$$ -285752 -438875 -573600 23038 274467 256416 220722 432341 428858 -18745 107919
1638A07919j5475J72695r1417l00024J76281k6689k52504K77988l59929K95292
$$ 107919 92444 265139 173722 -126302 49979 23290 -229214 48774 -311155 -15863
1628a5863L11186k36463p7683l51250L89959N30059m69730M25619l04248n851
$$ -15863 295323 58860 -18823 -370073 19886 549945 80215 505834 201586 195735
1618A95735l15083j98202j29796q3912r7282K11886M89510K52700j92584k7418
$$ 195735 -119348 -317550 -447346 -531258 -628540 -416654 72856 325556 132972 105554
$$ [...]
##END NTUPLES=NMR SPECTRUM
##END=
