##TITLE=1H_CA-8869-2
 CDCl3, 8 sc, 
 4.06.2021
##JCAMPDX= 6.0         $$ Bruker NMR JCAMP-DX V2.0
##DATA TYPE= NMR SPECTRUM
##DATA CLASS= NTUPLES
##ORIGIN= UXNMR, Bruker Analytische Messtechnik GmbH
##OWNER= root
$$ XWIN-NMR		Version 3.5
$$ Fri Jun  4 12:45:32 2021 Russian Standard Time (UT+4h)  she@DPX200
##.OBSERVE FREQUENCY= 200.131506
##.OBSERVE NUCLEUS= ^1H
##.ACQUISITION MODE= SIMULTANEOUS
##.ACQUISITION SCHEME= undefined
##.AVERAGES= 8
##.DIGITISER RES= 18
##SPECTROMETER/DATA SYSTEM= spect
##.PULSE SEQUENCE= zg30
##.SOLVENT NAME= CD3CN
##.SHIFT REFERENCE= (INTERNAL, CD3CN, 0, 17.5081)
##AUDIT TRAIL= $$ (NUMBER, WHEN, WHO, WHERE, WHAT)
$$ ##TITLE= Audit trail, XWIN-NMR		Version 3.5
$$ ##JCAMPDX= 5.01
$$ ##ORIGIN= Bruker BioSpin GmbH
$$ ##OWNER= she
$$ F:/spectra/data/she/nmr/H-F/1/pdata/1/auditp.txt
$$ ##AUDIT TRAIL=  $$ (NUMBER, WHEN, WHO, WHERE, WHAT)
(   1,<2021-06-04 12:44:17.07 +0400>,<she>,<DPX200>,
      <created by zg, POWCHK disabled, PULCHK disabled
       configuration hash MD5:
       00 E9 B6 7A A2 85 ED C7 34 08 36 98 17 FE 4E 26
       data hash MD5: 16K
       62 FF BC 78 D2 BA AE 1A B5 2C E4 0D AA 43 EA 22>)
(   2,<2021-06-04 12:44:19.57 +0400>,<she>,<DPX200>,
      <Start of raw data processing
       efp BC_mod = 2 LB = 0.24 FT_mod = 6 PKNL = 1 PHC0 = -11121.69 PHC1 = 12.80101 SI = 16K 
       data hash MD5: 16K
       EA FF 3F A6 9C 02 0B 25 92 C6 D6 39 75 56 A4 BC>)
(   3,<2021-06-04 12:44:41.67 +0400>,<she>,<DPX200>,
      <pk PHC0 = -3.958898 PHC1 = 6 
       data hash MD5: 16K
       91 BD 11 08 0B 08 D0 45 5B F1 E6 8A 85 30 B2 0A>)
(   4,<2021-06-04 12:44:45.18 +0400>,<she>,<DPX200>,
      <abs ABSG = 5 
       data hash MD5: 16K
       FB C1 5A EF 4B 59 D0 3F 0B 49 3F 7C AC E8 DE A8>)
$$ ##END=
$$ 
$$ hash MD5
$$ 6B 23 0F 10 F9 C4 D5 08 3E DA 26 DA 11 B7 95 8A
##$RELAX= 
##$RELAX= 
##$RELAX= 
##$RELAX= 
##$RELAX= 
##$RELAX= 
$$ Bruker specific parameters
$$ --------------------------
##$DU= <F:/spectra>
##$EXPNO= 1
##$NAME= <H-F>
##$PROCNO= 1
##$TYPE= <nmr>
##$USER= <she>
##$AMP= (0..31)
100 100 100 100 100 100 100 100 100 100 100 100 100 100 100 100 100 100 
100 100 100 100 100 100 100 100 100 100 100 100 100 100 
##$AQSEQ= 0
##$AQ_mod= 1
##$AUNM= <au_zg>
##$AUTOPOS= <>
##$BF1= 200.13
##$BF2= 200.13
##$BF3= 200.13
##$BF4= 200.13
##$BF5= 200.13
##$BF6= 200.13
##$BF7= 200.13
##$BF8= 200.13
##$BYTORDA= 1
##$CFDGTYP= 0
##$CFRGTYP= 5
##$CHEMSTR= <none>
##$CNST= (0..31)
1 1 145 1 1 1 1 1 1 1 1 1 1 1 1 1 1 1 1 1 1 1 1 1 1 1 1 1 1 1 1 1 
##$CPDPRG= <>
##$CPDPRG1= <>
##$CPDPRG2= <>
##$CPDPRG3= <>
##$CPDPRG4= <mlev>
##$CPDPRG5= <mlev>
##$CPDPRG6= <mlev>
##$CPDPRG7= <mlev>
##$CPDPRG8= <mlev>
##$CPDPRGB= <>
##$CPDPRGT= <>
##$D= (0..31)
0 1.2 0 0 0 0 0 0 0 0.06 0 0.03 0 0 0 0 0.0002 0 0 0 0 0 0 0 0 0 0 0 0 
0 0 0 
##$DATE= 1622796256
##$DBL= (0..7)
120 120 120 120 120 120 120 120 
##$DBP= (0..7)
150 150 150 150 150 150 150 150 
##$DBP07= 0
##$DBPNAM0= <>
##$DBPNAM1= <>
##$DBPNAM2= <>
##$DBPNAM3= <>
##$DBPNAM4= <>
$$ [...]
##$SUBNAM3= <"">
##$SUBNAM4= <"">
##$SUBNAM5= <"">
##$SUBNAM6= <"">
##$SUBNAM7= <"">
##$SUBNAM8= <"">
##$SUBNAM9= <"">
##$SW= 20.0188882624521
##$SWIBOX= (0..15)
0 0 2 0 0 0 0 0 0 0 0 0 0 0 0 0 
##$SW_h= 4006.41025641026
##$TD= 16384
##$TD0= 1
##$TE= 0
##$TE2= 300
##$TE3= 300
##$TEG= 300
##$TL= (0..7)
0 120 120 120 120 120 120 120 
##$TP= (0..7)
150 150 150 150 150 150 150 150 
##$TP07= 0
##$TPNAME0= <>
##$TPNAME1= <>
##$TPNAME2= <>
##$TPNAME3= <>
##$TPNAME4= <>
##$TPNAME5= <>
##$TPNAME6= <>
##$TPNAME7= <>
##$TPOAL= (0..7)
0.5 0.5 0.5 0.5 0.5 0.5 0.5 0.5 
##$TPOFFS= (0..7)
0 0 0 0 0 0 0 0 
##$TUNHIN= 0
##$TUNHOUT= 0
##$TUNXOUT= 0
##$USERA1= <user>
##$USERA2= <user>
##$USERA3= <user>
##$USERA4= <user>
##$USERA5= <user>
##$V9= 5
##$VALIST= <valist>
##$VCLIST= <CCCCCCCCCCCCCCC>
##$VD= 0
##$VDLIST= <DDDDDDDDDDDDDDD>
##$VPLIST= <PPPPPPPPPPPPPPP>
##$VTLIST= <TTTTTTTTTTTTTTT>
##$WBST= 1024
##$WBSW= 4
##$XGAIN= (0..3)
0 0 0 0 
##$XL= 0
##$YL= 0
##$YMAX_a= 249286
##$YMIN_a= -106701
##$ZGOPTNS= <>
##$ZL1= 120
##$ZL2= 120
##$ZL3= 120
##$ZL4= 120
##$ABSF1= 17.50566
##$ABSF2= -2.51338
##$ABSG= 5
##$ABSL= 3
##$ALPHA= 0
##$AQORDER= 0
##$ASSFAC= 0
##$ASSFACI= 0
##$ASSFACX= 0
##$ASSWID= 0
##$AUNMP= <proc_1d>
##$AZFE= 0.1
##$AZFW= 0.1
##$BCFW= 0
##$BC_mod= 2
##$BYTORDP= 0
##$COROFFS= 0
##$CY= -3
##$DATMOD= 1
##$DC= 0
##$DFILT= <>
##$DTYPP= 0
##$F1P= 0
##$F2P= 0
##$FCOR= 1
##$FTSIZE= 16384
##$FT_mod= 6
##$GAMMA= 0
##$GB= 0
##$INTBC= 1
##$INTSCL= 1.334414e-10
##$ISEN= 128
##$LB= 0.24
##$LEV0= 0
##$LPBIN= 0
##$MAXI= 10000
##$MC2= 0
##$MEAN= 0
##$ME_mod= 0
##$MI= 1.114404
##$NCOEF= 0
##$NC_proc= -8
##$NLEV= 6
##$NOISF1= 3.799351
##$NOISF2= 2.8
##$NSP= 0
##$NTH_PI= 0
##$NZP= 0
##$OFFSET= 17.50811
##$PC= 1
##$PHC0= -11125.65
##$PHC1= 18.80101
##$PH_mod= 1
##$PKNL= yes
##$PPARMOD= 0
##$PSCAL= 0
##$PSIGN= 0
##$REVERSE= no
##$SF= 200.13000530683
##$SI= 16384
##$SIGF1= 3
##$SIGF2= 2
##$SINO= 5.538805
##$SIOLD= 16384
##$SREGLST= <1H.CDCl3>
##$SSB= 0
##$STSI= 16384
##$STSR= 0
##$SW_p= 4006.41025641026
##$SYMM= 0
##$S_DEV= 0
##$TDeff= 16384
##$TDoff= 0
##$TI= <>
##$TILT= no
##$TM1= 0
##$TM2= 0
##$TOPLEV= 0
##$USERP1= <user>
##$USERP2= <user>
##$USERP3= <user>
##$USERP4= <user>
##$USERP5= <user>
##$WDW= 1
##$XDIM= 16384
##$YMAX_p= 379278972
##$YMIN_p= -1174531
$$ End of Bruker specific parameters
$$ ---------------------------------
##NTUPLES= NMR SPECTRUM
##VAR_NAME=  FREQUENCY,     SPECTRUM/REAL,   SPECTRUM/IMAG
##SYMBOL=    X,             R,               I
##VAR_TYPE=  INDEPENDENT,   DEPENDENT,       DEPENDENT
##VAR_FORM=  AFFN,          ASDF,            ASDF
##VAR_DIM=   16384,         16384,           16384
##UNITS=     HZ,            ARBITRARY UNITS, ARBITRARY UNITS
##FACTOR=    0.24454680195387, 1,            1
##FIRST=     3503.89815649594, 0,            0
##LAST=      -502.512099914323, 0,           0
##MIN=       -502.512099914323, -1174531,    0
##MAX=       3503.89815649594, 379278972,    0
$$ Real data points
##PAGE= N=1
##DATA TABLE= (X++(R..R)), XYDATA
$$ [...]
6667A841119j34917J3063M5017N70342l09670L40952N8251l40067R9975K84734
6657B468799J26828N89564N6647r4588j76355J27983O64619l52639m80990P0005
6647B999873L80183K52184N2911l0946L3285l70148q1145J26193k62080R38403
6637D038713R3484J22938k7412l57507M18331k52309M07577k54422M67300N46867
6627E203560L14869k27342O82438k29686k05475L23215M19723M69233K98564j49067
6617F900032k02724K51144O51246O7380Q86892K54016L2099O61621L39991N47439
6607A0389136P34643Q51012M23167R59453J219080J155578J448660J600676J353139
6598B0134544J669064K585932K666805L694520M124013N439304O162411P928158
$$ plain form
6667 1841119 1706202 1719265 1764282 2334624 2024954 2365906 2424157 2084090 2184065 2468799
6657 2468799 2595627 3185191 3241838 3147250 2970895 3098878 3763497 3410858 2929868 2999873
6647 2999873 3380056 3632240 3685151 3654205 3687490 3317342 3236197 3362390 3100310 4038713
6637 4038713 4132197 4255135 4227723 3870216 4288547 4036238 4443815 4189393 4656693 5203560
6627 5203560 5518429 5291087 5973525 5743839 5538364 5861579 6281302 6750535 7049099 6900032
6617 6900032 6697308 6948452 7599698 7667078 8553970 8807986 8840085 9501706 9841697 10389136
6607 10389136 11123779 11974791 12397958 13357411 14576491 15732069 17180729 18781405 20134544
6598 20134544 21803608 24389540 27056345 30750865 34874878 40314182 46476593 54404751
6590E4404751Q677558Q088713M828180M63151m304030p673478q724186r162803
6582D6597856o467659m751612m391920l571830k447799j676947q24618j057649
6574B1407822k065328j615945j301130j277552q24253p59043j037671j132873
6566A1394027q47676n26999k11045l46961o4475n44818k33027J99492l06893m41114
6556H070511L04734l04629j42549m49618j03797n50266J12191p9654L35222k72775
6546F919370p0666Q90857N2538j87726l66142m17883q295K7061j106171m70664
6536E262279l03528o5123j78716o06924O8486m12617m63971M30790k11575J02741
6526C621842J24276m11929k47227P6785j29413j79889M05826K25685m05421o46880
$$ plain form
6590 54404751 63082309 71171022 75999202 76462353 72158323 64484845 55760659 46597856
6582 46597856 40130197 35378585 30986665 27414835 24967036 23290089 22465471 21407822
6574 21407822 19342494 17726549 16425419 15147867 14323614 13564571 12526900 11394027
6566 11394027 10546351 10019352 9808307 9461346 9396871 8852053 8619026 8818518 8511625 8070511
6556 8070511 8375245 8070616 7928067 7478449 7374652 6824386 6936577 6856923 7192145 6919370
6546 6919370 6848704 7739561 7792099 7604373 7238231 6820348 6812053 6839114 5732943 5262279
6536 5262279 4958751 4893628 4714912 4107988 4176474 3763857 3299886 3730676 3519101 3621842
6526 3621842 3746118 3334189 3086962 3163747 3034334 2854445 3260271 3485956 3080535 2433655
6516B433655k3371n9402J46111M7058m17891M46005L57097n6079m28467J15651
6506B560367M41995j59943m70185j47297q5368l3621p8303K95328J68872k48746
6496B243099l42215K32942n544P7040j2650J43471L4136l09796N04668p15774
6486A849377M48159j35515r7309J61204K69788L63122L51050j88603m80585m53174
6476B087514K50338p0744P4683M1117j74608l03877J96031N8382k40481R9061
6466B017416P8932k791N37795K14865l74482M862n3460J33543k89852K20979J63528
6455B651335K13026K0742R5930j03762K60198L86846j19025j8698J70153L15813
6445C872558J74295j5304M803N2017Q17503k23611j15078N13091J59301J40908
$$ plain form
6516 2433655 2410284 2350882 2496993 2544051 2126160 2572165 2929262 2873183 2444716 2560367
6506 2560367 3002362 2842419 2372234 2224937 2139569 2105948 2027645 2322973 2491845 2243099
6496 2243099 1900884 2133826 2128282 2205322 2192672 2336143 2370279 2060483 2565151 1849377
6486 1849377 2297536 2162021 2064712 2225916 2495704 2858826 3209876 3021273 2540688 2087514
6476 2087514 2337852 2267108 2341791 2382908 2208300 1904423 2100454 2158836 1918355 2017416
6466 2017416 2096348 2093557 2631352 2846217 2471735 2476597 2423137 2556680 2266828 2487807 2651335
6455 2651335 2864361 2885103 2981033 2877271 3137469 3524315 3405290 3386592 3556745 3872558
6445 3872558 4046853 4031549 4036352 4088369 4905872 4682261 4567183 5080274 5239575 5380483
6435E380483R88299J31635O04047R29882Q15307O36060Q71063J330630J626099
6426A3313505J594293J439507J690522K202280K732273J707694J061719N37035
6418B6278828k30831j443832j750656j707956k268396k338692j852175j231607
6410A3454683j528014j215017q17099k07497j83886j40064l89315k76077n641
6401H692073j03797k64539q02195j28520m9752k34237m99499n45310m18704j0547
6391E634973o25197m50763J21779j56891j75484l9296M27797K90977n38356N217
6381D494756O9449r8498m8267k05508j70512n55117j21793m08820l8113l54057
6371B563520M89793K27089m98861o92928k44608O50296q6847j59483j48234m03917
$$ plain form
6435 5380483 6368782 6500417 7104464 8034346 8849653 9485713 10356776 11687406 13313505
6426 13313505 14907798 16347305 18037827 20240107 22972380 24680074 25741793 26278828
6418 26278828 26047997 24604165 22853509 21145553 18877157 16538465 14686290 13454683
6410 13454683 11926669 10711652 9894553 9687056 9503170 9363106 8973791 8697714 8692073
6401 8692073 8588276 8323737 7521542 7393022 7343270 7109033 6609534 6064224 5645520 5634973
6391 5634973 5009776 4559013 4680792 4523901 4348417 4309121 4736918 5027895 4489539 4494756
6381 4494756 4564205 4465707 4417440 4211932 4041420 3486303 3364510 2955690 2917577 2563520
6371 2563520 3053313 3280402 2781541 2088613 1844005 2494301 2407454 2247971 2099737 1695820
6361A695820j86209N20991K24950M4773l64448k1764l50025o09871K94571O3932
6351A312720j18105k61887j39895M64566j32503K58614j84581l4045l41955j1975
6341H10954N7592J35827l3833l46447N2540K77800K35104Q75n58359O6080J40046
6330H38179k06541l34693l712L79639j7850q4972L06850K69439k64196p8456K0528
6319H24215K32608j25658J16491J38332M53116o7166m26781k32818R7958Q985
6309A019282l37128l92635J79163M95439R3495j72507p9647r3936k3796j5618
6299F72112M83906m44737p6020K07349l51365J22632N21842j70050k39837m4686
6289F81146K20928o4326r2149j46055n1161P63388o76371k67047N1721k13503
$$ plain form
6361 1695820 1509611 2030602 2255552 2300325 1935877 1914113 1564088 954217 1248788 1312720
6351 1312720 1194615 932728 792833 1257399 1124896 1383510 1198929 1164884 822929 810954
6341 810954 868546 1004373 970540 624093 676633 954433 1189537 1190412 632053 698133 838179
6330 838179 631638 296945 293233 672872 655022 570050 876900 1146339 882143 803687 824215
6319 824215 1056823 931165 1047656 1185988 1639104 1571938 1145157 912339 1010297 1019282
6309 1019282 682154 289519 468682 964121 1057616 885109 805462 711526 687730 672112
6299 672112 1156018 711281 635261 842610 491245 613877 1135719 965669 725832 681146
6289 681146 902074 837748 745599 599544 548383 1311771 635400 368353 420074 206571
6279B06571J95113k82963P878J89055M00286j95294n71839M36858L14445R0984
6269G91094j14516K21433k68771k03211j05800k96382M3092L02156M50270j96300
6259F23065J69943r6246K47721M42099p36000j18355K48949M42856l67282n8869
6249G97881O8028n32721J54950j05784k79118M34821K26242r3871J01981M23384
6239A195793m63120j35027L00509r1461m1191J58161J70412m36221M74640j52554
6229I79941n05818K31916K66368l46778j3940L00687J29062l54849j43423n9430
6219D83736R6079n618P0606l67624Q9285K78041j96851L62089k15971k07819L62138
6208G48091K10131o59311K80903j40385k23236l42033K62203M50072N59391k69175
$$ plain form
6279 206571 401684 118721 126599 315654 715940 520646 -51193 385665 700110 791094
6269 791094 676578 898011 629240 426029 320229 23847 66939 369095 819365 623065
6259 623065 793008 696762 944483 1386582 650582 532227 781176 1224032 856750 797881
6249 797881 865909 333188 488138 382354 103236 538057 764299 670428 772409 1195793
6239 1195793 732673 597646 898155 806694 765503 923664 1094076 657855 1132495 979941
6229 979941 474123 706039 972407 625629 611689 912376 1041438 686589 543166 483736
6219 483736 579815 574197 644803 277179 366464 644505 447654 809743 593772 385953 748091
6208 748091 958222 298911 579814 439429 216193 -125840 136363 586435 1145826 876651
6198H76651j21642Q5473n85363l41314K01858M39660r2354j07458Q7577p6451
6188C66637M7685M5178M8236j90654p2920M13389r0397j39467l51020N09813k78035
6177C08445J79755k0897J42055M6931p9899m76967K34957M89851j94468k84370
6167C45393k1043K60945l66894K58727l7232N9899j93599K65476L04163k65388
6157F10447j34549l11049j0565K52698L82889k8548k57070j85412K93725j60144
6147D52422Q0282m1576l22218M89743j43882J16715K77398j57557j22657K05845
6137H34515m65231M43949r1311l9842o58990M60201Q8519l05009O65744l91690
6127E40855p2830r248L19267j67236l16026J07860J83744l58665j00951j47131
$$ plain form
6198 876651 755009 840482 255119 -86195 115663 555323 462969 355511 443088 366637
6188 366637 414322 459500 507736 317082 244162 657551 567154 427687 76667 586480 308445
6177 308445 488200 467303 609358 656289 576390 99423 334380 824231 629763 345393
6167 345393 324350 585295 218401 477128 439896 499795 306196 571672 875835 610447
6157 610447 475898 164849 154284 406982 789871 761323 504253 318841 612566 452422
6147 452422 532704 491128 168910 658653 514771 631486 908884 751327 628670 834515
6137 834515 369284 813233 721922 682080 23090 483291 571810 266801 932545 540855
6127 540855 468025 458777 778044 610808 294782 402642 586386 227721 126770 -20361
6117b0361j47527K55841j28232J87238M49435l49849p312K07386k86264o1807
6107I8548L34895l4577J97923N94q3661n30723R93462R3647l85976Q7877K31680
6096A003689l04990p8579K89030k74966P4634R0166k67385m916K7526l23897K22921
6085D53233J65883p6229J83102J3453o4101K96870O7053k87137l57499K55925
6075F50553m14349r7236R9429r9782J19898K85537Q455R4912o8007N442M1628
6064F26480J4561m6338p11922O6782K86765K1575N4929j91348O12386j54800j56227
6053D22843J51125l89669K38397P58661l66527l52409j9700O0165J38302l49173
6043B92015N9289M53878K16606m40323K350L26872j27284m79723M61145J89253
$$ plain form
6117 -20361 -167888 87953 -40279 146959 596394 246545 239233 446619 160355 98548
6107 98548 433443 398866 596789 597383 513722 -17001 976461 1070108 684132 772009 1003689
6096 1003689 698699 620120 909150 634184 708818 798984 531599 526683 554209 230312 453233
6085 453233 619116 542887 725989 739442 675341 972211 1039264 752127 394628 650553
6075 650553 236204 138968 238397 138615 258513 544050 552505 647417 579410 584852 626480
6064 626480 641041 594703 -117219 -50437 236328 257903 312832 121484 733870 579070 422843
6053 422843 573968 184299 422696 1181357 814830 462421 442721 502886 641188 292015
6043 292015 351304 805182 1021788 581465 583815 910687 783403 303680 764825 954078
6033I54078R8475j8297p1276k43403k83080N86412n07135l8605K94101R4088K63582
6022A128940K71225q97142J49966K67872k82531k3344M82786M29275l88868m25841
6012G12338J25604k8641J63100K70506q3854l39280K16175R3416m61894L8456
6002G05926N70744J64698l11385J0736l42780Q0172J01606K05314k20859K28594
5992A192766j59167k59842J89072J62218J25800N5343j30563l48144L51821J07440
5982A286744N4922L06343m20913O1331K69513J32994k24607L9958N66080j21651
5972A950714j45176O59566j10523j18783Q7163j8633j93697M94043k64812l14830
5962B025032M0732O74543K00263J43804j26539j57115K12695J02431j14615q874
$$ plain form
6033 954078 1052553 1034256 962980 719577 436497 1022909 515774 477169 771270 865358 1128940
6022 1128940 1400165 503023 652989 920861 638330 614986 1097772 1527047 1138179 712338
6012 712338 837942 809301 972401 1242907 1159053 819773 1035948 1129364 667470 705926
6002 705926 1276670 1441368 1129983 1140719 797939 878111 979717 1185031 964172 1192766
5992 1192766 1033599 773757 962829 1125047 1250847 1306190 1175627 827483 1179304 1286744
5982 1286744 1341666 1648009 1227096 1288427 1557940 1690934 1466327 1506285 2072365 1950714
5972 1950714 1805538 2465104 2354581 2235798 2322961 2304328 2110631 2604674 2339862 2025032
5962 2025032 2065764 2740307 2940570 3084374 2957835 2800720 3013415 3115846 3001231 2992357
5952B992357O14718L22422K37045M12508n3573J16766J27321j22999j94945p7746
5942D373874K28150l75944n5585j77653J47413N9086K92741N2215j98026l20112
5932D026159K04342j31823P30822N70102N719l15493J48275J37016L84918L03403
5922F063440k11449n8040L26349J94195J2003j79561j46769j55208q525J04595
5912E941030l98942l47688l91073R5115J42903j47991K82701M9616k17950k39663
5902D768058L56186p0694m07893M5988p3648L81720M88210j63444n57201J71935
5892D939217L3044j94854J68926K91471n56368k69055J42253j44812j55280j96379
5882D058163k21760k99728P0245m66775O0809J88449J58796j12129J02273k710
$$ plain form
5952 2992357 3607075 3929497 4166542 4579050 4525477 4642243 4769564 4646565 4451620 4373874
5942 4373874 4602024 4226080 4170495 3992842 4140255 4199341 4492082 4544297 4346271 4026159
5932 4026159 4230501 4098678 4829500 5399602 5405321 5089828 5238103 5375119 5760037 6063440
5922 6063440 5851991 5793951 6120300 6314495 6326498 6146937 6000168 5844960 5836435 5941030
5912 5941030 5542088 5194400 4803327 4898442 5041345 4893354 5176055 5225671 5007721 4768058
5902 4768058 5124244 5053550 4645657 4691645 4617997 4999717 5487927 5324483 4767282 4939217
5892 4939217 4972261 4777407 4946333 5237804 4681436 4412381 4554634 4409822 4254542 4058163
5882 4058163 3836403 3536675 3606920 3140145 3200954 3389403 3548199 3436070 3538343 3535633
5872C535633p57809Q260o4211K94771j52357k83769k63678K20870O4866M98777
5862C101353m36462L38420n04282m68775K44198j4810J97825k29798j02944J3347
5852B138072O54987j52237l66333j53185J5782L42847k2271R5133m83201K22285
5842B291879P17j17767j66929M3744L58390j29991P4311m21562P64795l05403
5832B392184j9404L07884j48506j19526k5415K6328o78504J43190O50060J03169
5822B631460K98829j29583k17668K55862R6262J28185l35463q509j37641p8174
5812B503560k7121l807L0873l54664M30339L60101K77766p3701l78387L07754
5802C072713N03593j59852J66927j97233L87450k38778j3113L21483l60445J58930
$$ plain form
5872 3535633 2777824 2786084 2721873 3016644 2864287 2580518 2316840 2537710 2602576 3101353
5862 3101353 2664891 3003311 2499029 2030254 2274452 2259642 2457467 2227669 2124725 2138072
5852 2138072 2793059 2640822 2274489 2121304 2137086 2479933 2457662 2552795 2069594 2291879
5842 2291879 2292596 2174829 2007900 2051644 2410034 2280043 2354354 1932792 2697587 2392184
5832 2392184 2372780 2680664 2532158 2412632 2387217 2413545 1735041 1878231 2528291 2631460
5822 2631460 2930289 2800706 2583038 2838900 2935162 3063347 2727884 2719375 2581734 2503560
5812 2503560 2476439 2472632 2503505 2148841 2579180 2939281 3217047 3143346 2764959 3072713
5802 3072713 3576306 3416454 3583381 3386148 3773598 3534820 3521707 3843190 3482745 3641675
5792C641675M16826L59279M7797K84910K55334j11504J66518N08038K2403m99465
5782E091811J03208P91187K24013J29667L20315j32671L34459R4639J3052j9201
5772F950479L16650L51361L50267P45681J64471K38422N30829O39498N08639K8686
5762A0824983J3184L23669L7549O68215K86740J63205L06884J25829K07428L79027
5752A3336713M14032Q25522K07742k36219N83392N40654L82010K216K58167P32231
5742A7046460M37869J00594L00437P5594K52501J47874J16747M76045j6477M82667
5732A9420311k18299K1709K4190j10831J984K95294K15168o6971j95812j3237
5722A9373506J452l44630l44789M02583K79438M2664P88644J04978n52500k02256
$$ plain form
5792 3641675 4058501 4417780 4465577 4750487 5005821 4894317 5060835 5568873 5591276 5091811
5782 5091811 5195019 5986206 6210219 6339886 6660201 6527530 6861989 6956628 6969680 6950479
5772 6950479 7267129 7618490 7968757 8714438 8878909 9117331 9648160 10287658 10796297 10824983
5762 10824983 10838167 11161836 11199385 11867600 12154340 12317545 12624429 12750258 12957686 13336713
5752 13336713 13750745 14576267 14784009 14547790 15131182 15671836 16053846 16056062 16314229 17046460
5742 17046460 17484329 17584923 17885360 17960954 18213455 18361329 18478076 18954121 18937644 19420311
5732 19420311 19202012 19223721 19247911 19137080 19139064 19434358 19649526 19582555 19386743 19373506
5722 19373506 19374958 19030328 18685539 19088122 19367560 19410224 20198868 20303846 19751346 19549090
5712A9549090N02394J02020J89822q6746o07966m26289k02373o0121j86825j88871
5702A8584135j21033l73501k77846n29325n2961j30327r60908j80775k61865j40056
5692A5555538k67501l23505j51198o42725k65240J5037O4001l64906o90972j38533
5682A2789996o58086o02771M01181o16234r0275q0158l21576j49714o68554o06692
5672I397117m1985k10667k25982k09519m3326n81844k3733J17004k14160L52859
5662H315764J14847l39445m28659l42197k40541J34224J57369j13317J17105j7551
5652G357599j92359L31460j61498P3709r7672o9675j70531J48221N06478l1798
5642G693934m4019J95796K73138J34751m08805q4972r3573j3255N35559Q6640
$$ plain form
5712 19549090 20051484 20153504 20343326 20256580 19648614 19222325 19019952 18959831 18773006 18584135
5702 18584135 18463102 18089601 17811755 17282430 17229469 17099142 16138234 15957459 15695594 15555538
5692 15555538 15288037 14964532 14813334 14170609 13905369 13920406 13984407 13619501 12928529 12789996
5682 12789996 12131910 11529139 11930320 11314086 11223811 11143653 10822077 10672363 10003809 9397117
5672 9397117 9355132 9144465 8918483 8708964 8665638 8083794 8060061 8177065 7962905 8315764
5662 8315764 8430611 8091166 7662507 7320310 7079769 7213993 7371362 7258045 7375150 7357599
5652 7357599 7165240 7496700 7335202 7408911 7311239 7241564 7071033 7219254 7725732 7693934
5642 7693934 7649915 7845711 8118849 8253600 7844795 7759823 7666250 7652995 8188554 8275194
5632H275194j3149o4104j73505L56269J16275k46596j57675j68481j1048k05507
5622G707673N80448k55178l13217K83354m9503J6538J9710R4081r6414O5600N9768
5611H112860J64391N3849Q4615k33348L10582J60469r5556m1100l04558j85462
5601H026742Q1300L00794j15443q6238K77102n16312j34604M72256l74396j24351
5591G806850j23663K17885K19792o17524L47613j59467n03181k25666j32727r6533
5581F733379K63512K2938j33944K14759k39800k71575L1439j59618M81696k79503
5571F663283k88804M425J39205K76773M5217j63093l23708m1322l03318L11189
5561F319847J1650J2305j30367K05625R7991K62757k41333j8768m6085j89426
$$ plain form
5632 8275194 8262045 8197941 8024436 8380705 8496980 8250384 8092709 7924228 7913180 7707673
5622 7707673 8288121 8032943 7719726 8003080 7953577 7970115 7989825 8083906 7987492 8053092 8112860
5611 8112860 8277251 8331100 8415715 8182367 8492949 8653418 8557862 8516762 8212204 8026742
5601 8026742 8108042 8408836 8293393 8207155 8484257 7967945 7833341 8305597 7931201 7806850
5591 7806850 7683187 7901072 8120864 7503340 7850953 7691486 7188305 6962639 6829912 6733379
5581 6733379 6996891 7019829 6885885 7100644 6860844 6589269 6620708 6461090 6942786 6663283
5571 6663283 6374479 6378904 6518109 6794882 6840099 6677006 6353298 6311976 6008658 6319847
5561 6319847 6331497 6343802 6213435 6419060 6517051 6779808 6538475 6519707 6473622 6284196
5551F284196L9300K6208L48313j51094m74757N42402K51710j45770k11407j25069
5541F384032N34363j33489j66013j840L48561K73916M32017K48217J07186L95980
5531H422930k70296L40520k9831p874M11966J81294J3734K39923J39029L80105
5521I821500j12239K62914N58876L46096O39559O42883P25640P97903M04978O19581
5511A4707691P25648Q36322P19094O40139P37014L47042k87977J04818K88535
5502A8818326q00099n63482L89374K39417l93386M41699J80174O69498N84464
5493A9565985J017600P27298R12662O71344J35721K90496L32766m06786l4173
5484B3212913j39434j34108j27665R16534L92943M8521Q20739N35597M44415J248695
$$ plain form
5551 6284196 6323496 6349704 6698017 6546923 6072166 6614568 6866278 6720508 6509101 6384032
5541 6384032 6918395 6784906 6618893 6617053 6965614 7239530 7671547 7919764 8026950 8422930
5531 8422930 8152634 8493154 8463323 8455449 8867415 9048709 9062443 9302366 9441395 9821500
5521 9821500 9709261 9972175 10531051 10877147 11516706 12159589 12885229 13683132 14088110 14707691
5511 14707691 15433339 16269661 16988755 17628894 18365908 18712950 18424973 18529791 18818326
5502 18818326 18018227 17454745 17844119 18083536 17690150 18131849 18312023 18981521 19565985
5493 19565985 20583585 21310883 22223545 22894889 23030610 23321106 23653872 23247086 23212913
5484 23212913 23073479 22939371 22811706 23728240 24121183 24169704 24990443 25526040 25970455 27219150
5474B7219150J511667J135418J563968J381451K174518J972848K017758J145934
5466D0122712R84070J82107n71670l87453q82527j027797q33709r04252n85961
5457C6095520J33248k17633O28289R71343N00804Q60862M71015J010076J186705
5448D1640229j03773q7609m05683j959381j067540q97739j106503n79630q49442
5439C4582929k44689J36369K7697O6731k08795J290897P09193O68942J632400
5430C8661674J515924Q14962P57237j15497k57390p26857j556872j172500j867370
5421C6053311j164439j051357j098823L5334m23285p80567J05030j84280J00776
5412C1591700R48196K71791L86521Q12120J214779R87373J234961Q94049o02097
$$ plain form
5474 27219150 28730817 29866235 31430203 32811654 34986172 36959020 38976778 40122712
5466 40122712 41106782 41288889 40717219 40329766 39447239 38419442 37585733 36681481 36095520
5457 36095520 36228768 36011135 36639424 37610767 38111571 38972433 39443448 40453524 41640229
5448 41640229 41536456 41448847 41043164 39083783 38016243 37118504 36012001 35432371 34582929
5439 34582929 34338240 34474609 34502306 34569037 34360242 35651139 36360332 37029274 38661674
5430 38661674 40177598 40992560 41749797 41634300 41376910 40650053 39093181 37920681 36053311
5421 36053311 34888872 33837515 32738692 32774026 32350741 31570174 31675204 31490924 31591700
5412 31591700 32539896 32811687 33198208 34010328 35225107 36212480 37447441 38341490 37739393
5403C7739393n57863k23122j269509j253532q02003r88952r88243j393153o58865
5394B9604151n30421l00136j44548N3345p2680j29200L05140l5373n97517o02496
5384B7550265p57725o05685r75892q35291o33336j27290p25373l26947M2742Q02208
5374B3407676M58905J27769J51403M22401L34285Q28299Q87653l3192O46964j6659
5364B7215504K41056K17612l50675p8859r14993p48932m55506o82631k86867m29662
5354B3726047m65928m98438p9305j74410j378092n11022j84221p39763n04490
5345A9190378k97149k13365q54333k02907m06671p787r0437j68333J73516N30214
5335A7653126N04796k83165p4493k20873N93523K71371L05829J24534j55192j51261
$$ plain form
5403 37739393 37181530 36958408 35688899 34435367 33633364 32644412 31656169 30263016 29604151
5394 29604151 29073730 28773594 28629046 28682391 28609711 28480511 28785651 28750278 28152761 27550265
5384 27550265 26792540 26186855 25210963 24375672 23742336 23615046 22889673 22562726 22605468 23407676
5374 23407676 23866581 23994350 24145753 24568154 24902439 25730738 26618391 26585199 27232163 27215504
5364 27215504 27456560 27674172 27323497 27244638 26329645 25580713 25125207 24442576 24155709 23726047
5354 23726047 23260119 22761681 22682376 22507966 21129874 20618852 20434631 19694868 19190378
5345 19190378 18893229 18679864 17825531 17622624 17215953 17208166 17117729 16949396 17122912 17653126
5335 17653126 18157922 17874757 17800264 17579391 18172914 18444285 18750114 18874648 18719456 18568195
5325A8568195l46277P0590K72930m90387m94512m06811k79897o96470k70650o84782
5315A5241929j043696K16096k88637p45974k38821N5706k56524n11646l18758
5306A2109675k84728p2101K52894k41423k90472j04007j15350o83583J471k63804
5296A0308572k17045n42123L35322p50056o05863P34875O3389k28476L9601l27018
5286H811178L80648n68481q06358O7148L29810J88221l70436j72642M25865j26181
5276H158772M7485p6470p14901K93150K30506o3028m49887J153k383L1628L91448
5265G847473l49081k39824j49581M610k66333K05293K26403k95854J56564K68588
5255G408258m43551m6698P2113m34360J24960k630l35181J42917M81209l03665
$$ plain form
5325 18568195 18221918 18292508 18565438 18075051 17580539 17173728 16893831 16197361 15926711 15241929
5315 15241929 14198233 14414329 14125692 13379718 13140897 13196603 12940079 12428433 12109675
5306 12109675 11824947 11752846 12005740 11764317 11473845 11369838 11254488 10570905 10572376 10308572
5296 10308572 10091527 9549404 9884726 9134670 8528807 9263682 9327071 9098595 9138196 8811178
5286 8811178 9191826 8623345 7816987 7884135 8213945 8402166 8031730 7859088 8284953 8158772
5276 8158772 8206257 8129787 7414886 7708036 7938542 7875514 7425627 7426780 7424397 7456025 7847473
5265 7847473 7498392 7258568 7108987 7113597 6847264 7052557 7278960 6983106 7139670 7408258
5255 7408258 6964707 6918009 6990122 6555762 6680722 6678092 6342911 6485828 6967037 6663372
5245F663372l36866L56310o0668m95213L31280p0090l60324K34806N86442M0314
5235F889363k54232K39071l82712l46146Q5303l32225K86939M40957L87041N83639
5225G596998l53020J71702L66754j85634Q4631m91480N48373K65708j81798R9140
5215G921374M43430K18875m6111L54026l21001R7450Q03984J871N97234K63687
5205A0334819N80460J08065J035060L00906K00326O09894P20538j40548J63876
5196A3913396M10899J27930J37168M07428J31767n62322k78752J68927N10123
5187A4966564Q4250J67756O335L47384k48856M47836P54422N3828M19962J56278
5177A7155759M0311M12772r7070m0058K78639K68572K38262j00531n66289Q8208
$$ plain form
5245 6663372 6326506 6682816 6622148 6126935 6458215 6388125 6027801 6262607 6849049 6889363
5235 6889363 6635131 6874202 6491490 6145344 6230647 5898422 6185361 6626318 7013359 7596998
5225 7596998 7243978 7415680 7782434 7596800 7681431 7189951 7738324 8004032 7822234 7921374
5215 7921374 8364804 8583679 8537568 8891594 8570593 8668043 9472027 9473898 10071132 10334819
5205 10334819 10915279 11023344 12058404 12359310 12559636 13169530 13890068 13749520 13913396
5196 13913396 14324295 14452225 14589393 14996821 15128588 14566266 14287514 14456441 14966564
5187 14966564 15050814 15218570 15224905 15572289 15323433 15771269 16525691 16579519 16999481 17155759
5177 17155759 17196070 17608842 17511772 17471714 17750353 18018925 18257187 18156656 17590367 17678575
5167A7678575m83291K1344M36106q5609p39689J47713l0871m04870j86675J27039
5157A6479772j26513j70837J02742L0448L9369Q3760J1787J78909n40691l41199
5147A5747547j62478r4045l71949p3613l49906P8069n26545o96086M52301n51471
5137A3451824p2222j11639J60602J33217L58049J33284J00443L96237K01129k76682
5127A4474242L01307M72019k51593K47674M27825j54620M23230j55829J52382
5118A5936637L76187M74311j04616n85344K98237j65747n10549m91070j51058
5109A5076988o42676o30493j53877l00548j6910k20640p62294K30112l25382o50013
5099A1604267P77343O15233j52718m60695Q8565K98554R5633K8101M96271M40280
$$ plain form
5167 17678575 17195284 17216628 17652734 17567125 16827436 16975149 16944278 16539408 16352733 16479772
5157 16479772 16353259 16182422 16285164 16315612 16354981 16438741 16450528 16629437 16088746 15747547
5147 15747547 15585069 15491024 15119075 15045462 14695556 14773625 14247080 13550994 14003295 13451824
5137 13451824 13379602 13267963 13428565 13561782 13919831 14053115 14153558 14549795 14750924 14474242
5127 14474242 14775549 15247568 14995975 15243649 15671474 15516854 15940084 15784255 15936637
5118 15936637 16312824 16787135 16682519 16097175 16395412 16229665 15719116 15228046 15076988
5109 15076988 14434312 13803819 13649942 13349394 13332484 13111844 12349550 12579662 12254280 11604267
5099 11604267 12381610 12996843 12844125 12383430 12471995 12770549 12866182 12894283 13390554 13830834
5089A3830834N13005K96520J8311O9255l43524m4216O5662o65241p36310O54537
5079A3658833Q6610l42454m06857l11783l27535K2953l7005r29777R6810j02511
5069A1407284j89819J55844n48036k1393k46765N65675J72500k79611J15016K74333
5059A1405028J74841L81615J3318m42989r1174L38493M73544j92981L38646j82173
5049A2216168k30720N0070J12267O30819L64971K58519O14442M86831M30192J18465
5039A5052024K33043L69472O69763O16606M91169Q23333R01581J338996Q67177
5030B1363164L31962L80903N0885J97500J93259L6592R78765N47791M8304N47222
5020B4676347j65153J12715N54800K57578l17J15603O78589L98540P7442Q87488
$$ plain form
5089 13830834 14343839 14640359 14658670 14727925 14384401 14340185 14405847 13740606 13004296 13658833
5079 13658833 13745443 13402989 12996132 12684349 12356814 12379767 12342762 11412985 11509795 11407284
5069 11407284 11217465 11373309 10825273 10803880 10557115 11122790 11295290 11015679 11130695 11405028
5059 11405028 11579869 11961484 11974802 11531813 11440639 11779132 12252676 12059695 12398341 12216168
5049 12216168 11985448 12035518 12147785 12778604 13143575 13402094 14016536 14503367 14933559 15052024
5039 15052024 15285067 15654539 16324302 16940908 17432077 18255410 19156991 20495987 21363164
5030 21363164 21695126 22076029 22126914 22324414 22517673 22554265 23533030 24080821 24129125 24676347
5020 24676347 24511194 24623909 25178709 25436287 25435970 25551573 26230162 26628702 26706144 27593632
5010B7593632K4064m04943N7535p2275j89592J56358l11356o06141q57073n72783
5000B4817426j104480j333983m28431j065327j403856l15023l09213o36521J96961
4991A8417553n34141L66175K84229k07595q4110j01813P9393K07668L23268J45831
4981A8896458P83967M99153P3337J39972m72303l47683l78136q9387M4059n68573
4971A8580864q60738N3276o0096J05703o3728J94267O95363j99319J04518N88944
4961A9139054Q74484L47901M55569L7858R3089L11710k90973n83440K00491J37824
4951B0723567n6689j49303J31574j51151K0894J41221K55584L99019L92558j82756
4941B1524518q8134K20666l18575j24407N41387j2184j02392P75772K88308L79959
$$ plain form
5010 27593632 27617696 27212753 27270288 27198013 27008421 27164779 26853423 26247282 25390209 24817426
5000 24817426 23712946 22378963 21950532 20885205 19481349 19166326 18857113 18220592 18417553
4991 18417553 17883412 18249587 18533816 18326221 18242111 18140298 18219691 18427359 18750627 18896458
4981 18896458 19680425 20179578 20252915 20392887 19920584 19572901 19194765 19105378 19149437 18580864
4971 18580864 17720126 17773402 17713306 17819009 17755281 17949548 18644911 18445592 18550110 19139054
4961 19139054 20013538 20361439 20817008 20854866 20947955 21259665 20968692 20385252 20585743 20723567
4951 20723567 20666878 20517575 20649149 20497998 20518892 20660113 20915697 21314716 21707274 21524518
4941 21524518 21436384 21657050 21338475 21214068 21755455 21743271 21640879 22416651 22704959 23084918
4931B3084918j92948n2302J81187m1744J63720O03930Q448J34720P6903L2692
4921B3999524r3107K95054O45768J71390Q64353O17592m14335K46370L49801M75766
4911B7158176L39692N5929P14868K82532J127645P59273J22696K47232j7769O12196
4901C1402470P13689P16416K89018j85220O03815R70519K66851N75493M33182
4892C5786233j81072J08599L47324L50599J5499M79483L2380L48529N85594k33218
4882C7639950j23392K70906l72918k92682P1774p42216n15829O67081m2299p23252
4872C5837123m17334l40624m09698p78558o15182l34912k43989j07196n84702
4863C2004928k01860j19658j055575n95517l5495o82427q82329n1241m15879o51878
$$ plain form
4931 23084918 22891970 22839668 23020855 22979111 23142831 23746761 23755209 23889929 23966832 23999524
4921 23999524 23906417 24201471 24847239 25018629 25882982 26500574 26086239 26332609 26682410 27158176
4911 27158176 27497868 27553797 28268665 28551197 29678842 30438115 30560811 30808043 30790274 31402470
4901 31402470 32116159 32832575 33121593 32936373 33540188 34510707 34777558 35353051 35786233
4892 35786233 35605161 35713760 36061084 36411683 36427182 36906665 36939045 37287574 37873168 37639950
4882 37639950 37516558 37787464 37414546 37121864 37193638 36451422 35935593 36602674 36560375 35837123
4872 35837123 35419789 35079165 34669467 33890909 33275727 32940815 32696826 32589630 32004928
4863 32004928 31803068 31683410 30627835 30032318 29996823 29314396 28432067 28380826 27964947 27313069
4853B7313069m30319r52387r99192j72330j59092j196443l54696m54250q19025
4844B1775335p77716j25091l63646k92028j65694r49299j1549l13902q1671q40192
4834A7854547m73911j98064o67465P620m89371n36335L23295l90920p12373j93100
4824A4523923R0742l04742J62139k11010n07415p38503l2730J24372l55477K3375
4814A2774674q39051p82135R99483l59543o25832k42943l03380r0441M14950m85853
4804A0459929r2332J05576l1974p28993l89899O0243j87178k13222J80467J29134
4794I291751m47049O9046n16036K72723K22146j69898k02142M76858p75621q27079
4784G394699L86374q311k19227R7864k59464j0449j09974l0471m06739J62906
$$ plain form
4853 27313069 26882750 25930363 24931171 24758841 24599749 23403306 23048610 22594360 21775335
4844 21775335 20997619 20872528 20508882 20216854 20051160 19101861 19090312 18776410 18694739 17854547
4834 17854547 17380636 17182572 16515107 16522727 16033356 15497021 15820316 15429396 14717023 14523923
4824 14523923 14614665 14309923 14472062 14261052 13753637 13015134 12982404 13106776 12751299 12774674
4814 12774674 11935623 11153488 12152971 11793428 11167596 10924653 10621273 10530832 10945782 10459929
4804 10459929 10367597 10473173 10441199 9712206 9322307 9382550 9195372 8982150 9162617 9291751
4794 9291751 8844702 8913748 8397712 8670435 8892581 8722683 8520541 8997399 8221778 7394699
4784 7394699 7781073 7772762 7553535 7651399 7391935 7381486 7271512 7241041 6834302 6997208
4774F997208o3091n42608j66988K02249R3370j71712O3977K60434k0544k03915
4764F448380k91823j33679j80831k68538k6597J05583K44232j75292k2259L01746
4754F000922n52283M5827M1357L79924l09600M21652K02229Q2247m70178m49239
4744E392858p3025l11855k02366n4367K65653L01993l036K21752L96296K71960
4734F205863n49071j58969N95863J9101n28480l57901k08214K16660j22830J78123
4724E290145K37568P3085m4336l58580K60970q542K69425p4062m0357k42130L65652
4713E728838p64510L24625l14843m19380J57344K8249p8107j9952K73464N5559
4703D971287L82038K15126p52621j65499L51302J21322j52870j68518J83028M14532
$$ plain form
4774 6997208 6934117 6391509 6224521 6426770 6520140 6348428 6412405 6672839 6652295 6448380
4764 6448380 6156557 6022878 5842047 5573509 5546912 5652495 5896727 5721435 5699176 6000922
4754 6000922 5448639 5494466 5535823 5915747 5606147 6027799 6230028 6312275 5842097 5392858
4744 5392858 5319833 5007978 4805612 4751245 5016898 5318891 5315855 5537607 5933903 6205863
4734 6205863 5656792 5497823 6093686 6112787 5584307 5226406 5018192 5234852 5112022 5290145
4724 5290145 5527713 5600798 5556462 5197882 5458852 5450310 5719735 5645673 5605316 5363186 5728838
4713 5728838 4964328 5288953 4974110 4554730 4712074 4740323 4662216 4642264 4915728 4971287
4703 4971287 5353325 5568451 4815830 4650331 5001633 5122955 4970085 4801567 4984595 5399127
4693E399127j73950N0497r773K35183j29185l80870K30138N49707O823m51580
4683E326117M5469N48292N60003k31536n4498l80160L22433m8925j8287j40163
4673E928745M86772M2413p0939P80162k13337K66529J9804j36614M3446J2605
4663G159586L05531O26270J10129K62954K36690K37448l81299p0319O40370Q36794
4653I964154L33923M40868L06392M66065M55236J1426L335p4373K71239J90105
4643A2368370J77423k89157O84740R55687P9829K77454J41490m65903J9331J27194
4633A4076458K89865O87958L92640N20778J113202Q04621N71824M2613O90415
4624A9190374O42379M86256N84522J95189Q60187P30296O5094K89990J08439j98562
$$ plain form
4693 5399127 5225177 5275674 5265901 5501084 5371899 4991029 5221167 5770874 5777697 5326117
4683 5326117 5371586 5919878 6479881 6248345 6193847 5813687 6136120 6087195 6068908 5928745
4673 5928745 6415517 6457930 6386991 7167153 6953816 7220345 7240149 7103535 7146981 7159586
4663 7159586 7465117 8091387 8201516 8464470 8701160 8938608 8557309 8486990 9127360 9964154
4653 9964154 10298077 10738945 11045337 11511402 11966638 11978064 11981399 11907026 12178265 12368370
4643 12368370 12545793 12256636 12941376 13897063 13976892 14254346 14395836 13929933 13949264 14076458
4633 14076458 14366323 15054281 15446921 15967699 17080901 17885522 18457346 18499959 19190374
4624 19190374 19832753 20319009 20903531 21098720 21958907 22689203 22754297 23044287 23152726 22954164
4614B2954164j30826K79627K65608k19082l45576p4259J86726k80435K0321o9199
4604B2587069n55771J2892l6882K75271j20243P267m9140K98400l44171k78453
4594B1796239L49070K84536J26824j43346l4308k51339J91675L20765n3716K12082
4584B2798482L16486N27573L96941J96911Q45766R18904J399678J103510J097401
4575B9601652J496895R99215O40594J057657L34905k1521L4022O2155n95318m00969
4565C3209287k51908n14659l18981p09525j141829q83909o48573j753963j626344
4556B5359596j354186j338160r77740j214751q02923j000087m26341m73149q87055
4547A6885204m98796o55477m51591P7404j03821k55067j21647l22209m44214R4044
$$ plain form
4614 22954164 22823338 23102965 23368573 23149491 22803915 22729656 22916382 22635947 22656268 22587069
4604 22587069 22031298 22044190 22007308 22282579 22162336 22169603 22120463 22418863 22074692 21796239
4594 21796239 22145309 22429845 22556669 22413323 22379015 22127676 22319351 22640116 22586400 22798482
4584 22798482 23114968 23642541 24039482 24236393 25082159 26001063 27400741 28504251 29601652
4575 29601652 31098547 32097762 32738356 33796013 34130918 34109397 34143419 34205574 33610256 33209287
4565 33209287 32957379 32442720 32123739 31414214 30272385 29388476 28739903 26985940 25359596
4556 25359596 24005410 22667250 21689510 20474759 19671836 18671749 18245408 17772259 16885204
4547 16885204 16386408 15730931 15279340 15356744 15252923 14997856 14876209 14554000 14109786 14203830
4537A4203830m1838n84165l55707O10691L9730l35453j06171n00274K69095R556
4527A3209294j64443k35211K64329N5993l83462M65314K63965j53401Q3952j26187
4517A3280143j30865P3426n1331k52795J86083L20503L15332J37589L95468L7044
4507A4310597O9819K92978K7616N95402N91896M99956L03139K87093J051611P26568
4497A8756675N75562R18976Q70366J160838J146867J293013J317426J030713M45012
4488B7515448Q74659O83611l7147n28943m00058q79628o41366m26122l93183r0818
4478B5676453p65578o79730q94358l16812L276r99584k96992q9389r25490l81821
4468B0329975R2554j96301n2421M78680R2421J14958M76213N66069M85158P13557
$$ plain form
4537 14203830 14161992 13577827 13222120 13832811 13872541 13537088 13430917 12930643 13199738 13209294
4527 13209294 13044851 12809640 13073969 13129962 12746500 13211814 13475779 13322378 13406330 13280143
4517 13280143 13149278 13222704 13171373 12918578 13104661 13425164 13740496 13878085 14273553 14310597
4507 14310597 14380416 14673394 14701010 15296412 15888308 16388264 16691403 16978496 18030107 18756675
4497 18756675 19332237 20251213 21121579 22282417 23429284 24722297 26039723 27070436 27515448
4488 27515448 28390107 29073718 29036571 28507628 28107570 27227942 26586576 26160454 25767271 25676453
4478 25676453 24910875 24231145 23336787 23019975 23023251 22023667 21726675 21637286 20711796 20329975
4468 20329975 20422529 20226228 20173807 20652487 20744908 20859866 21336079 21902148 22387306 23100863
4458B3100863Q07185R05328O39613Q34536N87985J144962J078725R05232M90477
4449C0494906M93866K69570J78188J19610Q2422l48279m31262J38673p7695j80142
4439C0739857l02002m24533k16375r20451j052867q53621j302063o33935j415419
4430B3618591n96066l64468o26004q20297q41474p95730m34879n95338n34839
4421A8009496m38904l07324n19307n55169j63766k42388K37749J99511R9626l88969
4411A5930555l5566n0410O5485M81372J87857K00880J89215Q00892M85061M00423
4401A8655764n5958k72282M08496Q593n1103j67633p04774m04198k97718l88636
4391A6730551q53420k63235k0205n79587j62448o17758j046762p29695L79325
$$ plain form
4458 23100863 23908048 24813376 25452989 26287525 26875510 28020472 29099197 30004429 30494906
4449 30494906 30988772 31258342 31436530 31556140 31638562 31290283 30859021 30997694 30919999 30739857
4439 30739857 30437855 30013322 29796947 28876496 27823629 26970008 25667945 25034010 23618591
4430 23618591 23022525 22658057 22032053 21211756 20370282 19574552 19139673 18544335 18009496
4421 18009496 17570592 17263268 16743961 16188792 16025026 15782638 16020387 16219898 16319524 15930555
4411 15930555 15894989 15844579 15910064 16391436 16579293 16780173 16969388 17770280 18255341 18655764
4401 18655764 18599806 18327524 18736020 18744613 18693510 18525877 17821103 17416905 17119187 16730551
4391 16730551 15877131 15613896 15593691 15014104 14851656 14233898 13187136 12457441 12836766
4382A2836766J22829p64460l51345n73514l83386l88019m9273L2749p28650L5370
4372I789067L90408J35420l31890l74623q0538l15922M7003R4138K86761m00395
4362I239429O22J59555j52811k22335O8314J2981q80611K42620M80478n90533
4352H357709R1169J93002n37414R0259L17486M0738k42931k43140J11790j17910
4342H060758j55656K22241l32827K71517K76259k21982k73357r1497l18134L2737
4332G470059M67237n6413J36263L6758J33661n04691k4087L93688k71775o09239
4322G171461o9408O32751j75670L09920j48653N273J72520l28804L99618J51355
4312H120363q8557k42863j07099M80650n93123k27187K59254n0530P1094L35785
$$ plain form
4382 12836766 12959595 12195135 11843790 11270276 10886890 10498871 10449598 10482347 9753697 9789067
4372 9789067 10179475 10314895 9983005 9608382 9527844 9211922 9258925 9353063 9639824 9239429
4362 9239429 9240051 9399606 9246795 9024460 9092774 9105755 8225144 8467764 8948242 8357709
4352 8357709 8448878 8641880 8104466 8194725 8512211 8552949 8310018 8066878 8178668 8060758
4342 8060758 7905102 8127343 7794516 8066033 8342292 8120310 7846953 7755456 7437322 7470059
4332 7470059 7937296 7880883 8017146 8053904 8187565 7682874 7658787 8052475 7780700 7171461
4322 7171461 7102053 7734804 7559134 7869054 7720401 7725674 7898194 7569390 7969008 8120363
4312 8120363 8031806 7788943 7681844 8162494 7569371 7342184 7601438 7550908 7622002 7957787
4302G957787m34627K74631k725l98363O07484N8848L65197k950l32296l1979K00018
4291H261025K65106k50166O7277J5703J78067J24699L60422J08223J80990J03958
4281I415304k18764m05139J90744O36211j35456J73347K46738J06321j23075q5965
4271I800266J88232m5499k40151J28684K35141N29816o43884j52569N23418N26119
4261A0849573L89728k36275K07479l2651j29852L15212o1535N60631L02036J61351
4251A2325697m5180J4189N24768J96644M78788Q2847K29056r408k22068J67205
4241A3742538J42929J57507R3983M63836N98995j01650L07654Q26510J01714N59791
4231A6893807Q59848O36203J21016O63691P31321j2698M85855R5283l30106O45581
$$ plain form
4302 7957787 7523160 7797791 7795066 7396703 8004187 8063035 8428232 8425282 8092986 8061007 8261025
4291 8261025 8526131 8275965 8343242 8358945 8537012 8661711 9022133 9130356 9311346 9415304
4281 9415304 9196540 8791401 8982145 9618356 9482900 9656247 9902985 10009306 9886231 9800266
4271 9800266 9988498 9942999 9702848 9831532 10066673 10596489 9952605 9800036 10323454 10849573
4261 10849573 11239301 11003026 11210505 11177854 11048002 11363214 11301679 11862310 12164346 12325697
4251 12325697 12280517 12294706 12819474 13016118 13494906 13577753 13806809 13797401 13575333 13742538
4241 13742538 13885467 14042974 14136957 14600793 15199788 15098138 15405792 16232302 16334016 16893807
4231 16893807 17753655 18389858 18510874 19174565 19905886 19893188 20379043 20474326 20144220 20789801
4221B0789801M64559k92167j4747N90259M26726L81096J14184r6899J14627N58702
4211B3036141N89602J97926Q04859J82299n711L98875L53481K43712K46439q1637
4201B5965986K59590L31712O1319P71140O35197K96915K21241M11910j44393J37353
4191B8947970l29650j67244n78599r75240j313670j175773p97792j204735j172048
4182B1233219r66476l80218r20953p10987o01732o43588l10162N226J53048m32414
4172A6424963m39306j88090l65507l15361p37916q1725l45274Q0260J20004M868
4162A4156916n11459L22985J10284n94161n89397n80776m5047r1824P5741k53873
4152A1999389l56957P6116j61978k41292j83355j023994m649M9986k85553O7700
$$ plain form
4221 20789801 21254360 20962193 20947446 21537705 21964431 22345527 22459711 22362812 22477439 23036141
4211 23036141 23625743 23823669 24628528 24810827 24805116 25203991 25557472 25801184 26047623 25965986
4201 25965986 26225576 26557288 26618607 27389747 28024944 28321859 28543100 28955010 28810617 28947970
4191 28947970 28618320 28451076 27872477 26897237 25583567 24407794 23610002 22405267 21233219
4182 21233219 20266743 19886525 18965572 18254585 17652853 17009265 16699103 16704329 16857377 16424963
4172 16424963 15985657 15797567 15432060 15116699 14378783 14297058 13951784 14032044 14152048 14156916
4162 14156916 13645457 13968442 14078726 13484565 12895168 12314392 12269345 12177521 12253262 11999389
4152 11999389 11642432 11718548 11556570 11315278 11131923 10107929 10103280 10153266 9867713 9935413
4142I935413j97932k4200L00637J30784R9550l29081o13118r2759j66877n8571
4132H983846O3639K9986M521j92659j36268J01984M40828R9997P2193j75153M15739
4121I708653j2266j45697N53374J37638l9313J19791R7880o4551j78110p08542
4111I468857k0686L95255k17919p45705P85447j14459m15240J7452q8910P61N2087
4100I116940p3366j1575m7115j0801J61528k55501J27515l12970K52782J02706
4090I050143m31213j37993L04394L44008j35232j02040J89497q483j84471R0763
4080H979373K83738K6229J4014k04796J80509l67740k34915J61358O01858L26585
4070I766213k66833k89647J82420K11852M22974Q8551L00770K19595k86960R1003
$$ plain form
4142 9935413 9737481 9713281 10013918 10144702 10244252 9915171 9302053 9209294 9042417 8983846
4132 8983846 9047485 9077471 9081992 8889333 8753065 8855049 9295877 9395874 9468067 9292914 9708653
4121 9708653 9696387 9550690 10104064 10241702 10202389 10322180 10420060 10355509 10177399 9468857
4111 9468857 9448171 9843426 9625507 8879802 9665249 9550790 9135550 9153002 9064092 9064853 9116940
4100 9116940 9043574 9031999 8984884 8974083 9135611 8880110 9007625 8694655 8947437 9050143
4090 9050143 8618930 8480937 8785331 9129339 8994107 8892067 9081564 9073081 8888610 8979373
4080 8979373 9263111 9289340 9303354 9098558 9279067 8911327 8676412 8837770 9439628 9766213
4070 9766213 9499380 9209733 9392153 9604005 10026979 10115530 10416300 10635895 10348935 10439938
4060A0439938J07854L35258O65507J71512j17078J24166n8821J87540J06775L80866
4050A2343517K26896K10747N3224L22016m8748L85281m2411j10341M94596J61389
4040A3996166k69835L74123L58051k26061M91311P44056L29321J20593J016991
4031A6934716j5659L32915N85075J29379O02246P38202N00970O15101L82481L64236
4021B1169662N82514L95475L88228N72138j0128N7526Q53611J133272L98111P29409
4011B6269818J297153J463170P16230J474869J023617L40846J858613J588097
4003C6032413J655269J352910K009992K965113K902391L403682M101073M468270
3995E8891113N734395O136398O841415O679946M239019J992265O98913k370284
$$ plain form
4060 10439938 10547792 10883050 11548557 11720069 11602991 11727157 11668336 11855876 11962651 12343517
4050 12343517 12570413 12781160 12834384 13156400 13107652 13492933 13450522 13340181 13834777 13996166
4040 13996166 13726331 14100454 14458505 14232444 14723755 15467811 15797132 15917725 16934716
4031 16934716 16919057 17251972 17837047 17966426 18568672 19306874 19807844 20422945 20805426 21169662
4021 21169662 21752176 22147651 22535879 23108017 23097889 23155415 24009026 25142298 25540409 26269818
4011 26269818 27566971 29030141 29746371 31221240 32244857 32585703 34444316 36032413
4003 36032413 37687682 39040592 41050584 44015697 46918088 50321770 54422843 58891113
3995 58891113 64625508 70761906 77603321 84283267 88522286 90514551 91213464 88843180
3987H8843180m879067n768981o687600o431658n261824m632432l234548l392504
3979D8554566k696637k412174j545310j248013j313529j119834p31992p60715
3971C6726362r26119o97550q99287p01080j110529m45929o88275k29531n08733
3962C0519329o39765L20368J03807o0913r8898O76193K030J37797L46867J64385
3952C1471200K36357k4108K22343R75311J92028Q7154J89678j64779J334700Q93333
3942C5413217L96685P84771O52823Q19121J066280P30153J469491J834448J322314
3933D4489303J148960J134690J484551J160623L66471Q01666J128376J479101
3925E3193741J836558K605881L151972L671650L773176L520221M483069N452035
$$ plain form
3987 88843180 83964113 78195132 71507532 65075874 59814050 55181618 51947070 48554566
3979 48554566 45857929 43445755 41900445 40652432 39338903 38219069 37487077 36726362
3971 36726362 35800243 35102693 34203406 33502326 32391797 31945868 31257593 31028062 30519329
3962 30519329 29879564 30199932 30303739 30242826 30143928 30820121 30822151 30959948 31306815 31471200
3952 31471200 31707557 31683449 31905792 32881103 33073131 33160285 33349963 33185184 34519884 35413217
3942 35413217 35809902 36594673 37247496 38066617 39132897 39863050 41332541 43166989 44489303
3933 44489303 45638263 46772953 48257504 49418127 49784598 50586264 51714640 53193741
3925 53193741 55030299 57636180 60788152 64459802 68232978 71753199 76236268 81688303
3917H1688303P046571Q002447R416865J0558698J2898141J5878045J8212703K1927310
3909A85629083K4823260K3431054J4533124J731919j2868238k1612751k3667235
3902A92000216k1427494j7803634j3823089j1573325r580216q344649o659170
3895A02788639m792657l947217l183314k737153j883780q02075n50775q0267P3123
3886H4884524k01631j18115n86431j008262r93285K65243r5439j11201R43994
3877H2979397N81325O54830R29318J218425J364535L156383L889624L973368M551028
3868A03298233M881224N856783O042760Q153624R352254J1228685J3775351J5733752
3860A78322666J8862184K4350546K9633922L8257811M4712316L7037943Q101584
$$ plain form
3917 81688303 88734874 96737321 106154186 116712884 129611025 145489070 163701773 185629083
3909 185629083 210452343 233883397 248416521 250148440 237280202 215667451 192000216
3902 192000216 170572722 152769088 138945999 127372674 117792458 109447809 102788639
3895 102788639 97995982 94048765 90865451 88128298 86244518 85442443 84891668 84811401 84884524
3886 84884524 84682893 84564778 83978347 82970085 81976800 82242043 82146604 82035403 82979397
3877 82979397 83560722 84215552 85144870 86363295 87727830 90884213 94773837 98747205 103298233
3868 103298233 108179457 114036240 120079000 128232624 137584878 148813563 162588914 178322666
3860 178322666 197184850 221535396 251169318 289427129 334139445 371177388 379278972
3853C79278972j8810600l6680195m4787500l7476677k9195145k1840611j6796605
3846A73691639j2640150j0280121p380163n409747n324425m651383l122620k904497
3838A21978533k486583j393874j286350j284179m37090r43356j617540j210346
3830A11319215r20945r35643k70086j19212J48085m06885P41339L01087R24620
3821A10781575J370534Q29004J195027J941031J658637J789495K497704R88591
3813A23051598J865834J877606K404845J791945J921967J856235K570496K193453
3805A39533979J719008J992925K051219J763460J950978K018416J588586J035993
3797A53654564J433408J381171J479344J725053J282402P58704O06309K86026
$$ plain form
3853 379278972 360468372 323788177 279000677 241524000 212328855 190488244 173691639
3846 173691639 161051489 150771368 143391205 137981458 132657033 128005650 124883030 121978533
3838 121978533 119491950 118098076 116811726 115527547 115090457 114147101 112529561 111319215
3830 111319215 110398270 109462627 109192541 109073329 109221414 108814529 109555868 109856955 110781575
3821 110781575 112152109 112981113 114176140 116117171 117775808 119565303 122063007 123051598
3813 123051598 124917432 126795038 129199883 130991828 132913795 134770030 137340526 139533979
3805 139533979 141252987 143245912 145297131 147060591 149011569 151029985 152618571 153654564
3797 153654564 155087972 156469143 157948487 159673540 160955942 161714646 162320955 162606981
3789A62606981P8400J21621o3401l95262m94326r57544j183053r98773j327234
3780A57387409j766198j531294j130832j753602k205886j829622k198509k918295
3772A42053171k116598k440568l046259l535916k934706k443497k348753k603556
3764A20583318l281817k412378k778905k742844k857404k679738k590576l005258
3756I8234398k554847k294609k245761k150850j740439k070650j811148k320132
3748H1045962k128278j570563j596265j546298j872607j327340p22509j462914
3740F8819188j518234j062536n96506q18471j612277o37080o45197o90302m30341
3731F0808244j71567l62563o58845m51885K39037k06600q05455R8579J48810J57555
$$ plain form
3789 162606981 162685381 162807002 162743601 162348339 161854013 160896469 159713416 158714643 157387409
3780 157387409 155621211 154089917 152959085 151205483 148999597 147169975 144971466 142053171
3772 142053171 139936573 137496005 134449746 130913830 127979124 125535627 123186874 120583318
3764 120583318 117301501 114889123 112110218 109367374 106509970 103830232 101239656 98234398
3756 98234398 95679551 93384942 91139181 88988331 87247892 85177242 83366094 81045962
3748 81045962 78917684 77347121 75750856 74204558 72331951 71004611 70282102 68819188
3740 68819188 67300954 66238418 65641912 64823441 63211164 62574084 61928887 61238585 60808244
3731 60808244 60636677 60274114 59615269 59163384 59402421 59195821 58390366 58488945 58637755 58795310
3721E8795310j49500l36726L32292p5747k43235J48256M5401J8830L22754J62620
3711E9020255j694K69709J68104L08912P15795M55425O7852M74372N50978N40899
3701F2570607J45646P68093P95791N03523M26053R44110J019322O09380K63570
3692F8046095O0114M45057J049494Q50148J481453R01375K92038R19556J022949
3683G5068279O66694J199292J231452M82631Q13683R24781O63303J176792P06264
3674H2933171J15580N21550M76011J325296N07599Q09393R93831J143612J369557
3665I0195600P84448J625938P33996J258094R12198Q58828J119345J227875L15747
3656I9032069J185889J083323J091242J633691P35064N26032J086578Q33138N81209
$$ plain form
3721 58795310 58645810 58309084 58641376 58565629 58322394 58470650 58516051 58534881 58857635 59020255
3711 59020255 59018561 59288270 59456374 59765286 60481081 60936506 61004358 61478730 62029708 62570607
3701 62570607 62716253 63484346 64280137 64783660 65209713 66153823 67173145 67782525 68046095
3692 68046095 68106209 68551266 69600760 70450908 71932361 72833736 73125774 74045330 75068279
3683 75068279 75734973 76934265 78165717 78648348 79462031 80386812 81050115 82226907 82933171
3674 82933171 83048751 83570301 84046312 85371608 85879207 86688600 87682431 88826043 90195600
3665 90195600 90980048 92605986 93339982 94598076 95510274 96369102 97488447 98716322 99032069
3656 99032069 100217958 101301281 102392523 104026214 104761278 105287310 106373888 107207026 107788235
3647A07788235J086749N43016L88379O32006M41845k20646j52368n48699n30684
3638A09427833j72830j10803m04144J60805j54357k47477k53167P0687J81485
3629A08498032M60593Q27262N22389J073310J477118J565058J768529K348434
3621A18540725K746455K318596L464365L220600L322903L526989L410818L930941
3613A44482392L929559M014314M082115M169851L702967L611442M003553L804569
3605A75800762L153350L426600K965552K233854J778860J581007J370132K91217
3597A92601334K28835o18799j311336j090048k095567k595494k603118l288055
3589A79227752k542968l752080l607141l697307l750263l563505m027813l819690
$$ plain form
3647 107788235 108874984 109418000 109806379 110438385 110880230 110659584 110507216 109958517 109427833
3638 109427833 109255003 109144200 108740056 108900861 108746504 108499027 108245860 108316547 108498032
3629 108498032 108958625 109785887 110308276 111381586 112858704 114423762 116192291 118540725
3621 118540725 121287180 123605776 127070141 130290741 133613644 137140633 140551451 144482392
3613 144482392 148411951 152426265 156508380 160678231 164381198 167992640 171996193 175800762
3605 175800762 178954112 182380712 185346264 187580118 189358978 190939985 192310117 192601334
3597 192601334 192830169 192211370 190900034 189809986 187714419 185118925 182515807 179227752
3589 179227752 176684784 172932704 169325563 165628256 161877993 158314488 154286675 150466985
3581A50466985l685826l126766l243310l639815l286786k929558k308193l128931
3573A25117800k934331k518775k313176k039160j898584j227186j440890j596160
3565A09149538j119204r93847j218423j012815q40736o77402n69339m10030m67943
3556A01839799o03203J52956j36590l07506k00851o90858L82249r3922n8319k80594
3546A00003161n18504n7710l575o2829k16847j63982j17238J10411m60730p1144
3536I8441013l54201o63940L971k27742n22119j65129k49352n08381n49285q7968
3526I5116867m8035Q9934N88738K00191O48807J032240J302495Q72285J408975
3517A01212497J319428J743726K435424J834136J127657J698876P59470j65242
$$ plain form
3581 150466985 146781159 143654393 140411083 136771268 133484482 130554924 128246731 125117800
3573 125117800 122183469 119664694 117351518 115312358 113413774 112186588 110745698 109149538
3565 109149538 108030334 107036487 105818064 104805249 103964513 103287111 102717772 102307742 101839799
3556 101839799 101236596 101389552 101252962 100945456 100744605 100053747 100435996 100342074 100283755 100003161
3546 100003161 99484657 99426947 99423372 99360543 99143696 98979714 98862476 98972887 98512157 98441013
3536 98441013 98086812 97422872 97426843 97199101 96676982 96511853 96262501 95754120 95204835 95116867
3526 95116867 95068832 95158766 95747504 95947695 96596502 97628742 98931237 99803522 101212497
3517 101212497 102531925 104275651 106711075 108545211 109672868 111371744 112131214 111965972
3509A11965972P1828K15814n03084l9935o7313q60174J39999m5907n87245j185811
3499A09104144j615079j173210j774225k486383k494203j931739j850952k335407
3491I3442946k271570j770791j120872j565845j101446p05005q11480J16296k42051
3482H3970182p43611k54674k548l52466k67096N47103J43291L31975R01355j65562
3472H4107949O46183P33461K60092L51443O41111j10731Q3035J127561O42451
3463H8482555L93626R68864P30435M83431O67622N82937J119836O85007J315424
3454I5429737Q96831J166109J699899Q09008J248131K024439J411605K029022
3446A06714781K908128K224911K390568K923271K767452K838538L938457L706588
$$ plain form
3509 111965972 112037800 112253614 111750530 111710595 111643282 110783108 110923107 110877200 110289955 109104144
3499 109104144 107489065 106315855 104541630 102055247 99561044 97629305 95778353 93442946
3491 93442946 91171376 89400585 88279713 86713868 85612422 84907417 84095937 84212233 83970182
3482 83970182 83226571 82971897 82969349 82616883 82349787 82896890 83040181 83372156 84273511 84107949
3472 84107949 84754132 85487593 85747685 86099128 86740239 86629508 86712543 87840104 88482555
3463 88482555 88876181 89845045 90575480 91058911 91726533 92309470 93429306 94114313 95429737
3454 95429737 96326568 97492677 99192576 100001584 101249715 103274154 104685759 106714781
3446 106714781 109622909 111847820 114238388 117161659 119929111 122767649 126706106 130412694
3438A30412694M545918L673196M517265M393125M948344N469494N014800N554351
3430A68529187N704901N834521N455227O176433O348813O237757N747217N920654
3422B15954710N861267O115099N442265N406831N432720N185240N002135N162425
3414B59562692M817495L911626M081848L925815L263098L218934L108406L064608
3406B88954522K275074K284437J020504O80887J072243Q39158j51990L10474q2541
3397B97202768r04941n93167o06612r77947j891469j652123k169309k539474k618036
3388B83249690k735190l740069l175414l774653m421333l668090m631116m947709
3380B52156116m881768m742722o477550n145866n227962n780119n183661n594570
$$ plain form
3438 130412694 134958612 138631808 143149073 147542198 152490542 157960036 162974836 168529187
3430 168529187 174234088 180068609 185523836 191700269 198049082 204286839 210034056 215954710
3422 215954710 221815977 227931076 233373341 238780172 244212892 249398132 254400267 259562692
3414 259562692 264380187 268291813 272373661 276299476 279562574 282781508 285889914 288954522
3406 288954522 291229596 293514033 294534537 295215424 296287667 297126825 296974835 297285309 297202768
3397 297202768 296297827 295704660 295098048 294120101 292228632 290576509 288407200 285867726 283249690
3388 283249690 280514500 276774431 273599017 269824364 265403031 261734941 257103825 252156116
3380 252156116 247274348 242531626 236054076 230908210 225680248 219900129 214716468 209121898
3372B09121898n965781o085871o075896n970767n128278n432624n330378n455936
3364A63676367m777267m878844m497567m516859l716619l759366l710879l307341
3356A30511625l162644l039192k321446j869943l016364k572724j675686j774152
3348A11079474j742899j687102j744056j328266j549272j524627j376042j108352
3340I9018858j659346j216937j684837j291523j158692j248256j532741j587723
3332H7638803r84108j466260j880878j298809k190738k016815j231812j442532
3324G5126851j400028j308691j718963k023183j429683j325872j947380j330788
3316F2642263j097133j376504j424468j154823j264882j996168j041366j328378
$$ plain form
3372 209121898 203156117 197070246 190994350 185023583 179895305 174462681 169132303 163676367
3364 163676367 158899100 154020256 149522689 145005830 141289211 137529845 133818966 130511625
3356 130511625 127348981 124309789 121988343 120118400 117102036 114529312 112853626 111079474
3348 111079474 109336575 107649473 105905417 104577151 103027879 101503252 100127210 99018858
3340 99018858 97359512 96142575 94457738 93166215 92007523 90759267 89226526 87638803
3332 87638803 86654695 85188435 83307557 82008748 79818010 77801195 76569383 75126851
3324 75126851 73726823 72418132 70699169 68675986 67246303 65920431 63973051 62642263
3316 62642263 61545130 60168626 58744158 57589335 56324453 54328285 53286919 51958541
3308E1958541q03409k96827r24676j121695r06037n32110j022554m69934o33156
3299D5248143q31259n99716k55907p05811r66629p8488q12966o17447k50993n29639
3289C9599288r44097m58776j080119o02181n10195q38009m80309K63183p34209
3280C4214576j021309l27096l89810q99919p11392l27935m74090r62867k38380
3271B8861778m29474o5045j75059q02540n45265j99987q2952o66679q52208m25790
3261B4616779k21596n35458j8254m42643n43385j15815q77073N226k1730J1156
3251B1857207p4545J97342l28871r70367j92215n09330p1718K38378L6591o05672
3241A9576800K78270j25619l70607l5358m58801K67227l75226J05666K46341k15190
$$ plain form
3308 51958541 51155132 50858305 49933629 48811934 47905897 47373787 46351233 45881299 45248143
3299 45248143 44416884 43817168 43561261 42855450 41888821 41810333 40997367 40379920 40128927 39599288
3289 39599288 38655191 38196415 37116296 36514115 36003920 35165911 34685602 34948785 34214576
3280 34214576 33193267 32866171 32476361 31576442 30865050 30537115 30063025 29100158 28861778
3271 28861778 28432304 28367259 28192200 27389660 26844395 26644408 26561456 25894777 25042569 24616779
3261 24616779 24395183 23859725 23841471 23398828 22855443 22739628 21862555 21867781 21846051 21857207
3251 21857207 21782662 21980004 21651133 20680766 20488551 19979221 19907503 20145881 20182472 19576800
3241 19576800 19855070 19729451 19358844 19323486 18864685 19131912 18756686 18862352 19108693 18893503
3231A8893503k78037j3207m39622j14535K75945m40993j57877m0189K67511M25300
3221A8377799l38710j99523l29752k92634p6616k2442R7582j03618l57317l0483
3211A6724286M31899k50481N3606l78574m04611L54936n91830n03376J03000j66116
3201A5372739R1148m04585r1845m02198o55761Q66943l20025o02094L01962l52641
3191A3803643k29744j85478N12378J13867k84202k90543k40425m76218J58757
3182A2882035j41019J08762j29212R654j65215L52401L61308J77045k27474n3004
3172A3175281j63104N48450M41302l13985j21489K08142r6226K13203k24306J91735
3162A3859003j35255K83101l74517K35371J89833n10111l50979K01767O01875
$$ plain form
3231 18893503 18615466 18602259 18162637 18048102 18324047 17883054 17725177 17684988 17952499 18377799
3221 18377799 18039089 17839566 17509814 17217180 17140564 17118122 17215704 17112086 16754769 16724286
3211 16724286 17156185 16905704 16959310 16580736 16176125 16531061 15939231 15435855 15538855 15372739
3201 15372739 15463887 15059302 14967457 14565259 13909498 14776441 14456416 13854322 14156284 13803643
3191 13803643 13573899 13388421 13900799 14014666 13730464 13439921 13199496 12723278 12882035
3182 12882035 12741016 12849778 12720566 12730220 12565005 12917406 13278714 13455759 13228285 13175281
3172 13175281 13012177 13560627 14001929 13687944 13566455 13774597 13678371 13891574 13667268 13859003
3162 13859003 13723748 14006849 13632332 13867703 14057536 13547425 13196446 13398213 14000088
3153A4000088k17600J58819j96405O0352o36106J38071L08516M2336k45367k22467
3143A3190237l45223q6254m7696j51356L44487j60047l19677J63450m26415j91200
3133A1970306k70656j91549L9287j8141q53490M72007J05863r6101k62580l91670
3123A0503276K38381p19714j03052O90197k80820k09775j1126L07326L85943l32500
3113A0468136j25359J80512M97587j03923n38616K86236O62574l35883L18080
3104A1309344q0967k9279L58818l7153J80164K50972L64836K77667J84248O71031
3094A3449681N18821P4595M77174K64265J68484L33054k66507o91454j45483l46306
3084A3836324Q1176o0022l38902p07910k76147o74241m31930n31420o8545n01369
$$ plain form
3153 14000088 13782488 13941307 13744902 13805254 13169148 13307219 13615735 13658071 13412704 13190237
3143 13190237 12845014 12758760 12711064 12559708 12904195 12744148 12424471 12587921 12161506 11970306
3133 11970306 11699650 11508101 11547388 11529247 10675757 11147764 11253627 11157526 10894946 10503276
3123 10503276 10741657 10021943 9918891 10609088 10328268 10118493 10107367 10414693 10800636 10468136
3113 10468136 10342777 10523289 11020876 10916953 10378337 10664573 11327147 10991264 11309344
3104 11309344 11228377 11199098 11557916 11520763 11700927 11951899 12316735 12594402 12778650 13449681
3094 13449681 13968502 14043097 14520271 14784536 14953020 15286074 15019567 14328113 14182630 13836324
3084 13836324 13917500 13857478 13518576 12810666 12534519 11860278 11428348 10896928 10828383 10327014
3074A0327014m61531m55425k07948k97389m75745L4569k38937K0960m17670q65013
3064F962885K66297J56493l82094k81830K89179K362j35868J7141K84309q34752
3054F344122l82127j9253l24749N5033R3715K17387l60998l27590P1349L07695
3044E674584N17418k87110o13536J3806q2761l61069K23401N58210r5134q8330
3034E459479K32776J9963m91324K36821K53227r0947p6624M75928j12545R3241
3024E999995j84725j7333J32062m8146l12694o1128J28556J38332L03514l30007
3014E748426k18024N34501j81814N6889m81744K69016q2994j34991n32169j66568
3004D810528m4951K19818L823k4845k07448m59578k94529p8425j03989L21564
$$ plain form
3074 10327014 9865483 9410058 9202110 8904721 8428976 8463545 8224608 8245568 7827898 6962885
3064 6962885 7229182 7385675 7003581 6721751 7010930 7013292 6877424 6894565 7178874 6344122
3054 6344122 5961995 5942742 5617993 5673026 5766741 5984128 5623130 5295540 5366889 5674584
3044 5674584 6192002 5904892 5291356 5305162 5222401 4861332 5084733 5642943 5547809 5459479
3034 5459479 5692255 5712218 5220894 5457715 5710942 5619995 5543371 6019299 5906754 5999995
3024 5999995 5815270 5797937 5929999 5881853 5569159 5508031 5636587 5774919 6078433 5748426
3014 5748426 5530402 6064903 5883089 5939978 5458234 5727250 5644256 5509265 4977096 4810528
3004 4810528 4765577 4985395 4989218 4964373 4756925 4297347 4002818 3924393 3820404 4141968
2994D141968L00771j96898k3051j92657L6751l7533m7440l91467n04932J44651
2984C230163K80072j32492j36943P50267K22258k71474j67835J83978k67998p8542
2974C611454l66315M4536M59340m64268J49558K86025R7836m15197L84854n53378
2964C234445j27710J09421k1012M11266q6202j08179J85898k75407R2366l51835
2954C063051m66487J44863o5272q789j14537k4801K09132L94965K68254o48477
2944B751902J26826O2907J87070L91971M1691n69993l99505j39327L88629J26655
2934B968826J71203k23717k88864j65018k25228l50639J47682N69914l03986m84299
2924A815874K97343k30453m742J68712p0762j01947K00874O08178k21002l73230
$$ plain form
2994 4141968 4442739 4245841 4222790 4030133 4066884 4029351 3981911 3590444 3085512 3230163
2984 3230163 3510235 3377743 3240800 3991067 4213325 3941851 3774016 3957994 3689996 3611454
2974 3611454 3245139 3289675 3749015 3284747 3434305 3720330 3818166 3402969 3787823 3234445
2964 3234445 3106735 3216156 3195144 3606410 3520208 3412029 3597927 3322520 3414886 3063051
2954 3063051 2596564 2741427 2676155 2667366 2552829 2528028 2737160 3132125 3400379 2751902
2944 2751902 2878728 2941635 3128705 3520676 3562367 2992374 2592869 2453542 2842171 2968826
2934 2968826 3140029 2916312 2627448 2462430 2237202 1886563 2034245 2604159 2300173 1815874
2924 1815874 2113217 1882764 1878022 2046734 1975972 1874025 2074899 2683077 2462075 2088845
2914B088845l88787j04754M2687j0298l59702R1606L78137j88155k28454M63878
2904A785003K4903j89397p3205k32843k62851P5391n7362O5516M09967j3824J82437
2893A713735L38700j17271k82495Q895l78070l53266N15650l960q6882j12478
2883A242558K47449j47430k91284N39367k28918j92791j33251J90324M06343k55559
2873A376808k74639P6161O16627P752j36302k9106l41312M0709k12963n1440J52138
2862A224433k40903j90390l40962N60973L6123M953q6171Q6734K26951j13451
2852A168290m7827l04014r4905J99776L08125k94072j04476N97586L09117o2895
2842A674705j82365K09079o39796j20945j20403J32461K83297J33619k11857k01197
$$ plain form
2914 2088845 1700058 1595304 1637991 1627693 1267991 1359597 1737734 1549579 1321125 1785003
2904 1785003 1809906 1620509 1547304 1314461 1051610 1127001 1069639 1135155 1545122 1531298 1713735
2893 1713735 2052435 1935164 1652669 1661564 1283494 930228 1445878 1441918 1355036 1242558
2883 1242558 1490007 1342577 1051293 1590660 1361742 1168951 1035700 1226024 1632367 1376808
2873 1376808 1102169 1178330 1794957 1802709 1666407 1637301 1295989 1336698 1123735 1072295 1224433
2862 1224433 983530 793140 452178 1013151 1049274 1054227 968056 1054790 1281741 1168290
2852 1168290 1120463 816449 721544 921320 1229445 935373 830897 1428483 1737600 1674705
2842 1674705 1492340 1701419 1061623 940678 820275 952736 1236033 1369652 1157795 956598
2832I56598K83288K26790r5534j6479J87128m6751o0317l0873K27557j57242L29833
2821A803998o39814L31968m84373K75575L21626j15538m6719M10278m0587J85824
2811B002238K05634r1878L78626j43745J46675O1891k0426M58699K46444p28153
2801B516005O69900J74217j2603K1310q2192m2169k24093K15262N7333p293J57034
2790C442711l20756k16143M06390M55397Q5203K69386J86580m33589L40016J70193
2780D385388M12557j89478J81045M88315l20302P12403n36135l17576j71085J28154
2770D773286k53591m94955p66522m56245J22239n7595K96535J23073j48802L8474
2760C175897L3353J50678j6843J19899K61465j47956l12506J2109K76723k6320
$$ plain form
2832 956598 1239886 1466676 1371142 1354663 1541791 1495040 1434723 1403850 1631407 1474165 1803998
2821 1803998 1164184 1496152 1011779 1287354 1608980 1493442 1446723 1857001 1816414 2002238
2811 2002238 2207872 2115994 2494620 2350875 2497550 2559441 2539015 2997714 3244158 2516005
2801 2516005 3185905 3360122 3347519 3368829 3286637 3244468 3020375 3235637 3292970 3285677 3442711
2790 3442711 3121955 2905812 3312202 3767599 3852802 4122188 4308768 3875179 4215195 4385388
2780 4385388 4797945 4608467 4789512 5277827 4957525 5669928 5133793 4816217 4645132 4773286
2770 4773286 4519695 4024740 3258218 2801973 2924212 2866617 3163152 3286225 3137423 3175897
2760 3175897 3209250 3359928 3343085 3462984 3724449 3576493 3263987 3276096 3552819 3526499
2750C526499J5724O6038N1667j798J62041o32482n3473J95972k30598o92726M33622
2739B840486j65716M2467J96813m57732n31361l92269K61168J29700J97786L07750
2729B429092j38797p6705p6714n96992J43825q2150q3107K60563L47818J89540
2719B316373m43406l4221M22959k3366L89680n05639L5135o3272k47892O9722
2709A916073l13663K68362K27682J57112K07530K78831J47701j46580j24998K29434
2699B847484j72713K54263P0216M28766j04499k08815K85985p100o4621j18196
2689C210770l86721m68583J79842R0780k19351m04339Q0645n44276k62938L0684
2679A306513L07969m8433J65902j37744l50872O5098J1461p6780r6570l7377l68475
$$ plain form
2750 3526499 3542223 3608261 3659928 3658130 3820171 3187689 3134216 3330188 3099590 2406864 2840486
2739 2840486 2674770 2717237 2914050 2456318 1924957 1532688 1793856 1923556 2121342 2429092
2729 2429092 2290295 2213590 2136876 1539884 1683709 1601559 1518452 1779015 2126833 2316373
2719 2316373 1872967 1838746 2261705 2238339 2628019 2122380 2157515 2094243 1846351 1916073
2709 1916073 1602410 1870772 2098454 2255566 2463096 2741927 2889628 2743048 2618050 2847484
2699 2847484 2674771 2929034 2999250 3428016 3323517 3114702 3400687 3393587 3328966 3210770
2689 3210770 2824049 2355466 2535308 2626088 2406737 2002398 2083043 1538767 1275829 1306513
2679 1306513 1614482 1566049 1731951 1594207 1243335 1308433 1319894 1243114 1146544 1109167 740692
2668G40692j09153M77599j67997J06828O06096o61685K72385j69623J1679j92117
2658I14704L53151k5505l41059j84617J36413J26744P994L24198n24214k73821
2648E13988q805J7189j39824N4054j70434J45249K92641k54744q7751K06328j584
2637E66307O2778j21119j49685Q4360l7269j00069L99197q749J93732l26373l3473
2626E29637J2641l21963m0677j75644N81789J48774j60167k89831r9581J90236
2616C75214J51501J8823N7009P7229l86190o7263J6550m55853j01724L63572L84563
2605D33431k90536k08837k9902m1650M82255J4231J5795J79592J67421m31907
2595B89893l34516J96685Q1470K44940k325j50096q4889M22444P6090q06296M54572
$$ plain form
2668 740692 631539 1109138 941141 1047969 1654065 992380 1264765 1095142 1106821 914704
2658 914704 1267855 1242350 901291 716674 853087 979831 987825 1312023 787809 513988
2648 513988 505183 522372 382548 436602 266168 411417 704058 449314 361563 567891 566307
2637 566307 629085 507966 358281 442641 405372 305303 704500 695751 889483 563110 529637
2626 529637 542278 220315 179638 3994 585783 734557 574390 284559 184978 375214
2616 375214 526715 545538 602547 679776 293586 226323 242873 -212980 -314704 48868 433431
2605 433431 142895 -65942 -95844 -137494 344761 358992 374787 554379 721800 289893
2595 289893 -44623 152062 233532 478472 476147 326051 241162 663606 739696 -66600 387972
2584C87972L11916m31972q722L38427j19626j8049L7008j41450K01722m02363
2574A54863J76453M00350l56247j50785l12190M9265P8294L96960r3300o04426
2564b60763M87583K40063r6194j37901j13293J90318K68248k3108n52720L4095
2554C6328J06931K44510o2091M196R0355n20520L37762L33876k54596k93956L09857
2543C32652j98439j08583M9267K08356J36087k01750j24763j2214N475k42080
2533a55992P8349M47740n6987J76510J6102N6018j6990k17357k77328J38436K12183
2522D00684l79282n8787N33239l34580q3920j62257L61479K99744l39118k87216
2512e0014o4811K68566n18928o1098J41933K9646J89793L82133m08346l01109
$$ plain form
2584 387972 699888 267916 259194 597621 477995 459946 496954 355504 557226 154863
2574 154863 331316 731666 375419 224634 -87556 -38291 40003 436963 343663 -260763
2564 -260763 226820 466883 370689 232788 119495 309813 578061 554953 2233 36328
2554 36328 143259 387769 325678 329874 420229 -100291 237471 571347 316751 22795 332652
2543 332652 134213 25630 74897 283253 419340 217590 92827 80613 86088 -155992
2533 -155992 -77643 370097 313110 489620 505722 561740 544750 327393 50065 188501 400684
2522 400684 21402 -37385 495854 161274 77354 -84903 276576 576320 237202 -50014
2512 -50014 -114825 153741 -365187 -426285 -284352 -254706 -64913 317220 -91126 -392235
2502c92235L40583K1369j06413p5604K20065N64914J25007j72900k95674l6195
2492A92917q4141K0629n30980L27745R6929r0954n0755J14273L01461j32299J23597
2481B88422J74207j78118J1923J8875m36361l41897P34336M7025K6477r4363k26194
2470B4332M53752o23674J49171J79005J58387J40883m18769J14298R0840l02382
2460c4157K1548n94695O3821J24723J88583L07660J66688j44145J93450L4620
2450C28096k05118N9916j06744l48900m01493J99464K10696J32545K44363j73104
2440f0279m4235J60227k57789m29838L89643J03688M350L23920K49016N315j01636
2429C42382k42504R950L72180N0729o6997k44482l05823p2022J72058O03860l11015
$$ plain form
2502 -392235 -51652 -30283 -136696 -212300 7765 572679 697686 524786 229112 192917
2492 192917 108776 129405 -401575 -73830 23099 -67855 -118610 -4337 297124 164825 288422
2481 288422 462629 284511 296434 315309 -121052 -462949 271387 318412 344889 250526 24332
2470 24332 478084 -145590 3581 182586 340973 481856 63087 177385 268225 -34157
2460 -34157 -12609 -607304 -543483 -418760 -230177 77483 244171 100026 293476 328096
2450 328096 122978 182894 76150 -272750 -674243 -474779 -264083 -131538 112825 -60279
2440 -60279 -104514 55713 -202076 -631914 -242271 -138583 -134233 189687 438703 444018 342382
2429 342382 99878 109828 482008 532737 465740 221258 -84565 -156587 15471 619331 308316
2418C08316k68331M60566p57393O2714J77048k67125L23850J58716J61668o49400
2408b89371l7770Q14387q59143K24967J40783j55472O9037k08488J86998M93889
2398C79817k13265j81852k9889M4750K39445k47737K18904q96689J58741Q34315
2388C06540K38503q7891j27261j82195m75850L35213l774j38089p2617O69389
2378D61968l1078J61106l12606l01060J17067N167m07695J69547M47934L7856
2368C48206o06591K77202M22938k51658J32709k68834o53791K29784L8216k48222
2358e80041M37311L59231K16161k44866k67203J15183k20807j28308k95507o3408
2348f72254L09421K60328l56265J75036L18745m32704M61912r8272r0771M65387
$$ plain form
2418 308316 39985 500551 -256842 -194128 -17080 -284205 39645 198361 360029 -289371
2408 -289371 -327141 487246 -371897 -146930 -6147 -161619 -92582 -301070 -114072 379817
2398 379817 166552 -15300 -45189 -439 239006 -8731 210173 -686516 -527775 306540
2388 306540 545043 457152 329891 147696 -328154 7059 3285 -134804 -207421 461968
2378 461968 430890 591996 279390 -21670 95397 100564 -307131 -137584 310350 348206
2368 348206 -258385 18817 441755 190097 322806 53972 -599819 -370035 -331819 -580041
2358 -580041 -142730 216501 432662 187796 -79407 35776 -185031 -313339 -608846 -672254
2348 -672254 -362833 -102505 -458770 -283734 35011 -397693 64219 -34053 -124824 340563
2338C40563J15536r4787k68703l79427k8324p8838L3372N3293J48247k49784O1396
2327c47456J9317J04936J15303M84912k79014N0708j9686q9213m2397l8666j79981
2316b21237J40513J64352K17380j66795K03973K24317l11602l93375L11480j61896
2306G110l7875L91700Q7071k33410L48727k49621k58240O44883l34699M1037L96558
2295H03241k30305k63483O5160M70930l60317j76707R6263o20338M64386m2477
2285B06353m13256K01469L23581P9983K7099n06403J40935j21242J39246j53991
2275g6226j35864Q45626j72552k596o7197m02195N2672P904k73512K93919M33646
2264E03625j98651n4281L8955J27417k13956K92993M09094p89699L07186N9052
$$ plain form
2338 340563 456099 361312 92609 -286818 -315142 -393980 -360608 -307315 -159068 -408852 -347456
2327 -347456 -328139 -223203 -107900 377012 97998 148706 129020 39807 -2590 -41256 -221237
2316 -221237 -80724 83628 301008 134213 338186 562503 250901 -142474 169006 7110
2306 7110 -30765 360935 448006 214596 563323 313702 55462 700345 365646 406683 803241
2295 803241 572936 309453 374613 845543 485226 308519 404782 -215556 248830 206353
2285 206353 -206903 -5434 318147 398130 425229 -81174 59761 -61481 77765 -76226
2275 -76226 -212090 633536 460984 458388 391191 -11004 41668 49572 -223940 69979 503625
2264 503625 304974 250693 289648 417065 203109 496102 905196 115497 422683 481735
2254D81735l36666J95115M55798m49704l21639M65509j76541m9458o8360J24222
2244C20011j32508K09073l48843j44835N30748L80602n3564l77070O744N8867
2234D49225l57475K79517N9861l81078K09549N75683m36461l61694L22307n30162
2224a70728N39050J41610n54401L74504l1544m87809m7142Q99513L02325k72822
2214F92556p00024L44316J11922K48303m05339J95887N68668k23954J83606o4096
2204I51845n24713J76200l80861o2956P8531j96515J77587O4889j1939o5508k93931
2193h7371J20902O33487m56400r2953J94810m2349J03816J171J69688K91970L16532
2182A153303m66835R235m10060L04921N3135O9867Q40346j60713r5812l53890
$$ plain form
2254 481735 145069 340184 795982 346278 24639 490148 313607 264149 195789 320011
2244 320011 187503 396576 47733 -97102 433646 814248 760684 383614 390358 449225
2234 449225 91750 371267 431128 50050 259599 835282 398821 37127 359434 -170728
2224 -170728 368322 509932 -44469 330035 298491 -189318 -236460 663053 965378 692556
2214 692556 -7468 336848 448770 697073 291734 487621 1056289 832335 1015941 951845
2204 951845 427132 603332 222471 159515 238046 41531 219118 284007 272068 206560 -87371
2193 -87371 33531 667018 210618 117665 312475 270126 373942 375113 544801 836771 1153303
2182 1153303 686468 695703 285643 590564 643699 713566 1553912 1393199 1297387 943497
2172I43497K99909O48213N7118l42237N72376n10844m23652N0896j98542o2897
2162A033837k2248m7965J57178p7406J99996L24216L0648k6034k18604m99239
2152H54379K00412Q2104M01694l23544J24594J60587k8448j16114k70035n7220
2142A028409K28637P5330M16782k07300k19646N05405k25593k22545J46379l03425
2132A222433j3460Q58452n575N5013L67862N214j09601j20268O98361k81452q7597
2121B589382O40518m74791J94714M01155m49157N54929K94007l23598K37610k87247
2111C377522k7106K98796P71858O5567k90090K24421K43050l019L39386J03951
2101E104336K6210j42016M39696l07992K78400P87939l37906K67176Q44814n1251
$$ plain form
2172 943497 1243406 1891619 1948737 1606500 2178876 1668032 1244380 1295276 1096734 1033837
2162 1033837 1011589 963624 1120802 1043396 1243392 1567608 1598256 1572222 1353618 854379
2152 854379 1054791 1136895 1538589 1215045 1339639 1500226 1471778 1355664 1085629 1028409
2142 1028409 1257046 1332376 1749158 1541858 1322212 1827617 1602024 1379479 1525858 1222433
2132 1222433 1208973 2067425 2061850 2116863 2484725 2489939 2380338 2260070 2958431 2676979 2589382
2121 2589382 3229900 2755109 2949823 3350978 2901821 3456750 3750757 3427159 3664769 3377522
2111 3377522 3350416 3649212 4421070 4486637 4196547 4420968 4664018 4660999 5000385 5104336
2101 5104336 5130546 4988530 5428226 5120234 5398634 6186573 5848667 6115843 6960657 6909406
2091F909406L76389L80235J52916M04664J81444K53682k26043J104850J178183
2082A0715726k2905Q67339O87552L59568N48702O80855O08183P68543J030185
2073A6243748J004163K105070K038992K274743K123404K336271K590337K489283
2065C3206011L387646M470155N284586P088286Q360587J0342982J3005191J9202710
2057A04348154K4162343K4500009M644453j1269061j9639582k5792832j8873408
2050H2080076j4178025r854544q431459n659914m018072l380590k593501j693191
2042C2270780j809720k274213k643815k501595j774489j390932j200952j490871
2034A7184193j176500j180814r95128k85438l32246n95311q52127l61980m27373
$$ plain form
2091 6909406 7285795 7666030 7818946 8223610 8405054 8658736 8432693 9537543 10715726
2082 10715726 10692821 11560160 12247712 12607280 13155982 13836837 14445020 15213563 16243748
2073 16243748 17247911 19352981 21391973 23666716 25790120 28126391 30716728 33206011
2065 33206011 36593657 41063812 46348398 53436684 61797271 72140253 85145444 104348154
2057 104348154 128510497 153010506 157654959 146385898 126746316 100953484 82080076
2050 82080076 67902051 58047507 49616048 43956134 39938062 36557472 33963971 32270780
2042 32270780 30461060 28186847 25543032 23041437 21266948 19876016 18675064 17184193
2034 17184193 16007693 14826879 13831751 13546313 13214067 12618756 11766629 11404649 10977276
2025A0977276k19963p37253P3478M9118k82940p38994m58442l99282J13651l81422
2015G995227l92958m48141j99673j30347N5812n27131n31450O6763m12612p4920
2005E400570j51135k14231k00289O4581m3658m69058m33536j64424m1338k06227
1995C541255P61615k99009p82377N08341k16900l84425K10427R1535L45137P9961
1985C855560m59212n87405l05880N12312l06655l0866J4304Q5830m8070J67077
1975B896995l35113p65731M07711r8839j83676m470q6212K13984l38949j64645
1965A541055n5050N38285k71590Q1288k10597K11985j87886K2389l5564l63804
1955A270511j40841L0898j1877R358Q5456k36452P0128j0880J66217l29392n94561
$$ plain form
2025 10977276 10757313 10020060 10093538 10142656 9859716 9120722 8662280 8262998 8376649 7995227
2015 7995227 7602269 7154128 6954455 6824108 6879920 6352789 5821339 5888102 5475490 5400570
2005 5400570 5249435 5035204 4834915 4899496 4855838 4386780 3953244 3788820 3747482 3541255
1995 3541255 4302870 4003861 3221484 3729825 3512925 3128500 3338927 3430462 3775599 3855560
1985 3855560 3396348 2808943 2503063 3015375 2708720 2677854 2692158 2777988 2729918 2896995
1975 2896995 2561882 1796151 2203862 2105023 1921347 1916877 1830665 2044649 1705700 1541055
1965 1541055 1486005 2024290 1752700 1833988 1623391 1835376 1647490 1669879 1634315 1270511
1955 1270511 1129670 1160568 1148691 1158049 1243505 1007053 1077181 1066301 1232518 903126 308565
1944C08565O64672J10117k55025J00383j28066J03677K47546J53026j85078Q1450
1934A201267J6960k34529L80567q2755j113774j29967N06276J67167K31836J31465
1924A074513k96912l3431M59343l36072j5928M06882l07381p8303L23094o84642
1914E11163M3516K61914N3877k61654J02150M65994m62953q845o523k99482K48577
1903F47734K34388j41781R6312n92008J50668J97706J97714J00617m40749J64258
1893F14859j83601p00369J35860J65100J28852k03021m9525L15378O6025J69506
1883D59064P8477j74387L12001k60206j67603L3482L04130l80081J88249n6340
1873C36786l04605J50568N1098P1880L63764j56682k62427P3024p42M6828k185
$$ plain form
1944 308565 973237 1083354 828329 928712 800646 904323 1151869 1304895 1119817 1201267
1934 1201267 1218227 983698 1364265 1281510 167736 37769 544045 711212 943048 1074513
1924 1074513 777601 744170 1203513 867441 851513 1258395 951014 872711 1195805 511163
1914 511163 554679 816593 870470 608816 710966 1176960 714007 705162 698639 399157 647734
1903 647734 882122 740341 836653 244645 395313 593019 790733 891350 450601 614859
1893 614859 431258 -269111 -133251 31849 160701 -42320 -91845 223533 289558 459064
1883 459064 537541 363154 675155 414949 247346 280828 584958 204877 393126 336786
1873 336786 32181 182749 233847 305727 669491 512809 250382 323406 322664 369492 367307
1862C67307k02989j75466j46809k918O44167j88579P3447l2812l6684j25837l85120
1851b12293K57514J50030J15524k38729L1354K31941L86119m28889k30136N71270
1841F33705l11960R6532k38912k81003J37437N96074l09229O9798j11148j04038
1831A77256j78243J22211R1344j40678K290O40425K68703J60688m46550n63534
1821A33912J86429O655k58335K00846q8931J45044P91671P6300j06253l64363
1811G22975k59257m86198P9565J34386l8192p147N67208l43653l23829M02039
1801D47897K82343o33053L82845L0982k46156L40426P2813l19498K77824k33170
1791D03253j00962O48849l8119l44945j29685L69599n23025o9268l063o6540M22444
$$ plain form
1862 367307 164318 -11148 -157957 -160875 483292 294713 368160 335348 298664 172827 -212293
1851 -212293 45221 195251 310775 72046 103400 335341 721460 292571 62435 633705
1841 633705 321745 418277 179365 -101638 35799 631873 322644 392442 281294 177256
1831 177256 -987 121224 212568 71890 74180 714605 983308 1143996 697446 133912
1821 133912 320341 326996 68661 269507 180576 325620 1117291 1193591 1087338 722975
1811 722975 463718 -22480 57085 191471 153279 146132 713340 369687 45858 447897
1801 447897 730240 97187 480032 511014 264858 605284 678097 358599 636423 403253
1791 403253 302291 951140 913021 568076 438391 807990 284965 215697 212634 146094 568538
1780E68538j05021m9644J53883m87341J86480l74308J16032p6004l33159P119
1770c93425M81225L456j0665N77335j88195M8758o3580m74889J65891K64637m17591
1759g043j58431j7625M00879p45053K43936R99485l78519J82239J537m97504M7726
1748G1627M0404j27328K59383Q4086j54720j13510m2582K05658p4728J25403M23202
1737F96895m71537j24730M62189q14795N0656J91561m5357K11476J03649l98175
1727a38168l7687N2810m26184O49431M29557j76724J89193r311j94016k59711
1717G9190j49249j42676k01044J98321K52106k62878N52817R4086n37431r7011
1707b13769M5344J42675K7727j46085j99394K3025n9338L02672j23897O53984
$$ plain form
1780 568538 463517 413873 567756 80415 266895 -107413 8619 -67385 -400544 -393425
1770 -393425 87800 91256 80591 657926 469731 518489 454909 -19980 145911 410548 -7043
1759 -7043 -165474 -183099 217780 -527273 -283337 716148 337629 519868 521405 23901 71627
1748 71627 112031 -15297 244086 328172 173452 59942 17360 223018 148290 273693 696895
1737 696895 225358 100628 562817 -251978 -201322 -9761 -55118 156358 260007 -138168
1727 -138168 -175855 -123045 -549229 100202 529759 353035 542228 532917 338901 79190
1717 79190 -70059 -212735 -413779 -215458 36648 -226230 326587 420673 -116758 -213769
1707 -213769 -168425 -25750 1977 -144108 -343502 -320477 -379815 -77143 -201040 452944
1697D52944L1242k50943K72109j50412j75004j79519j63340K72534J74880J00228
1687C84719r5832R9043p84568L1428L59312N2907m49488j02125O30978K35099
1677C61473L67087m05616m35159j35960K34711J49023j24678P7832K59144j64630
1667A83227k17286J05401m85724M9991K73726j24410M29351k39922j77695K67154
1657F3813M57030l11016j78643j11442k43112K14721P6321p6865O08083k24002
1647B74888l52994M04997l63935k0336k05351P9838K65418J64221k16796j30983
1637a01033L46568j45561O4951K60135j49859k38525j74500L03109K69633m65700
1627c0782J02815K20928N5543k71408j70758L73476J02543k18856m91814J04061
$$ plain form
1697 452944 484186 233243 505352 354940 179936 417 -162923 109611 284491 384719
1687 384719 288887 387930 -396638 -365210 -5898 47009 -402479 -504604 126374 361473
1677 361473 728560 322944 -112215 -248175 -13464 135559 10881 88713 347857 183227
1667 183227 -34059 71342 -414382 -364391 -90665 -215075 214276 -25646 -203341 63813
1657 63813 520843 209827 31184 -80258 -323370 -108649 -32328 -109193 498890 274888
1647 274888 -78106 326891 -37044 -57380 -262731 -182893 82525 246746 29950 -101033
1637 -101033 245535 99974 164925 425060 275201 36676 -137824 165285 434918 -30782
1627 -30782 72033 292961 348504 77096 -93662 279814 382357 163501 -328313 -224252
1617b24252J91543M0562J74403k54069M06070j74981n2503R7419k4164m08537
1607b28509k26759K31109J02247J27212K88959R8686p38435M74174l78222j19666
1597c69204M71370N6902k10613K7445k19693k11830M05526n5599J75572p7400
1587g524J12581n13217L83429K65008m20572k8985L93585j67270m94359N33646
1577E6322j18201j45211J00185R3230k91461j96470J62139j98202M53194K62471
1567A77996m33928L84704N8406j72929K182j15126L04034j82387l20004K9382
1557b67670l50163N52304L37218J19847j49447L3243m28048R347K27581k72790
1547a88578j0352j88246M7092j31440J51744R0133j25230N15821m11815p53449
$$ plain form
1617 -224252 -32709 7853 182256 -71813 334257 159276 106773 204192 180028 -228509
1607 -228509 -455268 -224159 -121912 5300 294259 392945 -345490 128684 -249538 -369204
1597 -369204 102166 159068 -51545 -24100 -243793 -455623 -50097 -105696 69876 -7524
1587 -7524 105057 -408160 -24731 240277 -180295 -209280 184305 17035 -477324 56322
1577 56322 -61879 -207090 -106905 -13675 -305136 -501606 -339467 -537669 -84475 177996
1567 177996 -255932 128772 187178 14249 16431 -98695 205339 22952 -297052 -267670
1557 -267670 -617833 -65529 271689 391536 242089 275332 -152716 -143369 84212 -188578
1547 -188578 -198930 -387176 -340084 -471524 -319780 -229647 -354877 160944 -250871 -1004320
1537a004320Q48168O8321k9102J23405l8332p5274k04883k26543k7030J76315
1527c89275L42563J97692q8998j43542R7062J25514m7577k57721J53083q4237
1517i5436P0579M99867j06981l01202l60847K32892N06322j37795m19106j03879
1507b15586L84609J57213j79640m44567K83364J52036k15257L48430K26026o75277
1497a78649k76577P61786l7419k11406R2594l04244k18524J85488L02405J73965
1487B89419k6290J15959k4109j2626j9000m72174k14808J92951L37638j79157
1477a2197J91492n24198q886O83388j17908j97055J58143J52676J96418m91468
1467C0405k51989m8872j65182o9661k94827L43644K40078J37164k13680O48231
$$ plain form
1537 -1004320 -156152 -87831 -116933 6472 -31860 -107134 -312017 -538560 -565590 -389275
1527 -389275 -46712 150980 61982 -81560 15502 141016 93439 -164282 -11199 -95436
1517 -95436 -24857 475010 368029 66827 -294020 -61128 445194 307399 -111707 -215586
1507 -215586 169023 326236 146596 -297971 -14607 137429 -77828 270602 496628 -178649
1497 -178649 -455226 306560 269141 57735 150329 -153915 -372439 -186951 115454 289419
1487 289419 263129 379088 354979 342353 323353 -148821 -363629 -170678 166960 -12197
1477 -12197 179295 -344903 -353789 329599 211691 14636 172779 325455 521873 30405
1467 30405 -221584 -270456 -435638 -505299 -800126 -456482 -216404 -79240 -292920 355311
1457C55311j20841J08336n17967K11940Q7228N128j43779l56737L17665M96156
1447D42440p07777o6383L09390J06488k45835l37914m8024P4999M26407j8314
1437f4523J10185m9573J71835p57287J99823L09119l1203l21785N8919L04760
1427f9730j10648K04422N174l41281J43249O080p2806L40754J05749k78132K00740
1416A33571L33824l50495o5600L84049J28708q23135J64130K56016k83971R8295
1406b4608M6860j29429l9548p420K65647l20260k15814L9733L15470K35477k72656
1395a06548k471M05946j21081m95782K70372k79545J2154o84256K40329N57288
1385b03594J84712l79499J1161K23190J48265l30744K92999L88632n56385q1681
$$ plain form
1457 355311 234470 342806 -175161 36779 124007 129135 -14644 -371381 -53716 442440
1447 442440 -265337 -331720 -22330 84158 -161677 -499591 -547615 -472616 -46209 -64523
1437 -64523 45662 -3911 167924 -589363 -389540 -80421 -111624 -433409 -374490 -69730
1427 -69730 -180378 24044 29218 -312063 -168814 -162734 -235540 105214 210963 -67169 133571
1416 133571 467395 116900 51300 435349 564057 -259078 -94948 161068 -122903 -24608
1406 -24608 22252 -107177 -146725 -154145 111502 -208758 -424572 -384839 -69369 166108 -106548
1395 -106548 -109019 296927 175846 -319936 -49564 -329109 -316955 -1001211 -760882 -203594
1385 -203594 -18882 -398381 -387220 -164030 -15765 -346509 -53510 335122 -221263 -302944
1375c02944J92270l22411J56196L80874r0104j59542j23511K60702J28800j75116
1365e4786M8354j00763K37162p3836M80007j31500n12741Q9711K15478n46094
1355c49008r1514M06740l65331M75140j28769J67556K57225o6696p6141l44633
1345a15431k88508J05778R1971P7452K45905k54360l18632M35014P1326n0775
1335b60N8680r7758j02885o6835J02350J32665J4229L71628R7750j50997j85474
1324A73093L8873k87831j03878l91780K67539J09039L70554J44717j63668j4523
1314A42135k28036j8359P334k47019k49632L23825K45884k11591M814q6882n6248
1303c73775j12206K5131Q5079P29889J3104k20212M1784l53447K6441L57505N4084
$$ plain form
1375 -302944 -110674 -433085 -276889 103985 13881 -145661 -269172 -8470 120330 -54786
1365 -54786 -6432 -107195 129967 56131 536138 404638 -108103 -18392 197086 -349008
1355 -349008 -440522 -33782 -399113 76027 -52742 114814 372039 305343 229202 -115431
1345 -115431 -403939 -298161 -206190 -128738 117167 -137193 -455825 -20811 50515 -260
1335 -260 58420 -39338 -142223 -209058 -106708 25957 40186 411814 509564 358567 173093
1324 173093 211966 -75865 -179743 -571523 -303984 -194945 175609 320326 156658 142135
1314 142135 -85901 -104260 -96926 -343945 -593577 -269752 -23868 -235459 -230645 -317527 -373775
1303 -373775 -485981 -460850 -375771 354118 367222 147010 188794 -164653 -138212 219293 273377
1292B73377k22882M87794O3296l06530n26608N25040k10416j72348M50636k99978
1282F1381j21534q1416l12888j72504M48377k24801R6571K29673K14575j89615
1272e2181L34291k89109m94743J5536K52453O8219J39542K25397p05852j16006
1262f22453J61412L99817R9835k03041o6658O95208L8471r6237j73779j00836
1252A31739j19675J98805l14065l7734j75265j52857J34455J76231J27747J554
1242b9065Q3493k43352J12014P6121j36648j00100J35543k28901N09933r0361
1232H8677k06936L66142n76670k12216M2028M10264K70237J49872k75853K61977
1222C17522J6402j31130j46685l0765R498k38625j75393L55259J78038m14048
$$ plain form
1292 273377 50495 538289 601585 295055 -231553 293487 83071 -89277 361359 61381
1282 61381 -60153 -141569 -454457 -626961 -178584 -403385 -306814 -77141 137434 -52181
1272 -52181 282110 -6999 -501742 -486206 -233753 -165534 -25992 199405 -506447 -622453
1262 -622453 -461041 -61224 38611 -164430 -231088 464120 502591 406354 232575 131739
1252 131739 12064 210869 -103196 -140930 -316195 -469052 -334597 -158366 -30619 -29065
1242 -29065 54428 -188924 -76910 -789 -137437 -237537 -101994 -330895 179038 88677
1232 88677 -118259 247883 -328787 -541003 -498975 -88711 181526 331398 55545 317522
1222 317522 333924 202794 56109 25344 34842 -203783 -379176 -23917 154121 -259927
1212b59927J05794M07108m05784k01372N0996j65304L63794r336N69498J14865
1202E70332n95783o5514n58645K92653J65434k07686M55475r4676k53149K74655
1192a6904k41731n7179M58655j42763o3338M66894n38553m22568J3179K20633
1182c23675N6398m0351J44758J89913k57915L50717L59014o3735j0158m42771
1172c7805q0079k52237K58189L91363j59107k18988R150k27842Q8118k05052L69633
1161f4657l12537k15293L92814J83977j89455j82090O2391K58747K6567M22932
1151C83396k43078j68479k38669j91723J977L81445J82113l88959M8746p9259
1141c12490L72172p2176k30451L50180J73978k20985m54591J17684O0337j31134
$$ plain form
1212 -259927 -154133 252975 -152809 -354181 -303185 -468489 -104695 -114031 455467 570332
1202 570332 -25451 -90965 -649610 -356957 -191523 -399209 56266 -38410 -291559 -16904
1192 -16904 -258635 -315814 142841 78 -63260 403634 -134919 -557487 -544308 -323675
1182 -323675 -267277 -307628 -162870 27043 -230872 119845 478859 415124 404966 -37805
1172 -37805 -117884 -370121 -111932 279431 120324 -98664 -89514 -317356 -229238 -434290 -64657
1161 -64657 -377194 -592487 -199673 -15696 -205151 -387241 -324850 -66103 -39536 383396
1151 383396 140318 -28161 -266830 -458553 -456576 -75131 106982 -281977 -233231 -312490
1141 -312490 59682 -12494 -242945 107235 281213 60228 -394363 -276679 -216342 -347476
1131c47476l923K90201j77630L08095q6353l7111J9124Q306k40607k3074l66898
1120f57346P82104k6121K56099J03627j23655K0469k86439J57456l08346N33560
1110D51408K10056o82738j06960K38139k48947L935O01660J9681j1112k14106
1100B61016m75802J27803k42882L74187n9084L79070J00878o13203k76972J19276
1090c05713J15550K42017o24920r1613L31211q5k86832M69990N0009p0871j22031
1079b93288L86527n22472p618J70197n2373j2438J43045L33556L12414k18485
1069B39065j95173M29778j72497n44796n0074J2776R5522J88420K98354n7092
1059B44283o5815m47526k25348J25609q2294L1197k76L09887K90774J24378r5547
$$ plain form
1131 -347476 -351399 -61198 -238828 69267 -17086 -54197 -35073 -26767 -267374 -290448 -657346
1120 -657346 124758 98637 354736 458363 334708 355177 68738 226194 -82152 451408
1110 451408 661464 -21274 -128234 109905 -139042 -135107 466553 486234 475122 261016
1100 261016 -214786 -86983 -329865 44322 -14762 364308 465186 -148017 -424989 -305713
1090 -305713 -190163 51854 -573066 -664679 -333468 -333553 -620385 -150395 -100386 -171257 -293288
1079 -293288 93239 -429233 -436851 -266654 -319027 -331465 -188420 145136 457550 239065
1069 239065 43892 473670 301173 -243623 -293697 -280921 -185399 3021 301375 244283
1059 244283 178468 -269058 -494406 -368797 -451091 -419894 -420170 -110283 180491 304869 209322
1048B09322J8191o71j26685j58558n38764O36608Q8331k08167L86627J58001l43263
1037A20972q8199M1852K11283l5609m75015R6729O9727N2617N5716J31650k91895
$$ plain form
1048 209322 227513 226842 100157 -58401 -597165 39443 127774 -80393 306234 464235 120972
1037 120972 32773 74625 285908 250299 -224716 -127987 -58260 -5643 50073 181723 -110172
$$ [...]
##END NTUPLES=NMR SPECTRUM
##END=
