##TITLE=1H_CA-8869-1
 CDCl3, 8 sc, 
 4.06.2021
##JCAMPDX= 6.0         $$ Bruker NMR JCAMP-DX V2.0
##DATA TYPE= NMR SPECTRUM
##DATA CLASS= NTUPLES
##ORIGIN= UXNMR, Bruker Analytische Messtechnik GmbH
##OWNER= root
$$ XWIN-NMR		Version 3.5
$$ Fri Jun  4 12:39:47 2021 Russian Standard Time (UT+4h)  she@DPX200
##.OBSERVE FREQUENCY= 200.131506
##.OBSERVE NUCLEUS= ^1H
##.ACQUISITION MODE= SIMULTANEOUS
##.ACQUISITION SCHEME= undefined
##.AVERAGES= 8
##.DIGITISER RES= 18
##SPECTROMETER/DATA SYSTEM= spect
##.PULSE SEQUENCE= zg30
##.SOLVENT NAME= CD3CN
##.SHIFT REFERENCE= (INTERNAL, CD3CN, 0, 17.5057)
##AUDIT TRAIL= $$ (NUMBER, WHEN, WHO, WHERE, WHAT)
$$ ##TITLE= Audit trail, XWIN-NMR		Version 3.5
$$ ##JCAMPDX= 5.01
$$ ##ORIGIN= Bruker BioSpin GmbH
$$ ##OWNER= she
$$ F:/spectra/data/she/nmr/H-F/1/pdata/1/auditp.txt
$$ ##AUDIT TRAIL=  $$ (NUMBER, WHEN, WHO, WHERE, WHAT)
(   1,<2021-06-04 12:38:36.98 +0400>,<she>,<DPX200>,
      <created by zg, POWCHK disabled, PULCHK disabled
       configuration hash MD5:
       00 E9 B6 7A A2 85 ED C7 34 08 36 98 17 FE 4E 26
       data hash MD5: 16K
       1D 1B E4 B9 BB 92 B2 31 A0 AB 4A 27 D4 12 B4 A1>)
(   2,<2021-06-04 12:38:39.60 +0400>,<she>,<DPX200>,
      <Start of raw data processing
       efp BC_mod = 2 LB = 0.24 FT_mod = 6 PKNL = 1 PHC0 = -11121.78 PHC1 = 12.40101 SI = 16K 
       data hash MD5: 16K
       5F F5 D7 85 C9 93 82 E1 D1 B7 C5 40 FA 4E 6E CA>)
(   3,<2021-06-04 12:38:56.65 +0400>,<she>,<DPX200>,
      <pk PHC0 = 0.08840752 PHC1 = 0.3999998 
       data hash MD5: 16K
       4D D2 BE 72 12 E6 72 2C 0E 2F D8 98 AC F4 4F FA>)
(   4,<2021-06-04 12:38:59.73 +0400>,<she>,<DPX200>,
      <abs ABSG = 5 
       data hash MD5: 16K
       DF FD 16 2B 18 29 8B 8D 89 23 5A 9C D1 4C 72 F0>)
$$ ##END=
$$ 
$$ hash MD5
$$ 25 E0 5F 40 47 5C 70 8E 19 5B A5 F1 E3 E1 73 C6
##$RELAX= 
##$RELAX= 
##$RELAX= 
##$RELAX= 
##$RELAX= 
##$RELAX= 
$$ Bruker specific parameters
$$ --------------------------
##$DU= <F:/spectra>
##$EXPNO= 1
##$NAME= <H-F>
##$PROCNO= 1
##$TYPE= <nmr>
##$USER= <she>
##$AMP= (0..31)
100 100 100 100 100 100 100 100 100 100 100 100 100 100 100 100 100 100 
100 100 100 100 100 100 100 100 100 100 100 100 100 100 
##$AQSEQ= 0
##$AQ_mod= 1
##$AUNM= <au_zg>
##$AUTOPOS= <>
##$BF1= 200.13
##$BF2= 200.13
##$BF3= 200.13
##$BF4= 200.13
##$BF5= 200.13
##$BF6= 200.13
##$BF7= 200.13
##$BF8= 200.13
##$BYTORDA= 1
##$CFDGTYP= 0
##$CFRGTYP= 5
##$CHEMSTR= <none>
##$CNST= (0..31)
1 1 145 1 1 1 1 1 1 1 1 1 1 1 1 1 1 1 1 1 1 1 1 1 1 1 1 1 1 1 1 1 
##$CPDPRG= <>
##$CPDPRG1= <>
##$CPDPRG2= <>
##$CPDPRG3= <>
##$CPDPRG4= <mlev>
##$CPDPRG5= <mlev>
##$CPDPRG6= <mlev>
##$CPDPRG7= <mlev>
##$CPDPRG8= <mlev>
##$CPDPRGB= <>
##$CPDPRGT= <>
##$D= (0..31)
0 1.2 0 0 0 0 0 0 0 0.06 0 0.03 0 0 0 0 0.0002 0 0 0 0 0 0 0 0 0 0 0 0 
0 0 0 
##$DATE= 1622795916
##$DBL= (0..7)
120 120 120 120 120 120 120 120 
##$DBP= (0..7)
150 150 150 150 150 150 150 150 
##$DBP07= 0
##$DBPNAM0= <>
##$DBPNAM1= <>
##$DBPNAM2= <>
##$DBPNAM3= <>
##$DBPNAM4= <>
$$ [...]
##$SUBNAM3= <"">
##$SUBNAM4= <"">
##$SUBNAM5= <"">
##$SUBNAM6= <"">
##$SUBNAM7= <"">
##$SUBNAM8= <"">
##$SUBNAM9= <"">
##$SW= 20.0188882624521
##$SWIBOX= (0..15)
0 0 2 0 0 0 0 0 0 0 0 0 0 0 0 0 
##$SW_h= 4006.41025641026
##$TD= 16384
##$TD0= 1
##$TE= 0
##$TE2= 300
##$TE3= 300
##$TEG= 300
##$TL= (0..7)
0 120 120 120 120 120 120 120 
##$TP= (0..7)
150 150 150 150 150 150 150 150 
##$TP07= 0
##$TPNAME0= <>
##$TPNAME1= <>
##$TPNAME2= <>
##$TPNAME3= <>
##$TPNAME4= <>
##$TPNAME5= <>
##$TPNAME6= <>
##$TPNAME7= <>
##$TPOAL= (0..7)
0.5 0.5 0.5 0.5 0.5 0.5 0.5 0.5 
##$TPOFFS= (0..7)
0 0 0 0 0 0 0 0 
##$TUNHIN= 0
##$TUNHOUT= 0
##$TUNXOUT= 0
##$USERA1= <user>
##$USERA2= <user>
##$USERA3= <user>
##$USERA4= <user>
##$USERA5= <user>
##$V9= 5
##$VALIST= <valist>
##$VCLIST= <CCCCCCCCCCCCCCC>
##$VD= 0
##$VDLIST= <DDDDDDDDDDDDDDD>
##$VPLIST= <PPPPPPPPPPPPPPP>
##$VTLIST= <TTTTTTTTTTTTTTT>
##$WBST= 1024
##$WBSW= 4
##$XGAIN= (0..3)
0 0 0 0 
##$XL= 0
##$YL= 0
##$YMAX_a= 345326
##$YMIN_a= -200745
##$ZGOPTNS= <>
##$ZL1= 120
##$ZL2= 120
##$ZL3= 120
##$ZL4= 120
##$ABSF1= 17.55454
##$ABSF2= -2.464499
##$ABSG= 5
##$ABSL= 3
##$ALPHA= 0
##$AQORDER= 0
##$ASSFAC= 0
##$ASSFACI= 0
##$ASSFACX= 0
##$ASSWID= 0
##$AUNMP= <proc_1d>
##$AZFE= 0.1
##$AZFW= 0.1
##$BCFW= 0
##$BC_mod= 2
##$BYTORDP= 0
##$COROFFS= 0
##$CY= -3
##$DATMOD= 1
##$DC= 0
##$DFILT= <>
##$DTYPP= 0
##$F1P= 0
##$F2P= 0
##$FCOR= 1
##$FTSIZE= 16384
##$FT_mod= 6
##$GAMMA= 0
##$GB= 0
##$INTBC= 1
##$INTSCL= 1.334414e-10
##$ISEN= 128
##$LB= 0.24
##$LEV0= 0
##$LPBIN= 0
##$MAXI= 10000
##$MC2= 0
##$MEAN= 0
##$ME_mod= 0
##$MI= 1.114404
##$NCOEF= 0
##$NC_proc= -7
##$NLEV= 6
##$NOISF1= 3.799351
##$NOISF2= 2.8
##$NSP= 0
##$NTH_PI= 0
##$NZP= 0
##$OFFSET= 17.50566
##$PC= 1
##$PHC0= -11121.69
##$PHC1= 12.80101
##$PH_mod= 1
##$PKNL= yes
##$PPARMOD= 0
##$PSCAL= 0
##$PSIGN= 0
##$REVERSE= no
##$SF= 200.130005796423
##$SI= 16384
##$SIGF1= 3
##$SIGF2= 2
##$SINO= 5.538805
##$SIOLD= 16384
##$SREGLST= <1H.CDCl3>
##$SSB= 0
##$STSI= 16384
##$STSR= 0
##$SW_p= 4006.41025641026
##$SYMM= 0
##$S_DEV= 0
##$TDeff= 16384
##$TDoff= 0
##$TI= <>
##$TILT= no
##$TM1= 0
##$TM2= 0
##$TOPLEV= 0
##$USERP1= <user>
##$USERP2= <user>
##$USERP3= <user>
##$USERP4= <user>
##$USERP5= <user>
##$WDW= 1
##$XDIM= 16384
##$YMAX_p= 425111861
##$YMIN_p= -701565
$$ End of Bruker specific parameters
$$ ---------------------------------
##NTUPLES= NMR SPECTRUM
##VAR_NAME=  FREQUENCY,     SPECTRUM/REAL,   SPECTRUM/IMAG
##SYMBOL=    X,             R,               I
##VAR_TYPE=  INDEPENDENT,   DEPENDENT,       DEPENDENT
##VAR_FORM=  AFFN,          ASDF,            ASDF
##VAR_DIM=   16384,         16384,           16384
##UNITS=     HZ,            ARBITRARY UNITS, ARBITRARY UNITS
##FACTOR=    0.24454680195387, 1,            1
##FIRST=     3503.40765783236, 0,            0
##LAST=      -503.002598577903, 0,           0
##MIN=       -503.002598577903, -701565,     0
##MAX=       3503.40765783236, 425111861,    0
$$ Real data points
##PAGE= N=1
##DATA TABLE= (X++(R..R)), XYDATA
$$ [...]
6212E18608N9867l04079p9173J64392K40526q2909j04734l4942M8156n15l44853
$$ 518608 578475 274396 195223 359615 600141 517232 412498 377556 425712 425197 80344
6201H0344J33331P2835j30283j50428o4596M94518L2485k83350l5837M1701L0475
$$ 80344 213675 286510 156227 5799 -58797 435721 468206 184856 149019 190720 221195
6190B21195m1919O5790N432R0059J9667j29483q016k70568R4054J98042j7318
$$ 221195 179276 245066 250498 340557 360224 230741 222725 -47843 46211 244253 226935
6179B26935O2948j24222J73120J26k65505J38699P7436P2162p072k16547k31384
$$ 226935 289883 165661 338781 338907 73402 212101 289537 361699 354627 138080 -93304
6168i3304J59346j73211M8557J88113k1497J58800m1037Q329j60208j23427j10973
$$ -93304 66042 -107169 -58612 129501 108004 266804 225767 234096 73888 -49539 -160512
6157a60512P5994n5495J25964k24129K31595J56861K0725J03897J07031k97564
$$ -160512 -84518 -140013 -14049 -238178 -6583 150278 171003 274900 381931 84367
6147H4367O8957P5324n958k4205j13419K26142l12686R279p1996m7348J15206
$$ 84367 153324 228648 222690 198485 85066 311208 -1478 7801 -64195 -111543 3663
6136C663L17810j34263J75491j81413M7194j38574k93507J98212J39678m8341
$$ 3663 321473 187210 362701 181288 228482 89908 -203599 -5387 134291 85950
6126H5950J00500j17005K94001L2918j27960p9846j57324j27335J21091m7556
$$ 85950 186450 69445 363446 396364 268404 188558 31234 -96101 24990 -22566
6116b2566R1467N9483L43219j37881l47339j39788K94912R7978l11432R1884O745
$$ -22566 68901 128384 471603 333722 -13617 -153405 141507 239485 -71947 19937 26682
6105B6682J24924j35324j67977p9354M24049J14344k08960l26387Q4335J43838
$$ 26682 151606 16282 -151695 -231049 193000 307344 98384 -228003 -143668 170
6095A70K85103j99559J13224j4882o8290o8897O1401l72036r6438r9239M43730
$$ 170 285273 85714 198938 184056 115766 46869 108270 -263766 -360204 -459443 -15713
6084a5713N4058J74848K9965m3183k54881k67124J58214L44897j90617L4067K70887
$$ -15713 38345 213193 243158 199975 -54906 -322030 -163816 181081 -9536 24531 295418
6073B95418J90566j59532k26611K7137l7618J37135p2300R9216N5740J76720k08435
$$ 295418 485984 326452 99841 126978 89360 226495 154195 253411 309151 485871 277436
6062B77436J0576j92040m3553Q8081k95319j40290K00346L73999M23425m95735
$$ 277436 288012 95972 52419 140500 -154819 -295109 -94763 279236 702661 206926
6052B06926p2018J31064L7553l38384q1093N7665L30858L4642R6481K81667P8104
$$ 206926 134908 265972 303525 -34859 -115952 -58287 272571 307213 403694 685361 763465
6041G63465m40329j97700o6993p9533J77039l2699L19789K07599n8070k37723
$$ 763465 323136 125436 58443 -21090 155949 123250 443039 650638 592568 354845
6031C54845k60770N0736K50875K3553L4767k20077J05650L32047k25443j80541
$$ 354845 94075 144811 395686 419239 454006 233929 339579 671626 446183 265642
6021B65642M8915K7023n1462j96945j26143J00928J85660l710P4086J20067J479
$$ 265642 314557 341580 290118 93173 -32970 67958 253618 249908 323994 444061 445540
6010D45540l40994J4138K42684j21756k30822L68323M58979l23678l33940j27804
$$ 445540 104546 118684 361368 239612 8790 377113 836092 512414 178474 50670
6000E0670L4023j52608P3289j0759K28140j26306K72441K33033r7275o5258l15941
$$ 50670 84693 -67915 5374 -5385 222755 96449 368890 601923 504648 439390 123449
5989A23449n0496J19467K93547k00669J70654p8951J64138l04p7090n7907K1414
$$ 123449 72953 192420 485967 285298 455952 377001 541139 540835 463745 405838 427252
5978D27252K22354k99708k21918k9756L32294q3910j98498k11542M31253r4324
$$ 427252 649606 349898 127980 98224 430518 346608 148110 -63432 367821 273497
5968B73497r1991q1706P9432N30951m5527k86212K54774n0243m09475R5675j29863
$$ 273497 181506 99800 179232 710183 664656 378444 633218 582975 173500 269175 139312
5957A39312J43273p6364N1471K97321p8346o3990N2200k53840M1446j64278J16758
$$ 139312 282585 206221 257692 555013 476667 412677 464877 211037 252483 88205 204963
5946B04963J47038N782K13753K9252r0001j13027j40460R6396j817k02562J12565
$$ 204963 352001 357783 571536 600788 510787 397760 257300 353696 351879 149317 261882
5935B61882J40977N0948K41006p3732L1317l15797m26706L18933J72886j26360
$$ 261882 402859 453807 694813 621081 652398 336601 -90105 228828 401714 275354
5925B75354J16085Q9444K80731J56155n47178n5386n0058q898Q5845N4298J56641
$$ 275354 391439 480883 761614 917769 370591 315205 265147 256249 342094 396392 553033
5914E53033J92166j13653k84664m0703J09001J63362n9666k820M0668K67576m8486
$$ 553033 745199 631546 346882 306179 415180 578542 518876 516056 556724 824300 775814
5903G75814l42356k62303K80219J16391j27073L974J94008J06767l13364P1792
$$ 775814 433458 171155 451374 567765 440692 444666 638674 745441 432077 503869
5893E03869N0586n68j31024M2296j24806j7890J44779k26259L50444j29536J41601
$$ 503869 554455 553887 422863 465159 340353 322463 467242 240983 591427 461891 603492
5882F03492O8612K3947k86787q4386N9253J27386J35968j64037K77383N7098j43541
$$ 603492 672104 696051 409264 324878 384131 511517 647485 483448 760831 817929 674388
5871F74388k03475J18462q3935p3114J20621Q3574p2080J5480R6775m0076j3048
$$ 674388 470913 589375 505440 432326 552947 636521 564441 579921 676696 636620 623572
5860F23572j62908J31894l3654J4048k48330K21292K64183k7983o5710j09693
$$ 623572 460664 592558 558904 572952 324622 545914 810097 782114 716404 606711
5850F06711K96992J744l64575j47297L78591K97912K1099l49267J46935o637k38995
$$ 606711 903703 905447 540872 393575 772166 1070078 1091177 741910 888845 882208 643213
5839F43213R6797J17529k1227q8366L0459L5588j03523L5244m1449q0659l5384
$$ 643213 740010 857539 836312 747946 778405 813993 710470 745714 704265 623606 588222
5828E88222K93295j46937o1342k556P5730m0122K06830k25022l9772j73115M19767
$$ 588222 881517 734580 673238 670682 746412 706290 913120 688098 648326 475211 894978
5817H94978R3123j99389m7402j46483R065L5202R8944p5377p3183l2263K40593
$$ 894978 988101 788712 741310 594827 603892 639094 738038 662661 589478 557215 797808
5806G97808l20965J60837K71205N103q6317l63870J33830K0330l00643j86311
$$ 797808 476843 637680 908885 913988 827671 463801 597631 617961 317318 131007
5796A31007K84036J73996L03438o2288k55218M0202k97533J121J73875P9473K84599
$$ 131007 415043 589039 892477 830189 574971 615173 317640 318761 492636 572109 856708
5785H56708J46962l48763K28622k65844J40259m0506k53079K49176R7907l6440
$$ 856708 1003670 654907 883529 617685 757944 717438 464359 713535 811442 775002
5775G75002P749J65987Q2040m7885j24038r2632l5074p2835J3933J6709M31685
$$ 775002 782751 948738 1030778 982893 858855 766223 731149 658314 672247 688956 1120641
5764A120641k21236l7740J59307j27500J8525K6619J68261K98042l9914q4645
$$ 1120641 899405 861665 1020972 893472 911997 938616 1106877 1404919 1365005 1280360
5754A280360J94742O2853j77491k63657J51088j5049M11827r506j36521p4519
$$ 1280360 1475102 1537955 1360464 1096807 1247895 1232846 1644673 1635167 1498646 1424127
5744A424127L10710J97741j36375r7307j37810N0177L29445J87283j34330l8337
$$ 1424127 1734837 1932578 1796203 1698896 1561086 1611263 1940708 2127991 1993661 1955324
5734A955324J51452J85554J57664l4333J58564k44551n0050K25795r0264J01992
$$ 1955324 2106776 2292330 2449994 2415661 2574225 2329674 2279624 2505419 2415155 2517147
5724B517147J81998J09492M9458k93042m86845J13707K20015J84772j87596M35101
$$ 2517147 2699145 2808637 2858095 2565053 2078208 2191915 2411930 2596702 2409106 2844207
5714B844207J00569j14821j47063K56197p6880L12727J19726J79193K03688J83334
$$ 2844207 2944776 2829955 2682892 2939089 2862209 3174936 3294662 3473855 3677543 3860877
5704C860877j15296L1760n6726l40838o908R6103Q6098j32892j91324o5302l5323
$$ 3860877 3745581 3777341 3720615 3379777 3372869 3468972 3555070 3422178 3230854 3165552 3130229
5693C130229l3687j47412r6984j34212J97475J43083k23981m3894K82396L03568
$$ 3130229 3096542 2949130 2852146 2717934 2915409 3058492 2834511 2790617 3073013 3376581
5683C376581k04582m35755R9661M79635k45426j11962k59762R5615j45260J07712
$$ 3376581 3171999 2736244 2835905 3315540 3070114 2958152 2698390 2794005 2648745 2756457
5673B756457j64262j26133J9085k85544l6266J05430k79048k7382K28166k44510
$$ 2756457 2592195 2466062 2485147 2199603 2163337 2268767 1989719 1962337 2190503 1945993
5663A945993K06407q4914o7865k56170j79153K17689M6341q3375J27790N0662
$$ 1945993 2152400 2067486 1999621 1743451 1564298 1781987 1828328 1744953 1872743 1923405
5653A923405m06272o433n4339K62612K5734l29464j80364L71584k22520j89889
$$ 1923405 1517133 1510700 1456361 1718973 1744707 1415243 1234879 1606463 1383943 1194054
5643A194054M1473j50409L4054l2445M8375Q3382Q9977R2196j55678N0871q794
$$ 1194054 1235527 1085118 1119172 1086727 1135102 1218484 1308461 1400657 1244979 1295850 1287056
5632A287056l06732l7859J13945M0452L05948k82830J24475l9682r4116j16240
$$ 1287056 980324 942465 1056410 1096862 1402810 1119980 1244455 1204773 1110657 994417
5622I94417k31925J85044k13716R9745K07856Q1342Q6633q9126k10290j65893
$$ 994417 762492 947536 733820 833565 1041421 1122763 1209396 1120270 909980 744087
5612G44087L17031J0894j65957l4060J43133K14338k40726l64341K92077N4797
$$ 744087 1061118 1072012 906055 871995 1015128 1229466 988740 624399 916476 971273
5602I71273l4878Q7229J94893L72487j08585m60368O2811P515R6391N1960P4500
$$ 971273 936395 1023624 1218517 1591004 1482419 1022051 1084862 1092377 1188768 1240728 1315228
5591A315228K9734k71061J33002M3213K29647J04612r5746l74076K30633J2806
$$ 1315228 1344962 1073901 1206903 1250116 1479763 1584375 1488629 1114553 1345186 1357992
5581A357992k06490k3498J58541l679j7633o8022Q2228Q2171j33638P4230k3779
$$ 1357992 1151502 1128004 1286545 1282866 1265233 1197211 1279439 1361610 1227972 1302202 1278423
5570A278423r5379L72160N4301J76229m23713j24687J52848j35438j24060p2211
$$ 1278423 1183044 1555204 1609505 1785734 1362021 1237334 1390182 1254744 1130684 1058473
5560A058473L60637K71949r2172j95208j00892p5446J95758M0004j22247q9659
$$ 1058473 1419110 1691059 1598887 1403679 1302787 1227341 1423099 1463103 1340856 1251197
5550A251197L579K85256Q5645l9177k51713J78990j09j55275k20432k37007K10485
$$ 1251197 1254776 1540032 1625677 1586500 1334787 1513777 1513668 1358393 1137961 900954 1111439
5539A111439L84334J54621r9702J22815j92174L74324m08621M9955r4336L54050
$$ 1111439 1495773 1650394 1550692 1673507 1481333 1855657 1447036 1496991 1402655 1756705
5529A756705K01097J5972j35406P2203K87930l96255l1165J02588O2336j80582
$$ 1756705 1957802 1973774 1838368 1910571 2198501 1802246 1771081 1873669 1936005 1755423
5519A755423O5842L7710J00760j62908J7333K2463K76093j5484n3600p8633M95549
$$ 1755423 1821265 1858975 1959735 1796827 1814160 1836623 2112716 2097232 2043632 1964999 2460548
5508B460548J45621j16758j09291n9037j79605j5660q5472K42368J70165J22172
$$ 2460548 2606169 2489411 2380120 2321083 2141478 2125818 2040346 2282714 2452879 2575051
5498B575051k07026K24735j61438k3551r9921m227K28972Q7189J37402K00957
$$ 2575051 2368025 2592760 2431322 2407771 2307850 2303623 2532595 2619784 2757186 2958143
5488B958143L1981j04836j39460Q9453J25741k67201L5513J6572Q8827J63445
$$ 2958143 2990124 2885288 2745828 2835281 2961022 2693821 2729334 2745906 2834733 2998178
5478B998178R2320l5356J77623j23226j75892p9605J80130R8876o6813m6210J54872
$$ 2998178 3090498 3055142 3232765 3109539 2933647 2854042 3034172 3133048 3066235 3020025 3174897
5467C174897P9769L88863j39740K7756M7439M2693k72612J42044J35844M82334
$$ 3174897 3254666 3643529 3503789 3531545 3578984 3621677 3349065 3491109 3626953 4109287
5457D109287J06572J01735l91760O3744K00063K49480m55400p1291M77758J54617
$$ 4109287 4215859 4317594 3925834 3989578 4189641 4439121 3983721 3912430 4390188 4544805
5447D544805o9652M133O0107O8291j12779j20640L37008K27341R3767K5790n9543
$$ 4544805 4475153 4479286 4539393 4607684 4494905 4374265 4711273 4938614 5032381 5058171 4998628
5436D998628K19031L55196J61786K15226p8781k9584J92311M80934M80933K81654
$$ 4998628 5217659 5572855 5734641 5949867 5871086 5841502 6033813 6514747 6995680 7277334
5426G277334j58173L84331M73666q2159R085R8786N91766O69931j80136M21787
$$ 7277334 7119161 7503492 7977158 7894999 7904084 8002870 8594636 9264567 9084431 9506218
5416I506218L5465M29143P43375M96032M13902Q04891J099134J078206M84020
$$ 9506218 9541683 9970826 10714201 11210233 11624135 12429026 13528160 14606366 15090386
5407A5090386J178431J365837J496418J707943J613910J943314K597089K349405
$$ 15090386 16268817 17634654 19131072 20839015 22452925 24396239 26993328 29342733
5399B9342733K217202K557674J928747J380723J319686K58154K28738J12348m71400
$$ 29342733 31559935 34117609 36046356 37427079 38746765 39004919 39233657 39346005 38874605
5390C8874605m19473o10949j24511N0999L06223N67551J129611J369978J757896
$$ 38874605 38455132 37844183 37719672 37770671 38076894 38644445 39774056 41144034 42901930
5381D2901930K456885L119747K706447K283985J837603J411782M65564k51213
$$ 42901930 45358815 48478562 51185009 53468994 55306597 56718379 57183943 56932730
5373E6932730k225878l000578l558802l701995l311288k747685k923888k558645
$$ 56932730 54706852 51706274 48147472 44445477 41134189 38386504 35462616 32903971
5365C2903971k511548k032629j957670j656408j491304j147764j129564j046018
$$ 32903971 30392423 28359794 26402124 24745716 23254412 22106648 20977084 19931066
5357A9931066q05880m79549j19709n98142l56566k07206j17877r947j32761R2094
$$ 19931066 19125186 18645637 18525928 17927786 17571220 17364014 17246137 17236190 17103429 17195523
5347A7195523L53361L7789K72123j47967R850k46000p6098j15203j38675n28322
$$ 17195523 17548884 17586673 17858796 17710829 17720679 17474679 17398581 17283378 17144703 16616381
5337A6616381J42781k4354K45065K58979j2804J89470N17410K8743K64639J45162
$$ 16616381 16759162 16734808 16979873 17238852 17226048 17415518 17932928 17961671 18226310 18371472
5327A8371472L52804K42378J69338k52135j9939j73504K96676P1885j43278P4933
$$ 18371472 18724276 18966654 19135992 18883857 18863918 18690414 18987090 19058975 18915697 18990630
5317A8990630K51640J37793J39677Q9368k60125r7882J01284K67912N6775k38674
$$ 18990630 19242270 19380063 19519740 19609108 19348983 19251101 19352385 19620297 19677072 19438398
5307A9438398l33379L2187r1304k54784k11920j78336j10002P2187J44182j68888
$$ 19438398 19105019 19137206 19045902 18791118 18579198 18400862 18290860 18363047 18507229 18338341
5297A8338341K9249K16853m6017P4292j89416k99076m28649l96154l90757l53434
$$ 18338341 18367590 18584443 18538426 18612718 18423302 18124226 17695577 17299423 16908666 16555232
5287A6555232l38587J50872m12853k72733j73749k15563m37664J16125N9808j944
$$ 16555232 16216645 16367517 15954664 15681931 15508182 15292619 14854955 14971080 15030888 15028944
5277A5028944k3135l96849l55947k09821m74170k62771k99713l20994m13564m91356
$$ 15028944 15005809 14608960 14253013 14043192 13569022 13306251 13006538 12685544 12271980 11780624
5267A1780624j47572j92490l07145k48605k26322j86733o3376j18727J08209r589
$$ 11780624 11633052 11440562 11133417 10884812 10658490 10471757 10408381 10289654 10397863 10388274
5257A0388274l43254j84999l1988j91181k043j65919L1787K3100k42469j11844
$$ 10388274 10045020 9860021 9828033 9636852 9634809 9468890 9500677 9523777 9281308 9169464
5247I169464r3139M524K76476P4118k27462K6536q534K99028j76520j8884L68398
$$ 9169464 9076325 9080849 9357325 9431443 9203981 9230517 9221983 9521011 9344491 9325607 9694005
5236I694005L62106J95505K84814m3084Q6150L4079J42376M10421L50007L8782
$$ 9694005 10056111 10251616 10536430 10493346 10579496 10613575 10755951 11166372 11516379 11555161
5226A1555161o726m2761J68804J65562n3947L55269M77324M49912O21908L48261
$$ 11555161 11548435 11505674 11674478 11840040 11786093 12141362 12618686 13068598 13690506 14038767
5216A4038767N77330M91105M93657N96183J4374M75388O69821L77345J95331J3949
$$ 14038767 14616097 15107202 15600859 16197042 16211416 16686804 17356625 17733970 17929301 17943250
5206A7943250K43144k18618O655K33570K90000J39735L90043P15744P31719M02794
$$ 17943250 18186394 17967776 17974431 18208001 18498001 18637736 19027779 19743523 20475242 20878036
5196B0878036J64155K80989K72714K07696K23775K74885L92693L93968j0165m0610
$$ 20878036 21042191 21323180 21595894 21803590 22027365 22302250 22694943 23088911 23078746 23038136
5186B3038136K02446J40191j25312K57187J35780L25871m2551L1931K89119K04331
$$ 23038136 23240582 23380773 23255461 23512648 23648428 23974299 23931748 23963679 24252798 24457129
5176B4457129j36295K83564j07640K14694j40099n15784l44730l77194j55039
$$ 24457129 24320834 24604398 24496758 24711452 24571353 24055569 23710839 23333645 23178606
5167B3178606k10431k79353j58036l1814Q7383k43201j74472L25693P8776j77943
$$ 23178606 22968175 22688822 22530786 22498972 22586355 22343154 22168682 22494375 22573151 22395208
5157B2395208j70225k33067l78264m78675n16493l96460l66722k08743m42506
$$ 22395208 22224983 21991916 21613652 21134977 20618484 20222024 19855302 19646559 19204053
5148A9204053p54644m03606j52238l6662j47797Q929P2079K77637j31376r9789
$$ 19204053 18449409 18045803 17893565 17856903 17709106 17718035 17790114 18067751 17936375 17836586
5138A7836586Q4190R3439j97656o6108o14888m69589j08166l04257m99667j23262
$$ 17836586 17920776 18014215 17816559 17750451 17135563 16665974 16557808 16253551 15753884 15630622
5128A5630622J28450j60621j31348n915k39321k51542j7029K89212J92297K21786
$$ 15630622 15759072 15598451 15467103 15461188 15221867 14970325 14953296 15242508 15434805 15656591
5118A5656591J7055k46375r2074P3821n6873M02044J4920m157J2673n8630J16648
$$ 15656591 15673646 15427271 15335197 15409018 15352145 15754189 15769109 15764952 15777625 15718995 15835643
5107A5835643J79099J13503K2389K94985K55249M12361J91822L366k4528M6790
$$ 15835643 16014742 16128245 16150634 16445619 16700868 17113229 17305051 17308417 17283889 17330679
5097A7330679L38910N14630K13929J74726J47925L77961L11391M40175N3107O3668
$$ 17330679 17669589 18184219 18398148 18572874 18720799 19098760 19410151 19850326 19903433 19967101
5087A9967101M69790P97062j6080L00974L22616O94386N21650J54082N23881Q53909
$$ 19967101 20436891 21233953 21217873 21518847 21841463 22535849 23057499 23211581 23735462 24589371
5077B4589371L59672M27767N02995N87818M39433N37106O19166O04550P45349
$$ 24589371 24949043 25376810 25879805 26467623 26907056 27444162 28063328 28667878 29413227
5068B9413227N20926L88379R23475L65193O11468M11919O30518Q39888Q82844
$$ 29413227 29934153 30322532 31246007 31611200 32222668 32634587 33265105 34104993 34987837
5059C4987837J74184L85725O86290Q45946Q21147N14367R23328P55861Q32939
$$ 34987837 35162021 35547746 36234036 37079982 37901129 38415496 39338824 40094685 40927624
5050D0927624R22340R57876R90067J027715J103267R01730J008002J012851J134341
$$ 40927624 41849964 42807840 43797907 44825622 45928889 46830619 47838621 48851472 49985813
5041D9985813J611094J107342J286315J034344J172981J436385J188282J070205
$$ 49985813 51596907 52704249 53990564 55024908 56197889 57634274 58822556 59892761
5033E9892761J385904J470640J470747J099719J392799R79922J428411J312877
$$ 59892761 61278665 62749305 64220052 65319771 66712570 67692492 69120903 70433780
5025G0433780J555073J083115J270532J289826J244101J538770J578504J475991
$$ 70433780 71988853 73071968 74342500 75632326 76876427 78415197 79993701 81469692
5017H1469692J548851J872961J741137J631480J841000J739529J982303J833622
$$ 81469692 83018543 84891504 86632641 88264121 90105121 91844650 93826953 95660575
5009I5660575J778277J576230J236555J542658J362505J008311O40085J138729
$$ 95660575 97438852 99015082 100251637 101794295 103156800 104165111 104805196 105943925
5001A05943925J167258J178518L34797K57214N37263N82323M22435L52908K76324
$$ 105943925 107111183 108289701 108624498 108881712 109418975 110001298 110423733 110776641 111052965
4992A11052965J69670K84220j70396l95647M8507l07281l2636p55668p36372q66706
$$ 111052965 111222635 111506855 111336459 110940812 110989319 110682038 110649402 109893734 109157362 108290656
4982A08290656o42121o31652p61695o65841p19802o91742o20023m03370n3722
$$ 108290656 107648535 107016883 106255188 105589347 104869545 104177803 103557780 103154410 103100688
4973A03100688q7468K71830M10796N54239J132763J545252K009327J766289K252462
$$ 103100688 103013220 103285050 103695846 104250085 105382848 106928100 108937427 110703716 112956178
4964A12956178K036080K082198K245485J220656k91994j085259j865994j372020
$$ 112956178 114992258 117074456 119319941 120540597 120248603 119163344 117297350 115925330
4956A15925330j673814k106090l613387l791521l575288k978124k934900j879510
$$ 115925330 114251516 112145426 108532039 104740518 101165230 98187106 95252206 93372696
4948I3372696j423264r78802m73641k29722M4589j88041j6687j27885p78235j473553
$$ 93372696 91949432 90970630 90496989 90267267 90311856 90123815 90107128 89979243 89201008 87727455
4938H7727455j862017j290799j068826j460433j577704j598140j789621k600402
$$ 87727455 85865438 84574639 83505813 82045380 80467676 78869536 77079915 74479513
4930G4479513l250911l904828l636582l188579k889087k722057k528624k445876
$$ 74479513 71228602 67323774 63687192 60498613 57609526 54887469 52358845 49912969
4922D9912969j921291k161506j391691j434294j715317j275126q13665o80314
$$ 49912969 47991678 45830172 44438481 43004187 41288870 40013744 39200079 38519765
4914C8519765j049059j332630p09761o54595p44835p49851q90965j034824r12222
$$ 38519765 37470706 36138076 35428315 34773720 34028885 33279034 32388069 31353245 30441023
4905C0441023r81646o88587p01228o02764o28331p38453m62634m96493l37749
$$ 30441023 29459377 28770790 28069562 27466798 26838467 26100014 25637380 25140887 24803138
4896B4803138n80619n20752n46720j74437k76783j04365j71404m83914l06377
$$ 24803138 24222519 23701767 23155047 22980610 22703827 22599462 22428058 21944144 21637767
4887B1637767j95257k42676l27971r80577l89909k05856l04288j79493l31099
$$ 21637767 21442510 21199834 20871863 19891286 19501377 19295521 18991233 18811740 18480641
4878A8480641l86949l44025m13996j60590k44845l86170j68609k59123j65967
$$ 18480641 18093692 17749667 17335671 17175081 16930236 16544066 16375457 16116334 15950367
4869A5950367m55079k58729K63361j78519p2072j19567j45076K08328j4222n4805
$$ 15950367 15495288 15236559 15499920 15321401 15249329 15129762 14984686 15193014 15178792 15123987
4859A5123987q7654K82280J60341J62487m5832r0880k2219K7136m8j3343n03356
$$ 15123987 15036333 15318613 15478954 15641441 15595609 15504729 15482510 15509646 15509598 15496255 14992899
4848A4992899k11255l99402K5113m4832l69437j62522L01018k02221j0928k45531
$$ 14992899 14781644 14382242 14407355 14362523 13993086 13830564 14131582 13929361 13918433 13672902
4838A3672902j48012o9032k94005K25323j25455K04323J55491J046K92696k42601
$$ 13672902 13524890 13455858 13161853 13387176 13261721 13466044 13621535 13622581 13915277 13672676
4828A3672676j22282L0444J1529j72785M4550m6057p7462p7143L5973j14266j19353
$$ 13672676 13550394 13580838 13592367 13419582 13464132 13418075 13340613 13263470 13299443 13185177 13065824
4817A3065824k01233j99095k49614j56471N3604j65557l36772l49025l50532j35769
$$ 13065824 12864591 12665496 12415882 12259411 12313015 12147458 11810686 11461661 11111129 10975360
4807A0975360o0067m56246K1688k62684j15314o0768m9998m53603k89970J46987
$$ 10975360 10915293 10459047 10480735 10218051 10102737 10041969 9991971 9538368 9248398 9395385
4797I395385K10559j19209J11673m20790J30242k04204l72072j06214R9965K43061
$$ 9395385 9605944 9486735 9598408 9177618 9307860 9103656 8731584 8625370 8725335 8968396
4787H968396l05933m65307j50958J0804m82641k28338j29734p2070j6780j54286
$$ 8968396 8662463 8197156 8046198 8057002 7574361 7346023 7216289 7144219 7127439 6973153
4777F973153K6383m55500m7626k02155k17985l28759j30006K83263J47256k51193
$$ 6973153 6999536 6544036 6496410 6294255 6076270 5747511 5617505 5900768 6048024 5796831
4767E796831l91387M44058l88735l20441r836K09988P0626M682k25970r6847j11269
$$ 5796831 5405444 5849502 5460767 5140326 5130490 5340478 5411104 5415786 5189816 5092969 4981700
4756D981700o3229j92809o0678K09625K05456k09844j87052r5432q1136P7235
$$ 4981700 4918471 4725662 4664984 4874609 5080065 4870221 4683169 4587737 4506601 4583836
4746D583836j73582m0943k17944K28390L7944j03662j76429m8878M8343o6497
$$ 4583836 4410254 4369311 4151367 4379757 4417701 4314039 4137610 4088732 4137075 4070578
4736D070578j68376k17705J13992M32484r7555j21590k51520l09629J93043m2609
$$ 4070578 3902202 3684497 3798489 4230973 4133418 4011828 3760308 3450679 3643722 3601113
4726C601113Q3281J12577R1800M0234n89451j22055J69576R3513J42767k32674
$$ 3601113 3684394 3796971 3888771 3929005 3339554 3217499 3387075 3480588 3623355 3390681
4716C390681q6815L73358l44290m0352k70467Q5819l0785J26289Q6882R4316k77963
$$ 3390681 3303866 3677224 3332934 3292582 3022115 3107934 3077149 3203438 3290320 3384636 3106673
4705C106673M4971k71029J0603j22407O5911m5858n3296j9218K1538N2190j91091
$$ 3106673 3151644 2880615 2891218 2768811 2834722 2788864 2735568 2716350 2737888 2790078 2598987
4694B598987Q6041M3400O4371l35277K08047m3332L34703j78528k40886J0311
$$ 2598987 2685028 2728428 2792799 2457522 2665569 2622237 2956940 2778412 2537526 2547837
4684B547837L4828J82484J16105l19262j18407J13331K02948k68485o7757j27995
$$ 2547837 2582665 2765149 2881254 2561992 2443585 2556916 2759864 2491379 2423622 2295627
4674B295627J69664P7360R0660j29795j49100q9258K31517l95926j15389O5442
$$ 2295627 2465291 2542651 2633311 2503516 2354416 2265158 2496675 2100749 1985360 2050802
4664B050802N09183J05540j29210j22787j54331j79374k6735M4191J31127K97233
$$ 2050802 2559985 2665525 2536315 2413528 2259197 2079823 2053088 2097279 2228406 2525639
4654B525639R5819J65962o7938k06789j95680k02315L599J05238L76660O053j27912
$$ 2525639 2621458 2787420 2719482 2512693 2317013 2114698 2118297 2223535 2600195 2606248 2478336
4643B478336N9458J34676l83483P3002M5202N6121K00719j53754J33231o4346
$$ 2478336 2537794 2672470 2288987 2361989 2407191 2463312 2664031 2510277 2643508 2579162
4633B579162J19338j19995j92865k93068K86884q012K3292R9796k7707m1888J9402
$$ 2579162 2698500 2578505 2385640 2092572 2379456 2371444 2394736 2494532 2466825 2424937 2444339
4622B444339J40842J14765l52181j86740K20463K0363J39072k48043R9177O2808
$$ 2444339 2585181 2699946 2347765 2161025 2381488 2401851 2540923 2292880 2392057 2454865
4612B454865r2978k11996q9354o3003K43036K13817r8531j10186J93830N6758
$$ 2454865 2361887 2149891 2060537 1997534 2240570 2454387 2355856 2245670 2439500 2496258
4602B496258L8858r3786k57830j19984Q0740J25599j60360k07425o9961M36686
$$ 2496258 2535116 2441330 2183500 2063516 2144256 2269855 2109495 1902070 1832109 2268795
4592B268795m194j06335j06678o364l5255P9136J38118R9930J20673J86436k58680
$$ 2268795 2264601 2158266 2051588 2045224 2009969 2089105 2227223 2327153 2447826 2634262 2375582
4581B375582j79466l1867J42543j6400q1284L8435M09227J2163J388k13158Q046
$$ 2375582 2196116 2164249 2306792 2290392 2209108 2247543 2656770 2668933 2670321 2457163 2465209
4570B465209K2974K54286J02540K1806N7621r5207j61763P3756j55552K522Q6402
$$ 2465209 2488183 2742469 2845009 2866815 2924436 2829229 2667466 2741222 2585670 2588192 2674594
4559B674594K17356Q576n1042L7398N5778j0209k85192j5857l1781j41460M4607
$$ 2674594 2891950 2900526 2849484 2886882 2942660 2932451 2647259 2631402 2599621 2458161 2502768
4548B502768l4054J38984J38687k48339p7851p613R6185k11845r3908k00545J54374
$$ 2502768 2468714 2607698 2746385 2498046 2420195 2412582 2508767 2296922 2203014 2002469 2156843
4537B156843J95631o103r3926J41699r9215j79098J90416j20946J57273m8737
$$ 2156843 2352474 2346371 2252445 2394144 2294929 2115831 2306247 2185301 2342574 2293837
4527B293837j98411o5965J71871J34022k23389Q1222J33l83209J81488L2995Q4998
$$ 2293837 2095426 2029461 2201332 2335354 2111965 2193187 2193320 1810111 1991599 2024594 2109592
4516B109592q3904l1021J02825J51940j2962o1138p7797j28221l44513L41452
$$ 2109592 2025688 1994667 2097492 2249432 2236470 2175332 2097535 1969314 1624801 1966253
4506A966253J11277j03766J04114j21818J0619J67687J11826K63440j01609m2543
$$ 1966253 2077530 1973764 2077878 1956060 1966679 2134366 2246192 2509632 2408023 2365480
4496B365480j2389k30007L34639q9916j81850J6710O4778o0462K22431j83409
$$ 2365480 2353091 2123084 2457723 2367807 2185957 2202667 2267445 2206983 2429414 2246005
4486B246005M4681L7407n18r7808K85994K52834J70594p7164j74343r7010J2793
$$ 2246005 2290686 2328093 2327575 2229767 2515761 2768595 2939189 2862025 2687682 2590672 2603465
4475B603465J82836J46635j53845M20061l11831J35178k982L39291k82794p2862
$$ 2603465 2786301 2932936 2779091 3199152 2887321 3022499 3019517 3358808 3076014 3003152
4465C003152O4258K99312j78373L72378l49J35425J19119p7968J20470j77600
$$ 3003152 3067410 3366722 3188349 3560727 3560378 3695803 3814922 3736954 3857424 3679824
4455C679824J13192M06259J68153m4001L64827J21212K31612j99319j0456Q6711
$$ 3679824 3793016 4199275 4367428 4323427 4688254 4809466 5041078 4841759 4831303 4918014
4445D918014J70679J38413L67109P5529K00957o907L8250L94322L49317J51102
$$ 4918014 5088693 5227106 5594215 5669744 5870701 5863794 5902044 6296366 6645683 6796785
4435F796785M64740J73607O61394M31863N01181L30308P49705P74547Q71468O99176
$$ 6796785 7261525 7435132 8096526 8528389 9029570 9359878 10109583 10884130 11755598 12454774
4425A2454774J291594J351924J054266J451514J457022J249088J230528M38911
$$ 12454774 13746368 15098292 16152558 17604072 19061094 20310182 21540710 21979621
4417B1979621K67016L63480n0236k08006j79934k96600q2414K76152P17131L28257
$$ 21979621 22246637 22610117 22559881 22351875 22171941 21875341 21792927 22069079 22786210 23114467
4407B3114467M06875M88267N19022O04029L25515J36076o51340n00775j088424
$$ 23114467 23521342 24009609 24528631 25132660 25458175 25594251 24942911 24442136 23353712
4398B3353712q21724j015481j162089j014056o84945p69672n12869n81132k08550
$$ 23353712 22531988 21516507 20354418 19340362 18655417 17885745 17372876 16791744 16583194
4389A6583194o96482n15996K29306K36252J51574L00627M27523N57989P46443
$$ 16583194 15886712 15370716 15600022 15836274 15987848 16288475 16715998 17273987 18020430
4380A8020430J070793J279073J236146J471976J728482K179203K125402K024645
$$ 18020430 19091223 20370296 21606442 23078418 24806900 26986103 29111505 31136150
4372C1136150K267013K310887K176455J715883R15870k06439l68534l56823n77866
$$ 31136150 33403163 35714050 37890505 39606388 40522258 40315819 39947285 39590462 39012596
4363C9012596m58198q56191N4458k26437N13794N21618M69636L65193Q00603j34616
$$ 39012596 38554398 37698207 37752665 37526228 38040022 38561640 39031276 39396469 40197072 40062456
4353D0062456j90941n92540j378377j773389k393816k163278j726780k107429
$$ 40062456 39871515 39278975 37900598 36127209 33733393 31570115 29843335 27735906
4345B7735906k168616j993031j947751j430703j275061r69053j041060j311716
$$ 27735906 25567290 23574259 21626508 20195805 18920744 17951691 16910631 15598915
4337A5598915p55086p88109p09830q61607o88544n28276m39953j42743k84764
$$ 15598915 14843829 14055720 13345890 12484283 11795739 11267463 10827510 10684767 10400003
4328A0400003j3071n57536k89752m30857j13285p9106J40436m85712R5576k75419
$$ 10400003 10386932 9829396 9539644 9108787 8995502 8916396 9056832 8571120 8666696 8391277
4318H391277m3053m61818l37560K00340j15389M9917J15444M7699n352n1564k89140
$$ 8391277 8348224 7886406 7548846 7749186 7633797 7683714 7799158 7846857 7841505 7789941 7500801
4307G500801k4101L9396K93705k8583j29028M1913L73268L12437R8062j70662
$$ 7500801 7476700 7516096 7809801 7781218 7652190 7694103 8067371 8379808 8477870 8307208
4297H307208K32232M39626Q3688J46099N12015K52505Q88759O53691L63713O05706
$$ 8307208 8539440 8979066 9062754 9208853 9720868 9973373 10862132 11515823 11879536 12485242
4287A2485242P13105Q48424P74555O93308J229556J162645J084054O10754P32447
$$ 12485242 13198347 14046771 14821326 15514634 16744190 17906835 18990889 19601643 20334090
4278B0334090K66713j36931k99520n51508k18600n65939l56753k68924K61764
$$ 20334090 20600803 20463872 20164352 19612844 19394244 18828305 18471552 18202628 18464392
4269A8464392m1017j32921P2198N93666M51136O00181J050058J116545J364558
$$ 18464392 18423375 18290454 18362652 18956318 19407454 20007635 21057693 22174238 23538796
4260B3538796J802901J558090J220081Q74152J075260L06196l16209o56509l46866
$$ 23538796 25341697 26899787 28119868 28994020 30069280 30375476 30059267 29402758 29055892
4251B9055892J39252J87099m61414m24111n94232r0056p54674j143884j062625
$$ 29055892 29195144 29382243 28920829 28496718 27902486 27812430 27057756 25913872 24851247
4242B4851247n93884n46283o41005n04642n00007p8247j20433L76314N03942Q07228
$$ 24851247 24257363 23711080 23070075 22565433 22065426 21987179 21866746 22243060 22747002 23554230
4232B3554230O21486J092300J141544R46915Q80618P72512M01330M31616K39022
$$ 23554230 24175716 25268016 26409560 27356475 28237093 29009605 29410935 29842551 30081573
4223C0081573k25280p67276j173560j282971q64980j084401r76788q83157o22111
$$ 30081573 29856293 29089017 27915457 26632486 25767506 24683105 23706317 22823160 22201049
4214B2201049m71245j99793K43036L18043P5192K33667K37524R1185K19514l92426
$$ 22201049 21729804 21530011 21773047 22091090 22166282 22399949 22637473 22728658 22948172 22555746
4204B2555746m63823k37885n23228j9035l5114m77243m31801n65700n31252q64768
$$ 22555746 22091923 21854038 21330810 21311775 21276661 20799418 20367617 19801917 19270665 18405897
4194A8405897j119097j063810l98636m77044q66528p86226l70927j69408l13666
$$ 18405897 17286800 16222990 15824354 15347310 14480782 13694556 13323629 13154221 12840555
4185A2840555k16265j1791J52942J72223J69390L56203N26553P11019L48447Q5219
$$ 12840555 12624290 12612499 12765441 12937664 13107054 13463257 13989810 14700829 15049276 15134495
4175A5134495J24949J57400l8814n22992o50759q50569j010613q46138o72575
$$ 15134495 15259444 15416844 15378030 14855038 14204279 13353710 12343097 11496959 10824384
4166A0824384o20825o87315n28319m18871p23913q7702k71698n40727j87366m70319
$$ 10824384 10203559 9516244 8987925 8569054 7845141 7757439 7485741 6945014 6757648 6287329
4156F287329k00397m2783l27217l50510L8227N0517k09137l79371j54819K06196
$$ 6287329 6086932 6044149 5716932 5366422 5404649 5455166 5246029 4866658 4711839 4918035
4146D918035q3177k00820j13805j17204j16536l406j97074K92237J45497j10959
$$ 4918035 4834858 4634038 4520233 4403029 4286493 4283087 4086013 4378250 4523747 4412788
4136D412788K56786r232j67341k73989j88865J53510q489K18838M9842L45158
$$ 4412788 4669574 4660342 4493001 4219012 4030147 4183657 4175168 4394006 4443848 4789006
4126D789006j20973q1367o1487P156q5343j03402r3889K04131j7419J6778R2955
$$ 4789006 4668033 4586666 4525179 4532335 4446992 4343590 4249701 4453832 4436413 4453191 4546146
4115D546146R7684k03024j01264N5577L81451J47209l7436j6672l20708j70921
$$ 4546146 4643830 4440806 4339542 4395119 4776570 4923779 4886343 4869671 4548963 4378042
4105D378042j57145j46552k48025j34846K6233J21053L22J29611j94153J60533
$$ 4378042 4220897 4074345 3826320 3691474 3717707 3838760 3839082 3968693 3774540 3935073
4095C935073k10586k29086L07849J26331p1235n1910j03585P6286k92095N756
$$ 3935073 3724487 3495401 3803250 3929581 3858346 3806436 3702851 3779137 3487042 3492798
4085C492798l65567J70597Q3538J12569r5413L02967k7451J52191L10499j41243
$$ 3492798 3127231 3297828 3381366 3493935 3398522 3701489 3674038 3826229 4136728 3995485
4075C995485k67200j13939k40033N0370J4603n634K70638k11392J58024o6608
$$ 3995485 3728285 3614346 3374313 3424683 3439286 3433652 3704290 3492898 3650922 3584314
4065C584314k60693j49251K75207N1305k6546k39279K42452L14657j68618j54180
$$ 3584314 3323621 3174370 3449577 3500882 3474336 3235057 3477509 3792166 3623548 3469368
4055C469368P0617M66418n26j88074K95696K02924R8147j51605l6393K33436M21159
$$ 3469368 3539985 4006403 4005877 3817803 4113499 4316423 4414570 4262965 4226572 4460008 4881167
4044D881167J17572j0888K32605K69551P425J88605L80530L74677J03970K34554
$$ 4881167 4998739 4987851 5220456 5490007 5497432 5686037 6066567 6441244 6545214 6779768
4034F779768K68358J97410J11146J18579M75371j30424J91276j85266o0258J83156
$$ 6779768 7048126 7245536 7356682 7475261 7950632 7820208 8011484 7826218 7765960 7949116
4024G949116O2717M2424k09337l34644K86990J62629r9582l56322j45674J81601
$$ 7949116 8011833 8054257 7844920 7510276 7797266 7959895 7860313 7503991 7358317 7539918
4014G539918O7928l530O0236L84080M690K13231K07998J50733N72106K38338M31002
$$ 7539918 7607846 7604316 7664552 8048632 8053322 8266553 8474551 8625284 9197390 9435728 9866730
4003I866730N51009L26051M85552P13564q6758k86410m29558m41689k84622l44567
$$ 9866730 10417739 10743790 11229342 11942906 11856148 11569738 11140180 10698491 10413869 10069302
3993A0069302k39285l1682l963j75821j17887n75310n2600l3643k0795l36892
$$ 10069302 9830017 9798335 9794372 9618551 9500664 8925354 8872754 8839111 8818316 8481424
3983H481424k98802k31242J77368j2633j04067j05332K04290l7566K4441M77460
$$ 8481424 8182622 7951380 8128748 8116115 8012048 7906716 8111006 8073440 8097881 8575341
3973H575341K20581J33640j17M72185K55069O8438J85410L69525L69769L37899
$$ 8575341 8795922 8929562 8929445 9401630 9656699 9725137 9910547 10280072 10649841 10987740
3963A0987740r261J50800M42847M69219K58670k13686J27123L57821K14847N23511
$$ 10987740 10978479 11129279 11572126 12041345 12300015 12086329 12213452 12571273 12786120 13309631
3953A3309631O1286K96735N08827M58276P33472M62376K65695O10797Q19436O43554
$$ 13309631 13370917 13667652 14176479 14634755 15368227 15830603 16096298 16707095 17526531 18170085
3943A8170085P88210M64301N08216N89808J157033O81384P50698R84538R14866
$$ 18170085 18958295 19422596 19930812 20520620 21677653 22359037 23109735 24094273 25009139
3934B5009139Q95621J092695J072985J585222J673838K149505K630029K996578
$$ 25009139 25904760 26997455 28070440 29655662 31329500 33479005 36109034 39105612
3926C9105612L326123M394010N002906N882550O674724P496432R631853J1497496
$$ 39105612 42431735 46825745 51828651 57711201 64385925 71882357 81514210 93011706
3918I3011706J2726633J2702977J0507791Q915281Q732807O170778j109616r264072
$$ 93011706 105738339 118441316 128949107 137864388 146597195 152767973 151658357 142394285
3910A42394285j3753120j2804010j0435769q681123p829507p293601o838925o447924
$$ 142394285 128641165 115837155 105401386 96720263 88890756 81597155 74758230 68310306
3902F8310306n731711n187293m171479l565122k744751k525704k316333j820133
$$ 68310306 62578595 57391302 53219823 49654701 46909950 44384246 42067913 40247780
3894D0247780j437208j379054q34146j041551n66278n89415k75964l67409l43394
$$ 40247780 38810572 37431518 36597372 35555821 34989543 34400128 34124164 33756755 33413361
3885C3413361k03337J11332q359R20378K02761N56677O75606M12773L20161N19753
$$ 33413361 33210024 33321356 33312997 34233375 34436136 34992813 35668419 36081192 36401353 36921106
3875C6921106O73821O64603R41222J254314J554636J582831J898988J772941K362764
$$ 36921106 37594927 38259530 39200752 40455066 42009702 43592533 45491521 47264462 49627226
3866D9627226K431046L096302L951820M380811N614005O775340Q266801R441247
$$ 49627226 52058272 55154574 59106394 63487205 69101210 75876550 84143351 93584598
3858I3584598J0646839J2115927J4359107J7911979K2484948K7585948K8071014
$$ 93584598 104231437 116347364 130706471 148618450 171103398 198689346 226760360
3851B26760360J8720245J4419532J7756500J8735033k27735l0816710l3660123
$$ 226760360 245480605 259900137 277656637 296391670 296163935 265347225 231687102
3844B31687102k6658586j8977803j3853991j5523984j5444467j3683212j2514756
$$ 231687102 205028516 186050713 172196722 156672738 141228271 127545059 115030303
3837A15030303j1672848r950306p920197o058176n475415m738924l991636l725547
$$ 115030303 103357455 93407149 85486952 79428776 73953361 69214437 65222801 61497254
3829F1497254l289393k904938k776954k126426j883209j820387j649634j183001
$$ 61497254 58207861 55302923 52525969 50399543 48516334 46695947 45046313 43863312
3821D3863312j026456j116616j267952r84522o87854m17180l75751l77437m73315
$$ 43863312 42836856 41720240 40452288 39467766 38779912 38362732 37986981 37609544 37136229
3812C7136229k56440l45313j05781k00387o3976J79645n1269n8347K37994N97210
$$ 37136229 36879789 36534476 36428695 36228308 36164332 36343977 36292708 36234361 36472355 37069565
3802C7069565P87701L73927L31592O61440Q83125O36180R59445J027167Q38562
$$ 37069565 37857266 38231193 38562785 39224225 40107350 40743530 41702975 42730142 43568704
3793D3568704J284609J396098J356931R08052J314226J491255J293361J814774
$$ 43568704 44853313 46249411 47606342 48514394 49828620 51319875 52613236 54428010
3785E4428010J823306J723420K023955K269081K028624K053425K234109K454270
$$ 54428010 56251316 57974736 59998691 62267772 64296396 66349821 68583930 71038200
3777G1038200K499914K442442K802327K886821K811295L021730K989292K711186
$$ 71038200 73538114 75980556 78782883 81669704 84480999 87502729 90492021 93203207
3769I3203207L142912L033809K763148L018537L400145L068138K809141K844571
$$ 93203207 96346119 99379928 102143076 105161613 108561758 111629896 114439037 117283608
3761A17283608K956499L129597K503938K209349K413264K604962K135973J516978
$$ 117283608 120240107 123369704 125873642 128082991 130496255 133101217 135237190 136754168
3753A36754168J732003J360417J126849Q00126M52177M07J42698o7008n77196
$$ 136754168 138486171 139846588 140973437 141773563 142225740 142226147 142368845 142301837 141724641
3744A41724641p31502q45223j357161j498314j927809k170621k625900k638387
$$ 141724641 140993139 140147916 138790755 137292441 135364632 133194011 130568111 127929724
3736A27929724k525349k422926k922057l376186l327380k885013l014711l487139
$$ 127929724 125404375 122981449 120059392 116683206 113355826 110470813 107456102 103968963
3728A03968963l391637l759742l230131l248795l343642l302780l304351l164350
$$ 103968963 100577326 96817584 93587453 90338658 86995016 83692236 80387885 77223535
3720G7223535l124641l168419l237479l031330k526975k483502k858998k462275
$$ 77223535 74098894 70930475 67692996 64661666 62134691 59651189 56792191 54329916
3712E4329916k259784k185565j931899k038021j805694j815598j767481j439235
$$ 54329916 52070132 49884567 47952668 45914647 44108953 42293355 40525874 39086639
3704C9086639j750955k183082j688006j389711j186538j477727j205222j279261
$$ 39086639 37335684 35152602 33464596 32074885 30888347 29410620 28205398 26926137
3696B6926137r08582q52159j262987r76727j076530p68734p72481o79747n45219
$$ 26926137 26017555 25165396 23902409 22925682 21849152 21080418 20307937 19628190 19082971
3687A9082971n61686n83118m95966p38618n11463n44613l69367p0082o03250k32849
$$ 19082971 18521285 17938167 17442201 16703583 16192120 15647507 15278140 15208058 14604808 14371959
3677A4371959l32663k69867j26976n67078l13343j2146k41799k76226N4510k86925
$$ 14371959 14039296 13769429 13642453 13075375 12762032 12749886 12508087 12231861 12286371 11999446
3667A1999446k16237j87147O6957m27275l02161N509K3591l878N2821J85892m84068
$$ 11999446 11783209 11596062 11663019 11235744 10933583 10939092 10962683 10958805 11011626 11197518 10713450
3656A0713450k75824j80258J22282L7469l3488Q8075L9150p0604l37989n64162
$$ 10713450 10437626 10257368 10379650 10417119 10383631 10471706 10510856 10440252 10102263 9538101
3646I538101R0040j15392j89081q2668j6888l55101j87692R0061l34332l61952
$$ 9538101 9628141 9512749 9323668 9241000 9224112 8869011 8681319 8771380 8437048 8075096
3636H075096n2329K62352L7004k34472K9595j12275k2307o585J0639j8223j8453
$$ 8075096 8022767 8285119 8322123 8087651 8117246 8004971 7982664 7976079 7986718 7968495 7950042
3625G950042K7506J11744j66662l61610k6800J88832J58768j1954m423k77339
$$ 7950042 7977548 8089292 7922630 7561020 7534220 7723052 7881820 7869866 7865443 7588104
3615G588104K31663j55815j98610m1418k03676K45272J82812P847l10017k21229
$$ 7588104 7819767 7663952 7465342 7423924 7220248 7465520 7648332 7656179 7346162 7124933
3605G124933o4354L95654j14220o16194j82581M80397Q9356k80618m08734K92188
$$ 7124933 7060579 7456233 7342013 6725819 6543238 7023635 7112991 6832373 6423639 6715827
3595F715827O1811J62060k07174j36296L77105K27330J75301k18552J5287M3415
$$ 6715827 6777638 6939698 6732524 6596228 6973333 7200663 7375964 7157412 7172699 7216114
3585G216114L0104K81418J52303j47843j52488J63015j08334m14659j66228p6685
$$ 7216114 7246218 7527636 7679939 7532096 7379608 7542623 7434289 7019630 6853402 6776717
3575F776717j17773n7391J69919m8892q8975j57194M00736m19836k4664Q6565
$$ 6776717 6658944 6601553 6771472 6722580 6633605 6476411 6877147 6457311 6432647 6519212
3565F519212K98233q3138J24076p2167K6879Q5886N7669k22420l5620K21449L05924
$$ 6519212 6817445 6734307 6858383 6786216 6813095 6898981 6956650 6734230 6698610 6920059 7225983
3554G225983j61097J21803j56383K27084M7618K6773J2037K94986J21290k27749
$$ 7225983 7064886 7186689 7030306 7257390 7305008 7331781 7343818 7638804 7760094 7532345
3544G532345j63133o0718K18988J96457J59189r9555k42996n4296J1805K08075
$$ 7532345 7369212 7308494 7527482 7723939 7883128 7783573 7540577 7486281 7498086 7706161
3534G706161M2686r2496J81596K38067K63834k9239j29586K8395M56553K28689
$$ 7706161 7748847 7656351 7837947 8076014 8339848 8310609 8181023 8209418 8665971 8894660
3524H894660J66304m4437L68694k4187N983P1800L16119J13759M42941L56871
$$ 8894660 9060964 9016527 9385221 9361034 9367017 9438817 9754936 9868695 10311636 10668507
3514A0668507K87141L6226J43374K91738L74431J92214L84210J55635O77571M02145
$$ 10668507 10955648 10991874 11135248 11426986 11801417 11993631 12377841 12533476 13211047 13613192
3504A3613192J93832n2432M45939L22132M22629N41166L72628M05715M61219P15744
$$ 13613192 13807024 13754592 14200531 14522663 14945292 15486458 15859086 16264801 16726020 17441764
3494A7441764K62988L35816N16752M59101J99058N81214R46600M90014N26264
$$ 17441764 17704752 18040568 18557320 19016421 19215479 19796693 20743293 21233307 21759571
3485B1759571N71483Q97172O94970M33549P29871J177994J012752J273643J295298
$$ 21759571 22331054 23228226 23923196 24356745 25086616 26264610 27277362 28551005 29846303
3476B9846303J286911J180821J102892J376327J590974J702001J941788K219569
$$ 29846303 31133214 32314035 33416927 34793254 36384228 38086229 40028017 42247586
3468D2247586J999512K142707J861054K230956K081602K146736K210453K356500
$$ 42247586 44247098 46389805 48250859 50481815 52563417 54710153 56920606 59277106
3460E9277106K244560K262084J900359J901670J812975K081186J798238J726778
$$ 59277106 61521666 63783750 65684109 67585779 69398754 71479940 73278178 75004956
3452G5004956J415775J323891J528084J002706P71570N86595O15771O80889J97157
$$ 75004956 76420731 77744622 79272706 80275412 81046982 81633577 82249348 82930237 83127394
3443H3127394J74586M19802N50409M40324N04868N78742L16804N89806R73735
$$ 83127394 83301980 83721782 84272191 84712515 85217383 85796125 86112929 86702735 87676470
3434H7676470J156585R68949J527533J660604J910476K486819K363786K749810
$$ 87676470 88833055 89802004 91329537 92990141 94900617 97387436 99751222 102501032
3426A02501032L146679L337909M237998M627644N128961N658544O152814O697838
$$ 102501032 105647711 108985620 113223618 117851262 122980223 128638767 134791581 141489419
3418A41489419P349514P482182P834067Q952304R117303R804250R982721J0885572
$$ 141489419 148838933 156321115 164155182 173107486 182224789 192029039 202011760 212897332
3410B12897332J1757595J1950327J2562493J3293889J3758425J4045772J4553922
$$ 212897332 224654927 236605254 249167747 262461636 276220061 290265833 304819755
3403C04819755J4700986J4363183J4080770J3601287J2189585J0640489R066166
$$ 304819755 319520741 333883924 347964694 361565981 373755566 384396055 393462221
3396C93462221Q000140O449700N184955L868071L129998K458338J648986R09452
$$ 393462221 401462361 407912061 413097016 416965087 420095085 422553423 424202409 425111861
3388D25111861p426p34305j708577k790373l283338m462035n183613m908223n166752
$$ 425111861 425104435 424370130 422661553 419871180 416587842 412125807 406942194 402033971 396867219
3379C96867219m601205m061151l345196k396135j218027m58679Q49545J125272
$$ 396867219 392266014 388204863 384859667 382463532 381245505 380786826 381636371 382761643
3371C82761643J691228J977157K342265K093557J455106P77662P21014l03619
$$ 382761643 384452871 386430028 388772293 390865850 392320956 393098618 393819632 393516013
3363C93516013j239627k041625k545959l533815m573264n293369o081092p024687
$$ 393516013 392276386 390234761 387688802 384154987 379581723 374288354 368207262 361182575
3355C61182575p792358q613843r606138j0835499j1493858j1495840j2429230
$$ 361182575 353390217 344776374 335170236 324334737 312840879 301345039 288915809
3348B88915809j2878498j2798981j2329740j1791383j1104896j1142492j0452619
$$ 288915809 276037311 263238330 250908590 239117207 228012311 216869819 206417200
3341B06417200r880175r070285q650246p843411p173411o434398o032281n588910
$$ 206417200 196537025 187466740 178816494 170973083 163799672 157365274 151332993 145744083
3333A45744083n253277m706748m339956l885427l580971l353982l186217k960569
$$ 145744083 140490806 135784058 131444102 127558675 123977704 120623722 117437505 114476936
3325A14476936k713845k733544k678562j971354k203440k268515k168343k166506
$$ 114476936 111763091 109029547 106350985 104379631 102176191 99907676 97739333 95572827
3317I5572827k115269j942237k102268j687431j797290j838364j877649j851117
$$ 95572827 93457558 91515321 89413053 87725622 85928332 84089968 82212319 80361202
3309H0361202k055462k442862k028580k065046k045195k185219k053201j945610
$$ 80361202 78305740 75862878 73834298 71769252 69724057 67538838 65485637 63540027
3301F3540027j886831k070005k269984k059251j680058j725066j715866j339818
$$ 63540027 61653196 59583191 57313207 55253956 53573898 51848832 50132966 48793148
3293D8793148j737991k078165j794879j358702j597973j595101j392770j526572
$$ 48793148 47055157 44976992 43182113 41823411 40225438 38630337 37237567 35710995
3285C5710995r79760j160635j204554j185552j061774r72215r01226r61689p37292
$$ 35710995 34731235 33570600 32366046 31180494 30118720 29146505 28245279 27283590 26546298
3276B6546298n56147o28253m56423p79661o19788m65919o74262n20855l82889
$$ 26546298 25990151 25361898 24905475 24125814 23506026 23040107 22365845 21844990 21462101
3267B1462101p3663l31081j90292l98683n38397n46772k81123k74306l47613l99077
$$ 21462101 21388438 21057357 20867065 20468382 19929985 19383213 19102090 18827784 18480171 18081094
3257A8081094l57969k90300o18637p42134k47631l41550l61638k90880j22186
$$ 18081094 17723125 17432825 16814188 16072054 15824423 15482873 15121235 14830355 14708169
3248A4708169k88843m10027l11808l63245l2956m48343l17297J36117J1699l28481
$$ 14708169 14419326 14009299 13697491 13334246 13301290 12852947 12535650 12671767 12683466 12354985
3238A2354985j01747M3505J88468j75833J56393l65921j42653r6155j14188j56272
$$ 12354985 12253238 12296743 12485211 12309378 12465771 12099850 11957197 11861042 11746854 11590582
3228A1590582k19543j78419k69790j67941k36133l87633K0871L29805J88692l19076
$$ 11590582 11371039 11192620 10922830 10754889 10518756 10131123 10151994 10481799 10670491 10351415
3218A0351415m01551m7835L231n5211l24825K4781J9004R550J4024L0573q4782
$$ 10351415 9949864 9902029 9905260 9850049 9525224 9550005 9569009 9578559 9592583 9623156 9538374
3207I538374R848j63348J75559m06543Q2635K62010k40745m9566q1651j63114
$$ 9538374 9548222 9384874 9560433 9153890 9236525 9498535 9257790 9208224 9126573 8963459
3197H963459p272l72136K39583J82660j52380j10692J22946O478l677N0095J51306
$$ 8963459 8956187 8584051 8823634 9006294 8853914 8743222 8866168 8872646 8868969 8919064 9070370
3186I070370j04733K27303J15458k87484M3099J60093J95464L0129k44396o4576
$$ 9070370 8965637 9192940 9308398 9020914 9064013 9224106 9419570 9449699 9205303 9140727
3176I140727M54912K80031k10562R979K99005K31683K40759n9244J99617Q3902
$$ 9140727 9595639 9875670 9665108 9675087 9974092 10205775 10446534 10387290 10586907 10670809
3166A0670809j9833L24708K74129J96995K67590N9338M38835K38642K2262J52774
$$ 10670809 10650976 10975684 11249813 11446808 11714398 11773736 12212571 12451213 12473475 12626249
3156A2626249M97935J762J03167J87232N76623J74402J42024L13595M01360L44784
$$ 12626249 13124184 13125946 13229113 13416345 13992968 14167370 14309394 14622989 15024349 15369133
3146A5369133M20412K21373L63213O32332M66816O31009M23081N31318N84916
$$ 15369133 15789545 16010918 16374131 17006463 17473279 18104288 18527369 19058687 19643603
3137A9643603P07034M30260M85516O25540P76739M05074M10558K85865L95944
$$ 19643603 20350637 20780897 21266413 21891953 22668692 23073766 23484324 23770189 24166133
3128B4166133O81763K20508M71441P22674K17185O76014Q02993Q27886N49719
$$ 24166133 24847896 25068404 25539845 26262519 26479704 27155718 27958711 28786597 29336316
3119B9336316N86349Q26260R88412J183006R80504J127218J372781J073383J207273
$$ 29336316 29922665 30748925 31737337 32920343 33900847 35028065 36400846 37474229 38681502
3110C8681502J693404J777142K022057K137907K520511K717092K783990L302329
$$ 38681502 40374906 42152048 44174105 46312012 48832523 51549615 54333605 57635934
3102E7635934L497930L779389M327333M025616M121561L802597L685769L165716
$$ 57635934 61133864 64913253 69240586 73266202 77387763 81190360 84876129 88041845
3094H8041845K767181K335604J668278M81392J72737q55951j290840j435077j841431
$$ 88041845 90809026 93144630 94812908 95294300 95467037 94611086 93320246 91885169 90043738
3085I0043738k410448k563819k763077l544601m156179m348921m329645l774869
$$ 90043738 87633290 85069471 82306394 78761793 74605614 70256693 65927048 62152179
3077F2152179l531818l130566l214547l001653l012844l031242k476091k521633
$$ 62152179 58620361 55489795 52275248 49273595 46260751 43229509 40753418 38231785
3069C8231785k096621j759500j690982j778746j208881j492655j153408j113725
$$ 38231785 36135164 34375664 32684682 30905936 29697055 28204400 27050992 25937267
3061B5937267r43406j081486q28319p95183p95752q06009o83448n51176p38128
$$ 25937267 24993861 23912375 23084056 22288873 21493121 20687112 20003664 19452488 18714360
3052A8714360p38116m84150o66621o70255l75701n98872o71567l77879n25355
$$ 18714360 17976244 17492094 16825473 16155218 15779517 15180645 14509078 14131199 13605844
3043A3605844n25034n29054k44059k50245k99530n68486k21135l39777l73895
$$ 13605844 13080810 12551756 12307697 12057452 11757922 11189436 10968301 10628524 10254629
3034A0254629m11958k74825o8663k27655l20861l05373j36397l26510l97486j59626
$$ 10254629 9842671 9567846 9499183 9271528 8950667 8645294 8508897 8182387 7784901 7625275
3024G625275r3306q1253n74757j27141J37778o2056m44780j42379J16828l84319
$$ 7625275 7531969 7450716 6875959 6748818 6886596 6824540 6379760 6237381 6354209 5969890
3014E969890k72190k53318R2450k5487j57458j26654j77929l77767j3194m02921
$$ 5969890 5697700 5444382 5536832 5511345 5353887 5227233 5049304 4671537 4658343 4255422
3004D255422m9545J45952j79737k40395m8507J75922k30597J41146k59915J70585
$$ 4255422 4205877 4351829 4172092 3931697 3883190 4059112 3828515 3969661 3709746 3880331
2994C880331R7256n13236M8933j47137K93034l1604k90838m06528J18894J07513
$$ 3880331 3977587 3464351 3513284 3366147 3659181 3627577 3336739 2930211 3049105 3156618
2984C156618j50526k15189j3808M55079J55618q8924J64752j27311r0313J42545
$$ 3156618 3006092 2790903 2777095 3232174 3387792 3298868 3463620 3336309 3245996 3388541
2974C388541m5407J01404J64774J13009K73196P2311o231l4840k24647m9385O1674
$$ 3388541 3343134 3444538 3609312 3722321 3995517 4067828 4061597 4026757 3802110 3752725 3814399
2963C814399k83612O726o7638L00925k9566m18475j58256r0875L0149J8552j17371
$$ 3814399 3530787 3537513 3469875 3770800 3741234 3322759 3164503 3073628 3103777 3122329 3004958
2952C004958j55757R0496l04595q5198l8402J21137j3442j64462P765J67636j19103
$$ 3004958 2849201 2939697 2635102 2549904 2511502 2632639 2619197 2454735 2462500 2630136 2511033
2941B511033J2363l56604L1343K3439m9960J1555J31133q1199K7757M3783o6504
$$ 2511033 2523396 2166792 2198135 2221574 2171614 2183169 2314302 2233103 2260860 2304643 2238139
2930B238139o8149k42220Q9102j51j70477N4729K10424J78399L9801j93466l5330
$$ 2238139 2169990 1927770 2016872 2016721 1846244 1900973 2111397 2289796 2329597 2136131 2100801
2919B100801p9407j71116k22430o1623J88083r6417J6725K99983m1526r7923L9357
$$ 2100801 2021394 1850278 1627848 1566225 1754308 1657891 1674616 1974599 1933073 1835150 1874507
2908A874507J25912k87812J40078m4697K47254l5120k87173J25116K71882K8872
$$ 1874507 2000419 1712607 1852685 1807988 2055242 2020122 1732949 1858065 2129947 2158819
2898B158819k32317L4993K07767M5234j46915n2308N9717K0223J98251j48122
$$ 2158819 1926502 1961495 2169262 2214496 2067581 2015273 2074990 2095213 2293464 2145342
2888B145342N8100J07478j47741O2868k01281r1015Q8004m5143L33280J65454
$$ 2145342 2203442 2310920 2163179 2226047 2024766 1933751 2021755 1976612 2309892 2475346
2878B475346N6647m5317k48278j1764J95103J46119n5161K88613M4601K6010m30966
$$ 2475346 2531993 2486676 2238398 2226634 2421737 2567856 2512695 2801308 2845909 2871919 2440953
2867B440953l1998L56243K74001q3583O1766K31350m4144j44949j84994M48353
$$ 2440953 2408955 2765198 3039199 2955616 3017382 3248732 3204588 3059639 2874645 3322998
2857C322998J33434k3533j11470K99275K51205k02438K8972J63704j52319r6016
$$ 3322998 3456432 3432899 3321429 3620704 3871909 3669471 3698443 3862147 3709828 3613812
2847C613812K89577J50326J60588J31916K21563K23339p0481O3954J05058J28711
$$ 3613812 3903389 4053715 4214303 4346219 4567782 4791121 4720640 4784594 4889652 5018363
2837E018363Q5687O2972M67329K97580L8461K17862J82954j65091M51132K67041
$$ 5018363 5104050 5167022 5634351 5931931 5970392 6188254 6371208 6206117 6657249 6924290
2827F924290J27197K87768N3097L91053N68057K58378K89180M41931O44760N38471
$$ 6924290 7051487 7339255 7392352 7783405 8351462 8609840 8899020 9340951 9985711 10524182
2817A0524182O05592P03036R31042P50644P47911O70484J113272J202924J168065
$$ 10524182 11129774 11832810 12763852 13514496 14262407 14932891 16046163 17249087 18417152
2808A8417152J131363J180512Q90048P82900P54467J39511O14949L32795J9270
$$ 18417152 19548515 20729027 21619075 22401975 23156442 23295953 23910902 24243697 24262967
2799B4262967J08697J56452M14445J55015j457M56926L82659L27527M42298O76922
$$ 24262967 24371664 24528116 24942561 25097576 25096119 25553045 25935704 26263231 26705529 27382451
2789B7382451R19165R20945P35272J358377J799795K124450J933008J679354J184066
$$ 27382451 28301616 29222561 29957833 31316210 33116005 35240455 37173463 38852817 40036883
2780D0036883J122921J417461N38065j042869k444250k483322k225349j807546
$$ 40036883 41159804 42577265 43115330 42072461 39628211 37144889 34919540 33111994
2772C3111994j563486j505061j524294j085895j299780j426854j237735p06636
$$ 33111994 31548508 30043447 28519153 27433258 26133478 24706624 23468889 22762253
2764B2762253k56349m83447k42700l03681k08394J18161J1070P1019K84426O03173
$$ 22762253 22505904 22022457 21779757 21476076 21267682 21385843 21396913 21467932 21752358 22355531
2754B2355531Q8233J84364J33588j3133m66368m45271q32015j218078r19133q28142
$$ 22355531 22443764 22628128 22761716 22748583 22282215 21836944 21004929 19786851 18867718 18039576
2744A8039576j083553n87588r14845p89267m57058p77978n41832p51354m12844
$$ 18039576 16956023 16368435 15453590 14664323 14207265 13429287 12887455 12136101 11723257
2735A1723257o98166n76863p12063l19867m47298j51399o40336m06607o73623
$$ 11723257 11025091 10448228 9736165 9416298 8969000 8817601 8177265 7770658 7097035
2726G097035k27445l72318J4578l12257k21872l04778m00353j40064j45058k00141
$$ 7097035 6869590 6497272 6511850 6199593 5977721 5672943 5272590 5132526 4987468 4787327
2716D787327j40889l08317j57314k4849k09607k12229k37576J17327n5439m54885
$$ 4787327 4646438 4338121 4180807 4155958 3946351 3734122 3496546 3613873 3558434 3103549
2706C103549n9555R6792p2318j91528K1708q6487k31164J4875j91335j64554p7963
$$ 3103549 3043994 3140786 3068468 2876940 2898648 2812161 2580997 2595872 2404537 2239983 2162020
2695B162020K6614n326m9121n6653m2717O420j10883j90275m139j90656L30762
$$ 2162020 2188634 2183308 2134187 2077534 2034817 2041237 1930354 1740079 1735940 1545284 1876046
2684A876046q1850j19315j55272o7853j28733K4447O5901J4074j08056Q1528M0505
$$ 1876046 1794196 1674881 1519609 1451756 1323023 1347470 1413371 1427445 1319389 1400917 1441422
2673A441422M0963k64472J34082j69262k29617L9338K4740O3789m4849M2510J89057
$$ 1441422 1482385 1217913 1351995 1182733 953116 992454 1017194 1080983 1036134 1078644 1267701
2662A267701p5756j30582k45660J2093K53899J934k20122J49021J36100J9305
$$ 1267701 1191945 1061363 815703 827796 1081695 1083629 863507 1012528 1148628 1167933
2652A167933m55187L1184o7320J62078m1703q5725n8355J54061l4703R3830o0555
$$ 1167933 712746 743930 676610 838688 796985 711260 652905 806966 772263 866093 805538
2641H05538j71087Q997o2924j419R2677J04145J8369k70742m8762R2691j25851
$$ 805538 634451 643448 580524 579105 671782 775927 794296 523554 474792 567483 441632
2630D41632p2624n34L05190k17275j94805M9852L31682j44966l12051j63822M43259
$$ 441632 369008 368474 673664 456389 261584 311436 643118 498152 186101 22279 465538
2619D65538j02759O8349r5052K20545L75641k0960k55014o7332k51937M1672Q9744
$$ 465538 362779 431128 336076 556621 932262 911302 656288 588956 337019 378691 468435
2608D68435j23603M1334P0387M907M2871k43945J77451l4411J7352p1870j57667
$$ 468435 344832 386166 456553 461460 504331 260386 437837 403426 420778 348908 191241
2597A91241J40061J23636j8680j5690k50634O962J96670N509L6546p3026r8447
$$ 191241 331302 454938 436258 420568 169934 176896 373566 379075 415621 342595 244148
2586B44148k3385J69135j79190m4117M2331O0748r2781q7814J62041L6134J4617
$$ 244148 220763 389898 210708 166591 208922 269670 176889 89075 251116 287250 301867
2575C01867J42461k37209j6787K35132r9032k21858L01689J4617L7078r1786r7516
$$ 301867 444328 207119 190332 425464 326432 104574 406263 420880 457958 366172 268656
2564B68656j46285J48820P376j11745K34115P2410k84319j38697J87188M4323
$$ 268656 122371 271191 278567 166822 400937 473347 189028 50331 237519 281842
2554B81842m7998o3458J78442M2919P4412k98420K05124k37860K4178j11958r3542
$$ 281842 233844 170386 348828 391747 466159 167739 372863 135003 159181 47223 -46319
2543d6319L13447J75572p1391l4830k44736J8597L7410Q2786J9721J76290J03308
$$ -46319 267128 442700 371309 336479 91743 110340 147750 230536 250257 426547 529855
2532E29855j2192j45572j82768k52474K05380l5908L36793K805j3569M57318l86634
$$ 529855 517663 372091 189323 -63151 142229 106321 443114 445919 432350 889668 503034
2521E03034o3324k15276r3765L05293k07016q2193L20193j32410J56050m13210
$$ 503034 439710 224434 130669 435962 228946 146753 466946 334536 490586 77376
2511G7376k6259K58895J6145j07949j55350n8267K60202j10038K31888j55451
$$ 77376 51117 310012 326157 218208 62858 4591 264793 154755 386643 231192
2501B31192n2188j75054J47757J31916j8104k89768J14572J61048J83221j69611
$$ 231192 179004 3950 151707 283623 265519 -24249 90323 251371 434592 264981
2491B64981j63111j05666J76330k44121j50235K25589K78320J19546J2336r9494
$$ 264981 101870 -3796 172534 -71587 -221822 3767 282087 401633 413969 314475
2481C14475j60255j18622J46299Q878k06821M1942J25787L18128j16846l4241
$$ 314475 154220 35598 181897 190775 -16046 25896 151683 469811 352965 318724
2471C18724j05647n4483q5134K1916j94750K62494N6758J29051r5975q0664l0140
$$ 318724 213077 158594 73460 95376 -99374 163120 219878 348929 252954 172290 142150
2460A42150o1308j12154k46945J70060j68620M32708J69397l68382J69141q9647
$$ 142150 80842 -31312 -278257 -108197 -276817 155891 325288 -43094 126047 36400
2450C6400j43921O8825j83745O8128J69644L9186L01035m41830k26710K34919
$$ 36400 -107521 -38696 -222441 -154313 15331 54517 355552 -86278 -312988 -78069
2440g8069j23295l3148J08648k5681L64364N816J2816j13338l11062J71056L0175
$$ -78069 -201364 -234512 -125864 -151545 212819 218635 231451 118113 -192949 -21893 8282
2429H282j47958K7917m1686K9019J21419J32874J25706l68267r047J48750j46744
$$ 8282 -139676 -111759 -153445 -124426 -3007 129867 255573 -112694 -121741 27009 -119735
2418a19735N3831K3764K6122j01276K07878M5251p0874k81740M9614J27445J22607
$$ -119735 -65904 -42140 -16018 -117294 90584 135835 64961 -216779 -167165 -39720 82887
2407H2887N9781R6985m568J48550k75151R5358o8440k54030k3395R517k9465J48145
$$ 82887 142668 239653 235085 383635 108484 203842 135402 -118628 -142023 -132506 -161971 -13826
2395a3826j7819L8878J37574j64357K9775k01208K21904m6096k35930Q6195K07556
$$ -13826 -31645 7233 144807 -19550 10225 -190983 30921 -15175 -251105 -164910 42646
2384D2646j78800K80173j9652j53755j31494L7844k2845R251n2125J9119K40360
$$ 42646 -136154 144019 124367 -29388 -160882 -123038 -145883 -136632 -188757 -169638 70722
2373G0722l7133l50251L0575K17922M188j99375O0112Q6661J70370o3053J30580
$$ 70722 33589 -316662 -286087 -68165 -63977 -263352 -203240 -116579 53791 -9262 121318
2362A21318k92493J3990J19852J76374j28813J09402N8286l03402m5355K6974
$$ 121318 -171175 -157185 -37333 139041 10228 119630 177916 -125486 -170841 -143867
2352a43867J99059Q5549J39047j73740k02266k0434l8336k18483K58155o7219
$$ -143867 55192 140741 279788 106048 -96218 -116652 -154988 -373471 -115316 -182535
2342a82535M7334J78608L4218k87408J48943j94636J46899j14607O1623P8849
$$ -182535 -135201 43407 77625 -209783 -60840 -255476 -108577 -223184 -161561 -82712
2332h2712J27596L2789O9648j21497j91451M399K55444k7496l1630j29024Q1079
$$ -82712 44884 77673 147321 25824 -165627 -161228 94216 66720 35090 -93934 -12855
2321a2855J967M699M08r2062K13132M2766l2004J1254j77285m513J73505P4788
$$ -12855 -10888 -6189 -5781 -97843 115289 158055 126051 137305 -39980 -44493 129012 203800
2309B03800J36204k36306P7220j54674O4195L4972L7473K9405N0194k69331k60562
$$ 203800 340004 103698 180918 26244 90439 125411 162884 192289 242483 -26848 -287410
2298b87410J21270P1815p749M37608k2409m5774k7799O0019j30478k00471j66979
$$ -287410 -166140 -94325 -102074 335534 313125 267351 239552 299571 169093 -31378 -198357
2287a98357K20628L4619K91089j72808j11135J29690k7941J5449k50893j65054
$$ -198357 22271 56890 347979 175171 64036 193726 165785 181234 -69659 -234713
2277b34713R7243J43618J88328N0076k80906J5292J59529P6905k37662j21245
$$ -234713 -137470 6148 194476 244552 -36354 -21062 138467 215372 -22290 -143535
2267a43535L14186J02568j89487N0034m5652N5300J5345o9972k9956j04750m1824
$$ -143535 170651 273219 83732 133766 88114 143414 158759 88787 58831 -45919 -87743
2256h7743K29050j3694j62289J19476l7632j86591l6930j27394Q7687R0000J32888
$$ -87743 141307 127613 -34676 84800 47168 -139423 -176353 -303747 -216060 -126060 6828
2245F828L64332R7900j66752j98008r2813J87197k01100k64952J93586J81419
$$ 6828 371160 469060 302308 104300 11487 198684 -2416 -267368 -73782 107637
2235A07637K01363K7369k12488O4220j14082N1126J25767k61297O5711l04953
$$ 107637 309000 336369 123881 188101 74019 125145 250912 -10385 55326 -249627
2225b49627J86689J90653N918j66622J20978P2871K3834m3928j40180R2786J30017
$$ -249627 -62938 127715 133633 -32989 87989 160860 184694 140766 586 93372 223389
2214B23389q8242l0483n2224j77357K52741p7580k3553o6152J36029J1826l847
$$ 223389 135147 104664 52440 -124917 127824 50244 26691 -39461 96568 108394 104547
2203A04547P1350L6388l08049L21439k20481O4759K41885n0327J5922n8386o3975
$$ 104547 175897 212285 -95764 225675 5194 69953 311838 261511 277433 219047 155072
2192A55072J65391j77648L6756j68865j13994K16497j20502J86669O5421O6081
$$ 155072 320463 142815 179571 10706 -103288 113209 -7293 179376 244797 310878
2182C10878j09251j58723j9561J4086m5500O0459J05074K61745J82611J07331
$$ 310878 201627 42904 23343 37429 -8071 52388 157462 419207 601818 709149
2172G09149O9939K8986j05705j02257J15512j37235R1141K56293r2334j64365
$$ 709149 779088 808074 702369 600112 715624 578389 669530 925823 833489 669124
2162F69124k63528L6936J6689m543P9024J8820R2644R9510l68270k7241j1674
$$ 669124 405596 442532 459221 454678 533702 552522 645166 744676 376406 349165 337491
2151C37491J79887Q9118J98910N5714k08848o8155J46860k06450P6200K3085J97463
$$ 337491 517378 606496 805406 861120 652272 584117 730977 524527 600727 623812 821275
2140H21275p2025k75675k21223J23042J35406k03755P8348K20251J42547k70182
$$ 821275 749250 473575 252352 375394 510800 307045 385393 605644 748191 478009
2130D78009J08721l4372J65552p9273J72298R1186J93887j00543j80252j81548
$$ 478009 586730 552358 717910 638637 810935 902121 1096008 995465 815213 633665
2120F33665K52936k2760J63510o8446q4973o0249J19115L54790J96466p5026P8614
$$ 633665 886601 863841 1027351 958905 873932 813683 932798 1287588 1484054 1409028 1487642
2109A487642j38803M4996O2735p7761K36322o2577K41800Q2498L0192M7106r6856
$$ 1487642 1348839 1393835 1456570 1378809 1615131 1552554 1794354 1876852 1907044 1954150 1857294
2098A857294Q4669R339p8631M53572K28065n2946J97238K12266K03865o2145j35948
$$ 1857294 1941963 1951302 1872671 2326243 2554308 2501362 2698600 2910866 3114731 3052586 2916638
2087B916638M85982N57258M3578R256J48305L34407M24270J51471L91502K41411
$$ 2916638 3402620 3959878 4003456 4012712 4161017 4495424 4919694 5071165 5462667 5704078
2077E704078N82214P40667M22191M49283O01546J100050J464392J303012J104068
$$ 5704078 6286292 7026959 7449150 7898433 8499979 9600029 11064421 12367433 13471501
2068A3471501J644457J840626J934967K917999L189097M973371N782511L988237
$$ 13471501 15115958 16956584 18891551 21809550 24998647 29972018 35754529 39742766
2060C9742766J927792K837731M110825K644283n243165p075642m972434l656908
$$ 39742766 41670558 44508289 48619114 51263397 46020232 38944590 33972156 30315248
2052C0315248j866607k455852k933395k449467k007043k229769j652084j345398
$$ 30315248 28448641 25992789 23059394 20609927 18602884 16373115 14721031 13375633
2044A3375633q00453j030794j231932r16166n90958p36184o11028n97458k62637
$$ 13375633 12575180 11544386 10312454 9396288 8805330 8069146 7458118 6860660 6598023
2035F598023k34934l78526l20349l07908m39204k0421j21075j77869n56283j14445
$$ 6598023 6363089 5984563 5664214 5356306 4917102 4896681 4775606 4597737 4041454 3927009
2025C927009r0834l32949k65653k06587l2776R0484l88037k9563J2313P9712l28623
$$ 3927009 3836175 3503226 3237573 3030986 2998210 3088694 2700657 2671094 2683407 2763119 2434496
2014B434496j93339N7607k45625l5553O6845n0117k48335o0714O9411K1405k87755
$$ 2434496 2241157 2298764 2053139 2017586 2084431 2034314 1785979 1725265 1794676 1816081 1528326
2003A528326n4137m8249p962l1217J42433j54373j88134p6645m5919N7428p7534
$$ 1528326 1474189 1425940 1417978 1386761 1529194 1374821 1186687 1110042 1064123 1121551 1044017
1992A044017k7903J67098l786n435j72949K4911o8007o179k28441J60728j30765
$$ 1044017 1016114 1183212 1179426 1173991 1001042 1025953 957946 951767 723326 884054 753289
1981G53289j27436J70053l0783J1858j87831K0539J4401J42049j83399k49551
$$ 753289 625853 795906 765123 776981 589150 609689 624090 766139 582740 333189
1971C33189P1348j18381o0312M3407L4930n484k55041K60767j03399k29701K4841
$$ 333189 404537 286156 225844 269251 304181 298697 43656 304423 201024 -28677 -3836
1960c836m5442L90882J58928n93436P4410M17519q4053l41836q615J07351M0203
$$ -3836 -49278 341604 500532 -92904 -18494 399025 314972 -26864 -35479 71872 112075
1949A12075K35453N4851l70024J92759K9073N5608j32490n5033J49519K35753
$$ 112075 347528 402379 32355 225114 254187 309795 177305 122272 271791 507544
1939E07544l7847l52823J06554K25737l04986N18j48082M48099J8307o5928K03397
$$ 507544 469697 116874 223428 449165 144179 144697 -3385 444714 463021 397093 600490
1928F00490j49055Q2135j6202k06918q8698k7809l01242K83796Q2866J65521k52763
$$ 600490 451435 533570 517368 310450 221752 193943 -107299 176497 259363 424884 172121
1917A72121j1086L246k28612L06111K24159k96784j28836K87025m6855l90995
$$ 172121 161035 164281 -64331 241780 465939 169155 40319 327344 280489 -110506
1907a10506q375j0417K35729n390J4061n4745o5503k4758R1710l4710p5753k44309
$$ -110506 -118881 -129298 106431 101041 115102 60357 -5146 -29904 61806 27096 -48657 -292966
1895b92966J04791K10704m26774o4018M33017J80913R0038l19190J77230J34812
$$ -292966 -188175 22529 -404245 -468263 -35246 145667 235705 -83485 93745 228557
1885B28557l25871N5333p0406l6375L51934Q0959K6297J33782l11961j86568K9911
$$ 228557 -97314 -41981 -112387 -148762 203172 284131 310428 444210 132249 -54319 -24408
1874b4408l063j73317L1989J45395K52483N7345j57864r9301q5406J22220j47143
$$ -24408 -27471 -200788 -168799 -23404 229079 286424 128560 29259 -56147 66073 -81070
1863h1070j91432J24426j06814K80171L40501j57205J862l2459j15567q2299r8026
$$ -81070 -272502 -148076 -254890 25281 365782 208577 210439 177980 62413 -19886 -117912
1852a17912J99852K4490j12786J95306M0327k28811N2480j57308J94120K01509
$$ -117912 81940 106430 -6356 188950 229277 466 52946 -104362 89758 291267
1842B91267j87227N8014l1348R9827m9718k79327p5495J12204m9351J8511O5283
$$ 291267 104040 162054 130706 230533 180815 -98512 -174007 -61803 -111154 -92643 -27360
1831b7360k37019q0269K64698J61544l31642k55739K04035L65124k12817N3456
$$ -27360 -264379 -344648 -79950 81594 -250048 -505787 -301752 63372 -149445 -95989
1821i5989R1789J00690J27964k990K40072j76369P5449L69465l66152l56186p3733
$$ -95989 -4200 96490 224454 221464 461536 285167 360616 730081 363929 7743 -65990
1810f5990J52370K14266q1391j68940O1490J10894m97121O8739N02382K171k39198
$$ -65990 86380 300646 219255 50315 111805 222699 -274422 -205683 296699 298870 59672
1799E9672M9719J51860o6787l31171L9216K44615J41968R6638k53387k56662P7908
$$ 59672 109391 261251 194464 -136707 -97491 147124 289092 385730 132343 -124319 -46411
1788d6411r0217J39080j1455L3625N7708J3412Q9206j34110k90891J44014J99235
$$ -46411 -136628 2452 -9003 24622 82330 95742 184948 50838 -240053 -96039 103196
1777A03196l2461N3099k15614L4228J2218j11571J06544J92689n4448N9977o878
$$ 103196 70735 123834 -91780 -57552 -45334 -156905 -50361 142328 87880 147857 140979
1766A40979k22713N9221J46745j48550J39874N4391J71904k80087j11955m5564
$$ 140979 -81734 -22513 124232 -24318 115556 169947 341851 61764 -50191 -95755
1756i5755l4758K73665K8927J70001p4188k19745k18878l43721L03790K31160
$$ -95755 -130513 143152 172079 342080 267892 48147 -170731 -514452 -210662 20498
1746B0498n4177j02873R1775J21554J18685k3075l14600q3476o973J69889J39893
$$ 20498 -33679 -136552 -44777 76777 195462 172387 -142213 -225689 -232662 -62773 77120
1735G7120J09615l14326K8238J07616K0776j46324j1369K44330L8000j24182n017
$$ 77120 186735 -127591 -99353 8263 29039 -117285 -128654 115676 153676 29494 24477
1724B4477j26385K9711L4225J75862l9772l39233r1922K84703J07010j8797n1789
$$ 24477 -101908 -72197 -37972 137890 98118 -241115 -333037 -48334 58676 39879 -11910
1713a1910M7783K35244m08276j46882K05932Q9020J211j49085J33105P3375o861
$$ -11910 35873 271117 -137159 -284041 -78109 10911 12122 -136963 -3858 69517 62656
1702F2656O7999m0597j78886k78533J09277K24673M0554l4927M3981K2350p9892
$$ 62656 130655 90058 -88828 -367361 -258084 -33411 7143 -27784 16197 38547 -41345
1691d1345j06120M3890r7411L09207J66525k87648N1261n879J07361M6518k96072
$$ -41345 -147465 -103575 -200986 108221 274746 -12902 38359 32480 139841 186359 -109713
1680a09713j29413j24036L56863K1702k484J0677J22535l26427O4416J19328j88808
$$ -109713 -239126 -363162 -6299 15403 12919 23596 146131 -180296 -115880 3448 -185360
1669a85360K07572Q0792m0022p7345N5723K5911j25005J21555L1203j9952P4195
$$ -185360 22212 103004 62982 -14363 41360 67271 -57734 63821 95024 75072 149267
1658A49267J35301l8642j34203p8137j70131R6952j97844j09815o1989J19271
$$ 149267 284568 245926 111723 33586 -136545 -39593 -237437 -347252 -409241 -289970
1648b89970O0999j06604P2849J36848r6430m4388O6637k8549J3300O5488q8689
$$ -289970 -228971 -335575 -262726 -125878 -222308 -266696 -200059 -228608 -215308 -149820 -238509
1637b38509K54034m867O7649o4917J34019k27789k7447l219P6424J63848r8875
$$ -238509 15525 10658 78307 13390 147409 -80380 -107827 -111046 -34622 129226 30351
1626C0351j18673o4804P4840p0271k4029N7795p1269j23444K02284K01578l2504
$$ 30351 -88322 -153126 -78286 -148557 -172586 -114791 -186060 -309504 -107220 94358 61854
1615F1854k12935j2495J82554m7018j70296J21141J7453K56387r7290k52617m228
$$ 61854 -151081 -163576 18978 -28040 -198336 -77195 -59742 196645 99355 -153262 -157490
1604a57490P2190O8567r358l7647j31135P7963L34153Q2409l18851j72444j45526
$$ -157490 -85300 -16733 -26091 -63738 -194873 -116910 217243 299652 -19199 -191643 -337169
1593c37169K5835L7740K36857k94138k42810N0725J27879K90859k1839j38164
$$ -337169 -311334 -273594 -36737 -330875 -573685 -522960 -395081 -104222 -126061 -264225
1583b64225J43684J65767K809j70168l19280M16372J84329M6627l69131m385J47523
$$ -264225 -120541 45226 48035 -122133 -441413 -25041 159288 205915 -163216 -167601 -20078
1572b0078q3171l6343k39961K22614L71238p2678k10974l94414p8374K45526L3571
$$ -20078 -103249 -139592 -379553 -156939 214299 141621 -69353 -463767 -542141 -296615 -263044
1561b63044j04074k20475K61245L74267r7353j24481k47701M9819L32820O5495
$$ -263044 -367118 -587593 -326348 47919 -49434 -173915 -421616 -371797 -38977 26518
1551B6518j84814j91378Q8086K34737K8917j11825j1014L38851R9291k85150n45769
$$ 26518 -158296 -349674 -261588 -26851 2066 -109759 -120773 218078 317369 32219 -513550
1540e13550P0555L67314m7054j2497J16402r7003R12J23025l73912j01688K27296
$$ -513550 -442995 -75681 -122735 -135232 -18830 -115833 -114921 8104 -365808 -467496 -240200
1529b40200K06602O8956m1528j56421k6942O3717p2099l5960J5942j86321l8737
$$ -240200 -33598 35358 -6170 -162591 -189533 -125816 -197915 -233875 -217933 -404254 -442991
1518d42991M5651J07105J25554r3310P2660J76424N7233j03036j75591k4514K59488
$$ -442991 -397340 -290235 -164681 -257991 -185331 -8907 48326 -54710 -230301 -254815 4673
1507D673k40744j0736K3428K85147r7065k37106l0919N6925J88901k90130J09037
$$ 4673 -236071 -246807 -223379 61768 -35297 -272403 -303322 -246397 -57496 -347626 -238589
1496b38589J74605k3019j08904r9241q2264K95958n3208L13893k80426j0730k3653
$$ -238589 -63984 -87003 -195907 -295148 -377412 -81454 -134662 179231 -101195 -111925 -135578
1485a35578J38813j74102J2861M8708l2450M5576p2424Q3494j12375R7339r2639
$$ -135578 3235 -170867 -158006 -109298 -141748 -96172 -168596 -85102 -197477 -100138 -192777
1474a92777j3880L7590j9986O3389P9839l12367R0798M15151k174k06029K19407
$$ -192777 -206657 -169067 -189053 -125664 -45825 -358192 -267394 147757 145583 -60446 158961
1463A58961j2041j44683l79347K8774K96685k09118j41442M21017p502J84249
$$ 158961 146920 2237 -377110 -348336 -51651 -260769 -402211 18806 11304 195553
1453A95553j48190k78804Q4481r2888j09384R4738K93294n1577J24256j48217
$$ 195553 47363 -231441 -146960 -239848 -349232 -254494 38800 -12777 111479 -36738
1443c6738K48564k49873J3926j83175k32792K95884J86446K45508k53591j13862
$$ -36738 211826 -38047 -24121 -207296 -440088 -144204 42242 287750 34159 -79703
1433g9703O9257k9129j67447L39530j20479N90L1628j57949R8941R7466n8684
$$ -79703 -10446 -39575 -207022 132508 12029 12619 44247 -113702 -14761 82705 24021
1422B4021m2855j1515j54284O1598J67044n116R025j5076j72147j0861N7097R632
$$ 24021 -18834 -30349 -184633 -123035 44009 38893 47918 32842 -139305 -150166 -93069 -83437
1410h3437J4152N9798K43190Q0207J8451j66608q4664l26686L02102j41518j29177
$$ -83437 -69285 -9487 233703 313910 332361 165753 81089 -245597 56505 -85013 -214190
1399b14190K65521K9850q3034l6985J50469P4956r3619j57115J65826q0905K51427
$$ -214190 51331 81181 -1853 -38838 111631 186587 92968 -64147 101679 20774 272201
1388B72201j35938n5733L06484j53676J1216k63053J20870n3614k69694K75150
$$ 272201 136263 80530 387014 233338 244554 -18499 102371 48757 -220937 54213
1378E4213L0626j078J6279p4772Q1929n3402j50550K7646N0983J70348Q4491j84203
$$ 54213 84839 83761 100040 25268 107197 53795 -96755 -69109 -18126 152222 236713 52510
1366E2510q6906J82885m97144J07087m8263j3390K66325L37645J1114l3901J05424
$$ 52510 -34396 148489 -348655 -241568 -289831 -303221 -36896 300749 311863 277962 383386
1355C83386r725l21641l6342p4586P2839L0868j54487K23114K7774j00143J9252
$$ 383386 373661 52020 15678 -58908 13931 44799 -109688 113426 141200 41057 60309
1344F0309J41017j20317p1313J75931n6101L21260K02085l14639q8052J60242
$$ 60309 201326 81009 9696 185627 129526 450786 652871 338232 250180 410422
1334D10422j66162j96981J38125p1070L13093n3595q5633p2858J46932r6220j48238
$$ 410422 244260 47279 185404 114334 427427 373832 288199 215341 362273 266053 117815
1323A17815k93962M03951j8317r1470J1634K1805L9881l51779N3786n1301L4333
$$ 117815 -176147 227804 209487 118017 129651 151456 191337 -160442 -106656 -157957 -123624
1312a23624K99900M4065K14669j91122j73375L70672j27128p7728k32673M1835
$$ -123624 176276 220341 435010 243888 70513 441185 314057 236329 3656 45491
1302D5491L74907j34096j6693m9113k68981J85004o2860m9855K990L77661j13320
$$ 45491 420398 286302 269609 220496 -48485 136519 73659 23804 26794 404455 291135
1291B91135O5134r7448O1339j57366o531r7053o7583l3050N5980N909R2762p0442
$$ 291135 356269 258821 320160 162794 156263 59210 -8373 -41423 14557 20466 113228 42786
1279D2786J4677k25684P4975K3982J90839J99877l57235K509n2750J1073k7641
$$ 42786 57463 -168221 -93246 -69264 121575 321452 -35783 -33274 -86024 -74951 -102592
1268a02592J06361J90017q2123j74641K40814O4863k6204j65992n8987M7124M2020
$$ -102592 3769 193786 111663 -62978 177836 242699 216495 50503 -8484 38640 80660
1257H0660P7969J5727j06961K76996j79618l33242j03657J00574J10624J10493
$$ 80660 158629 174356 67395 344391 164773 -168469 -272126 -171552 -60928 49565
1247D9565o6418J13240N2071J9976l60511o3884J11792K21525r2299R6359j21874
$$ 49565 -16853 96387 148458 168434 -192077 -255961 -144169 77356 -14943 81416 -40458
1236d0458L14941j28846n9390k0792l8684l547K11269k2063p4785j75744J52380
$$ -40458 274483 145637 86247 65455 26771 23224 234493 212430 137645 -38099 114281
1225A14281K51325k53130l31429J27282L89519j27650o7554J01267k3147j56771
$$ 114281 365606 112476 -218953 -91671 297848 170198 102644 203911 180764 23993
1215B3993j35946O3059P8795j80668P8669L3931K15107Q5716j29969j15832J35589
$$ 23993 -111953 -48894 29901 -150767 -72098 -38167 176940 262656 132687 16855 152444
1204A52444r6248Q5045j29723q3812j91075L7828K36280l1459o7877K98283l17270
$$ 152444 56196 141241 11518 -72294 -263369 -225541 10739 -20720 -88597 209686 -107584
1193a07584k400j46776J42034J1547J81902j68813J45317M9718j9409Q9497j17266
$$ -107584 -109984 -256760 -114726 -103179 78723 -90090 55227 104945 85536 175033 57767
1182E7767j33232L2611k4593j83279j07073J90349J91645l6086J4769J31823n6003
$$ 57767 -75465 -42854 -67447 -250726 -357799 -167450 24195 -11891 2878 134701 78698
1171G8698R2753o2330j60901K43251k39517O5150j82441J34635J44420k20493
$$ 78698 171451 109121 -51780 191471 -48046 17104 -165337 -30702 113718 -106775
1161a06775K2929J61763j50061Q5309q5890Q6020j76394r9425R2335L26028K8629
$$ -106775 -83846 77917 -72144 13165 -72725 13295 -163099 -262524 -170189 155839 184468
1150A84468m6706k29453M4693L2716N1192j26359J66009n3518j29546l1059J23816
$$ 184468 137762 -91691 -46998 -14282 36910 -89449 76560 23042 -106504 -137563 -13747
1139a3747r8901J97519L23337J3554j86884J23641k57806k18364Q0510j53553
$$ -13747 -112648 84871 408208 421762 234878 358519 100713 -117651 -37141 -190694
1129a90694m6232R1654L3464K5721n7356j18876J47599j74436L91936p4923j58801
$$ -190694 -236926 -145272 -111808 -86087 -143443 -262319 -114720 -289156 102780 27857 -130944
1118a30944J37914J89342n0234J13543k94397Q5423j81248J1007J06394O7882
$$ -130944 6970 196312 146078 259621 -34776 50647 -130601 -119594 -13200 54682
1108E4682k1031J9236j52176K75151r4453k38326j07027J98542k01204J45560
$$ 54682 33651 52887 -99289 175862 81409 -156917 -263944 -65402 -266606 -121046
1098a21046r0456J87411J82169k69758r0900J00941j34358P3166q0317Q9535j3540
$$ -121046 -211502 -24091 158078 -111680 -202580 -101639 -235997 -162831 -243148 -153613 -167153
1087a67153L7634P1122J93422j66609m7023J18635j47426j89538r297J58979k82491
$$ -167153 -129519 -58397 135025 -31584 -78607 40028 -107398 -296936 -306233 -147254 -429745
1076d29745K62153J93631Q1360O7638m2935m42630m080j76128L59014m1590K24906
$$ -429745 -167592 26039 107399 175037 132102 -310528 -314608 -490736 -131722 -173312 51594
1065E1594o1814K04200k00244j60056m361K18210j46341M2657J95921J63658k53788
$$ 51594 -10220 193980 -6264 -166320 -170681 47529 -98812 -56155 139766 303424 49636
1054D9636K4145k12267L35737k32777j831k40168J61467K92396N7239k00641j7954
$$ 49636 73781 -138486 197251 -35526 -37357 -277525 -116058 176338 233577 32936 14982
1043A4982L1433q2505J42003k83918Q1834m3940J50986K08369j26167j36445J31231
$$ 14982 46415 -36090 105913 -178005 -96171 -140111 10875 219244 93077 -43368 87863
1032H7863k46626j34166k51012J75061J58449J10899M820K58108j33932J9082
$$ 87863 -158763 -292929 -543941 -368880 -210431 -99532 -94712 163396 29464 48546
1022D8546k89738J30147j41231J24154J49995N9903j21111L76057j84774n8400
$$ 48546 -241192 -111045 -252276 -128122 21873 81776 -39335 336722 151948 93548
1012I3548k92998j47339L0192p075J4431K59604J13025K22215l19783j52488K45139
$$ 93548 -199450 -346789 -316597 -323672 -309241 -49637 63388 285603 -34180 -186668 58471
1001E8471k36599j48687o8046K9787J52315M81726k32440J0245o1934J26898j89943
$$ 58471 -178128 -326815 -394861 -365074 -212759 268967 36527 46772 -15162 111736 -78207
990g8207j87779J76646J03427r7699P2441j83273M27662j61391j4760j62320k09800
$$ -78207 -265986 -89340 14087 -83612 -11171 -194444 233218 71827 57067 -105253 -315053
979c15053J85957M4723M4414K23887k76217J27943j41395J64645j8028m06804
$$ -315053 -129096 -84373 -39959 183928 -92289 35654 -105741 58904 40876 -365928
969c65928K96884K70698j38988l57783L33442n0686n9137p8612K70718K3962k83939
$$ -365928 -69044 201654 62666 -295117 38325 -12361 -71498 -150110 120608 144570 -139369
958a39369j64189J23987J56101K78472R0198m15598o0921R9576k10229l4657m2456
$$ -139369 -303558 -179571 -23470 255002 345200 -70398 -131319 -31743 -241972 -276629 -319085
947c19085J84317L12008k00170q9775J39049L6612J02706k10159k74198J52775
$$ -319085 -134768 177240 -22930 -112705 26344 62956 165662 -44497 -318695 -165920
937a65920J44073J64952r1279k31736L21752j73731l48733K30467J03887j30220
$$ -165920 -21847 143105 51826 -179910 141842 -31889 -380622 -150155 -46268 -176488
927a76488J13045m161M2633j32558o2409J67063J22631J44790l94222n6532K55070
$$ -176488 -63443 -67604 -24971 -157529 -219938 -52875 69756 214546 -179676 -236208 18862
916A8862P8290r8898J39658j3128O3784j48314n69244J51798K57599N5975J00315
$$ 18862 97152 -1746 137912 124784 188568 40254 -528990 -377192 -119593 -63618 36697
905C6697j46960J16833o1446j06368q9135m51186M1731K18415K62270M3431K83164
$$ 36697 -110263 6570 -54876 -161244 -250379 -701565 -659834 -441419 -179149 -135718 147446
894A47446P7159l24232O8096J06760k7354l18569k634K38880J56129j55236r9263
$$ 147446 224605 -99627 -31531 75229 47875 -270694 -273328 -34448 121681 -33555 -132818
883a32818J48750K72906l21640k58060J0940k8654K45613J82796j9345j42862
$$ -132818 15932 288838 -32802 -290862 -279922 -308576 -62963 119833 100488 -42374
873d2374q3401m6286q3414L52288k3386j17663L45347L4667j49030l96746J7851
$$ -42374 -125775 -172061 -255475 96813 73427 -44236 301111 335778 186748 -209998 -192147
862a92147J70293L0009r4078P8446R6949k2547q8657J06040j19161L0806J44377
$$ -192147 -21854 8155 -85923 -7477 89472 66925 -21732 84308 -34853 -4047 140330
851A40330r2012l86173K3396J03284J73421J14100J21091k77342K10105j1951
$$ 140330 48318 -337855 -314459 -211175 -37754 76346 197437 -79905 130200 118249
841A18249J63489k61792o8162L1950l3142J3429R5444r3714Q9948k3193o9699
$$ 118249 281738 19946 -48216 -16266 -49408 -35979 59465 -34249 55699 32506 -37193
830c7193j12365r6600J14160Q5741L75597l09508n5850J13454L5240k82808l0291
$$ -37193 -149558 -246158 -131998 -46257 329340 19832 -36018 77436 112676 -170132 -200423
819b00423R7501N4965J26401o7536k50129L66801l3939p0246j95364j8182k44317
$$ -200423 -102922 -47957 78444 10908 -239221 127580 93641 23395 -171969 -190151 -434468
808d34468m5749L46542M14879j70590o4597j82257J88744j29004k56594j38394
$$ -434468 -480217 -133675 281204 110614 46017 -136240 52504 -76500 -333094 -471488
798d71488L09410J15299M0589j82015J183J55636J12904L7536k1794j6464p2044
$$ -471488 -162078 -46779 -6190 -188205 -187022 -31386 81518 119054 97260 80796 8752
787H752j4703K5135L1814o3029l9162K25056j27652k81203J30670k16524K96761
$$ 8752 -5951 19184 50998 -12031 -51193 173863 46211 -234992 -104322 -320846 -24085
776b4085Q0885j8417j53159j90394N72602r2581l22922o5874j20926M10945o0427
$$ -24085 56800 38383 -114776 -305170 267432 174851 -148071 -213945 -334871 76074 15647
765A5647r1598k03005L24075l8699k73299J34324J92274J1797K1947j39241p1134
$$ 15647 -75951 -278956 45119 6420 -266879 -132555 59719 71516 93463 -45778 -116912
754a16912j3583Q0319R9840k89284R6807J63649K32499m7852l09814N1623k01498
$$ -116912 -130495 -50176 49664 -239620 -142813 20836 253335 205483 -104331 -52708 -254206
743b54206N8019J57002J15594l7784j75647N5469R4632J41798J57859L1986j83408
$$ -254206 -196187 -39185 76409 38625 -137022 -81553 13079 154877 312736 344722 161314
732A61314k3723l40886J51105J38003j37760Q1408O5390n4920M7260q8427m843
$$ 161314 137591 -203295 -52190 85813 -51947 29461 94851 39931 87191 -1236 -6079
721f079q783l2774j12871J80103L7766r9868o0827j91722q86k2006K56663J81609
$$ -6079 -14862 -47636 -160507 19596 57362 -42506 -103333 -295055 -295941 -317947 -61284 120325
709A20325k95286k25177p0276K53584R0135l33N4407j5266Q0613r6964K34637
$$ 120325 -174961 -400138 -470414 -216830 -126695 -127028 -72621 -87887 -7274 -104238 130399
698A30399k05842J28616j67369j77876K53934q600j9912N2890J59243J37754k89024
$$ 130399 -75443 53173 -114196 -292072 -38138 -46738 -66650 -13760 145483 283237 -5787
687e787j31392R0011p8383Q5924l2519m3793K64707j0822Q5128q4372M6744k72279
$$ -5787 -137179 -47168 -125551 -39627 -72146 -115939 148768 137946 223074 138702 185446 -86833
675h6833Q9490m938J20955q1731m9991M3405m448J02559k15654o6231R8729J36312
$$ -86833 2657 -2281 118674 36943 -13048 30357 25909 128468 -87186 -153417 -54688 81624
663H1624j14269k3308J84600J26254M762l27875j07878j22117L5109K07225K69131
$$ 81624 -32645 -55953 128647 254901 259663 -68212 -176090 -298207 -263098 -55873 213258
652B13258j5096r5921J44553n4961k10185R4588j60627M4979M1498N745K04259
$$ 213258 198162 102241 246794 191833 -18352 76236 -84391 -39412 2086 7831 212090
641B12090Q2551j54729l12247K15053j45420K40273k73499m9913J78180K40943
$$ 212090 294641 139912 -172335 42718 -102702 137571 -135928 -185841 -7661 233282
631B33282N2851j66722p9227q2507m5745J3105j64183K01017K31506k5672n3130
$$ 233282 286133 119411 40184 -42323 -88068 -74963 -239146 -38129 193377 167705 114575
620A14575n5852j62331P9747L848j07050p2377K12474K11376k36609J1500j85418
$$ 114575 58723 -103608 -23861 -20013 -127063 -199440 13034 224410 -12199 -699 -186117
609a86117n4808J60460M136o4948K4118N605j2606J01242J91000l7811r2776n2862
$$ -186117 -240925 -80465 -76329 -141277 -117159 -111554 -124160 -22918 168082 130271 37495 -15367
597a5367l4103l5913j21919r0426L8476K23106J68153p0212j52008K26167O272
$$ -15367 -49470 -85383 -207302 -297728 -259252 -36146 132007 61795 -90213 135954 142226
586A42226J55400j21076j47421N8896K54736k76529j02720N358m4534r6767j39364
$$ 142226 297626 176550 29129 88025 342761 66232 -36488 -31130 -75664 -172431 -311795
575c11795J50992J49164K85045N4588k43672k59898j50933N45137M5155p0859
$$ -311795 -160803 -11639 273406 327994 84322 -175576 -326509 218628 263783 192924
565A92924l16446L5487J73081K89731j69574j55584J84501j88864J44460j5981
$$ 192924 -123522 -88035 85046 374777 205203 49619 234120 45256 189716 173735
555A73735J6295K76222j17245l90964M6432j17567J13433N2024Q8837j32128K40655
$$ 173735 190030 466252 349007 -41957 4475 -113092 341 52365 141202 9074 249729
544B49729M9939j05280j84312J29462j42521J30284j7814l6515R1762q7326j12317
$$ 249729 299668 194388 10076 139538 -2983 127301 109487 72972 164734 77408 -34909
533c4909L66142j25081k08594k91152J72706K13996J08384j83655n035j1206r1961
$$ -34909 331233 206152 -2442 -293594 -120888 93108 201492 17837 12802 1596 -90365
522i0365j2685O045k1143J62600K7605k5963M17553m20152k46124k51998J94142
$$ -90365 -103050 -97005 -118148 44452 72057 46094 463647 43495 -202629 -454627 -260485
511b60485K53946L145j61841M02678J64416q5551j61311k11101p5924k7277p04
$$ -260485 -6539 -3394 -165235 237443 401859 316308 154997 -56104 -132028 -159305 -160009
500a60009p3002K36367K53662K4395k26674j50026J82527j62511p9304k40455
$$ -160009 -233011 3356 257018 281413 54739 -95287 87240 -75271 -154575 -395030
490c95030L52908K90772k45111p3741L3873k23703j56912P3292M00012K56479
$$ -395030 -42122 248650 3539 -70202 -36329 -260032 -416944 -343652 56360 312839
480C12839l46646N1681k771J65045J66517l31214L9220K5882j54868j38426P1480
$$ 312839 -33807 17874 15103 180148 346665 15451 54671 80553 -74315 -212741 -141261
469a41261q0260J94919J83516K82943k04656l70664O0797K09437J16996j59893
$$ -141261 -221521 -26602 156914 439857 235201 -135463 -74666 134771 251767 91874
459I1874M1872K3002N0580j82764k29128k41845L57232K62836j2627k30889j11165
$$ 91874 133746 156748 207328 24564 -204564 -446409 -89177 173659 161032 -69857 -181022
448a81022J60198L27996k67375k93041p2232J45506K53839j95098q9326K96628
$$ -181022 -20824 307172 39797 -253244 -325476 -179970 73869 -121229 -210555 86073
438H6073J11681o8180j42644j5800p7215k8811L5897L41110l22372k50145J50546
$$ 86073 197754 129574 -13070 -28870 -106085 -134896 -98999 242111 -80261 -330406 -179860
427a79860J75640K40819l63233J04841J90624N1077n9756l32739O5560O7722O6530
$$ -179860 -4220 236599 -126634 -21793 168831 219908 160152 -172587 -107027 -39305 27225
416B7225N7402K2772o2981J33414k01825M9531q1733P7600M0789j32054n2057
$$ 27225 84627 107399 44418 177832 -23993 25538 -56195 21405 62194 -69860 -121917
405a21917M5138P1354K3027j25663o0027K3956n2992p3067J47347K23399l30418
$$ -121917 -76779 -5425 17602 -108061 -168088 -144132 -197124 -270191 -122844 100555 -229863
394b29863K48367m7506N4609o3457j59138M7338J68380j26267j33297j22546R8230
$$ -229863 18504 -29002 25607 -37850 -196988 -149650 18730 -107537 -240834 -363380 -265150
383b65150J37486n614Q587r5968L3095O3204j76494j28491J87283L87448k16684
$$ -265150 -127664 -133278 -124691 -220659 -187564 -124360 -300854 -429345 -242062 145386 -71298
372g1298j62065k9321J73169j13732j37018J84440K31135J82662k05715j31994
$$ -71298 -233363 -262684 -89515 -203247 -340265 -155825 75310 257972 52257 -79737
$$ [...]
##END NTUPLES=NMR SPECTRUM
##END=
