##TITLE=1H_CA-8868-1
 CDCl3, 8 sc, 
 2.06.2021
##JCAMPDX= 6.0         $$ Bruker NMR JCAMP-DX V2.0
##DATA TYPE= NMR SPECTRUM
##DATA CLASS= NTUPLES
##ORIGIN= UXNMR, Bruker Analytische Messtechnik GmbH
##OWNER= root
$$ XWIN-NMR		Version 3.5
$$ Wed Jun  2 11:18:42 2021 Russian Standard Time (UT+4h)  she@DPX200
##.OBSERVE FREQUENCY= 200.131506
##.OBSERVE NUCLEUS= ^1H
##.ACQUISITION MODE= SIMULTANEOUS
##.ACQUISITION SCHEME= undefined
##.AVERAGES= 8
##.DIGITISER RES= 18
##SPECTROMETER/DATA SYSTEM= spect
##.PULSE SEQUENCE= zg30
##.SOLVENT NAME= CDCl3
##.SHIFT REFERENCE= (INTERNAL, CDCl3, 0, 15.9792)
##AUDIT TRAIL= $$ (NUMBER, WHEN, WHO, WHERE, WHAT)
$$ ##TITLE= Audit trail, XWIN-NMR		Version 3.5
$$ ##JCAMPDX= 5.01
$$ ##ORIGIN= Bruker BioSpin GmbH
$$ ##OWNER= she
$$ F:/spectra/data/she/nmr/H-F/1/pdata/1/auditp.txt
$$ ##AUDIT TRAIL=  $$ (NUMBER, WHEN, WHO, WHERE, WHAT)
(   1,<2021-06-02 11:17:26.04 +0400>,<she>,<DPX200>,
      <created by zg, POWCHK disabled, PULCHK disabled
       configuration hash MD5:
       00 E9 B6 7A A2 85 ED C7 34 08 36 98 17 FE 4E 26
       data hash MD5: 16K
       7C 03 D8 72 18 D9 25 83 EF D3 F4 23 6E 4C 26 E7>)
(   2,<2021-06-02 11:17:29.71 +0400>,<she>,<DPX200>,
      <Start of raw data processing
       efp BC_mod = 2 LB = 0.24 FT_mod = 6 PKNL = 1 PHC0 = -11479.78 PHC1 = 11.20099 SI = 16K 
       data hash MD5: 16K
       35 79 93 92 BB 49 B9 92 47 6A 4D 4D 32 4C E5 1B>)
(   3,<2021-06-02 11:17:45.96 +0400>,<she>,<DPX200>,
      <pk PHC0 = 0.8481799 PHC1 = -0.8 
       data hash MD5: 16K
       03 A1 E8 25 98 00 95 81 92 CE B5 2A 79 77 C8 3D>)
(   4,<2021-06-02 11:17:49.46 +0400>,<she>,<DPX200>,
      <abs ABSG = 5 
       data hash MD5: 16K
       BF 99 0C 5A 18 C8 BA AD 69 14 CF 4A 67 F8 7A 05>)
$$ ##END=
$$ 
$$ hash MD5
$$ C9 20 BF 54 43 0E 00 DD 00 4A 78 48 76 C4 60 44
##$RELAX= 
##$RELAX= 
##$RELAX= 
##$RELAX= 
##$RELAX= 
##$RELAX= 
$$ Bruker specific parameters
$$ --------------------------
##$DU= <F:/spectra>
##$EXPNO= 1
##$NAME= <H-F>
##$PROCNO= 1
##$TYPE= <nmr>
##$USER= <she>
##$AMP= (0..31)
100 100 100 100 100 100 100 100 100 100 100 100 100 100 100 100 100 100 
100 100 100 100 100 100 100 100 100 100 100 100 100 100 
##$AQSEQ= 0
##$AQ_mod= 1
##$AUNM= <au_zg>
##$AUTOPOS= <>
##$BF1= 200.13
##$BF2= 200.13
##$BF3= 200.13
##$BF4= 200.13
##$BF5= 200.13
##$BF6= 200.13
##$BF7= 200.13
##$BF8= 200.13
##$BYTORDA= 1
##$CFDGTYP= 0
##$CFRGTYP= 5
##$CHEMSTR= <none>
##$CNST= (0..31)
1 1 145 1 1 1 1 1 1 1 1 1 1 1 1 1 1 1 1 1 1 1 1 1 1 1 1 1 1 1 1 1 
##$CPDPRG= <>
##$CPDPRG1= <>
##$CPDPRG2= <>
##$CPDPRG3= <>
##$CPDPRG4= <mlev>
##$CPDPRG5= <mlev>
##$CPDPRG6= <mlev>
##$CPDPRG7= <mlev>
##$CPDPRG8= <mlev>
##$CPDPRGB= <>
##$CPDPRGT= <>
##$D= (0..31)
0 1.2 0 0 0 0 0 0 0 0.06 0 0.03 0 0 0 0 0.0002 0 0 0 0 0 0 0 0 0 0 0 0 
0 0 0 
##$DATE= 1622618245
##$DBL= (0..7)
120 120 120 120 120 120 120 120 
##$DBP= (0..7)
150 150 150 150 150 150 150 150 
##$DBP07= 0
##$DBPNAM0= <>
##$DBPNAM1= <>
##$DBPNAM2= <>
##$DBPNAM3= <>
##$DBPNAM4= <>
$$ [...]
##$SUBNAM3= <"">
##$SUBNAM4= <"">
##$SUBNAM5= <"">
##$SUBNAM6= <"">
##$SUBNAM7= <"">
##$SUBNAM8= <"">
##$SUBNAM9= <"">
##$SW= 16.9725357007746
##$SWIBOX= (0..15)
0 0 2 0 0 0 0 0 0 0 0 0 0 0 0 0 
##$SW_h= 3396.73913043478
##$TD= 16384
##$TD0= 1
##$TE= 0
##$TE2= 300
##$TE3= 300
##$TEG= 300
##$TL= (0..7)
0 120 120 120 120 120 120 120 
##$TP= (0..7)
150 150 150 150 150 150 150 150 
##$TP07= 0
##$TPNAME0= <>
##$TPNAME1= <>
##$TPNAME2= <>
##$TPNAME3= <>
##$TPNAME4= <>
##$TPNAME5= <>
##$TPNAME6= <>
##$TPNAME7= <>
##$TPOAL= (0..7)
0.5 0.5 0.5 0.5 0.5 0.5 0.5 0.5 
##$TPOFFS= (0..7)
0 0 0 0 0 0 0 0 
##$TUNHIN= 0
##$TUNHOUT= 0
##$TUNXOUT= 0
##$USERA1= <user>
##$USERA2= <user>
##$USERA3= <user>
##$USERA4= <user>
##$USERA5= <user>
##$V9= 5
##$VALIST= <valist>
##$VCLIST= <CCCCCCCCCCCCCCC>
##$VD= 0
##$VDLIST= <DDDDDDDDDDDDDDD>
##$VPLIST= <PPPPPPPPPPPPPPP>
##$VTLIST= <TTTTTTTTTTTTTTT>
##$WBST= 1024
##$WBSW= 4
##$XGAIN= (0..3)
0 0 0 0 
##$XL= 0
##$YL= 0
##$YMAX_a= 321520
##$YMIN_a= -209084
##$ZGOPTNS= <>
##$ZL1= 120
##$ZL2= 120
##$ZL3= 120
##$ZL4= 120
##$ABSF1= 15.9906
##$ABSF2= -0.9820642
##$ABSG= 5
##$ABSL= 3
##$ALPHA= 0
##$AQORDER= 0
##$ASSFAC= 0
##$ASSFACI= 0
##$ASSFACX= 0
##$ASSWID= 0
##$AUNMP= <proc_1d>
##$AZFE= 0.1
##$AZFW= 0.1
##$BCFW= 0
##$BC_mod= 2
##$BYTORDP= 0
##$COROFFS= 0
##$CY= -3
##$DATMOD= 1
##$DC= 0
##$DFILT= <>
##$DTYPP= 0
##$F1P= 0
##$F2P= 0
##$FCOR= 1
##$FTSIZE= 16384
##$FT_mod= 6
##$GAMMA= 0
##$GB= 0
##$INTBC= 1
##$INTSCL= 1.334414e-10
##$ISEN= 128
##$LB= 0.24
##$LEV0= 0
##$LPBIN= 0
##$MAXI= 10000
##$MC2= 0
##$MEAN= 0
##$ME_mod= 0
##$MI= 1.114404
##$NCOEF= 0
##$NC_proc= -6
##$NLEV= 6
##$NOISF1= 3.799351
##$NOISF2= 2.8
##$NSP= 0
##$NTH_PI= 0
##$NZP= 0
##$OFFSET= 15.97921
##$PC= 1
##$PHC0= -11478.93
##$PHC1= 10.40099
##$PH_mod= 1
##$PKNL= yes
##$PPARMOD= 0
##$PSCAL= 0
##$PSIGN= 0
##$REVERSE= no
##$SF= 200.13000645127
##$SI= 16384
##$SIGF1= 3
##$SIGF2= 2
##$SINO= 5.538805
##$SIOLD= 16384
##$SREGLST= <1H.CDCl3>
##$SSB= 0
##$STSI= 16384
##$STSR= 0
##$SW_p= 3396.73913043479
##$SYMM= 0
##$S_DEV= 0
##$TDeff= 16384
##$TDoff= 0
##$TI= <>
##$TILT= no
##$TM1= 0
##$TM2= 0
##$TOPLEV= 0
##$USERP1= <user>
##$USERP2= <user>
##$USERP3= <user>
##$USERP4= <user>
##$USERP5= <user>
##$WDW= 1
##$XDIM= 16384
##$YMAX_p= 395058885
##$YMIN_p= -315703
$$ End of Bruker specific parameters
$$ ---------------------------------
##NTUPLES= NMR SPECTRUM
##VAR_NAME=  FREQUENCY,     SPECTRUM/REAL,   SPECTRUM/IMAG
##SYMBOL=    X,             R,               I
##VAR_TYPE=  INDEPENDENT,   DEPENDENT,       DEPENDENT
##VAR_FORM=  AFFN,          ASDF,            ASDF
##VAR_DIM=   16384,         16384,           16384
##UNITS=     HZ,            ARBITRARY UNITS, ARBITRARY UNITS
##FACTOR=    0.207333158178282, 1,           1
##FIRST=     3197.91938035365, 0,            0
##LAST=      -198.819750081137, 0,           0
##MIN=       -198.819750081137, -315703,     0
##MAX=       3197.91938035365, 395058885,    0
$$ Real data points
##PAGE= N=1
##DATA TABLE= (X++(R..R)), XYDATA
$$ [...]
8331 6459194 6205181 5906248 5647693 5490607 5227933 5036205 4872182 4732215 4518546 4530075
8321 4530075 4439594 4372796 4281075 4187966 4207142 4097224 3975839 3944738 3969934 3845378 3857243
8310 3857243 3881087 3733474 3742766 3701213 3760325 3843222 3902870 3877088 3790994 3765356 3820519
8299 3820519 3860896 3872715 3847301 3864038 3788859 3780578 3836026 3786030 3682418 3614375 3579946
8288 3579946 3472315 3299518 3306594 3262994 3174851 3058029 3018546 2994484 2987787 3054873 3002861
8277 3002861 2950707 2891040 2909839 2959649 2972304 2954263 2993222 3022409 3059805 3152241 3138413
8266 3138413 2969816 2823756 2796804 2745407 2862530 2871829 2918184 2851183 2773126 2834468 2815189
8255 2815189 2803577 2809209 2848777 2743481 2765582 2824242 2870067 2842149 2876310 2932508 2888630
8244 2888630 2935177 3057930 3093213 3088449 2957279 2973825 3077476 3203253 3259685 3332554 3307131
8233 3307131 3317785 3395954 3422669 3466904 3378878 3392880 3364612 3408418 3435516 3529133 3590997
8222 3590997 3624400 3667591 3701642 3739264 3735597 3756722 3785408 3846419 3927416 3969800 4037203 4152278
8210 4152278 4191986 4320740 4417717 4548093 4657492 4663506 4772666 4797778 4941157 5109250
8200 5109250 5169422 5354848 5411007 5666779 5850055 6111101 6190095 6703526 6780858 6354468
8190 6354468 6529107 6732230 7106430 7199433 7515192 7821521 8094271 8349754 8536047 8775367
8180 8775367 9052387 9235815 9390701 9512283 9700623 10005948 10066715 10110140 10145215 10293092
8170 10293092 10520425 10625209 10738630 10857838 11180674 11431031 11555690 11911849 12246498
8161 12246498 12603684 13084827 13420657 13768947 14184016 14660261 15166256 15611069 16230151
8152 16230151 16726502 17506347 18290427 19047687 19895141 20618934 21553213 22577017 23562369
8143 23562369 24582341 25740019 26876560 28082439 29329936 30883238 32578105 34260969
8135 34260969 36361215 38680671 40995338 43271130 45718252 48142359 50907195 54129740
8127 54129740 57791002 61563661 65070069 68088870 70085721 70692167 69829417 67862542
8119 67862542 65169771 62208547 59568663 57476733 56142458 55405280 54818426 53823656 52842538
8110 52842538 51939174 50924841 50347559 50381440 50700102 51584257 52767719 54401611 56448423
8101 56448423 58763526 61488490 64380240 67490202 70796917 74587018 78776403 83595564
8093 83595564 89079145 95263893 101748847 108234540 114245408 119249257 122649412 124043894
8085 124043894 123428936 120919473 116956859 112250075 107393867 102641438 97579758 92073590
8077 92073590 86105742 80033437 74435552 69750515 65659373 62154248 59233333 56690559
8069 56690559 54544099 52925044 51714878 50897070 50585286 50558463 50922537 51585278 52594825
8060 52594825 53940395 55651203 57890665 60496224 63306872 65683735 67673964 69351034
8052 69351034 71136563 73207969 75613196 78061182 80185597 81131290 80326406 77771239
8044 77771239 73351246 67997513 62270308 56847604 52142454 48368888 45187815 42638533
8036 42638533 40431998 38323041 36312382 34303835 32579955 30932227 29495448 28240569
8028 28240569 27308457 26209910 25273755 24460561 23776444 23082440 22407258 21942452 21407424
8019 21407424 20945049 20531197 20259180 19911407 19550777 19397769 19085611 18818505 18545714
8010 18545714 18128149 17746164 17527837 17263542 16932175 16779353 16577562 16421147 16163330
8001 16163330 16135267 15944445 15811313 15748448 15711032 15859485 15904502 16154556 16582568 16964554
7991 16964554 17309418 17654051 18250069 18805548 19370904 20152023 20953558 21824413 23033153
7982 23033153 24397223 26319914 28723098 31564053 34629020 36979909 37077308 35486298
7974 35486298 32770311 29409513 26407260 24095650 22195784 20723180 19648231 18660874
7966 18660874 17747731 17076472 16668132 16158487 15681492 15405510 15266034 15122872 15022942 14963557
7956 14963557 14796155 14682718 14656952 14609513 14690540 14880438 15015880 15250715 15524835 15746646
7946 15746646 16083201 16234180 16288076 16561489 16894557 17135125 17441860 17743306 18079925 18383369
7936 18383369 18786642 19227172 19539828 20016702 20604347 21206808 22126444 23063615 24197769
7927 24197769 25561044 26975120 28421120 29861619 31594130 33584563 35710909 37914236
7919 37914236 40129039 41935438 43637191 45453778 47229594 48977048 50224427 50431467
7911 50431467 49534610 48163506 46587691 45343384 43815283 42012062 40096511 37972349
7903 37972349 36006190 34269322 32886041 31694781 30917478 30452418 30224718 30303259 30515386
7894 30515386 31063079 31843744 32856299 33926135 35277728 37037785 39119363 41272583
7886 41272583 43197223 44996138 46706360 48690361 51127526 53915371 57069735 60032149
7878 60032149 62231590 63197697 62438931 60137154 56649481 52561229 48524964 44997229
7870 44997229 42195106 39778957 37638391 35569482 33362942 31213327 29441909 27810310
7862 27810310 26441919 25287565 24393652 23663986 23096002 22671833 22389677 22264248 22206285
7853 22206285 22500451 22828138 23267042 23994398 24811386 25582991 26175899 26712794 27054328
7844 27054328 27427106 27934097 28225089 27875268 27000152 25973277 24798600 23690167 22543414
7835 22543414 21213893 19713734 18165073 16732145 15462889 14342282 13479950 12740163
7827 12740163 12018766 11359236 10795107 10378668 9790375 9372904 9112475 8712881 8430873
7818 8430873 8196300 8042229 7714278 7472251 7218259 7075139 6730791 6457734 6349378 6229239
7808 6229239 5984517 5777174 5686871 5620966 5510839 5330611 5136785 4952462 4882882 4747266
7798 4747266 4716020 4626282 4543229 4310850 4028867 4169930 4030718 3899239 3798243 3762897
7788 3762897 3660597 3507384 3439216 3433315 3458165 3427450 3322623 3224912 3105995 3033737 3063326
7777 3063326 2919861 2782326 2858350 2738076 2650010 2611360 2546010 2446617 2480358 2432817 2356742
7766 2356742 2227270 2084510 2275807 2217900 2110751 2135072 2177392 2106185 2121134 2043775 1972246
7755 1972246 1859469 1836414 1919785 1933680 1788708 1798492 1816794 1709523 1766368 1765596 1688545
7744 1688545 1751753 1766730 1813142 1696587 1720234 1685023 1766168 1694037 1590847 1575769 1501016
7733 1501016 1532694 1496391 1495698 1481581 1473763 1400346 1338796 1371072 1318726 1216124 1240025 1218250
7721 1218250 1189693 1153959 1189046 1276499 1217537 1208284 1220086 1215238 1204278 1140255 1105531 1131069
7709 1131069 1023942 1018150 1156359 1259594 1215873 1132030 1171777 1280634 1275676 1272239 1311889
7698 1311889 1335135 1371209 1261360 1136050 1257731 1272468 1193839 1190472 1118632 1160403 1170904
7687 1170904 1082488 979359 995706 893776 799420 821082 807666 710779 723429 749100 658579
7676 658579 648872 612160 623252 633689 608834 749991 779207 668716 719877 727516 670339 714056
7664 714056 700133 651644 630999 682980 609668 654890 749826 741846 567998 546328 581777 543339
7652 543339 496119 487805 592973 664869 747640 665974 615070 630808 549920 513200 486844 440730
7640 440730 344094 402083 473097 477977 425404 435877 351243 278175 317563 307809 365624 332749
7628 332749 316765 298965 321447 299450 377887 411071 380899 325165 282453 271710 202024 305875
7616 305875 265094 251051 301264 305140 320160 314571 304766 283382 299843 251940 262169 227592
7604 227592 205054 230135 122768 162720 126939 154009 119659 152177 173152 108347 155916
7593 155916 238800 267711 178055 163833 172255 163182 150590 148764 157244 135141 168811 194909
7581 194909 111872 122887 122864 64872 143726 187041 55410 51947 117858 241541 191663 220725
7569 220725 184958 144237 143409 94054 82498 -17957 21012 73563 46040 78361 120162 199045
7557 199045 104561 195581 226638 165413 88011 154197 92988 34316 -11855 52770 114818 111153
7545 111153 125213 111594 127235 130396 220691 180139 189214 111908 192505 114199 99167 219539
7533 219539 206290 287925 305577 256311 167424 180981 273533 302643 359904 329770 276425 261000
7521 261000 274542 191197 215896 260714 258930 193218 245903 169883 150845 230297 206885 282923
7509 282923 213031 261446 249779 313059 308734 313240 340112 256288 265585 260778 332797 307413
7497 307413 424859 410866 326053 374079 433384 422253 473468 515675 433948 433637 370870 473033
7485 473033 375937 339088 488258 396531 307788 265791 301970 226310 278340 259908 278063
7474 278063 242899 301574 346578 282185 240662 233095 194805 275534 354330 237773 291139 303259
7462 303259 314080 271731 263991 326342 316208 150405 170755 108701 148424 96773 120758 235931
7450 235931 215887 195206 186731 194126 116466 20430 -19075 53312 173850 84201 146761 259837
7438 259837 175935 97697 114441 108653 71782 87029 2233 172962 146002 203645 132788 128148
7426 128148 200234 244898 165256 82873 134592 124161 107152 161712 98630 59464 137044 122064
7414 122064 80180 136529 314758 308909 223816 189908 166114 166299 88307 50124 25593 -48231
7402 -48231 -120808 -106994 -32902 -120040 71195 131377 135922 104795 163172 143893 7867 61666
7390 61666 99008 147364 109670 146654 124499 165535 158935 109158 93826 33757 168221 168678
7378 168678 121234 118905 145413 135407 105317 133866 199980 81230 53319 167512 30856
7367 30856 -49063 75332 123880 117364 206641 213634 138927 103269 140625 162704 147902 170463
7355 170463 123679 60997 506 140819 87187 -62812 13142 41518 65127 89220 142816
7344 142816 102087 102407 111773 132528 149212 56351 83834 77070 91064 34366 100717 185710
7332 185710 203980 130534 110577 178899 94138 101470 151048 137725 15535 -32644 41278 -21345
7320 -21345 -9851 88643 34866 71699 147235 130472 27969 81048 82480 68075 23725 -11610
7308 -11610 214 12637 55657 14806 3310 -29517 -7066 32002 77715 94788 48408 804
7296 804 -11430 105355 92122 -12907 75517 109262 100287 91009 105602 178444 108961 30328
7284 30328 69838 140448 152283 97137 107476 81887 112536 176230 317309 218126 57729
7273 57729 91230 122937 77542 57650 151132 28869 115725 156812 141140 165729 149099 205849
7261 205849 268201 216858 44797 58561 166867 196154 269137 217479 122983 20631 146721
7250 146721 187748 84436 70236 162061 141193 77312 154174 250794 235544 92503 142148
7239 142148 231920 18269 71781 250634 179241 100685 153344 193500 92027 127729 143219
7228 143219 145975 303413 364424 333106 178313 181099 239739 211133 114077 120894 190901 69413
7216 69413 143690 216228 278398 248678 215931 271770 154603 151772 223422 217136 133771 138132
7204 138132 115690 55803 205107 296181 205754 230052 312014 353560 342563 236299 138210
7193 138210 118835 148519 154708 166875 155008 203499 164125 213173 241241 227668 226718 230387
7181 230387 256310 179415 73457 84965 119284 172683 182753 151921 118194 269580 177229
7170 177229 148743 135481 168907 141942 208354 249202 229713 272698 298113 255061 173114 179285
7158 179285 201521 200393 194668 197292 224035 326919 434334 360651 316667 347478 350224 286770
7146 286770 253297 317130 454321 261731 242030 313241 251283 369158 346868 277659 240062
7135 240062 353553 364656 336918 298897 395002 433321 355931 290130 266406 190486 139347
7124 139347 236771 327294 295864 284115 375036 420153 380450 518641 406677 357198 228786
7113 228786 246977 168862 198228 304779 321262 189318 256733 361021 386105 405530 364085
7102 364085 357539 325428 352572 280038 287850 325565 470614 411873 316155 471636 420202 417898
7090 417898 406624 364101 372191 476110 534870 458212 451689 437682 573433 544363 490716 435347
7078 435347 481138 416933 364357 355416 437306 471466 514662 590565 509309 514759 504658 524776
7066 524776 524860 465933 433634 440541 502935 520949 547445 503372 434455 415429 429782 474554
7054 474554 533744 413040 425294 500373 382056 341570 370835 401107 398829 476285 462870
7043 462870 540471 524787 520666 465312 473443 666508 586779 574721 477110 499725 470637 438896
7031 438896 450517 508643 512955 521936 628342 662508 645894 602135 695836 627051 437353 503443
7019 503443 472524 401544 414237 557352 564660 499188 657520 613649 629473 658569 634384
7008 634384 573600 548827 550472 505597 493837 599369 717978 676648 659893 639806 603963
6997 603963 622210 571897 656854 657043 646200 699938 718715 780883 827949 774992 706378 736256
6985 736256 673902 658900 676357 589868 625946 681540 695518 700696 875682 843978 870696 883527
6973 883527 766891 776316 760584 741027 746114 718661 713708 737737 662519 655709 646734 723691
6961 723691 666936 694623 781789 777979 722094 650946 788201 680936 735868 824687 842752
6950 842752 820300 849482 895338 815104 933549 905725 940035 810999 711887 756123 754337
6939 754337 731656 782384 814217 775853 819636 881841 806711 746919 859822 881791 878206 904724
6927 904724 892861 937855 914703 967744 925286 840170 896132 892644 888086 960568 968033 964498
6915 964498 946672 986815 906025 839598 852340 955481 945296 914470 1043065 1069746 1168240
6904 1168240 1027617 889698 935861 940882 979255 1007486 1039793 1041151 998511 1002251 1031082 1044355
6892 1044355 1023634 1097810 1109402 969938 890156 994682 1074024 1072739 1063004 1118067 1138759
6881 1138759 1065697 1030780 1046021 999117 936157 1014804 1038743 1086061 1132872 1172077 1160301
6870 1160301 1229713 1273864 1254454 1229087 1102220 1134217 1147066 1271535 1164117 1229776 1275238
6859 1275238 1258153 1315365 1415762 1515888 1366728 1303185 1262822 1338038 1358432 1313291 1306591
6848 1306591 1313152 1233302 1189932 1201393 1199522 1277164 1280397 1298842 1341903 1364614 1331585 1383435
6836 1383435 1406690 1333100 1234299 1185579 1254721 1250444 1326936 1385940 1371704 1316970 1375453 1379527
6824 1379527 1321523 1346998 1417994 1324961 1233901 1236481 1296258 1405703 1290516 1411293 1446850
6813 1446850 1371425 1429778 1474636 1467157 1294463 1313610 1364187 1390912 1377228 1488162 1514263
6802 1514263 1399146 1423786 1514942 1563575 1413705 1343241 1316782 1359818 1402621 1458441 1500747
6791 1500747 1486151 1514664 1559623 1674811 1615499 1545095 1376838 1345918 1299123 1375923 1438862
6780 1438862 1428377 1503472 1442941 1539738 1567410 1621356 1548998 1532400 1512033 1552831 1501162
6769 1501162 1429672 1470476 1498218 1619422 1697417 1738775 1644134 1664582 1684068 1669345 1680229
6758 1680229 1602766 1711662 1668438 1592229 1473269 1502616 1511904 1460540 1543104 1632277 1648101
6747 1648101 1692105 1777690 1676275 1707715 1740941 1683617 1617353 1583554 1662543 1573396 1558041
6736 1558041 1606908 1623975 1556787 1527944 1717115 1732647 1658273 1635023 1671045 1659734 1709076
6725 1709076 1674351 1699469 1738968 1737708 1708960 1714614 1714047 1700992 1649314 1657039 1818319 1822374
6713 1822374 1667778 1750730 1963424 1902633 1760145 1763178 1725817 1711424 1663836 1702602 1701573
6702 1701573 1642790 1680362 1793719 1889898 1886894 1903429 1880733 1834940 1776390 1923898 1828038
6691 1828038 1703101 1675862 1616537 1721187 1748717 1773665 1835703 1911925 1787334 1786185 1863343
6680 1863343 1883858 1889819 1845415 1850389 1768463 1771164 1755945 1767086 1756497 1864272 1946956 1840083
6668 1840083 1902787 1921794 1908381 1858617 1872390 1821799 1818415 1709349 1794282 1846818 1844681 1902208
6656 1902208 1846278 1830737 1707730 1837677 1913439 1939076 1935426 1907867 1802437 1815860 1966193
6645 1966193 1857505 1799003 1805867 1682204 1646440 1708997 1810306 1831103 1880651 1895104 1908835
6634 1908835 1792987 1701983 1796152 1859424 1824624 1849455 1913471 1896823 1842078 1822546 1833629
6623 1833629 1863485 1871952 1806510 1875645 1796567 1777243 1854680 1911269 1788385 1768756 1836048
6612 1836048 1759885 1737249 1623245 1700461 1750794 1895507 2000711 1967567 2036088 2042931 2022272
6601 2022272 1837889 1831265 1753215 1723357 1751488 1769065 1875288 1756400 1833494 1804815 1877535
6590 1877535 1869373 1862995 1827420 1779505 1798825 1751177 1744839 1717050 1729433 1757440 1752083 1752839 1810858
6577 1810858 1746496 1755943 1912934 1980857 1833573 1772363 1915125 1880893 1866468 1816052 1786146
6566 1786146 1799341 1730665 1932924 1966393 1859148 1887913 1930080 1909669 1938478 1995570 2005059
6555 2005059 1913686 1892798 1832780 1758316 1839818 1849532 1889520 1850492 1766156 1791415 1718053 1662925
6543 1662925 1671808 1737085 1766721 1783838 1891782 1808131 1773774 1841631 1777207 1649204 1631537
6532 1631537 1665400 1637217 1672178 1676653 1624091 1636377 1639817 1708958 1698441 1712981 1733156 1666261
6520 1666261 1633874 1665440 1669949 1581571 1658665 1630964 1572139 1535384 1617889 1644993 1678904 1709050
6508 1709050 1526512 1443039 1459844 1505628 1467989 1392461 1532309 1567133 1550643 1585955 1671131
6497 1671131 1628919 1562399 1706980 1632682 1594539 1512494 1470791 1450061 1433240 1447862 1512376
6486 1512376 1522575 1535004 1555561 1414600 1422829 1449008 1459169 1445039 1430490 1459205 1450984 1553827
6474 1553827 1531607 1468479 1543866 1500408 1415479 1335250 1454745 1515238 1564867 1517587 1497403
6463 1497403 1457414 1437941 1451657 1371376 1354142 1305175 1338683 1429681 1445948 1368601 1396974
6452 1396974 1512886 1510012 1449328 1425070 1373959 1309158 1271781 1317277 1381317 1330079 1315696
6441 1315696 1393888 1441946 1265059 1203091 1362424 1294497 1209429 1254484 1323138 1284551 1319054
6430 1319054 1391198 1297781 1201336 1267124 1265577 1136515 1193919 1222205 1217196 1270502 1297424 1394612
6418 1394612 1263639 1296957 1398040 1291503 1311966 1322265 1310775 1244103 1277196 1353341 1353620
6407 1353620 1300219 1227849 1226371 1215403 1253369 1293766 1351831 1411268 1361202 1399105 1390732 1409799
6395 1409799 1431107 1378678 1352070 1336661 1357814 1398677 1421672 1510866 1499628 1457573 1473441
6384 1473441 1500432 1493073 1390841 1388269 1389868 1407993 1423525 1478648 1470985 1443158 1251727 1138531
6372 1138531 1164183 1197353 1112719 1134599 1198791 1157658 1236690 1362431 1362736 1297758 1251056 1211793
6360 1211793 1160796 1159300 1259299 1271349 1202870 1324905 1257401 1300010 1299642 1269180 1219601 1139315
6348 1139315 1187544 1099167 1047088 1040029 1150414 1146932 1149531 1206008 1225255 1338875 1285180 1311926
6336 1311926 1256455 1164608 1184305 1186787 1316523 1277799 1323131 1387293 1336750 1259307 1296895
6325 1296895 1299870 1313466 1308149 1367242 1377586 1362682 1375617 1396543 1374278 1302832 1343442 1415450
6313 1415450 1330522 1356569 1514134 1489989 1439380 1455270 1537646 1569028 1586144 1615238 1487708
6302 1487708 1478377 1654037 1688336 1685209 1843244 1890878 1878461 1944752 1997009 2121038 2106491
6291 2106491 2097765 2133864 2233054 2361341 2408727 2505229 2561223 2753366 2830960 2972890 2947986
6280 2947986 3028495 3167045 3191356 3382951 3500408 3812138 3993816 4323526 4577292 4704709
6270 4704709 4745596 4944439 5123451 5207545 5388431 5408885 5517944 5563373 5678374 5754846
6260 5754846 5642793 5529615 5508183 5200886 4856612 4678677 4349915 4127602 3906182 3715221
6250 3715221 3603541 3441464 3421868 3247871 3114577 3003169 2944202 2782605 2713974 2552245
6240 2552245 2561067 2532324 2409065 2300754 2153549 2063297 1952003 1931457 1860068 1842414 1829494
6229 1829494 1781047 1643478 1549802 1566573 1507278 1520976 1559596 1587009 1436367 1277340 1355393
6218 1355393 1307443 1234431 1188815 1256163 1257061 1350327 1239218 1207534 1139101 1117087 1125103 1052116
6206 1052116 1072224 1127155 1129496 1063502 1029251 991054 1059380 1038549 912256 898786 1044402
6195 1044402 947714 831625 967863 910584 937955 949763 905855 871695 822301 787148 666201
6184 666201 653077 720245 729480 715425 872064 852772 779484 810089 798291 717680 602364
6173 602364 569912 562108 556398 543078 676034 501028 459801 492676 588347 614770 616660 701822
6161 701822 630100 568204 558336 592914 602162 634321 595806 557707 577753 602070 569726 504859
6149 504859 533195 579016 579182 666027 609031 519829 500289 465300 494805 485342 523923 507938
6137 507938 460543 435832 404613 443612 428278 464468 437635 474028 484607 495360 516711 416499
6125 416499 446682 429958 479792 469415 404198 459575 437904 475926 397737 455201 443624 420793
6113 420793 349352 296055 458201 419708 339692 294433 439153 427356 348124 366535 305456
6102 305456 328999 343487 431115 357354 285903 268930 310613 253137 262417 374862 429635 407022
6090 407022 223807 217565 212795 248403 265291 280722 306538 272577 307702 387242 322306 327010
6078 327010 199368 191398 265305 333158 313922 203263 183077 282186 400223 327620 366384
6067 366384 401320 380973 332292 319702 331671 318433 261415 367922 414979 382970 351877
6056 351877 396709 231155 116746 5069 77209 103716 153771 344780 423193 407860 407994
6045 407994 399037 380710 288487 206950 31749 26652 134191 173712 196023 208943 308238 272683
6033 272683 230014 294470 332294 231317 138961 100116 71777 54655 149669 309339 348347
6022 348347 258406 227489 304221 319179 174379 143394 106555 188239 145766 60136 106014
6011 106014 106686 134384 216641 153399 175994 177709 279576 255754 249455 320669 229398 208996
5999 208996 169099 216937 259657 199011 134617 135278 15246 114891 206464 117718 160134 215025
5987 215025 252809 139842 99041 214022 187424 86552 149411 281643 231619 191333 253389
5976 253389 339151 271214 174127 180172 67634 19591 -29463 17660 47539 134179 182362 186663
5964 186663 147167 275488 212640 118393 49720 105669 81134 74494 139738 127169 141476 163889
5952 163889 106934 82225 81452 114967 78918 -3661 7363 -14469 -4324 -24867 3466 77497
5940 77497 106403 129125 193739 106458 111744 51484 31504 27157 90878 142807 116247 111662
5928 111662 30716 19506 69992 20850 68618 35421 -8193 -71811 3439 31590 50204 167028
5916 167028 157178 93781 97914 173847 149868 151143 76789 48411 11981 81080 149680 45914
5904 45914 17720 69930 115904 122034 64163 52998 13964 26708 22131 41367 5398 23842
5892 23842 99095 92824 79846 47389 11740 13710 55625 -19080 38134 -6627 7757 22387
5880 22387 29617 -7660 43774 55918 21024 27649 23884 46852 8815 -34789 73912 -54479
5868 -54479 -28150 24408 52134 3748 48587 54756 67423 -4070 -40210 25732 3317 27413
5856 27413 -8001 31090 17112 -54183 -32492 828 -69585 -81156 -68094 -29690 -82993 -20050
5844 -20050 112479 9115 35133 74869 74942 45611 -9849 -50668 -38602 52760 72135 57099
5832 57099 16601 21215 -21744 -92154 -93504 10406 -8972 16778 -56043 -16714 75405 19963
5820 19963 -91857 -44828 7385 -25538 -49915 61514 -46096 -127350 -36465 -57896 -44028
5809 -44028 -53869 -4221 45785 -122700 -124847 -94788 -102879 -82359 21320 -20695 -112577 -141210
5797 -141210 -101538 -37763 -40876 -24107 18000 -7548 -15915 -17453 -156132 -120526 10744 -19508
5785 -19508 -67286 -9691 31434 7912 -4781 45209 63579 11480 2898 -23040 -18124 -23787
5773 -23787 -17924 -75384 -164936 -53098 61843 116235 73651 76087 30232 8928 -126660 -205440
5761 -205440 -32306 -86427 -74166 -30367 116144 64299 382 -29288 -56864 -6669 34971
5750 34971 34926 -4780 52180 15522 -21879 721 -35189 124 64701 -4887 -47416 -122462
5738 -122462 -90089 -70799 -44552 -412 -91239 10539 -20792 -149912 -188754 -135279 -114712
5727 -114712 -123894 -40117 -37065 106406 -49049 -26414 17856 -7973 -102467 -63054 -134267 -179543
5715 -179543 -181647 -167395 -38135 18785 31105 -112679 -112190 -107967 -108986 -36142 -108540 -1392
5703 -1392 17244 75904 39515 29257 6066 -164008 -118411 -128867 -136913 -51964 7127 -26656
5691 -26656 23613 79256 63971 -27461 9684 -6691 -91776 -139257 -155175 -48659 27304 93051
5679 93051 93065 72871 -36075 -55368 26760 -71475 -168030 -112475 66905 -11062 -23843 -89557
5667 -89557 -113189 -62516 -11034 -100662 -166822 -182774 -142686 -43619 -20140 140522 185261 82003
5655 82003 -63394 -50577 -114407 -238049 -261802 -193321 -172376 -157532 2244 40052 -39328
5644 -39328 -69094 -45699 -6600 -83071 -144016 -112846 -120209 -93320 9310 107610 61224 85195
5632 85195 58217 -110976 -161141 -124300 -111769 -133943 -120082 -56728 -65976 -199763 -139450 3948
5620 3948 -97122 -62035 26975 63736 -154534 -80161 56435 -20399 -51748 -45967 -71733 -81489
5608 -81489 -64412 -49949 -169272 -156103 6212 -59880 -104767 -139405 -59502 -151741 -137774
5597 -137774 -42502 -57220 -100787 -159049 -90957 3759 -54363 -38777 -25683 -4031 -88470 -125371
5585 -125371 -132920 -145361 -166483 -190668 -172286 -102049 -144866 -127890 -160332 -179563 -141160 -139261
5573 -139261 -17597 -26970 82648 20682 -84140 -43630 -34035 -101710 -126369 -71063 -54516
5562 -54516 -185915 -222456 -87567 -36513 -92264 -98277 -123019 -186563 -222281 -140619 -110051 -16170
5550 -16170 97432 34558 55003 76251 91667 -31642 -119813 -214709 -186079 -165676 -163722 -31253
5538 -31253 48146 4299 19744 4845 -130263 -198304 -154159 -65250 -198486 -211830 -130147
5527 -130147 -23186 16633 61837 136610 -55568 -117845 -205618 -202434 -278282 -258986 -112685
5516 -112685 -63909 -68771 -89357 27366 -103423 -41066 -64552 -47003 -90344 -124022 -143916
5505 -143916 -194393 -165684 -98649 -66749 -959 29896 -63359 -25509 -49003 -13791 24228 11253
5493 11253 -49187 -46999 -49650 -64816 -65983 -121051 -92346 -96525 -51330 -59800 -41628 -66078 -114146
5480 -114146 -88597 -169880 -42726 83336 68653 72896 142838 104553 101283 68979 -79440
5469 -79440 -18638 -81957 37818 115320 87717 144350 156340 224770 214184 228369 218655 233980
5457 233980 194503 94614 135332 145756 147342 192214 236400 222706 204387 132465 -8621 -43161
5445 -43161 -53939 -62217 -129305 -63057 46137 88470 54363 60773 131765 -14082 -70825 7756
5433 7756 55150 43332 74795 121429 140088 205480 250189 175937 67187 54154 28595 -14319
5421 -14319 -164712 -117279 8745 76014 107412 237861 211995 94237 -64727 3703 -10701
5410 -10701 -32105 66052 140568 209202 202482 168903 199771 175613 240219 101307 21754 8401
5398 8401 81346 31618 80880 209878 165676 260608 288509 250227 175225 302092 277616 189600
5386 189600 127815 134068 203403 285910 345835 343786 282834 296360 277463 292299 248515 331739
5374 331739 283724 240904 304968 370498 350634 370533 377423 326137 400147 486716 405787 345311
5362 345311 448352 514307 482791 456430 432964 490504 446214 530526 523364 543529 527159 553318
5350 553318 669308 629979 567358 540909 511852 672886 740458 819802 881222 837192 886087
5339 886087 908562 868342 796795 956858 1053026 1081298 1011521 1088046 1008116 1029250 1227918
5328 1227918 1216516 1151602 1190992 1188888 1166118 1247307 1388544 1386906 1385600 1490482 1507191 1450398
5316 1450398 1432648 1482603 1501705 1516400 1616878 1638417 1549564 1598156 1701067 1693883 1622941
5305 1622941 1758262 1672614 1561234 1606028 1700663 1798315 1876619 1940959 1922755 1881882 1979593
5294 1979593 1926382 1804391 1751032 1759272 1820690 1818108 1884863 1850888 1993190 2030994 2039901 1963530
5282 1963530 1909427 1880182 1961784 1922499 1887556 1999955 2037497 2071826 2012860 1907380 1969372
5271 1969372 1979220 1915286 1890222 1864228 1847123 1889453 1930083 1906911 1915786 1904157 1907863 1904127
5259 1904127 1836106 1799500 1836807 1867191 1834314 1771985 1655649 1639636 1749752 1593406 1551885
5248 1551885 1633157 1558135 1639746 1683129 1632661 1593913 1586568 1579439 1629904 1473904 1384105 1519893
5236 1519893 1464692 1405959 1392232 1373472 1299049 1354982 1333860 1314925 1300011 1299409 1382126 1362324
5224 1362324 1356125 1402238 1297728 1180689 1244289 1191888 1006542 1077682 1077894 1052999 1141264
5213 1141264 1135006 1117233 1089227 1113059 1330192 1204572 1150312 1148727 1169006 1146959 1168436
5202 1168436 1140108 1153849 1272299 1157297 1220845 1198260 1123677 1125044 1119164 1191991 1112857
5191 1112857 1195677 1267550 1172652 1162269 1093786 1102207 1049627 1094408 1029021 1032981 1057083 1202289
5179 1202289 1270014 1213632 1247350 1308231 1200633 1064095 1097029 1118774 1006764 1064367 1173574
5168 1173574 1269797 1280000 1236970 1218041 1134017 1168294 1167157 1126792 1133284 1109551 1105215 1151801
5156 1151801 1219131 1114187 1124780 1120977 1102456 1025925 1030967 1096935 985164 1030572 1069189
5145 1069189 1113132 1164103 1200926 1133953 1039964 950886 874957 910056 911202 989202 993494 963896
5133 963896 976431 1084626 962106 938579 1043116 921670 855304 866728 923166 735117 770935
5122 770935 915655 854349 681448 710395 724052 769879 788555 889603 851978 732392 807870
5111 807870 833483 764874 597365 545996 546730 569614 698691 669946 726320 750765 805382 728164
5099 728164 622266 651633 654071 644425 598991 686923 555362 587212 580916 655156 691020 630349
5087 630349 708311 619180 632285 539323 525549 535528 529642 466410 471721 528204 572489 636402
5075 636402 549662 504610 472245 473732 463250 493791 501425 586300 616121 564042 585539 475553
5063 475553 447503 413930 376920 319828 423373 501702 491958 459652 523218 565553 551573 640323
5051 640323 588433 570214 535770 502293 541197 535050 600751 626616 560793 499188 611994 571279
5039 571279 499926 525930 591985 597355 508751 579763 605970 625420 560046 622944 545899 486148
5027 486148 574248 518233 531338 609721 582810 611858 632139 642295 676429 781426 826759
5016 826759 786591 680072 710155 737641 774410 756605 796045 805054 846006 875263 876745 862256
5004 862256 872751 904515 838701 916817 1009272 955831 953987 1011678 1095557 1161471 1204435 1271955
4992 1271955 1291880 1313483 1310020 1290647 1277020 1203421 1275463 1404251 1550476 1592158 1589904
4981 1589904 1626595 1565928 1628799 1516676 1600721 1618041 1631930 1710293 1696629 1704745 1753015
4970 1753015 1964641 1814368 1867221 1900159 1895794 1830751 1757751 1876921 1925013 1927259 1965091
4959 1965091 1996004 2045646 2206092 2216880 2238429 2238492 2360963 2340061 2296853 2349906 2391618 2493629
4947 2493629 2559102 2700365 2668104 2749511 2853193 2776847 2739530 2866051 2924721 2960900 3096554
4936 3096554 3241799 3429031 3447184 3532740 3533481 3642810 3795297 3781595 3738846 3769541 3850536
4925 3850536 3920849 4027795 4043530 3952454 3970409 4064222 4175187 4140612 4363283 4426200 4482092
4914 4482092 4587144 4681749 4679853 4734190 4826592 4693027 4643611 4627385 4643853 4564464 4554607
4903 4554607 4585105 4561378 4488737 4531033 4507024 4453443 4479433 4437412 4388382 4266802 4294957
4892 4294957 4264901 4204204 4228503 4291439 4289299 4303546 4311278 4208116 4075915 4179760 4261124
4881 4261124 4029583 3964484 3889190 3874455 3822425 3787696 3865653 3647891 3603687 3581699 3592556
4870 3592556 3444342 3362391 3387326 3205961 3187992 3109739 3026160 2997169 2990498 2861672 2781409
4859 2781409 2747118 2711406 2657180 2623543 2585642 2659114 2632325 2576832 2589069 2417096 2379902
4848 2379902 2362916 2179054 2092696 2148647 2213251 2101013 2098709 2007802 2072611 1972899 2047737
4837 2047737 2082407 2025327 2072966 1933844 1888571 1899964 1928916 1825141 1850835 1925078 1905849
4826 1905849 1827070 1764244 1865884 1892156 1796099 1763866 1770740 1752772 1714173 1644966 1562454
4815 1562454 1615625 1515615 1545823 1562571 1614139 1617543 1566748 1598680 1526682 1498387 1507052 1533556
4803 1533556 1500716 1561981 1531364 1519983 1564106 1570100 1453729 1394733 1496772 1407602 1346012
4792 1346012 1326669 1415491 1447901 1375972 1402959 1339948 1306858 1302542 1252786 1176449 1125007 1178601
4780 1178601 1186993 1156756 1256608 1170386 1118979 1144051 1253717 1283351 1200073 1267876 1161315
4769 1161315 1133617 1120454 1212863 1217927 1205807 1205749 1122889 1150257 1107111 1052999 1067977 1049761
4757 1049761 1040193 1051089 925205 867769 832465 866163 903701 856353 817783 766835 767301 845951
4745 845951 929943 927470 869206 856980 912382 879187 734989 772032 751632 630017 645167
4734 645167 687387 790502 799056 813662 865712 852657 881741 894585 768067 655207 654185
4723 654185 636027 505788 608100 734644 662521 643733 717990 732500 668984 789327 718151
4712 718151 682100 707810 654885 585675 598648 692712 675289 698264 727329 646816 705680 750775
4700 750775 711938 714209 701448 711048 785965 750743 774114 759649 683599 650704 622379 680888
4688 680888 625656 737818 785322 724196 704618 798174 756482 676300 659160 655317 673542 741600
4676 741600 729652 652403 679019 689109 662119 702010 690051 659482 665376 752967 780068 804754
4664 804754 727783 879029 892406 820429 815947 780548 851876 868031 835380 746018 752582 734015
4652 734015 862275 855343 850324 818322 867542 852545 636815 621796 596558 705875 710239 723188
4640 723188 821678 874588 959842 980312 946405 880107 818524 711752 764502 798415 823300
4629 823300 800029 843149 875949 889106 862471 877574 925073 916706 864996 808095 875872 841004
4617 841004 819898 836991 824542 734014 751879 1004899 1030832 857748 848010 835232 754440
4606 754440 891216 1084995 993185 886581 916877 1055235 1024625 942620 975804 895978 833168
4595 833168 952072 1108239 1041603 1045167 1092505 1184622 1150863 1269639 1301759 1143761 1140348
4584 1140348 1114275 1123836 1154324 1250453 1357304 1374077 1345399 1385089 1410272 1393377 1421878
4573 1421878 1505517 1545254 1595361 1673814 1641985 1638730 1580121 1621224 1643493 1656641 1588552 1518568
4561 1518568 1481936 1470406 1610927 1598581 1550823 1505388 1575296 1630992 1506237 1436637 1393179
4550 1393179 1312079 1325379 1424361 1421457 1375364 1371222 1452605 1473906 1556602 1522554 1442659 1488618
4538 1488618 1502909 1562789 1473490 1425371 1391498 1425886 1535273 1394974 1385679 1649270 1632367
4527 1632367 1551693 1601723 1660608 1627252 1563286 1497969 1493400 1504316 1513017 1614149 1550707 1450985
4515 1450985 1641363 1639359 1479794 1454449 1570881 1501212 1463786 1518311 1549353 1561647 1562705
4504 1562705 1745266 1678670 1614919 1719782 1722687 1584670 1726389 1853957 1898847 1893326 1960328
4493 1960328 2001498 2013052 2046727 1863541 1874700 1840666 1798210 1826148 1918131 1944339 1957254
4482 1957254 1985140 1995205 2028938 2149532 2213679 2209087 2169971 2133579 2168704 2173145 2234704 2319686
4470 2319686 2273658 2267691 2336083 2355241 2329048 2383704 2482741 2561182 2506510 2550525 2609302 2465426
4458 2465426 2532508 2572109 2543994 2423294 2522606 2676612 2697582 2770696 2947848 3007913 2937428
4447 2937428 3014164 3013106 2856521 2834699 3008316 2983484 2970918 3156525 3251784 3256582 3311236
4436 3311236 3332626 3339536 3277389 3313435 3509241 3518672 3555432 3732961 3851092 3844296 3848793 3866390
4424 3866390 3791612 3804655 3849224 3812961 3824324 3970364 4027933 4169697 4289265 4265706 4280530
4413 4280530 4324628 4386110 4397289 4413689 4449991 4467352 4595939 4664940 4786266 4845437 4934840
4402 4934840 4872275 4817095 4888414 4948720 4962835 4854995 4926879 4939135 4989832 4921736 4898129
4391 4898129 4811289 4741544 4811614 4743108 4757685 4844364 4879279 4894858 4914867 4927980 4963224
4380 4963224 4997650 4957593 5000526 5028137 4956398 5108539 5201061 5248395 5338156 5434439 5491881
4369 5491881 5387808 5454346 5401847 5345068 5466789 5583266 5698480 5737771 5697606 5666482 5662386
4358 5662386 5669939 5749684 5688593 5711788 5943955 6091897 6212445 6189203 6279205 6315680 6344085
4347 6344085 6387957 6520404 6667370 6670641 6832461 7018144 7012808 7013133 7228276 7359350 7382419
4336 7382419 7557120 7602913 7686996 7739738 7944621 8175160 8332677 8459880 8661153 8764831
4326 8764831 8881802 9096785 9279690 9361531 9600457 9924314 10225895 10418333 10616204 10908466
4316 10908466 11090684 11354017 11568285 11933095 12152626 12421092 12786969 13128080 13503359
4307 13503359 13774224 14100698 14426234 14670388 15096132 15367811 15709087 16169075 16801058
4298 16801058 17110014 17562946 18053322 18534850 19111358 19679126 20371661 20915211 21634859
4289 21634859 22259215 22868252 23441841 24289766 25148654 25820234 26784402 27689598 28670274
4280 28670274 29738855 30844844 32077195 33116581 34361759 35806150 37260273 38793749
4272 38793749 40487641 42237134 44025604 46073847 48246449 50546478 52945813 55630351
4264 55630351 58377250 61168248 64226547 67384909 70612279 74090062 77642031 81360259
4256 81360259 85145762 89086347 92788761 96536224 100139212 103480846 106681792 109569512
4248 109569512 112116912 114078603 115484111 116230924 116416669 115937092 114763798 112994092
4240 112994092 110531431 107857899 104694664 101084158 97399774 93674552 89946887 85962398
4232 85962398 82197511 78494191 74872474 71321022 67933542 64792362 61803894 58915293
4224 58915293 56245795 53796724 51325392 49066485 46974947 44897465 43114047 41384545
4216 41384545 39795375 38211751 36758439 35434932 34084867 32732559 31541438 30475812
4208 30475812 29400650 28405131 27522675 26549903 25655806 24879283 24158143 23385830 22724368
4199 22724368 22012027 21290879 20708313 20172351 19628237 18994849 18472620 17953892 17499269
4190 17499269 16919575 16519371 16140512 15634827 15275172 14869357 14512668 14102260 13707126
4181 13707126 13398590 13089782 12844359 12563483 12329881 12008554 11809498 11625276 11288725
4172 11288725 11003396 10753462 10634298 10296607 10073242 9953424 9761381 9619346 9490704
4163 9490704 9411237 9130581 8814899 8647335 8413003 8221371 8077726 7930333 7946643 7808113
4153 7808113 7519508 7380160 7292845 7096121 6910394 6710313 6662814 6576213 6448629 6344570
4143 6344570 6190936 6167088 6034112 5897480 5673842 5576865 5508673 5335593 5390596 5313747
4133 5313747 5236006 5125554 5135812 4979001 4711660 4584229 4650578 4577422 4418730 4456198
4123 4456198 4392410 4303319 4294135 4297333 4171870 4093606 3929029 3835686 3776486 3694533 3653876
4112 3653876 3673964 3663508 3592140 3599341 3589251 3587267 3525410 3548475 3501761 3360454 3253740
4101 3253740 3264406 3273622 3203549 3157407 3081030 3014285 2913178 2888380 2807864 2786572 2896424
4090 2896424 2894669 2708063 2665815 2739499 2789483 2673986 2626759 2593454 2515057 2482534 2602082
4079 2602082 2580931 2456685 2377613 2392740 2266553 2131432 2159998 2140856 2161723 2171957 2136805
4068 2136805 2158902 2163632 2161526 2214922 2083192 1996964 2053555 2018019 2020042 2029353 2044211 2088634
4056 2088634 1935583 2005796 1896792 1790608 1763359 1802933 1794039 1730180 1720387 1751885 1766125
4045 1766125 1811040 1811212 1909656 1941335 2031558 1943490 1844015 1801815 1767065 1792891 1763502 1787476
4033 1787476 1854108 1862845 1880230 1885115 1860310 1924027 1857710 1946446 1931743 1870474 1990864 2083554
4021 2083554 2116720 2126389 2145559 2085594 1992249 2117635 2150722 2090821 2125860 2227919 2305759
4010 2305759 2337191 2429571 2481160 2438039 2508916 2441277 2491254 2408367 2419307 2497032 2551310
3999 2551310 2666297 2632059 2729126 2765615 2687336 2708833 2700555 2666150 2667207 2760529 2705066 2598053
3987 2598053 2630709 2732515 2762036 2677929 2674207 2713971 2735328 2831804 2793939 2788239 2823002 2926287
3975 2926287 2995527 3072171 3109738 3106207 3103331 3061168 3128855 3120082 3099815 3121864 3283160 3269521
3963 3269521 3177033 3255463 3281828 3283702 3267503 3235475 3207285 3209590 3221519 3269839 3433163 3355744
3951 3355744 3344522 3487525 3464330 3406513 3514653 3610833 3508160 3559645 3621420 3660861 3640384
3940 3640384 3600119 3636033 3506031 3565394 3576775 3571587 3481647 3545837 3648362 3565674 3513488
3929 3513488 3580528 3574798 3504577 3529417 3591918 3632922 3699011 3792619 3894926 3860919 3830643
3918 3830643 3828343 3867545 3830247 3827497 3849631 3881815 4010288 4041774 4025504 4021809 4014548 3980978
3906 3980978 3857190 3828293 3824599 3784899 3783333 3788376 3834209 3755571 3724285 3616247 3560401 3392524
3894 3392524 3249357 3142184 3122594 3086891 3038330 3005247 2946479 2803630 2731003 2706945 2596282
3883 2596282 2505755 2349230 2303239 2255861 2244677 2272903 2264856 2251743 2218628 2229024 2137198
3872 2137198 2000639 1927064 1987239 1861460 1844435 1894756 1768174 1837085 1925993 1924248 1755197
3861 1755197 1824353 1801619 1834048 1847825 1813873 1777744 1739469 1857217 1869708 1820873 1760692
3850 1760692 1762847 1671048 1708874 1744326 1838950 1828995 1854564 1896657 1865659 1999271 2049001 2095838
3838 2095838 2139854 2277808 2231660 2340683 2406621 2374211 2381242 2353708 2488166 2474819 2567587
3827 2567587 2641883 2711203 2714271 2844158 2981766 2899423 2990097 3079501 3016908 3089204 3138466
3816 3138466 3082194 2931190 3037210 3133499 2978233 2914655 3050214 2971004 2843129 2850955 2953844
3805 2953844 2925987 2793294 2842496 2789193 2764789 2770126 2811720 2769538 2782483 2753918 2618010
3794 2618010 2552174 2659773 2722066 2734503 2788555 2952389 3013503 2880701 2969536 3034133 3055215
3783 3055215 2948054 3036301 3118478 3165116 3274329 3374475 3464260 3381660 3433383 3490486 3452055
3772 3452055 3402367 3335399 3356381 3421835 3413170 3445497 3470948 3520221 3563397 3487487 3517682 3410851
3760 3410851 3204881 3208599 3222875 3180708 3221904 3180223 3060057 3143506 3107167 3099710 2931546
3749 2931546 2747434 2639727 2581900 2460890 2514375 2537818 2477375 2451691 2446761 2491077 2365977
3738 2365977 2305453 2260924 2218287 2254662 2212160 2120600 2137561 2144305 2152294 2198968 2218891 2227990
3726 2227990 2211979 2147909 2093406 2103970 2140229 2218359 2277694 2428354 2404013 2347944 2285505
3715 2285505 2278870 2298844 2185206 2197778 2253017 2247280 2201976 2177901 2126365 2047624 2056028 1999034
3703 1999034 2010241 2015321 1942366 1858942 1857602 1801869 1729573 1763027 1854598 1704001 1621055 1619173
3691 1619173 1530634 1490600 1562155 1562657 1526472 1537651 1500436 1541429 1399453 1374396 1375188 1395180
3679 1395180 1385193 1399712 1355465 1331329 1341577 1323442 1373254 1300219 1218575 1300073 1264868 1260106
3667 1260106 1141540 1209907 1185936 1171076 1182149 1188790 1164820 1141078 1289361 1319505 1189886
3656 1189886 1100452 1097625 1005401 974316 1029664 1085361 979162 984000 1063021 985620 1003003 1062673
3644 1062673 1097619 994268 1058543 1045219 868063 850438 908322 824459 837394 891313 980460
3633 980460 910176 929713 1041540 926875 808264 847045 876255 845325 836778 922436 966820
3622 966820 880414 759714 736618 708318 771174 793771 726209 748575 801585 900914 895626 919611
3610 919611 893349 885219 813001 900254 902255 884888 831415 791719 773585 866467 951780 982651
3598 982651 982268 909148 885063 898082 900318 929429 830944 892031 826741 760120 843701 1006704
3586 1006704 1014563 972179 1037854 1099095 977741 879135 964734 853869 769161 751898 844860
3575 844860 751345 735018 783443 732154 669601 725253 876048 734279 746327 885423 933326
3564 933326 881520 825170 908249 825374 786502 767655 802194 751919 788638 893756 934889
3553 934889 918125 830337 817588 832574 750847 770463 779157 722825 750930 750472 934964 904477
3541 904477 797384 903924 929561 844800 879752 892382 875983 743823 693702 748173 760905
3530 760905 789266 795468 776320 786016 770486 884700 856820 784080 833232 873757 812964 822787
3518 822787 805117 774121 873738 1028180 1089934 976352 884935 856151 794367 744830 800050
3507 800050 817842 793062 913999 963073 850503 813065 807821 731645 740897 785825 754469 817073
3495 817073 837834 952436 967395 834069 799705 910357 813665 880843 1009872 999436 851580
3484 851580 814772 933427 882955 883701 928897 910896 851450 892775 870743 884659 992097 1073021
3472 1073021 1049234 1173905 1268799 1155815 1212187 1269614 1338707 1348118 1437239 1407970 1357829
3461 1357829 1349690 1336998 1233379 1114852 1165125 1151197 1067162 968197 1094092 1139743 1075846
3450 1075846 1056792 1013476 1044497 1108907 1100720 1063988 1052190 1081199 1146755 1100212 1194557 1098849
3438 1098849 1032927 920781 970625 1003618 993153 1092005 1057375 1097603 1047324 1008179 1101949
3427 1101949 1111023 1174332 1202078 1165315 1126438 1154254 1159119 1091391 1078227 1161442 1127812 1061171
3415 1061171 1091085 1112423 1077065 1115298 1179776 1078071 1086661 1124393 1208604 1133544 1157836
3404 1157836 1124810 1199192 1184249 1101580 1075534 1171342 1256458 1199132 1220448 1266071 1226448
3393 1226448 1218012 1386442 1422230 1433874 1419201 1320591 1348382 1350660 1465361 1507190 1560958
3382 1560958 1758612 1861759 1848098 1852967 1957730 1972379 2042150 2113066 2164571 2077403 2135607
3371 2135607 2320840 2316164 2248359 2290601 2476890 2468035 2445461 2617155 2731021 2843744 3020069
3360 3020069 3297576 3414632 3397677 3567921 3627220 3452185 3366216 3261723 3002254 2769207
3350 2769207 2689278 2551890 2376630 2369998 2336927 2311055 2218774 2176868 2069051 1998421 1945191
3339 1945191 1963111 2065464 2036243 2054755 2029848 2031126 2050272 2140507 2085061 1992013 2033725
3328 2033725 2051122 2076865 2087289 2178513 2182333 2311703 2352063 2325407 2396623 2451826 2397999
3317 2397999 2493542 2550622 2584918 2605168 2593837 2632724 2590915 2577821 2663405 2584204 2537296
3306 2537296 2505785 2530532 2560503 2557451 2597806 2584335 2546932 2606206 2504692 2450580 2601392
3295 2601392 2546798 2523131 2569586 2696023 2726269 2737372 2873601 2987105 2892735 2864884 3018156
3284 3018156 3045462 3078804 3216666 3450179 3530825 3582944 3728267 3831125 3824671 3783314 3949919
3273 3949919 4000018 4043321 4079541 4245668 4251593 4324562 4338671 4266984 4275589 4345619 4381838 4398456
3261 4398456 4509450 4521057 4456139 4457749 4646544 4693275 4676158 4743168 4773730 4965372 5110802
3250 5110802 5208929 5322547 5627739 5885067 6181545 6470538 6844399 7204250 7519328 7954163
3240 7954163 8456671 9026785 9725305 10516268 11194395 12039695 13209220 14391982 15731370
3231 15731370 17212813 18600185 19230729 19223748 18663951 17594358 16346520 15133867 14220345
3222 14220345 13139233 12213841 11489501 10706997 9956547 9411793 8951137 8584806 8246173
3213 8246173 8046850 7965020 7829583 7719597 7554131 7319369 7161657 7133933 7083614 6909733
3203 6909733 6967394 6934218 6861184 6861413 6927176 7001479 6924800 6956609 6924035 6748503 6783443 6897139
3191 6897139 6900690 6826093 6911469 7018030 6947229 6948448 7060088 7151310 7138455 7148100 7266656
3180 7266656 7293976 7282933 7360418 7423721 7407569 7584332 7783102 7897556 8071560 8082179 8176685
3169 8176685 8340538 8535322 8598473 8834752 9015716 9112789 9295075 9635178 9960908 10131219
3159 10131219 10391215 10663958 10867630 11156414 11547151 11895106 12287498 12785763 13412888
3150 13412888 13953571 14658703 15457910 16275729 16971403 17776455 18661948 19587660 20692902
3141 20692902 21940239 23175859 24600535 26179175 27820339 29253235 30755580 32059639
3133 32059639 32952030 33574826 33641768 33254095 32375970 31404688 30422432 29245561 28234051
3124 28234051 27340163 26561324 25720438 25044234 24573945 24134435 23781223 23614036 23520469 23363537
3114 23363537 23307527 23216018 23096542 23182188 23252778 23300598 23428687 23636131 23943568 24250980
3104 24250980 24579418 25030653 25435684 25858674 26352773 26804591 27295587 27802856 28346974
3095 28346974 29000323 29772065 30322265 30891924 31513603 32266262 33027124 33764893 34523995
3086 34523995 35372401 36387597 37462674 38649827 39928802 41148290 42570608 43922543
3078 43922543 45331648 46909698 48685415 50586992 52593270 54819709 57253109 60067162
3070 60067162 63462157 67376100 71858270 76991313 83049707 89814171 97383881 105645183
3062 105645183 114793931 124637744 135414459 147482785 161083874 176225235 193000889
3055 193000889 212168156 233825576 258790801 287399566 318883297 350455787 377406962
3048 377406962 393766325 395058885 381133853 355372042 322890084 288589137 256057183
3041 256057183 227151867 202155242 180913559 163086756 148120886 135495936 124834394
3034 124834394 115867451 108305797 101765652 96056124 90959151 86316614 82071013 78398952
3026 78398952 74838164 71520919 68575934 65908331 63520891 61391316 59390001 57589436
3018 57589436 55954441 54361598 52952234 51700678 50362726 49160189 48130190 47343708
3010 47343708 46435516 45609616 44920967 44176462 43481718 42591558 41746985 40945441 40167663
3001 40167663 39472164 38833081 38172780 37672872 37232976 36730411 36110376 35653069 35023399
2992 35023399 34469390 34101754 33666184 33162511 32647096 32243987 31879251 31342568 30863716
2983 30863716 30495799 30112606 29634486 29227136 28915073 28542117 28232890 27886604 27599190
2974 27599190 27173493 26928367 26610825 26136798 25834031 25476324 25120488 24701331 24350652
2965 24350652 23998486 23548470 23269582 22886969 22458864 22161656 21904724 21568078 21156975
2956 21156975 20769762 20315997 19974869 19689317 19600227 19258617 18952106 18746159 18619030 18445264
2946 18445264 18198569 18105183 17928156 17659790 17347810 17105858 16822102 16635302 16518764 16319074
2936 16319074 16089924 15923347 15771178 15581703 15323385 15209822 14986325 14792324 14642823
2927 14642823 14541828 14388333 14173062 14196146 14090275 13970163 13810324 13608325 13390217 13225292
2917 13225292 13073898 12829016 12738235 12599380 12333364 12204539 12054586 11917224 11835217 11662998
2907 11662998 11479146 11389309 11407339 11308495 11249121 11210545 11096112 10976919 10942648 10868522 10787679
2896 10787679 10582673 10526745 10444285 10350136 10362123 10361031 10233413 10205736 10187222 10108312 10060561
2885 10060561 10074784 10051871 10015536 10103228 10112490 10133926 10114303 10078594 10067193 10129869 10025548
2874 10025548 9941484 10001020 9943425 9853289 9840937 10027601 10018030 9909924 9936343 9990807 10018103
2863 10018103 10023297 10148879 10287082 10356415 10372013 10494323 10505156 10542537 10748458 10817015 10949033
2852 10949033 11021668 11023652 11247709 11344436 11473324 11596347 11547230 11619388 11770140 11854187 11873005
2841 11873005 12038366 12232260 12517664 12607571 12524124 12718753 12849936 12875958 13015985 13329858
2831 13329858 13477272 13557800 13751669 13868171 14047652 14178757 14317731 14393268 14515878 14585429
2821 14585429 14632322 14735127 14796281 14994786 15075362 15295663 15407956 15484009 15586424 15653120
2811 15653120 15815215 15808872 15920022 16086168 16223547 16169074 16175560 16348213 16379905 16398623 16529821
2800 16529821 16754226 16718295 16616508 16706737 16931510 16895127 16993037 17078082 17199906 17239743
2790 17239743 17373551 17520127 17634000 17685735 17788835 17818269 17853200 17982363 17977541 18136785
2780 18136785 18248661 18289554 18468867 18436290 18489501 18568973 18697177 18664551 18663231 18586769 18580359
2769 18580359 18590753 18567853 18619458 18548561 18570244 18422083 18336681 18325645 18189024 18061246 17929977
2758 17929977 17703268 17623384 17412820 17300495 16968319 16781320 16616493 16444811 16313103 16152336
2748 16152336 15964434 15843200 15677170 15452931 15335943 15221259 15073992 14977922 14784305 14704022
2738 14704022 14562662 14538929 14555312 14424894 14154698 13878464 13589346 13163712 12812555 12414677
2728 12414677 12049951 11687331 11472498 11262680 11038177 11016366 10820729 10585261 10427988 10233745
2718 10233745 10007125 9831916 9826323 9679840 9557551 9592354 9474979 9285267 9067321 9030179
2708 9030179 9004766 8893560 8766936 8637671 8493210 8507917 8513604 8326431 8228340 8259112 8280025
2697 8280025 8198321 8108555 8037732 7920103 7891343 7872893 7754581 7628046 7563769 7552276 7530309
2686 7530309 7506912 7493783 7424751 7297922 7230243 7205806 7149589 7175672 7184783 7194580 7112094 7042404
2674 7042404 7093649 6948729 6992694 6921058 6892775 6829761 6898908 6936352 6836825 6839378 6753727
2663 6753727 6708686 6630074 6767049 6747011 6731654 6741958 6741989 6856519 6864425 6855021 6851783 6959301
2651 6959301 6875129 6824331 6831109 6856252 6977723 7140432 7137708 7114051 7149198 7272002 7245922
2640 7245922 7175445 7302570 7321052 7410716 7534291 7664456 7769677 7893771 7998429 8068336
2630 8068336 8116918 8237255 8499402 8510390 8585649 8835840 8896441 9008666 9170044 9325622
2620 9325622 9435998 9681961 9863226 10038802 10105323 10257175 10452726 10584420 10725217 10847244
2610 10847244 11111921 11277712 11536693 11688091 11926174 12024729 12249713 12467893 12664158 12878173
2600 12878173 13008474 13208096 13417254 13638423 13778018 13922402 14150600 14341846 14499898
2591 14499898 14707120 14998942 15163354 15319583 15586658 15934304 16107208 16323693 16596668
2582 16596668 16906904 17166973 17405861 17695391 17805561 18109260 18418956 18823861 19249540
2573 19249540 19640182 19947122 20239391 20603032 21063905 21433416 21685329 22226278 22758018
2564 22758018 23260030 23716029 24191563 24734350 25279071 25733120 26181312 26684628 27099239
2555 27099239 27555365 27921118 28394081 28763971 28993617 29452860 29934962 30179435 30308751
2546 30308751 30569050 30716225 30867867 31066483 31247034 31422331 31544683 31711092 31744985 31788131
2536 31788131 31747062 31606180 31502306 31508456 31321297 31192542 31059786 30996680 30963554 30773225
2526 30773225 30565992 30509455 30275426 30079473 29857310 29644898 29416194 29213348 29043890 28773792
2516 28773792 28475219 28147548 27925913 27717675 27286134 26949834 26802276 26475892 26219171
2507 26219171 25996783 25735184 25494400 25239507 24942768 24647289 24154910 23768850 23528080
2498 23528080 23204668 22912428 22633958 22318933 22020017 21807599 21520999 21278749 21043457
2489 21043457 20713157 20380257 19944813 19623447 19368305 19074594 18761287 18497397 18227348
2480 18227348 17898408 17704415 17413583 17014481 16810837 16527435 16374280 16075040 15705546
2471 15705546 15487065 15343031 15081564 14707893 14497350 14140052 13900407 13799420 13614876
2462 13614876 13300201 13094641 13057349 12841864 12673678 12557780 12191328 11926548 11766534 11604949
2452 11604949 11369140 11266121 11148219 10940270 10858295 10806760 10835536 10708407 10549888 10464676
2442 10464676 10303468 9949683 9742949 9685932 9667885 9574258 9521357 9458089 9174387 8935124
2432 8935124 8909678 8779901 8687344 8568474 8389729 8251770 8105825 8059306 7862822 7742056
2422 7742056 7771573 7816552 7646463 7487876 7358473 7123727 6944947 6842389 6849757 6708303
2412 6708303 6570401 6494169 6446415 6317456 6220958 6202091 6040376 5922969 5827067 5624677
2402 5624677 5506306 5509560 5560737 5459339 5328254 5317786 5158254 5003580 4890400 4751922
2392 4751922 4690095 4543418 4551729 4536981 4483533 4453670 4450345 4405845 4341034 4212097 4152517
2381 4152517 4053271 3962175 4019217 3909747 3795686 3825084 3963807 3897340 3834467 3770621 3673310
2370 3673310 3533417 3452335 3550064 3597183 3440246 3464648 3533014 3485155 3351742 3298866 3224106
2359 3224106 3018618 2968344 3001236 2992030 2991866 3082132 3101585 3106586 3103209 3086872 3025281 2927497
2347 2927497 2857563 2744024 2628763 2683385 2818018 2831197 2750676 2815952 2789275 2746922 2667803
2336 2667803 2713248 2713464 2562408 2600466 2577959 2504118 2461882 2541939 2539372 2589849 2505078 2319570
2324 2319570 2304293 2307024 2257442 2244783 2278472 2318694 2169297 2308946 2336300 2249657 2319871
2313 2319871 2264963 2229547 2223454 2249030 2160195 2110444 2151345 2260231 2307694 2193781 2163488
2302 2163488 2139551 2143933 2137803 2141579 2125960 2016570 2017617 2046034 2062476 2073408 2082907 2016933
2290 2016933 2063858 2160178 2013912 1961428 1996297 2035066 2134459 2093710 2022605 2013240 1986987
2279 1986987 1926567 1941683 1912133 1910999 1929750 1925257 1886305 1843870 1927232 1924845 1899845 1890313
2267 1890313 2030176 2047959 1967601 1928118 1976746 1903658 1878470 1984798 1915282 1911954 1997022
2256 1997022 2003462 1952230 1895174 1907649 1827737 1724708 1813598 1877836 1961883 1990107 1984617 1998531
2244 1998531 2009681 1931701 1970339 1969797 1948360 2048360 1986016 2018869 2102569 2126608 2122685 1994605
2232 1994605 1985682 1952348 1955215 1873925 1947635 1900856 1867787 1945369 1943108 1956944 1887522 1894526
2220 1894526 1913359 1940305 1890060 1871750 1923820 1805201 1817789 1915136 1975685 1946037 1890141
2209 1890141 1868668 1854972 1924038 1863089 1845472 1817902 1863303 1988770 1848692 1837340 1911862
2198 1911862 1975834 1979854 1943760 2026962 1998092 2029418 2135283 2046015 2029113 2073757 2196862
2187 2196862 2134681 2002468 2084307 2152212 2179778 2276643 2461578 2471216 2564932 2657977 2530003
2176 2530003 2536018 2730544 2705041 2655118 2771961 2834729 2831165 2870949 2948923 2893670 2691839
2165 2691839 2632421 2580114 2585052 2488778 2406524 2296770 2116229 2058314 1974924 1960284 1914203
2154 1914203 1939084 1982333 1982629 1891698 1829101 1857245 1879692 1799525 1743163 1733277 1636309 1499709
2142 1499709 1469535 1489862 1438502 1475983 1470713 1393915 1424320 1539477 1471692 1469739 1452956 1455590
2130 1455590 1353976 1323365 1432255 1259305 1144571 1263037 1335796 1305869 1147395 1106154
2120 1106154 1111140 1048504 932606 992327 1048387 1033046 1170423 1151720 1107573 1022617 1172427
2109 1172427 1125358 1012378 1078164 1074661 1213876 1178709 1145770 1058767 1120084 1145932 983206
2098 983206 977893 952314 916783 896732 907145 954825 933211 953730 917334 941120 857264 867827
2086 867827 947985 957634 967667 961568 957284 1026606 1063797 974965 943347 922520 955335 865712
2074 865712 802114 815742 859663 878826 901947 955807 931142 953875 903493 844914 783707 721134
2062 721134 770972 761240 776601 893002 1004056 907514 891000 872631 823938 827583 745713 710698
2050 710698 686424 697391 754455 789345 742811 802594 781602 712418 680203 631984 721487 701264
2038 701264 789529 709629 690639 691603 771434 757252 674948 702633 596225 512134 492680 647227
2026 647227 676308 544353 612797 626051 642469 543208 632005 651822 559142 533067 575732
2015 575732 712631 611169 621925 574286 530335 631641 719419 715830 662130 648987 616373
2004 616373 490056 451254 479503 480068 430459 409867 515029 444281 418746 442026 595533
1993 595533 593013 632420 731158 677293 450879 343543 374634 275021 377319 449733 460637
1982 460637 395198 486207 414311 253239 277562 271578 331416 425184 472439 504125 459859 447697
1970 447697 488572 480541 349349 354700 398342 401761 314086 374248 388191 371174 424309 477162
1958 477162 445271 425599 444532 332713 232113 124312 310171 371285 287446 379921 429604
1947 429604 394848 321621 470692 426729 385077 401688 308172 229141 362358 496523 462639
1936 462639 349783 379888 378627 269778 235908 199285 251248 364480 466479 448630 418802
1925 418802 552231 544659 505828 476916 470718 454768 367504 440518 455628 562983 607589 732876
1913 732876 736698 575123 647512 551138 461154 451133 315884 299935 397673 564170 561048
1902 561048 541365 638316 589833 404561 425754 484836 500258 535609 557432 569896 643541
1891 643541 655463 682781 657284 637625 589616 634069 717944 707865 754986 778154 810650 824671
1879 824671 911115 818578 720098 720441 814561 826268 827720 908763 744703 580592 576851 576717
1867 576717 644568 655295 715548 661420 656971 712227 676036 583520 524004 628617 554291 453998
1855 453998 503375 573239 579809 755224 841621 762349 719646 791152 716393 544038 489247
1844 489247 529952 587906 645660 652709 788000 868346 858904 840164 823596 731505 733995 746708
1832 746708 714403 653168 689090 766945 694051 689767 792199 761681 609896 632031 559977
1821 559977 568355 501485 509568 615397 649737 675546 617087 572301 494106 466120 427640 477787
1809 477787 618889 739372 817980 871536 942223 884597 859806 749451 717840 680742 615404
1798 615404 574833 689422 761078 770011 838233 839764 762493 695354 658733 656177 704571 727646
1786 727646 769294 816796 864052 901889 865211 820055 822431 753509 638911 680069 713477 721848
1774 721848 783327 758304 762582 795659 742459 649831 708765 568104 483981 594666 597489 554690
1762 554690 561852 605540 499312 539068 488676 466436 550787 459119 362992 421919 556133
1751 556133 464879 505643 376113 362827 346426 330108 292686 188943 273557 378568 468608
1740 468608 374393 330980 244301 259399 224512 203448 194853 127214 265441 262842 313899 289929
1728 289929 286578 293164 252879 226301 131294 180500 222289 223282 226913 238766 241232 305165 252411
1715 252411 256667 253695 201853 107948 142297 229125 154384 231131 195024 171475 65727 133728
1703 133728 162775 74151 115687 79550 105013 63849 90284 51573 28928 59046 114427 76847
1691 76847 64465 40011 63707 33323 33190 60546 60128 -18984 41563 95230 609 -94470 14600
1678 14600 136371 77705 2944 33702 55725 -4617 -77342 -141418 -68675 -117162 -119671 -52152
1666 -52152 129 77313 159113 109097 47553 -16992 40009 19733 -28464 -9520 13990 -17756
1654 -17756 -60784 -3470 -20392 -12306 96911 77488 19554 1796 151496 66583 -92869
1643 -92869 -26032 41733 -88197 -124397 41138 55699 -47132 -42237 58740 29837 22305
1632 22305 -90921 -70879 -30839 -81798 -32458 325 -16019 44643 64438 36890 60923 59490
1620 59490 19648 -56824 -51314 -23011 -46768 -120870 -33975 52190 -59717 -104147 -41460 -57523
1608 -57523 -202902 -175822 -174207 -214855 -103011 -16753 16544 -92729 24282 45016 -58823
1597 -58823 -30149 -81116 -137795 -135704 -112285 -187713 -123936 -124110 -64922 -3843 -113489 -69181
1585 -69181 -29840 -44100 -97832 -47179 -47360 -41295 -39034 20907 -40754 -144560 -65491 -49333
1573 -49333 -57368 -36245 98790 74200 42224 4110 76163 59480 21167 67051 126747 30107
1561 30107 -141239 23310 44376 27430 88078 66238 47243 -31475 -39183 -27820 -5612 -34994
1549 -34994 19438 15182 1929 18195 -35562 -144509 -107903 -27964 -104486 -72291 -125176 -90277
1537 -90277 73 33261 103067 54441 85897 123499 115728 32542 33496 23307 27424 51632 73134
1524 73134 167103 191657 81624 41385 180797 49058 91711 96837 140880 94859 78859
1513 78859 76977 43934 52977 40319 137087 107085 89362 145933 272312 232351 235683 339433
1501 339433 249824 196104 122442 82341 -3522 15231 55030 -17053 84355 179466 257029
1490 257029 137302 54904 103900 90896 -6687 63710 164035 147085 171208 249105 241598
1479 241598 138118 271646 338070 292950 196173 246388 173446 89489 160534 179205 95566
1468 95566 92630 165837 146895 81388 89686 45014 71750 92726 158394 154920 86247 61876
1456 61876 125190 57636 57090 106736 62261 49534 30537 102850 24252 100910 39612 92533
1444 92533 4794 62326 142277 134259 2171 41184 207853 189519 135777 55543 52611 -7930
1432 -7930 21107 44087 39432 45524 85344 135497 -47375 -28175 7404 -75943 -132361 -92123
1420 -92123 -11608 -93513 -188605 -11509 41683 12127 126022 44751 -73034 -94242 -161509
1409 -161509 -225610 -275450 -211632 -112202 -10924 6213 90306 35262 -87766 -49466 32247
1398 32247 -220 -32792 -19079 -26178 27259 -20444 -10659 -91656 -149026 -178318 -232010 -206925
1386 -206925 -148853 -133829 -152523 -94853 -80485 -41129 20264 -87873 1589 3071 3510 -75624
1374 -75624 -25107 -65929 -115483 -56261 -105362 -1819 -30460 -83892 -60545 -182919 -146347
1363 -146347 -93997 -5701 -102206 -94324 -139997 -205520 -175682 -210410 -82900 -51575 49082
1352 49082 61458 -29924 -101156 -117033 -82365 -90869 -136272 -141121 -101451 -111918 -117461 -107324
1340 -107324 -110875 -69558 -28379 -63450 -82502 -89860 29291 55290 105311 64233 -33540 -75302
1328 -75302 -135806 -238757 -264409 -176568 -261540 -243157 -180824 -118704 -3744 -33557 -86566
1317 -86566 -164601 -168466 -171348 -182569 -123811 -148046 -156757 -139288 -47629 -20317 36073 128652
1305 128652 103330 -63693 -135625 -73899 -88172 -142612 -181992 -102495 -54483 -133375 -118784
1294 -118784 -133824 -78267 -95283 -107265 -111786 6741 -4602 -55554 -9032 -17878 -20561 -106205
1282 -106205 -187680 -159292 -111539 -81621 -97249 -103327 -32577 -113748 -94699 -36481 -160338 -214280
1270 -214280 -118887 -28030 -131026 -72407 -22356 -10451 41715 -41735 3927 -130170 -122564
1259 -122564 -53903 -34530 -52305 -18626 41223 114291 154237 -74783 -114692 -38639 -7357
1248 -7357 -21719 15912 11148 -58186 32896 17738 107373 113155 71649 9328 -39001 -101150
1236 -101150 -176751 -108604 -202395 -70613 14416 -6033 -90543 -158089 -149523 -143993 -138475 -121878
1224 -121878 -134590 -190440 -154926 -85638 -138887 -67879 16664 -54969 -113815 -94202 -99521 -36288
1212 -36288 -111571 -102813 -21830 -139992 -229957 -61704 -75320 -7346 -62561 -124167 -116995 -72364
1200 -72364 -32817 -103955 -20312 -18522 -76585 -139005 13905 15351 -68721 -5752 60554 56052
1188 56052 -56756 -99726 -73324 -150658 -114660 -205936 -166285 -31876 -37938 -168750 -76907
1177 -76907 -59955 -126306 -76518 -81462 -25979 -84611 -66086 -33848 -34846 3099 30117 14842
1165 14842 12343 -11867 -39585 -68017 -142813 -244397 -211338 -17958 46218 126761 124
1154 124 -7351 5541 -105037 -108356 -169105 -135538 -79184 6450 43322 84153 103621 40627
1142 40627 4373 -44389 -59017 -173210 -139923 -78538 -62758 -34773 34046 22216 44418 83605
1130 83605 -116441 -108062 33657 -76646 -80135 -10244 86594 80883 166585 158678 60369 -13615
1118 -13615 21574 8169 -86785 -90597 -50076 -69893 -7219 94412 81368 900 78049 32452
1106 32452 -31004 -32728 -55631 35140 81380 71157 -13012 70275 140439 70403 105736 16280
1094 16280 122077 27243 31990 221392 76812 142123 130266 205926 205888 321784 254117 257274
1082 257274 228423 144358 130067 186793 116690 -47424 68303 185612 172612 66112 70244
1071 70244 204706 127036 42239 74977 152155 114288 77595 30921 31136 158518 154417 101034
1059 101034 130612 44900 87163 113999 96446 137437 208599 146305 100196 173250 288299
1048 288299 307267 355815 328135 190453 193183 249565 250898 197198 217210 302694 226251 277584
1036 277584 465209 433424 392022 357146 320398 314854 315706 451382 418956 482739 625398 589866
1024 589866 538990 520811 463323 420269 459729 562165 693647 670654 652876 698244 771687
1013 771687 846274 943978 957311 874103 962102 982501 956015 981698 985867 1033651 1054025 1150198
1001 1150198 1170675 1293694 1309834 1269313 1248029 1256733 1367430 1474178 1607474 1807445 1799001
990 1799001 1895939 2033474 2167286 2167080 2311648 2457228 2543481 2595690 2732042 2863941 3074360
979 3074360 3271217 3639653 3978809 4399313 4857668 5393989 5864280 6328118 6908173 7333243
969 7333243 7977690 8825081 9835013 10892269 11999571 13415475 15174934 17499451 20349666
960 20349666 23290591 25325177 25065718 23480509 20963461 17899698 15228856 13127049
952 13127049 11354284 9985809 8760741 7777846 6958221 6406151 5970038 5593675 5374381
943 5374381 5102381 4765344 4506280 4247574 3968744 3745729 3480497 3222280 2987980 2841763
933 2841763 2738785 2563645 2396603 2311498 2185676 2159244 2176060 2022187 1855567 1751907
923 1751907 1787381 1746209 1707809 1621863 1582553 1562772 1447246 1431183 1351759 1244034 1067076
912 1067076 1002609 1077595 942971 1025806 989213 893861 902462 839166 909789 805264 843881
901 843881 806547 769590 692667 741839 721529 786704 697483 634854 708610 709670 695109 612063
889 612063 575129 602302 666686 548413 619105 679018 630834 540661 446377 438718 458759 501788
877 501788 529879 459639 503226 501890 503809 510941 511551 518558 461180 410404 315730 274166 382108
864 382108 328463 277150 277948 217700 242532 255434 351290 311079 257577 259369 253241 170112 186614
851 186614 260534 201202 212106 271200 243577 177497 172782 242340 151112 63766 11743 89255
839 89255 45129 138042 209112 144172 217743 192237 193690 156596 112041 87235 57022 107994
827 107994 156377 167198 209367 203950 151908 206003 222844 81625 86235 16176 48556 125154
815 125154 113205 77297 97079 110970 73068 108091 138740 138765 81324 73704 200205 146247
803 146247 111681 131793 -20324 13563 38376 -725 -121189 -71758 -39913 -124819 -17337
792 -17337 -95574 -35035 -4208 119285 4267 -29973 -41636 -2663 3575 -28308 -12264 -64791
780 -64791 101368 129454 59415 -20844 -44851 -23423 44849 55131 -19631 -100146 -117340 65525
768 65525 94728 50206 58117 46866 5338 31794 61372 43375 121273 171009 23882 82590
756 82590 190666 139418 174103 105593 14597 66935 4214 2354 17035 34739 84019 70983
744 70983 35874 -21788 60460 25706 61913 -53702 -17663 -34222 3829 1531 107707 103470
732 103470 -84123 -101257 -145395 -74910 -124988 -6794 15043 18357 57418 7439 -3557 -15005
720 -15005 17100 -42085 -24361 20198 12205 -26909 -7591 -23751 67701 111716 43621 -65026
708 -65026 -59702 -4732 28664 52008 -13543 32411 41610 23196 -53882 -111337 -71054 -37519
696 -37519 -1574 44575 161987 77078 146050 166206 183935 152253 85469 16328 -39897 9179
684 9179 -95573 -109139 -89801 33696 112940 37566 36554 179818 360957 183673 179428 154627
672 154627 65829 16652 14987 128610 125362 103658 112873 98006 96934 35705 30745 105705 61936
659 61936 66464 3652 -37560 27499 18933 -85085 -64151 85568 9478 -30527 9805 -9646
647 -9646 -12531 -48398 -60414 -52683 -72035 -86001 -26250 -49754 -160649 -189200 -199162 -177786 -165797
634 -165797 -145663 -72697 -20293 -79770 -55483 48455 36833 128995 58685 -25857 -124347 -24469
622 -24469 -12156 -12754 39965 40746 -5977 -124562 -54315 29999 8714 -12789 -1952 6955 -60905
609 -60905 -53811 -85047 22792 87704 147490 21999 -3749 -50632 16662 -20054 -10825 60444
597 60444 23602 -31657 47247 95505 -33775 -48951 -74658 -118934 -208309 -222203 -74152 -60092
585 -60092 -63258 -66969 30143 -6250 -59672 -29366 94876 51376 62167 109201 -62480 -33941
573 -33941 -8993 50074 -59061 -85742 -81510 -109663 -99469 -103068 -41516 -90207 -50995 17317
561 17317 18967 57787 91133 65979 25327 28373 -66109 7318 86546 61498 52410 65986 -34875
548 -34875 54039 -76660 -122839 -46047 -9789 -28451 1502 -38492 -42371 92536 21577 4813
536 4813 86426 36722 4497 -729 117398 67838 151587 160102 153497 29126 105336 25003
524 25003 -102677 -62924 -129893 -167421 -192028 -41462 -53630 -45181 -3988 -49474 -28868 -8432
512 -8432 29182 28996 16022 22426 41550 -15084 -543 83164 54112 109530 28313 -59793 -57858
499 -57858 -69105 -151683 -89322 -1478 -60442 -10658 18555 -6167 874 -14879 -101052 -153629
487 -153629 -96194 53941 39707 74248 41844 23437 37726 31955 -8189 16316 38806 14816
475 14816 72514 34924 79846 119517 167531 75869 20535 -27518 -6569 89614 58384 35560
463 35560 103042 61756 72810 32174 -42409 -71295 -46739 -174707 -99429 -76200 -7602 -70577
451 -70577 -112129 25588 94096 109316 6559 -24639 12395 36323 57190 69794 -17088 28276
439 28276 40831 -52939 -61018 -111382 -92814 -8704 -11679 -78839 -4057 29668 38945 89773 192387
426 192387 50828 -8513 -28011 47463 67314 -58211 -11711 -77685 -79431 70723 32364
415 32364 1503 -17607 -77397 -63787 -121936 -105679 -59858 12682 -123539 -104470 -37802 -12152
403 -12152 -40706 65784 49452 94972 12276 4246 79540 147689 136449 94903 138217 89815
391 89815 168289 139441 110727 67661 6140 -17044 -48257 -94572 -115613 -96494 10429 16976
379 16976 -51876 -106814 -55026 6259 61675 59082 51546 19781 105648 9134 -28573 15311
367 15311 -51029 -30841 16477 12016 -54602 -135939 -94688 -4796 12241 -1723 7881 -3797
355 -3797 46825 40485 97813 57942 72143 161582 72283 11672 26909 37022 -75560 21674
343 21674 -2120 119794 85997 109417 148520 18483 -4850 -29127 14930 -32234 -94928 -88257
331 -88257 12791 -12826 39547 126211 115033 113207 -24371 -80486 -46211 101254 -2421
320 -2421 -8806 53340 115683 71929 -24856 42437 5043 -58548 -99000 -131680 -69967 -45824
308 -45824 21759 92552 65210 -5682 15788 33874 2343 15425 -67190 -99938 -56582 15438
296 15438 -37379 -120741 -10679 63508 41249 20441 -19688 68587 45200 31558 -6088 -4063
284 -4063 -11866 -9702 98134 92503 173855 109916 57342 -69302 18444 -41438 -169488 -54801
272 -54801 26955 46170 -42613 -59724 -73716 -52048 -32922 2107 -56477 -73307 -21498 3649
260 3649 48127 36670 118145 157307 150855 131079 -33903 -68281 -150925 -88858 -63513 -28836
248 -28836 71561 96111 35491 47241 -22795 55282 84773 58834 70059 8803 58235 41152
236 41152 48468 2988 -22445 -65354 -69394 -15855 -101517 -42808 56831 29608 -36924 -1380
224 -1380 62877 32559 32554 -23086 -21262 -20888 137671 198520 90821 48266 4398 -41327 -120116
211 -120116 14493 -19270 -65306 -138046 -8152 -30951 -96985 -13423 -16659 34730 -75805
200 -75805 -13263 22287 -4463 -51664 -31304 42197 -24485 42869 70103 24749 31497 51046
188 51046 42992 -104736 -26595 48724 -18599 -13362 -22983 -31786 -44397 -82006 -2931 -50540 -99142
175 -99142 -79634 -11246 -22025 39675 104628 6847 -2858 19795 141940 34206 -45048 -52188
163 -52188 -36149 59729 49871 31006 -152743 -61179 19516 -18891 -50177 -147527 -151597 -80246
151 -80246 42733 115095 82125 19641 75777 130346 85494 35391 -12783 23965 -14260 -22858
139 -22858 18676 65400 106296 127327 136223 27098 -67570 -91223 -54639 -51840 13579 29513
127 29513 14485 -56469 -41693 -3846 24776 1977 -1625 -38638 -68343 -69415 -75147 -29779 -46481
114 -46481 34855 -57266 -55823 13099 -30052 -70542 -37816 -2206 49592 123222 31310 78740
102 78740 141263 97861 6134 -64700 -9970 5152 4653 21684 26120 60870 10680 -56770 -42010
89 -42010 -38194 -58457 -88046 -52392 -11262 -14764 1963 45465 42247 44162 -2544 -37577 -33687
76 -33687 -47858 -64145 26422 13571 20225 -500 -55707 -94672 -132508 -49973 -48548 -114677 -75847
63 -75847 -38780 -104883 -84185 11563 71644 -19642 -5976 17800 -2850 -44472 28544 21365
51 21365 -66910 -21956 65974 44574 60375 14326 5212 -76581 -84065 -61545 -51620 30864 11025
38 11025 41366 49156 72255 54234 51475 52700 39814 -7669 -5653 -58332 -29957 -16626 31727
25 31727 -40018 -138365 -112679 -92647 -121940 -132451 12296 -20350 -47369 37707 41573 27232
13 27232 -20408 -13476 -74600 -110306 -31933 -17310 4645 -31070 18924 13421 75874 79510 -27613
0 -27613
$$ Imaginary data points
##PAGE= N=2
##DATA TABLE= (X++(I..I)), XYDATA
16383 -1406255 -1342647 -1252960 -1253580 -1249142 -1261726 -1285648 -1190815 -1090208 -1137314 -1205418 -1124770 -1085370
16371 -1085370 -1146346 -1064733 -953906 -981903 -997428 -1003084 -1068713 -1052550 -983977 -943728 -980611
16360 -980611 -928355 -829503 -785604 -784205 -752186 -694221 -700061 -724584 -712996 -722814 -692529 -635558
16348 -635558 -647710 -535863 -551621 -568029 -471061 -419896 -478221 -506634 -440285 -405959 -439928
16337 -439928 -432093 -385631 -422620 -427534 -358654 -290856 -311002 -237426 -238682 -225791 -204852 -199279
16325 -199279 -180178 -153690 -129184 -111502 -220594 -159171 -53470 -70496 -160203 -152469 -35187
16314 -35187 56706 74563 74877 119615 80509 163140 217894 204694 210325 151954 93545 58078
16302 58078 137055 170910 209564 286071 359437 376608 283159 335199 374276 313901 330644 356196
16290 356196 331963 375391 369777 448376 502392 539847 539110 517883 499854 487056 487705 500724
16278 500724 500953 478683 529460 539545 602719 680238 678849 728394 672148 734348 679828 685712
16266 685712 627621 727546 857536 917003 893022 895556 962820 828950 843044 771651 782047
16255 782047 806957 893390 987548 1042541 995507 1009258 1056972 1084413 1123577 1075222 1066713 1034452
16243 1034452 1020107 1038302 978997 997752 1077587 1159950 1135549 1210600 1241686 1153519 1210303
16232 1210303 1163390 1090972 1142129 1309364 1343757 1235184 1295608 1383478 1335700 1256011 1223146
16221 1223146 1226076 1187242 1224403 1378045 1293824 1328427 1444290 1495698 1462162 1489109 1485898
16210 1485898 1438662 1432623 1403533 1393821 1308685 1419900 1475030 1491594 1494628 1416767 1408043 1463589
16198 1463589 1483270 1465065 1427873 1582889 1625223 1503802 1515058 1653884 1715655 1664800 1645392
16187 1645392 1659778 1624899 1568258 1658207 1623641 1547685 1629856 1622259 1602787 1594689 1692604 1772051
16175 1772051 1661769 1596272 1574151 1543720 1611315 1566302 1630693 1733734 1777793 1733923 1748137
16164 1748137 1774545 1708825 1759541 1794365 1839618 1764862 1709581 1741316 1889988 1920467 1883550
16153 1883550 1828557 1788712 1769419 1766796 1792768 1866997 1885544 1823981 1847592 1798326 1785556
16142 1785556 1855134 1791549 1806309 1825665 1829457 1852659 1837182 1840138 1792651 1794924 1800675 1716115
16130 1716115 1788462 1820620 1778189 1895391 1983454 1978224 1940931 1890329 1832928 1806484 1830245
16119 1830245 1896641 1844676 1764143 1925302 1856445 1860870 1898733 1889037 1752311 1751038 1847576
16108 1847576 1743304 1738572 1785049 1855755 1853880 1879071 1864307 1890916 1955436 2067931 2040353
16097 2040353 1958624 2042731 1965776 1897120 1880443 1847105 1883272 1936849 1954966 1889219 1925083
16086 1925083 1865024 1839354 1954954 1986447 2027419 2027609 1969365 2003715 1957717 2062985 2104611
16075 2104611 2073467 2130021 1967222 1844379 1862489 1879480 1903603 1997819 2006400 2002088 1903936
16064 1903936 1872053 1905969 1880895 2000456 1962942 2126982 1987470 1911908 1889756 1860082 1858946
16053 1858946 1844507 1805794 1848809 1926248 1927894 1920212 1902011 1976570 1903496 1955138 1877013 1886692
16041 1886692 1927205 1912622 2054122 2024681 1968653 2021531 2052399 2008762 2010656 2018735 1974796
16030 1974796 1851020 1802893 1870496 1882479 1987442 2054049 2039506 2053898 2169733 2097130 1984551
16019 1984551 2056368 1937408 1934439 1963210 2054939 2012979 2017585 2082522 2017495 2031682 1937124
16008 1937124 1918184 1862833 2041961 2030440 1968453 1928376 1941415 1899959 1941861 1914499 1974915
15997 1974915 1869728 1893355 1963229 1911108 1949336 1936143 1924205 1878909 1917741 1991464 1968195
15986 1968195 2010707 2032513 1956218 1978478 2033640 2071871 2060021 2052047 2080371 2003239 1885276
15975 1885276 1975643 1953180 1981842 1961968 1950149 1966258 2044403 2017646 2084937 2060741 1987084
15964 1987084 1921669 1864113 2026874 1975058 1940837 2035136 2025504 1980971 2008380 2015350 1942221
15953 1942221 1983527 1981294 1896802 1946790 2014473 1986467 1951183 1963237 2019208 1918450 1894552
15942 1894552 1911358 2029714 2125893 2086872 2116927 2078834 2127478 2094505 2042835 2039053 1896856
15931 1896856 1927188 1912267 1936683 1946076 1962493 1972259 2044429 2030702 1998818 1954816 1948109 1940435
15919 1940435 1816920 1950300 2054486 2061639 2075528 2119248 2014828 1970712 1988986 1946303 1852072
15908 1852072 1818408 1868335 1904874 1925430 2006751 2065643 2054581 2094521 2125388 2009767 1912642
15897 1912642 1887278 1917780 1917035 1987308 2053338 1929520 1940386 2061574 2034699 2052636 2085220
15886 2085220 2011226 1879519 1839787 1930737 2061349 2010830 2094557 2112523 1974640 2010084 2050872
15875 2050872 2034078 2009184 1940228 1979205 2044401 2025348 2060041 2085663 2059708 2063971 2111889
15864 2111889 2083364 2021933 2100350 2066159 1956732 1809287 1881017 2017375 1977276 1929315 1942720
15853 1942720 2034213 1922768 1952341 2016282 2059324 1973224 1966204 2066653 1914810 1939531 2036112
15842 2036112 2020670 1943326 1980318 2061061 2054959 2004465 1972414 2104417 2055582 2139613 2110292
15831 2110292 2081762 2051143 1981995 1952705 1968519 1965066 1956401 1933950 1923160 1972294 2029893 2053315
15819 2053315 1843483 1865191 1969319 2019999 1968579 1929756 1960715 2006284 2077719 2058500 2005865
15808 2005865 1876992 1953015 1885321 1961710 1982412 2056978 2064019 1983041 2135391 2079644 2067716
15797 2067716 2007556 2216661 2118302 1913361 1960416 1957698 1991345 2017932 2092922 2017742 1975580
15786 1975580 2004915 1925613 1975838 2019407 1996607 1991871 2012564 1950619 1891785 1912332 1974199
15775 1974199 1978609 1931448 1956379 1962150 2053388 2094874 2179715 2201625 2100289 2103868 2065252 1970677
15763 1970677 1950791 1903885 1978248 2027202 2082312 2152732 2128878 2148708 2018684 1967101 2031311
15752 2031311 2065161 1947678 1995959 2105290 2041019 2021539 2022218 2040524 2098128 2086292 2216373
15741 2216373 2118382 2027530 1991688 1897361 1783379 1927205 2126647 2199127 2118760 2060658 2167729
15730 2167729 2031493 1948560 1983810 1954906 1926066 1915292 2042020 1990277 2009068 2099642 2050286
15719 2050286 2000818 1950598 2008289 2003779 2130915 2094086 2129713 2104043 2050960 2082095 2000246
15708 2000246 2028957 2052087 2167738 2110147 2035555 2104462 1965644 1963191 2045574 2134292 2032070
15697 2032070 2033335 2052541 2132125 2036478 1967705 2062109 2145793 2187991 2159344 2088133 1987172
15686 1987172 1934886 2039682 1977320 1857373 1959265 1953917 2003453 2094841 2090909 2066959 2001581
15675 2001581 2020457 2050920 2078802 2056412 2121409 2025455 2098308 2102875 2060241 2063531 2013168 2096561
15663 2096561 2101758 2268739 2122930 2104311 2074693 2036047 2071520 2057141 2009223 1942996 2012207
15652 2012207 2102220 2174827 2160876 2202525 2191316 2102638 2132194 2099601 2127210 2000465 2024430
15641 2024430 2067874 1975045 1938517 2035578 2015684 2035516 2058650 2059892 2065565 2067311 2107835 2038731
15629 2038731 2006749 2006323 2202386 2079593 1983911 2017227 1982349 1947853 2054798 2104906 1951189
15618 1951189 1951725 2029326 2049908 2033527 2111891 2142655 2123809 2132414 2179357 2238433 2176563 2125174
15606 2125174 2109093 2151849 2061250 1945179 2003856 2017870 2071889 2126824 2151932 2127672 2219096
15595 2219096 2145182 2014943 2059616 2087151 2052029 2126036 2043805 2100109 2118011 2184940 2226979
15584 2226979 2242534 2223299 2205269 2245634 2153330 2087547 2058059 2126381 2051576 2012817 2087375
15573 2087375 2056441 2056140 2094401 2067769 2013279 2061347 2091479 2053038 2034676 2026297 2085568 1994935
15561 1994935 2011454 2002853 1948504 1932122 1959620 1991432 2013455 2053361 2033262 2003515 2068732
15550 2068732 2049208 2040693 2010212 2025214 1996962 1974628 2016412 2063461 2111520 2007816 2066161
15539 2066161 2041094 2080928 2162099 2073571 2107241 1999151 2023370 2058060 2158586 2213767 2187382
15528 2187382 2131570 2029200 2017325 2013895 1999834 2078697 2063757 2012114 2078770 2096345 2063825
15517 2063825 2101827 2113383 2159031 2049007 1991915 1997818 2045470 1969728 1981022 2096464 2080624
15506 2080624 2132239 2160835 2111621 2061433 2117059 2093918 2060982 1984354 2062117 2083447 2039944
15495 2039944 2096744 2114871 2131886 2124089 2111977 2172634 2122674 2019541 2009873 1956472 1983759
15484 1983759 2139500 2170046 2037823 2011726 2138755 2097396 2019950 2021483 2101928 2058445 2067059
15473 2067059 2158379 2205231 2090677 2071406 2160419 2054022 2054272 2157556 2128121 2010356 2073606
15462 2073606 2209687 2062239 1916489 2051517 2064162 1987694 1968886 2022142 1972737 1913103
15452 1913103 2104378 2194531 2117696 2038510 2174272 2171508 2086268 2105854 2107868 2144261 2160566
15441 2160566 2189533 2137425 2060040 2200079 2230415 2170922 2113212 2119296 2045448 2092226 2248351
15430 2248351 2212846 2128081 2199917 2291416 2373980 2264048 2085458 2095971 2086115 2010850 1976791
15419 1976791 1975717 2032003 2119460 2187070 2220305 2096596 2117553 2107695 2046688 2006513 2070551
15408 2070551 2200622 2169669 2166315 2118351 2147859 2072824 2010045 2106021 2102183 2171260 2178743 2229510
15396 2229510 2257767 2281109 2288054 2109149 2136265 2100580 2012078 1977891 2001614 2095486 2151488
15385 2151488 2186935 2209579 2273580 2300747 2260808 2114646 2055810 2027633 2094221 2072587 2074391
15374 2074391 2117871 2184970 2200130 2180746 2125309 2145587 2143236 2072514 2048436 2042227 2111628 2093339
15362 2093339 2077605 2148631 2217011 2212979 2236822 2297015 2149857 2088943 2099614 2114103 1969512
15351 1969512 2039593 2143924 2089984 2106917 2161899 2178093 2069906 2085154 2049831 2016273 1986962
15340 1986962 2019700 2118184 2160913 2158755 2118728 2058356 2099687 2107679 2045757 2036402 2109507 2144270
15328 2144270 2070445 2151643 2114929 2094932 2061425 2041637 2094543 2101135 2138529 2099309 2152541
15317 2152541 2190848 2161498 2072637 2221274 2114362 2127051 2256906 2130372 2102090 2049450
15307 2049450 2208732 2188074 2234098 2317939 2220948 2100513 2063448 2192760 2099644 2013828 2038770
15296 2038770 1987666 2083672 2133393 2210811 2182927 2278024 2394333 2229219 2148106 2184260 2220481
15285 2220481 2142019 2167872 2115126 2040863 2088012 2091590 2149858 2149383 2120096 2125685 2106122 2254058
15273 2254058 2223955 2262270 2189912 2169523 2155300 2217765 2133511 2127618 2216929 2187037 2221506
15262 2221506 2148697 2098313 2060121 2040625 2099927 2134172 2174486 2173207 2139680 2065129 2095486
15251 2095486 2115561 2053788 2033009 2009489 2153679 2156220 2226309 2198032 2193027 2245287 2219938
15240 2219938 2219142 2228319 2185438 2125722 2127056 2139111 2117969 2031426 2099275 2200167 2161693 2200842
15228 2200842 2231409 2213552 2159775 2232724 2201010 2204782 2165777 2231730 2223614 2244398 2157200 2086311
15216 2086311 2133047 2073175 2185951 2211538 2197525 2169524 2156760 2137899 2104510 2140752 2086913
15205 2086913 2076371 2055129 2177709 2248314 2207558 2235686 2256602 2299675 2144250 2250080 2270142
15194 2270142 2184178 2012727 2040531 2119628 2143881 2177025 2215399 2110590 2123476 2237049 2174728
15183 2174728 2136210 2202829 2181144 2227935 2281941 2283761 2219721 2250624 2228462 2182642 2150195
15172 2150195 2164451 2097858 2085441 2219076 2163456 2217275 2111134 2039237 2069441 2149203 2147218
15161 2147218 2133796 2116480 2208577 2149826 2158665 2246312 2197357 2168225 2132012 2194781 2121201
15150 2121201 2026001 2178380 2155500 2137569 2162352 2302673 2121959 2094839 2141871 2115250 2026550
15139 2026550 2123303 2245662 2076149 2130990 2175525 2134708 2124760 2259829 2209490 2157526 2173975
15128 2173975 2169000 2225615 2133873 2060710 2168657 2161165 2127375 2134850 2169179 2159827 2217968 2177159
15116 2177159 2218256 2198342 2197984 2131510 2099107 2254017 2248008 2174893 2130684 2188450 2140612 2166061
15104 2166061 2209628 2217647 2108120 2021736 2053283 2104345 2056841 1969826 1964510 2089589 2101953
15093 2101953 2079801 2237245 2203425 2172612 2099089 2130389 2102603 2124965 2216828 2233657 2238763
15082 2238763 2180713 2292260 2240606 2212274 2212531 2199094 2180057 2127339 2227128 2134445 2192918
15071 2192918 2189842 2266751 2223290 2250494 2249375 2153847 2144341 2220479 2206149 2125427 2180731 2195425
15059 2195425 2221455 2225375 2151490 2149207 2182007 2199768 2190360 2135857 2118835 2083281 2179572 2184005
15047 2184005 2199023 2216537 2245828 2282551 2345023 2245395 2251123 2281705 2276161 2203441 2205799 2199808
15035 2199808 2254270 2245904 2198576 2199753 2227961 2148497 2158477 2167837 2098345 2104924 2064459 2110943
15023 2110943 2091793 2158218 2235558 2190112 2214958 2204448 2195798 2260950 2259489 2286138 2230638 2168720
15011 2168720 2180131 2262773 2269793 2286109 2352254 2197842 2171781 2197724 2178107 2200434 2194725
15000 2194725 2193510 2095447 2212962 2286509 2232539 2274506 2258811 2219664 2306811 2379845 2251435
14989 2251435 2188000 2111662 2020449 2111434 2170771 2283943 2107149 2014597 2072835 2117002 2132848
14978 2132848 2107766 2151911 2072023 2213596 2282913 2268020 2301744 2273985 2231757 2220086 2185928
14967 2185928 2097279 2091416 2081809 2097384 2189060 2172736 2230735 2184992 2124026 2188902 2237248 2217574
14955 2217574 2123528 2108543 2088349 2136455 2103284 2217742 2343791 2254943 2177815 2197664 2294557
14944 2294557 2217587 2143960 2183327 2082030 2066408 2019851 2068699 2133320 2192247 2186478 2165953
14933 2165953 2220630 2222467 2149683 2196973 2299372 2268269 2325265 2326241 2214824 2198139 2212132
14922 2212132 2227884 2269473 2265465 2241013 2181396 2149400 2174150 2179250 2192469 2291845 2245093 2211384
14910 2211384 2213345 2307197 2245235 2198415 2221710 2264172 2233115 2175321 2132862 2105206 2183939
14899 2183939 2218625 2244750 2209808 2259253 2214354 2208501 2154778 2147893 2121431 2094582 2186590 2231781
14887 2231781 2273519 2208938 2186361 2146038 2146231 2184900 2214088 2300326 2245938 2247610 2226178 2215448
14875 2215448 2225710 2246657 2223118 2237061 2315924 2205373 2217826 2233250 2229568 2241964 2288882
14864 2288882 2258540 2248566 2375999 2342847 2266381 2191782 2141842 2193642 2152867 2139715 2195027
14853 2195027 2278853 2284542 2284173 2341075 2251154 2258944 2221544 2182717 2199798 2109069 2180142 2160805
14841 2160805 2156072 2252484 2302813 2261498 2283189 2347974 2276539 2211912 2191571 2234613 2145111
14830 2145111 2129969 2139096 2184619 2307763 2280620 2261401 2186517 2296067 2278422 2190136 2146923
14819 2146923 2162147 2339572 2380319 2395358 2382642 2383112 2369280 2308503 2286450 2233799 2211628
14808 2211628 2189757 2177337 2161209 2188260 2277572 2355255 2413726 2311801 2265843 2272461 2211198
14797 2211198 2204808 2249132 2324521 2276890 2318714 2376574 2367275 2302308 2278044 2202022 2072954
14786 2072954 2121350 2197604 2232462 2228651 2263216 2402346 2353115 2418537 2433431 2352689 2339648
14775 2339648 2322955 2295073 2233458 2326209 2319104 2341231 2348571 2406067 2372214 2227253 2154727
14764 2154727 2203476 2228529 2270598 2215041 2322325 2332494 2404366 2356661 2203461 2319307 2420395
14753 2420395 2283347 2204243 2240462 2192212 2250387 2238030 2326662 2283134 2249158 2260148 2175960
14742 2175960 2263725 2247799 2304695 2294975 2375184 2374836 2248014 2235886 2261950 2266584 2255292 2293120
14730 2293120 2198125 2255737 2295720 2275976 2372812 2300462 2376049 2445333 2233996 2248621 2243102
14719 2243102 2234611 2274291 2293186 2284758 2261503 2322472 2322452 2310983 2226946 2198559 2232671 2265507
14707 2265507 2311094 2371022 2429048 2347863 2274438 2198569 2195437 2167889 2210962 2245995 2215132
14696 2215132 2251016 2335804 2439077 2345690 2267789 2219608 2354543 2430631 2260817 2268110 2257916
14685 2257916 2266136 2285252 2259173 2351628 2412715 2308211 2304227 2342483 2303191 2272726 2260903
14674 2260903 2176245 2204107 2250461 2174186 2225382 2292224 2257483 2223963 2339400 2226201 2208509
14663 2208509 2294220 2296810 2321271 2340207 2365445 2300391 2266205 2169666 2184390 2247183 2210905
14652 2210905 2199294 2326187 2365891 2356407 2319298 2361138 2290670 2304910 2363799 2274141 2217644
14641 2217644 2220272 2255572 2194120 2195909 2283255 2190185 2118703 2213617 2264119 2231564 2363341
14630 2363341 2378939 2357577 2270412 2297658 2290049 2150152 2205791 2322289 2216246 2088820 2258299
14619 2258299 2371504 2248291 2317379 2424284 2380729 2223145 2208169 2191126 2322683 2313226
14609 2313226 2289424 2368099 2297241 2345486 2258423 2298796 2277155 2332384 2158421 2126738 2230339
14598 2230339 2220066 2303952 2416497 2441392 2360726 2310705 2297271 2229063 2316259 2282170 2251679
14587 2251679 2325707 2365501 2384996 2411992 2474041 2446209 2271906 2294892 2197562 2183672 2188323
14576 2188323 2292492 2329066 2300345 2520132 2534165 2401813 2374459 2509707 2383390 2280312
14566 2280312 2435423 2362783 2238888 2288954 2402421 2348419 2300661 2387511 2354552 2368547 2360602
14555 2360602 2359021 2296274 2310281 2370491 2357843 2357402 2368754 2397395 2372250 2314797 2353982 2432316
14543 2432316 2400703 2362066 2287499 2320194 2337772 2332438 2261566 2198701 2274224 2309472 2284219
14532 2284219 2356543 2345365 2266649 2289977 2320683 2383919 2314181 2367372 2374901 2291324 2392397
14521 2392397 2409532 2350552 2321973 2367875 2319309 2178510 2234406 2306291 2279448 2273485 2327898
14510 2327898 2294771 2297993 2301225 2308014 2319874 2301518 2285134 2271660 2197529 2161239 2302561 2400054
14498 2400054 2339537 2437112 2395851 2410840 2445921 2475344 2297755 2209495 2303637 2336217 2293747
14487 2293747 2233634 2387971 2355350 2290793 2308389 2244530 2205945 2460785 2587685 2517467 2439788
14476 2439788 2433425 2512049 2412534 2403939 2372379 2279351 2208575 2286238 2308018 2255988 2339535 2335873
14464 2335873 2386714 2352799 2413339 2406565 2377932 2428146 2330100 2386576 2342050 2287124 2289930 2314508
14452 2314508 2334064 2340908 2268722 2327686 2476996 2354519 2398716 2391285 2400898 2366611 2393141
14441 2393141 2324250 2328897 2417423 2455909 2370064 2280711 2353954 2354542 2341139 2392238 2487609 2500129
14429 2500129 2428800 2389475 2459183 2395431 2351182 2331168 2386427 2410298 2382808 2374179 2390179
14418 2390179 2417290 2299819 2395766 2413266 2498826 2482517 2396250 2333222 2280619 2422598 2346558
14407 2346558 2344209 2285636 2414082 2452508 2325866 2342121 2351954 2355711 2373066 2479717 2423685
14396 2423685 2476318 2459291 2453504 2319706 2258782 2437054 2341516 2298723 2342231 2508552 2403745
14385 2403745 2393025 2451665 2425817 2270944 2217109 2306345 2282748 2329092 2381883 2357881 2273652
14374 2273652 2391203 2337394 2324423 2349543 2335280 2302898 2194324 2310856 2308078 2299131 2416064
14363 2416064 2507903 2397201 2316459 2352702 2347509 2360224 2295825 2426001 2408618 2337947 2473768
14352 2473768 2489304 2577683 2510129 2459929 2308695 2235457 2269573 2403661 2410991 2471721 2582924
14341 2582924 2567501 2642938 2617330 2577952 2496227 2446831 2368281 2404376 2341633 2386968 2383823
14330 2383823 2461194 2427640 2465676 2418294 2313425 2408640 2413055 2419506 2430982 2501693 2512197
14319 2512197 2490954 2527835 2522590 2483580 2411365 2471518 2375105 2337104 2353559 2403540 2457539
14308 2457539 2497186 2469642 2434155 2548462 2477118 2493267 2359466 2309824 2169588 2262974 2430159
14297 2430159 2370185 2452036 2327527 2347123 2369990 2438846 2481567 2510908 2521404 2464235 2424702
14286 2424702 2388409 2464439 2429390 2328370 2311712 2406893 2331917 2299706 2389012 2404826 2450994
14275 2450994 2391164 2465798 2420525 2403172 2478609 2421340 2385535 2457469 2528175 2463583 2466904
14264 2466904 2452754 2491819 2477831 2435891 2375313 2385705 2400871 2418994 2383777 2392887 2436192
14253 2436192 2457955 2500746 2463734 2383335 2417267 2318159 2337929 2455498 2589989 2603827 2579107
14242 2579107 2521698 2552374 2565289 2510164 2439098 2246440 2246061 2294822 2406624 2424624 2498545
14231 2498545 2491841 2529256 2568924 2536870 2440428 2403699 2440738 2302945 2470473 2583108 2508758
14220 2508758 2451881 2493841 2505414 2483520 2460352 2306272 2256700 2254834 2400336 2367937 2464092
14209 2464092 2533103 2614130 2549186 2479956 2506479 2393312 2402511 2346937 2386230 2383792 2573787
14198 2573787 2625858 2546976 2563925 2602184 2562112 2406569 2334063 2338740 2340406 2277569 2371041
14187 2371041 2454405 2377057 2468198 2459045 2441056 2469246 2523517 2502162 2414819 2436318 2453108
14176 2453108 2404316 2425113 2437106 2415421 2415173 2455110 2516353 2477414 2499022 2502041 2514868 2365113
14164 2365113 2410191 2419024 2572728 2651282 2528397 2495394 2479142 2531333 2470435 2470686 2436357
14153 2436357 2417511 2398087 2444847 2457499 2438030 2480944 2428518 2402944 2418031 2428432 2495343
14142 2495343 2406837 2366910 2395479 2383530 2329166 2409590 2448829 2382147 2488213 2548175 2462868
14131 2462868 2448110 2562579 2480119 2409050 2479232 2424108 2358573 2463638 2580952 2593183 2482027
14120 2482027 2463538 2502858 2538732 2529347 2499112 2462872 2406478 2490364 2562462 2412465 2386692
14109 2386692 2496369 2554017 2525132 2637716 2602486 2481156 2377679 2503374 2537295 2458944
14099 2458944 2565208 2557865 2562984 2486850 2553725 2536994 2430439 2346358 2403956 2461951 2458084
14088 2458084 2542779 2573707 2594708 2563841 2526949 2577226 2527953 2440340 2388079 2308893 2322940
14077 2322940 2324991 2388637 2463764 2499675 2605821 2658552 2555594 2548160 2548418 2573170 2502917 2444938
14065 2444938 2557561 2590405 2518542 2543724 2554836 2455233 2522583 2622779 2638162 2519378 2544071
14054 2544071 2510026 2524961 2477993 2500920 2389321 2418664 2487512 2461128 2565053 2588099 2630748
$$ [...]
##END NTUPLES=NMR SPECTRUM
##END=
